##TITLE=1H_CA-8659-1
 CDCl3, 8 sc, 
 18.10.2019
##JCAMPDX= 6.0         $$ Bruker NMR JCAMP-DX V2.0
##DATA TYPE= NMR FID
##DATA CLASS= NTUPLES
##ORIGIN= UXNMR, Bruker Analytische Messtechnik GmbH
##OWNER= root
$$ XWIN-NMR		Version 3.5
$$ Fri Oct 18 13:47:01 2019 Russian Standard Time (UT+4h)  she@DPX200
##.OBSERVE FREQUENCY= 200.1315
##.OBSERVE NUCLEUS= ^1H
##.DELAY= (6, 6)
##.ACQUISITION MODE= SIMULTANEOUS
##.ACQUISITION SCHEME= undefined
##.AVERAGES= 8
##.DIGITISER RES= 18
##SPECTROMETER/DATA SYSTEM= spect
##.PULSE SEQUENCE= zg30
##.SOLVENT NAME= CDCl3
##.SHIFT REFERENCE= (INTERNAL, CDCl3, 0, 15.7039)
##AUDIT TRAIL= $$ (NUMBER, WHEN, WHO, WHERE, WHAT)
$$ ##TITLE= Audit trail, XWIN-NMR		Version 3.5
$$ ##JCAMPDX= 5.01
$$ ##ORIGIN= Bruker BioSpin GmbH
$$ ##OWNER= she
$$ F:/spectra/data/she/nmr/H-F/1/audita.txt
$$ ##AUDIT TRAIL=  $$ (NUMBER, WHEN, WHO, WHERE, WHAT)
(   1,<2019-10-18 13:46:00.60 +0400>,<she>,<DPX200>,
      <created by zg, POWCHK disabled, PULCHK disabled
       configuration hash MD5:
       00 E9 B6 7A A2 85 ED C7 34 08 36 98 17 FE 4E 26
       data hash MD5: 16K
       CF BD C7 94 C1 25 F7 0A 1D 24 B4 84 87 36 96 29>)
$$ ##END=
$$ 
$$ hash MD5
$$ 78 C0 7D 8B 77 33 54 26 20 D7 52 6E F6 DE 87 36
##$RELAX= 
##$RELAX= 
##$RELAX= 
##$RELAX= 
##$RELAX= 
##$RELAX= 
$$ Bruker specific parameters
$$ --------------------------
##$DU= <F:/spectra>
##$EXPNO= 1
##$NAME= <H-F>
##$PROCNO= 1
##$TYPE= <nmr>
##$USER= <she>
##$AMP= (0..31)
100 100 100 100 100 100 100 100 100 100 100 100 100 100 100 100 100 100 
100 100 100 100 100 100 100 100 100 100 100 100 100 100 
##$AQSEQ= 0
##$AQ_mod= 1
##$AUNM= <au_zg>
##$AUTOPOS= <>
##$BF1= 200.13
##$BF2= 200.13
##$BF3= 200.13
##$BF4= 200.13
##$BF5= 200.13
##$BF6= 200.13
##$BF7= 200.13
##$BF8= 200.13
##$BYTORDA= 1
##$CFDGTYP= 0
##$CFRGTYP= 5
##$CHEMSTR= <none>
##$CNST= (0..31)
1 1 145 1 1 1 1 1 1 1 1 1 1 1 1 1 1 1 1 1 1 1 1 1 1 1 1 1 1 1 1 1 
##$CPDPRG= <>
##$CPDPRG1= <>
##$CPDPRG2= <>
##$CPDPRG3= <>
##$CPDPRG4= <mlev>
##$CPDPRG5= <mlev>
##$CPDPRG6= <mlev>
##$CPDPRG7= <mlev>
##$CPDPRG8= <mlev>
##$CPDPRGB= <>
##$CPDPRGT= <>
##$D= (0..31)
0 1.2 0 0 0 0 0 0 0 0.06 0 0.03 0 0 0 0 0.0002 0 0 0 0 0 0 0 0 0 0 0 0 
0 0 0 
##$DATE= 1571391960
##$DBL= (0..7)
120 120 120 120 120 120 120 120 
##$DBP= (0..7)
150 150 150 150 150 150 150 150 
##$DBP07= 0
##$DBPNAM0= <>
##$DBPNAM1= <>
##$DBPNAM2= <>
##$DBPNAM3= <>
##$DBPNAM4= <>
##$DBPNAM5= <>
##$DBPNAM6= <>
##$DBPNAM7= <>
##$DBPOAL= (0..7)
0.5 0.5 0.5 0.5 0.5 0.5 0.5 0.5 
##$DBPOFFS= (0..7)
0 0 0 0 0 0 0 0 
##$DE= 6
##$DECBNUC= <off>
##$DECIM= 24
##$DECNUC= <off>
##$DECSTAT= 4
##$DIGMOD= 1
##$DIGTYP= 9
##$DL= (0..7)
0 120 120 120 120 120 120 120 
##$DP= (0..7)
150 150 150 150 150 150 150 150 
##$DP07= 0
##$DPNAME0= <>
##$DPNAME1= <>
##$DPNAME2= <>
##$DPNAME3= <>
##$DPNAME4= <>
##$DPNAME5= <>
##$DPNAME6= <>
##$DPNAME7= <>
##$DPOAL= (0..7)
0.5 0.5 0.5 0.5 0.5 0.5 0.5 0.5 
##$DPOFFS= (0..7)
0 0 0 0 0 0 0 0 
##$DQDMODE= 0
##$DR= 18
##$DS= 0
##$DSLIST= <SSSSSSSSSSSSSSS>
$$ [...]
##$SUBNAM2= <"">
##$SUBNAM3= <"">
##$SUBNAM4= <"">
##$SUBNAM5= <"">
##$SUBNAM6= <"">
##$SUBNAM7= <"">
##$SUBNAM8= <"">
##$SUBNAM9= <"">
##$SW= 24.0689530833862
##$SWIBOX= (0..15)
0 0 2 0 0 0 0 0 0 0 0 0 0 0 0 0 
##$SW_h= 4816.95568400771
##$TD= 16384
##$TD0= 1
##$TE= 0
##$TE2= 300
##$TE3= 300
##$TEG= 300
##$TL= (0..7)
0 120 120 120 120 120 120 120 
##$TP= (0..7)
150 150 150 150 150 150 150 150 
##$TP07= 0
##$TPNAME0= <>
##$TPNAME1= <>
##$TPNAME2= <>
##$TPNAME3= <>
##$TPNAME4= <>
##$TPNAME5= <>
##$TPNAME6= <>
##$TPNAME7= <>
##$TPOAL= (0..7)
0.5 0.5 0.5 0.5 0.5 0.5 0.5 0.5 
##$TPOFFS= (0..7)
0 0 0 0 0 0 0 0 
##$TUNHIN= 0
##$TUNHOUT= 0
##$TUNXOUT= 0
##$USERA1= <user>
##$USERA2= <user>
##$USERA3= <user>
##$USERA4= <user>
##$USERA5= <user>
##$V9= 5
##$VALIST= <valist>
##$VCLIST= <CCCCCCCCCCCCCCC>
##$VD= 0
##$VDLIST= <DDDDDDDDDDDDDDD>
##$VPLIST= <PPPPPPPPPPPPPPP>
##$VTLIST= <TTTTTTTTTTTTTTT>
##$WBST= 1024
##$WBSW= 4
##$XGAIN= (0..3)
0 0 0 0 
##$XL= 0
##$YL= 0
##$YMAX_a= 425409
##$YMIN_a= -579175
##$ZGOPTNS= <>
##$ZL1= 120
##$ZL2= 120
##$ZL3= 120
##$ZL4= 120
##$ABSF1= 10
##$ABSF2= 0
##$ABSG= 5
##$ABSL= 3
##$ALPHA= 0
##$AQORDER= 0
##$ASSFAC= 0
##$ASSFACI= 0
##$ASSFACX= 0
##$ASSWID= 0
##$AUNMP= <proc_1d>
##$AZFE= 0.1
##$AZFW= 0.1
##$BCFW= 1
##$BC_mod= 2
##$BYTORDP= 1
##$COROFFS= 0
##$CY= 11.3945322036743
##$DATMOD= 1
##$DC= 2
##$DFILT= <>
##$DTYPP= 0
##$F1P= 20.1720416913024
##$F2P= 0.152960286110954
##$FCOR= 0.5
##$FTSIZE= 0
##$FT_mod= 4
##$GAMMA= 1
##$GB= 0.15
##$INTBC= 1
##$INTSCL= 1
##$ISEN= 128
##$LB= 0.24
##$LEV0= 0
##$LPBIN= 0
##$MAXI= 10000
##$MC2= 0
##$MEAN= 0
##$ME_mod= 0
##$MI= 1.114404
##$NCOEF= 0
##$NC_proc= 0
##$NLEV= 6
##$NOISF1= 3.799351
##$NOISF2= 2.8
##$NSP= 1
##$NTH_PI= 0
##$NZP= 0
##$OFFSET= 15.70392
##$PC= 1
##$PHC0= -9569.914
##$PHC1= 10.80089
##$PH_mod= 1
##$PKNL= yes
##$PPARMOD= 0
##$PSCAL= 0
##$PSIGN= 0
##$REVERSE= no
##$SF= 200.130013532006
##$SI= 16384
##$SIGF1= 3
##$SIGF2= 2
##$SINO= 400
##$SIOLD= 16384
##$SREGLST= <1H.CDCl3>
##$SSB= 0
##$STSI= 0
##$STSR= 0
##$SW_p= 3612.71676300578
##$SYMM= 0
##$S_DEV= 0
##$TDeff= 0
##$TDoff= 0
##$TI= <>
##$TILT= no
##$TM1= 0
##$TM2= 0
##$TOPLEV= 0
##$USERP1= <user>
##$USERP2= <user>
##$USERP3= <user>
##$USERP4= <user>
##$USERP5= <user>
##$WDW= 1
##$XDIM= 8192
##$YMAX_p= 0
##$YMIN_p= 0
$$ End of Bruker specific parameters
$$ ---------------------------------
##NTUPLES= NMR FID
##VAR_NAME=  TIME,          FID/REAL,        FID/IMAG
##SYMBOL=    X,             R,               I
##VAR_TYPE=  INDEPENDENT,   DEPENDENT,       DEPENDENT
##VAR_FORM=  AFFN,          ASDF,            ASDF
##VAR_DIM=   8192,          8192,            8192
##UNITS=     SECONDS,       ARBITRARY UNITS, ARBITRARY UNITS
##FACTOR=    0.0002076,     1,               1
##FIRST=     0,             0,               0
##LAST=      1.7004516,     0,               0
##MIN=       0,             -579175,         0
##MAX=       1.7004516,     425409,          0
$$ Real data points
##PAGE= N=1
##DATA TABLE= (X++(R..R)), XYDATA
0 0 0 0 0 -8 8 -8 8 -16 24 -24 32 -40 49 -63 72 -89 112 -128 152 -182 214 -246 286 -333 381 -437 497
27 497 -566 642 -724 817 -917 1029 -1151 1285 -1433 1594 -1771 1965 -2178 2414 -2672 2958
43 2958 -3275 3628 -4025 4472 -4976 5560 -6236 7029 -7982 9147 -10612 12513 -15100
56 -15100 18838 -24746 35532 -61621 254961 93437 -432598 89215 403103 115007 -244222
67 -244222 -57849 192451 87530 -260178 -195254 136166 104373 -196807 -40400 251020
77 251020 67552 -221676 -58859 175527 128642 -47882 -132367 -82786 23044 -32908 -142523
88 -142523 -76521 11654 -33689 -14119 19991 -69125 -28529 168986 107585 -106622 -42216 123493
100 123493 45229 -107214 -105873 4920 68861 -58675 -209860 -54218 161310 15053 -162472
111 -162472 2460 131262 -10568 -70729 42501 74587 -17156 -117503 -102586 52888 64191
122 64191 -159488 -170918 102416 119909 -131277 -140000 70373 137428 55254 -33034 -46089
133 -46089 36760 45440 -59085 -23715 79656 -41670 -151757 6558 83181 -79050 -103385
144 -103385 62678 111736 14553 -68444 -41884 82671 91428 -66246 -58770 108906 25271
155 25271 -168863 -51353 130755 27852 -95214 -10064 90331 71121 -9648 -29851 91073
166 91073 154770 -3715 -71944 99614 113969 -78742 -63422 100750 72196 -40253 -35631
177 -35631 12371 56073 68637 1673 -21215 47821 43895 4290 40279 -330 -93001 -153
189 -153 96694 -46057 -137615 2688 70844 -29567 -70145 -10124 45827 31789 -50004 -33963
201 -33963 103022 51739 -152037 -73528 158425 59737 -169125 -90450 99379 70005 -76768
212 -76768 -106498 34035 143836 8178 -141521 7418 155091 -11560 -132135 24137
222 24137 100932 -27413 -93996 -40003 21503 36958 -28885 -70197 20252 55986 -44300 -38637
234 -38637 57343 13192 -48362 16500 22591 -48273 -24902 9320 -28867 -20145 12768 -15280
246 -15280 -25120 -12498 -20897 30707 66840 -45983 -87925 64930 94119 -67913 -90263 33741
258 33741 53595 -17330 -59543 -40901 36121 46035 -53509 -44076 78113 36186 -79858 -3243
270 -3243 92035 9513 -56238 -8639 24348 23193 -11 -45859 -12531 55482 3152 -47633
282 -47633 26626 43084 -24774 9508 54294 -12736 -26760 38442 22539 -20311 -1140 3387
294 3387 -346 13481 -21474 -26455 58419 42049 -70830 -23548 91201 32666 -55154 -7962
306 -7962 42416 27636 -4366 -41964 -12560 65315 16661 -76324 -797 79825 -9317 -57107
318 -57107 28765 54903 5071 -16609 -19953 12536 58557 286 -65318 7984 55710 -22343
330 -22343 -37733 20634 7241 -7706 21095 -6781 -28782 25567 28300 -22640 -5948 15789
342 15789 -9296 -2464 -3792 -36002 11935 53521 -40531 -77778 39929 65975 -38512 -50923
354 -50923 22239 41754 4718 -47719 -40062 54401 55243 -75236 -66203 71357 37522 -87426
366 -87426 -37992 63736 30257 -41655 -50490 -1686 55241 15267 -73200 -23257 65496 -6107
378 -6107 -76770 -2284 31830 -22518 -17153 1871 -26377 -13534 13192 -12602 -11310 13466 -11858
391 -11858 -16486 10401 -19730 -22859 41585 11498 -68354 -10645 59812 -8768 -52261 10918
403 10918 42198 11749 -21751 -33398 22202 69149 -11603 -66214 35807 73528 -36402 -53899
415 -53899 40851 49504 -4522 -18083 -7387 25661 43285 -11770 -28179 47400 45735 -32664
427 -32664 -12022 41755 10173 -4696 21987 677 -7647 26663 7438 -18976 19278 26520
439 26520 -7474 4872 7520 -17781 17158 37227 -28853 -32141 39731 18895 -42636 -15423
451 -15423 20947 10087 101 -23361 -27186 33724 33553 -50900 -31327 57571 21672 -50133 -15634
464 -15634 27937 15587 -717 -21944 -14799 40547 24201 -49947 -12157 60903 9299 -42803
476 -42803 4612 26395 -518 -2857 -11682 -15032 22732 10433 -44525 -16916 26100 -11056 -27111
489 -27111 1949 -16357 -23841 14537 -8786 -49247 -3792 22660 -27209 -36760 -4360 -3051 -2768
502 -2768 -11496 -39120 -3204 43280 -20878 -65235 20970 55397 -24750 -43112 13426 28226
514 28226 7654 -18216 -25956 24752 47028 -28726 -45534 42223 42606 -35708 -19933 33121 15770
527 15770 -5079 -5528 -11357 16537 33518 -17157 -28013 26655 19844 -17638 5102 12452 -10143
540 -10143 15714 24240 -22019 -7915 40069 9965 -21033 10259 18262 2943 7456 -7953 -7934
553 -7934 37706 19373 -47296 -9630 55014 7647 -39557 -1462 21840 8929 -1990 -23023
565 -23023 -10484 38051 10805 -48836 -5020 45196 -5710 -32917 10272 19322 3235 2052
577 2052 -13503 -3946 39950 16765 -33514 2780 39418 1545 -9803 14651 3998 5913 23595
590 23595 -7519 -19828 25956 20738 -23417 -4886 18589 -4687 -8085 -4286 -19909 5726 25165
603 25165 -31791 -48802 17972 22832 -33765 -29883 869 67 -1170 -19282 -38000 6521 31328
616 31328 -29253 -41292 22424 15138 -34157 -13641 16499 5636 -174 -14579 -24229 19830 33842
629 33842 -26009 -29486 28869 17647 -21609 -6675 2713 -1342 17612 1686 -33108 -60 28238
642 28238 -13274 -22241 14916 7491 -11038 -2082 -12320 -7014 28145 4198 -40707 267 37413
655 37413 -8770 -27892 7454 15743 8063 2189 -21594 -6629 37689 7281 -35870 9616 39815
668 39815 -11711 -26830 10438 18602 11256 732 -23703 -2251 40328 3889 -38437 8587
680 8587 37487 -3035 -13461 3455 566 13120 20622 -12708 -8533 30273 7467 -22638 13548
693 13548 28622 -1545 -978 6069 -2467 19245 24281 -20054 -11857 39746 17286 -26163 -4204
706 -4204 17721 9440 9565 -7695 -21550 17350 24956 -27604 -19758 31582 8179 -30692 -7761
719 -7761 8966 1237 1730 -16140 -23308 18766 18303 -36984 -25014 25854 7575 -20945 -7006
732 -7006 -5968 -5817 11896 -6720 -24820 10903 16433 -27272 -16886 18697 1020 -14960 -1719
745 -1719 -8294 -2523 16258 -14127 -34546 14633 28119 -21601 -26146 4350 3300 951 -1241
758 -1241 -22269 -6313 25295 -8311 -35418 9085 22357 -17206 -15065 7090 701 1632 -1267
771 -1267 -21663 1757 32662 -8039 -35388 10415 24645 -9460 -8595 3951 -1027 11823 7897
784 7897 -21481 -501 31912 -2650 -23958 15215 20412 -7977 -2987 2527 775 21855 12105
797 12105 -27401 -3606 38182 7395 -20769 5322 13575 5023 11082 -4234 -12145 22878 20978
810 20978 -21480 -4457 30183 2608 -16332 9455 12540 3875 6630 -10567 -8663 30412 17158
823 17158 -31123 -7981 31436 6369 -13909 331 1066 6562 15696 -11748 -18972 22025 17093
836 17093 -23787 -6787 20321 -102 -9148 -247 -6680 5430 18336 -16727 -25626 19410 17388
849 17388 -22348 -11139 9906 -1322 -1091 -1569 -18605 88 20447 -14373 -25013 15481 10874
862 10874 -23805 -10012 7881 -637 1626 -7280 -25215 4526 26663 -17243 -31857 12409 15477
875 15477 -13588 -10018 -5392 -5061 13159 1323 -27821 -720 24052 -12768 -23210 12814 10036
888 10036 -12372 -5153 -4656 -4014 16009 -412 -29107 3099 28026 -10060 -23077 6752 8226
901 8226 -903 2746 -11734 -9447 20864 5988 -27289 1872 26112 -7019 -17763 5627 6826
914 6826 4671 5420 -15579 -8377 28765 8968 -29024 -810 27198 1954 -8435 1467 -1513
927 -1513 10058 17247 -11565 -10346 26014 10523 -21379 4671 24119 757 -4113 3371 -870
940 -870 14363 17099 -17304 -9671 32464 13597 -22892 -1642 18712 6439 4816 -1072 -11335
953 -11335 13758 21933 -15908 -13076 26054 11112 -17667 2 9559 1340 8260 -1736 -16334
966 -16334 11725 20835 -18828 -16583 20855 9686 -13136 -2829 -1238 -1973 11779 -3952 -21654
979 -21654 10197 18760 -21686 -19531 16086 7009 -11614 -5805 -8825 -2641 14456 -9215 -28535
992 -28535 8660 21205 -18701 -21789 5314 1018 -4464 -424 -15175 -8901 14307 -6521 -26913
1005 -26913 5839 15515 -17817 -15356 4594 -2875 -3170 -688 -17278 -5737 19824 -7370 -30122
1018 -30122 4669 17311 -10336 -10780 -613 -5889 5857 6424 -19958 -7231 24154 -721 -24270
1031 -24270 4694 15165 -4325 -2399 -700 -5266 13789 11925 -19962 -5181 28703 4419 -18897
1044 -18897 5878 14590 1702 5524 -124 -5544 17727 15677 -17031 -725 29559 4680 -13814
1057 -13814 7961 12323 4637 10864 -1569 -8402 20737 18953 -16872 -4317 25332 7472 -6983
1070 -6983 4711 1915 4619 17421 -2644 -14382 17276 18265 -16111 -5835 19532 4997 -4544
1083 -4544 1597 -4759 3945 17824 -7787 -18483 16746 16578 -18653 -9970 12671 2373 -1685
1096 -1685 -1028 -13117 -170 16716 -12108 -22430 13142 11948 -20446 -12171 3611 -3882 -715
1109 -715 -3044 -20709 -3707 14997 -14646 -25340 7696 8147 -17035 -10122 -3966 -9568 3608
1122 3608 98 -22178 -3974 16608 -12594 -23971 6732 8159 -9365 -4451 -6632 -8580 11350
1135 11350 3003 -23269 -498 23092 -7440 -20868 5098 8125 -1949 2017 -6608 -7618 15503
1148 15503 5146 -22094 1428 23987 -4116 -14238 6266 4860 1301 7895 -5577 -6633 19539
1161 19539 8465 -19372 2187 22892 784 -5658 6589 1238 5317 14497 -5478 -6503 23128
1174 23128 12593 -16653 1538 19820 3582 -60 4959 -3087 8500 17653 -9715 -11068 23247
1187 23247 13548 -15853 -1155 13247 2227 3419 1885 -8863 8536 17706 -13542 -13253 20922
1200 20922 11594 -15040 -2183 7768 -79 5072 -332 -13115 7817 16945 -15054 -15529 15813
1213 15813 6908 -12910 -1539 263 -5154 6010 -2419 -19062 4258 16138 -15051 -18311 7784
1226 7784 2796 -9002 -1637 -7599 -7414 10148 -3482 -24535 2122 17602 -12380 -17035 4918
1239 4918 1271 -4686 -191 -9801 -4397 15544 -3424 -24450 4537 18763 -9781 -12487 5451
1252 5451 103 -877 2519 -11463 -4673 18308 -1258 -22517 3875 15009 -7858 -7011 3967
1265 3967 -2734 2312 5731 -14129 -6100 20708 1513 -20325 2651 12507 -4449 -1329 1777
1278 1777 -5102 8362 10270 -15685 -6992 22093 4796 -15487 3718 10041 -2278 2618 181
1291 181 -6271 12834 13186 -17172 -8101 21917 6422 -12616 3367 7434 -421 5321 -2740 -9264
1305 -9264 14599 15021 -15609 -7590 18204 2753 -9151 4765 4188 219 8487 -4182 -13029 13836
1319 13836 16085 -13615 -7131 14308 2123 -5460 4014 -1987 833 14498 -4041 -16932 10820
1332 10820 15735 -11796 -6317 11015 1131 -2426 1676 -7742 1958 17577 -6416 -19382 10810
1345 10810 14396 -12372 -7122 7136 -311 842 1215 -13139 -719 17346 -6526 -18910 8474
1358 8474 9455 -12337 -4848 3510 -3929 2802 1034 -17214 -2526 17161 -6442 -18551 5805
1371 5805 6671 -9058 -2646 -1660 -7044 7656 4632 -18652 -4584 16459 -4364 -15420 4891
1384 4891 4184 -5507 855 -4600 -7922 11978 5891 -19716 -4138 17503 -2836 -13598 3314
1397 3314 2827 -1484 3832 -7966 -10030 13567 6850 -18798 -2886 16129 -3477 -10368 3461
1410 3461 238 -102 6903 -8376 -10397 14991 8114 -16858 -2397 14243 -1206 -3813 3399 -4081
1424 -4081 2627 13147 -6477 -10971 15687 10736 -12685 199 12462 769 1494 4038 -5142
1437 -5142 7010 17458 -7407 -11340 17918 13013 -9524 398 9157 1697 6644 3685 -8942
1450 -8942 6962 18599 -7384 -11556 14651 8958 -9051 748 4893 -1036 7150 1042 -13991
1463 -13991 4505 16567 -9387 -13083 10021 5025 -7509 122 -2243 -4932 9283 709 -17766
1476 -17766 1413 14384 -9576 -12584 6335 1517 -5288 527 -7040 -6462 11823 33 -20573
1489 -20573 573 14863 -7652 -11870 3076 -442 -1483 2835 -10428 -7104 13982 1214 -19286
1502 -19286 1262 12851 -7363 -8032 3122 -2356 980 4766 -12089 -7438 15188 1013 -18476
1515 -18476 774 10112 -6233 -4534 209 -7300 2357 7394 -13378 -10470 13373 946 -16017
1528 -16017 255 6252 -4562 -752 -1665 -9249 6316 10710 -13518 -9202 15905 4766 -11430
1541 -11430 1971 6491 468 6909 933 -7833 11296 15464 -9348 -4532 18123 6658 -6466
1554 -6466 5462 6473 2879 10125 133 -8623 12473 15977 -10282 -5733 14426 4272 -4576 2692
1568 2692 -1356 -904 10736 -1637 -13610 7716 12072 -10792 -6486 9271 769 -3006 2316 -6024
1582 -6024 -1492 13426 -3015 -15607 7856 13095 -9051 -6066 6008 451 1785 3497 -9705
1595 -9705 -1697 15217 -2822 -15781 7130 10594 -8803 -4938 3036 -2727 3175 2868 -13124 -2608
1609 -2608 14833 -4130 -16236 5264 7856 -7158 -2148 -496 -5867 5687 5264 -13229 -3664
1622 -3664 13919 -3568 -13647 4152 5012 -4992 194 -2938 -7868 6864 4706 -16522 -5587
1635 -5587 13098 -3897 -14032 544 343 -4169 1448 -6946 -11415 7502 4490 -17113 -5332
1648 -5332 12138 -3160 -10045 1132 -296 -835 6332 -5369 -8721 12910 8959 -13003 -1332
1661 -1332 14470 1421 -2532 5072 -404 2875 11962 -3084 -7448 13853 9835 -10793 -131
1674 -131 11140 -354 -174 3624 -5075 1950 11557 -6544 -11395 11511 8033 -10448 -2133 4982
1688 4982 -1853 2542 2599 -8986 2421 13783 -6172 -10837 11506 8366 -6944 879 4908 -436
1702 -436 6420 3462 -9478 5235 16254 -4791 -9693 10719 6988 -4723 2181 1498 -2408 8010
1716 8010 2831 -12342 2408 13590 -5937 -9681 6667 2612 -4347 1763 -3182 -4854 9335
1729 9335 1848 -15372 227 12760 -5192 -8748 3997 5 -2290 3195 -6604 -6933 10734 1933
1743 1933 -15640 -855 10099 -5950 -7855 1466 -3218 -1178 3406 -10389 -9247 10426 1205
1756 1205 -16714 -1738 7323 -5594 -5586 -723 -6159 912 5820 -10746 -9231 11186 2138 -13475
1770 -13475 300 6757 -3864 -987 758 -6232 4423 9702 -9309 -7873 12380 3714 -9735
1783 -9735 1219 5072 -1927 3446 80 -8513 5985 11229 -9263 -7476 11762 3744 -7619 1619
1797 1619 2566 -571 6674 -448 -9775 6925 12582 -7977 -6275 11311 4462 -4165 3151 874
1811 874 338 10272 859 -9749 7700 13165 -6572 -4218 10095 3348 -1272 3930 -2481 -56
1825 -56 11918 498 -11434 6553 12069 -6339 -4377 6557 849 978 4087 -6338 -2040 12808
1839 12808 -262 -12243 4955 10029 -5895 -3738 3191 -1615 2717 4476 -9418 -3301 12610
1852 12610 -1100 -12523 3654 7579 -5361 -2392 673 -4408 4008 4362 -11095 -4514 11560
1865 11560 -2039 -12842 2386 4575 -4962 -940 -2288 -6834 4836 4464 -12945 -5512 10324
1878 10324 -2172 -11173 1078 1164 -3950 1172 -4386 -9504 5009 4797 -12910 -5681 9191 -2205
1892 -2205 -9145 492 -1063 -2040 4141 -4928 -9782 7220 6572 -11613 -4099 9721 -596 -4609
1906 -4609 2124 -1640 464 8651 -3448 -8506 9338 8557 -9094 -2099 9416 648 -677 3149
1920 3149 -3356 1697 10874 -2629 -8570 9206 8468 -7381 -983 6710 -233 2243 3506 -6458
1934 -6458 1658 11544 -3691 -9100 8645 7381 -6312 -604 3851 -973 4351 3130 -8246 1466
1948 1466 12470 -3494 -8834 7822 6588 -3960 1302 2156 -1403 6987 4168 -8992 1877 13230
1962 13230 -2597 -7238 7204 5630 -2045 2938 -13 -3038 8504 4341 -10356 1182 11921
1975 11921 -3115 -6627 4315 1901 -1707 2901 -3869 -5571 8231 2582 -12624 -1517 8631
1988 8631 -4545 -7018 933 -2767 -1866 2936 -7510 -8808 7354 1416 -13835 -2711 6600 -4972
2002 -4972 -6004 -397 -4939 -762 4537 -8344 -8596 7961 2277 -11773 -1784 5262 -3472 -2153
2016 -2153 190 -6152 1253 7359 -7283 -8072 8442 3409 -8848 -143 4173 -1992 1706 602
2030 602 -6879 3303 9017 -6993 -7011 8904 3599 -6618 981 2637 -1382 4442 729 -8150 3581
2045 3581 9957 -6205 -6286 8272 2884 -4431 1472 -73 -1486 6629 753 -9378 3778 10092
2059 10092 -5589 -5472 7447 2933 -1566 2797 -1696 -892 9554 2066 -8329 5309 11293 -3005
2073 -3005 -2171 7680 2909 1932 5912 -1784 83 12341 3457 -7627 6008 10674 -2382 -1154
2087 -1154 4826 407 2863 5453 -5500 -2798 10723 358 -10440 2258 6373 -4673 -3081
2100 -3081 273 -4214 1490 2923 -9773 -5500 8159 -1504 -11500 168 3401 -4491 -1865 -1525
2114 -1525 -6364 2559 4798 -9787 -5558 8473 -557 -9065 735 1992 -3344 1164 -2270 -7484
2128 -7484 3975 5228 -10048 -5492 7765 -935 -7794 294 -581 -3064 2806 -2798 -8873 4406
2142 4406 5238 -9655 -5112 6682 -656 -4896 875 -1885 -1528 5683 -2966 -8749 6286 6944 -7775
2157 -7775 -3547 6560 166 -1741 1862 -3308 -519 7905 -2716 -8608 6205 6902 -6722 -1968
2171 -1968 5188 -820 420 2517 -4684 453 9548 -1855 -7407 6810 7553 -3813 365 4719
2185 4719 330 4723 5030 -4636 2028 12064 -88 -5763 7702 7632 -1785 2147 3481 -210 6023
2200 6023 4748 -6204 1122 11107 -1469 -6942 4812 3975 -2928 1030 -946 -4122 4760 2784
2214 2784 -9726 -1667 8138 -3368 -7386 2273 880 -2579 1650 -3024 -5322 5784 2830 -10155
2228 -10155 -1277 8513 -2438 -5532 2169 -127 -1018 3662 -4024 -6020 6731 3300 -9926 -1567
2242 -1567 6245 -2771 -4078 896 -3196 -1164 3758 -6269 -7546 6615 2403 -9836 -2251 4318
2256 4318 -3261 -2271 46 -4939 224 5450 -5894 -7523 6786 3035 -8206 -1016 3400 -2475
2270 -2475 540 752 -5650 1879 7475 -5469 -6925 6793 3074 -6445 99 1895 -2114 2845 950
2285 950 -6969 1888 8290 -5058 -5976 6501 2893 -4453 1410 621 -1565 5407 1623 -7163 2951
2300 2951 8933 -3876 -4468 6296 2884 -1577 2976 -541 -1580 7448 2215 -7517 3439 9226
2314 9226 -3113 -3415 5010 1419 -244 3573 -2411 -2031 8428 1824 -8080 3061 8290 -3154
2328 -3154 -2628 4037 -474 866 4607 -3969 -2637 8744 1428 -8455 2319 6474 -3042 -1230 2100
2343 2100 -2422 2310 5054 -5689 -3271 8977 959 -8167 1454 4527 -2652 -70 447 -4413 2043
2358 2043 4829 -7020 -4613 7687 134 -7963 730 2175 -2618 1215 -1000 -5875 2737 4880
2372 4880 -7885 -4716 7166 83 -6463 436 -71 -2698 2941 -1727 -7069 3519 5342 -7817
2386 -7817 -4413 6089 -316 -4808 803 -1444 -2420 4200 -1885 -8144 3908 5902 -7293 -4082
2400 -4082 4851 -844 -2605 1472 -3318 -1849 5700 -2288 -8332 4012 5624 -6569 -3054 3599
2414 3599 -1100 -606 2222 -4440 -1157 7274 -1735 -7868 4460 5919 -4748 -902 3428 -1221 1888
2429 1888 3536 -5002 -228 8967 -858 -6608 5486 5643 -2493 1376 2944 -1208 4219 4294 -5183
2444 -5183 198 10101 114 -5541 4961 4972 -1716 2253 1646 -2392 5100 4300 -6511 -352 8983
2459 8983 -1119 -5263 3677 2281 -1593 2737 -999 -3975 5432 3931 -7826 -1065 7610 -1295
2473 -1295 -4855 2570 349 -1333 3408 -2600 -5402 6204 3575 -8206 -1235 6721 -1901 -3485
2487 -3485 1872 -1712 -453 4456 -3928 -6253 6068 3175 -7714 -1144 4636 -2395 -2366 821 -4249
2502 -4249 -791 4992 -4992 -7319 5127 2235 -7524 -1583 2505 -2851 -701 91 -5941 -846 5583
2517 5583 -5769 -7769 4729 1763 -6984 -961 941 -3341 976 157 -6983 21 6491 -4894
2531 -4894 -6712 4897 1952 -4727 684 840 -2692 3907 1537 -6588 1802 7855 -3449 -4690 5551
2546 5551 2170 -2545 2419 186 -1900 5801 2570 -6313 2586 8295 -2639 -3098 5536 1658 -728
2561 -728 3500 -1159 -1833 7376 2718 -6642 2152 7798 -2188 -2105 4374 -53 460 4506 -2794 -2414
2577 -2414 7748 2233 -6914 2002 6489 -2532 -1481 3087 -1403 1379 4746 -3924 -3532 7489 1963
2592 1963 -6963 1571 4817 -2142 254 1783 -3412 2054 5613 -5069 -3727 7227 1559 -6253
2606 -6253 1656 3014 -2367 1170 392 -4587 2374 5356 -6069 -4283 6111 145 -5658 545 599
2621 599 -3087 1704 -1007 -7186 1894 4652 -6905 -5195 4903 -1104 -5569 648 -1560 -3200 3049
2636 3049 -1898 -8101 2022 4706 -6500 -4365 4085 -1270 -3250 1332 -2492 -2443 4685 -1382 -7596
2651 -7596 3096 5097 -5424 -2682 3872 -1418 -1069 2701 -3461 -1803 6312 -703 -6736 3338
2665 3338 5366 -4424 -1428 3261 -1823 693 3213 -4114 -1136 7528 -469 -6580 4019 5115 -3336
2680 -3336 366 2540 -1600 2808 4241 -4553 -857 8307 -215 -5505 4043 3985 -2193 1562 1534 -2512
2696 -2512 3983 4503 -5119 -767 8228 -319 -4765 3862 2812 -1669 2888 583 -3682 4951 4674
2711 4674 -5900 -1167 7638 -482 -3705 3159 1205 -1275 3909 -791 -4249 5132 4550 -6340 -1028
2726 -1028 6265 -1038 -2837 2456 -1177 -837 4486 -2045 -5981 4912 3724 -6794 -1733 4518 -2316
2741 -2316 -2205 1397 -3541 -1461 4731 -3685 -6662 4093 2600 -6894 -1350 3114 -2785 -901 1236
2756 1236 -5034 -970 5069 -3835 -6730 4387 2394 -6137 -732 1725 -2836 492 1091 -5818 -716
2771 -716 5919 -3922 -6195 4166 1803 -5010 165 291 -3013 2266 1549 -6713 -219 6424 -3567
2786 -3567 -5125 4084 1698 -3383 1297 -200 -2710 4053 2132 -6241 581 6860 -2561 -3787 4499
2801 4499 1119 -1428 2810 -881 -2708 5801 2793 -6068 1687 7046 -2186 -2054 4210 149 2
2816 2 4307 -1412 -2609 6980 2822 -5836 1901 6418 -1692 -561 3699 -925 1102 4870 -2654 -2699
2832 -2699 7091 2546 -5739 1803 5248 -1838 288 2847 -2133 1352 5406 -3627 -3337 6772 1804
2847 1804 -5492 1560 3386 -2026 994 1483 -4033 1360 5343 -4933 -3956 5946 895 -5152 1009
2862 1009 1077 -2763 1731 341 -5672 1569 4959 -5544 -4839 4900 -240 -4848 794 -617 -2876
2877 -2876 2432 -458 -6711 1272 4717 -5488 -3984 3974 -1278 -3589 1182 -2201 -3147 3347 -866
2892 -866 -7478 1627 4169 -5238 -3516 2930 -1483 -2075 1790 -2962 -2793 4884 -707 -6795 2235 4313
2908 4313 -4110 -2008 2828 -2037 -354 2716 -3586 -2158 6388 -323 -6161 2650 4243 -3243 -332
2923 -332 2575 -1865 1523 3668 -4007 -1486 6686 282 -5175 3404 3635 -2271 1397 2334 -2369 2801
2939 2801 4474 -4255 -1152 7151 432 -3938 3451 2678 -1437 2699 1422 -3090 4019 5102 -4430
2954 -4430 -960 6927 413 -3160 3400 1478 -1278 3590 344 -3889 4349 4639 -5150 -904 5834
2969 5834 -516 -2682 2709 -317 -1270 4076 -958 -5232 3885 4047 -5529 -1367 4546 -1483 -1940 2203
2985 2203 -1875 -1469 4646 -1835 -5818 3727 3196 -5670 -1320 3215 -2165 -1057 1721 -3801 -1452
3000 -1452 4476 -2637 -6216 3125 2398 -5727 -1161 1457 -2978 92 1522 -5168 -1339 5113 -3003
3015 -3003 -6245 3045 1497 -4772 -477 289 -3488 1218 1476 -5943 -1130 5276 -3020 -5785 3107
3030 3107 1072 -3569 895 -28 -3112 2699 1964 -5768 -340 5512 -2315 -4237 3066 956 -2053
3045 -2053 2110 -816 -3179 4197 2490 -5574 601 6190 -1960 -2696 3366 332 -614 3736 -715
3060 -715 -3083 5492 3093 -5114 1234 5712 -1484 -984 3348 -487 417 4590 -1821 -2794 6270 3253
3076 3253 -4998 1671 4897 -1023 62 2760 -1511 1038 5046 -2142 -3190 5790 2278 -4553 1353
3091 1353 3783 -1799 790 2071 -2958 1346 5223 -3340 -3737 5202 1416 -4413 1212 2221 -2244
3106 -2244 1566 1094 -4420 1189 4983 -3674 -3864 4535 644 -3727 849 87 -2549 1995 117 -5550
3122 -5550 884 4212 -4524 -3992 3453 -285 -3477 871 -1450 -3152 2696 -316 -6708 527 4061
3137 4061 -4681 -3661 2647 -1536 -2499 1247 -2743 -2952 3619 -235 -6250 1377 3858 -3818 -2531
3152 -2531 2351 -1465 -1224 2391 -2980 -2511 4973 119 -5980 1733 3527 -3304 -1140 2265 -1963
3167 -1963 395 3427 -3403 -2302 5472 390 -5163 2341 3409 -2371 479 2157 -2297 1696 3853
3182 3853 -3654 -1791 6050 673 -3998 2654 2987 -1611 1912 1495 -2812 3008 4764 -3609 -1311
3197 -1311 6324 497 -2767 2915 1687 -1299 3092 975 -3122 3313 4331 -4039 -1013 5432 120
3212 120 -2150 2335 437 -1128 3640 -2 -3963 3362 4199 -4160 -1119 4403 -501 -1563 2195
3227 2195 -1031 -1117 3849 -742 -4612 3096 3436 -4516 -1080 3432 -1607 -1027 1492 -3117 -1603 3842
3243 3842 -1429 -5534 2643 2716 -4539 -1426 1763 -2261 -513 1462 -4370 -1714 4223 -2254 -5776
3258 -5776 2255 1739 -4294 -866 687 -2851 402 1697 -4653 -1400 4394 -2090 -4881 2047 1186
3273 1186 -3303 406 133 -2991 2004 2022 -4972 -1025 4943 -1795 -3854 2442 701 -2265 1586 -465
3289 -465 -3367 2413 2266 -4945 -289 4811 -1635 -2868 2509 10 -1174 2654 -774 -3270 4012
3304 4012 2779 -4327 305 5067 -882 -1508 2820 -361 -327 3761 -1160 -2847 4551 2714 -3936 665
3320 665 4201 -1051 -516 2484 -1405 571 4124 -1508 -3019 4670 2756 -3804 907 3408 -1226
3335 -1226 528 2035 -2052 812 4911 -2033 -3150 4853 2168 -3408 840 2378 -1299 1344 1643
3350 1643 -2839 725 4547 -2493 -3122 3872 1223 -3384 929 867 -1816 1939 1412 -4459 629 4287
3366 4287 -3312 -3768 3192 85 -2858 848 -384 -2568 2169 659 -5061 428 3814 -3511 -3252
3381 -3252 2446 -607 -2232 908 -1464 -2813 2587 312 -5656 300 3374 -3280 -2472 2070 -1541
3396 -1541 -1498 1612 -2714 -3127 3580 105 -5407 749 3052 -2860 -1475 1768 -1636 -268 2557 -2615
3412 -2615 -2447 4164 463 -5072 1019 2454 -2183 91 1411 -2313 621 3056 -3008 -2124 4371
3427 4371 609 -4015 1174 2146 -1703 843 930 -2463 1745 3780 -3064 -1584 5098 417 -2984 2058
3443 2058 1878 -1586 2301 1164 -2603 2161 3956 -2757 -1359 4629 539 -1901 2357 994 -897
3458 -897 3428 788 -3264 2658 4304 -3307 -1091 4210 404 -1313 2370 -364 -893 3919 138
3473 138 -3360 2655 3866 -3253 -890 3290 -692 -1019 1832 -1509 -1083 3644 -450 -4162 2142 2702
3489 2702 -3606 -1036 1947 -1783 -572 1468 -2979 -1654 3705 -1214 -4546 1644 1761 -3286 -853
3504 -853 1120 -2287 18 1531 -3642 -1700 3576 -1448 -4519 1798 1243 -3092 -101 314 -2448 873
3520 873 1443 -3872 -1497 3483 -1175 -4070 1511 481 -2482 882 -273 -3362 1342 1663 -4468 -1230
3536 -1230 3736 -1495 -3240 1379 -46 -1663 1902 -457 -3184 2242 1944 -4035 -648 3409 -1091
3551 -1091 -1895 2223 -413 -837 2793 -670 -2735 3384 3015 -3434 286 3959 -569 -412 2196 -708
3567 -708 -138 4058 -695 -2804 3873 2668 -2647 922 3321 -471 553 2276 -1112 135 4503
3582 4503 -775 -2476 3839 2595 -2623 800 2336 -864 1300 1990 -2261 349 4419 -1546 -2785
3597 -2785 3478 1694 -2417 954 1282 -1869 1788 1395 -3447 277 3930 -2021 -2906 2523 664 -2453
3613 -2453 885 380 -2194 1855 808 -4155 195 3683 -2450 -3028 2245 -255 -2053 1124 -1111
3628 -1111 -2491 2155 845 -4569 6 3213 -2464 -2636 1629 -1237 -1305 1527 -1696 -2550 2381 339
3644 339 -4395 27 2559 -2482 -1902 1127 -1766 -771 1775 -2375 -2802 2872 266 -4410 37 1958
3660 1958 -2291 -1003 643 -1909 -104 2370 -2471 -2443 3402 344 -3644 1185 1892 -1427 396 1433
3676 1433 -2151 763 3554 -2490 -1716 4419 903 -2608 1607 1697 -1309 1594 1500 -2314 2039 3752
3692 3752 -2060 -1219 4122 923 -1521 1862 1234 -820 2420 1122 -2616 1949 3879 -2125 -1426 3680
3708 3680 537 -1480 2180 60 -1187 2869 507 -2868 2122 3373 -2492 -753 2828 54 -604
3723 -604 1654 -736 -897 3483 259 -3362 2149 2726 -2463 -530 2526 -1189 -249 1716 -1966 -1306
3739 -1306 3082 -397 -3576 1356 2171 -2689 -701 1090 -1922 -269 1452 -2951 -1273 3203 -893
3754 -893 -3825 1275 1377 -2323 -374 835 -2472 -12 1474 -3428 -1716 3076 -1144 -3534 1338
3769 1338 438 -2193 371 -80 -2976 1100 1697 -3926 -1559 2908 -1668 -3426 1192 -79 -1946 1306
3785 1306 -167 -2978 1378 1780 -3660 -1209 2906 -984 -1857 1302 -415 -1335 1719 -327 -2793 2499
3801 2499 2474 -2694 -412 3197 -933 -1106 1996 -614 -303 2941 -391 -2808 2734 2422 -2716 186
3817 186 2925 -955 84 1783 -1035 -81 3570 -614 -2297 3221 2357 -2380 604 2451 -780 876
3833 876 1902 -1513 280 3735 -525 -2092 3041 2016 -1973 1030 1705 -1040 1459 1639 -2127 304
3849 304 3509 -1002 -2432 2452 975 -1490 1007 887 -1629 1588 1632 -3358 60 3536 -1458 -2301
3865 -2301 2097 298 -1656 1168 -357 -2357 2074 1279 -3403 -79 3021 -1903 -2417 1554 -543
3880 -543 -1400 1240 -1331 -2509 2148 513 -4074 -127 2350 -2124 -1647 903 -1513 -1194 1778 -1671
3896 -1671 -2869 2267 457 -3709 -91 1934 -2226 -989 896 -1875 -674 1802 -1700 -2653 2476
3911 2476 583 -3738 205 1772 -1963 -40 854 -2316 61 2698 -1832 -2120 2946 920 -2476
3926 -2476 968 1364 -1312 1070 1029 -2099 978 3225 -1853 -1710 3619 990 -1827 1449 1132 -985
3942 -985 2100 1500 -2316 1232 3368 -2010 -1079 3212 397 -1452 1861 438 -915 2493 937 -2520
3958 -2520 1514 3282 -1793 -872 3053 384 -675 1976 -360 -1049 2864 1010 -2990 1714 2740
3973 2740 -1819 -312 2673 -416 -267 2056 -1038 -1344 3109 281 -3094 1585 2303 -1996 -749 1539
3989 1539 -866 -249 1631 -1992 -1434 3121 -235 -3415 827 1807 -2215 -309 827 -2218 -5 1583
4005 1583 -3014 -1691 2805 -641 -3142 1058 578 -2458 157 368 -2384 258 1516 -3500 -1886
4020 -1886 2403 -1070 -2971 779 -109 -2203 782 -394 -2850 551 1699 -3112 -1330 2785 -737
4035 -737 -2354 1178 -417 -1614 1229 -41 -2669 1571 1987 -2885 -730 2668 -655 -1419 1852 -188
4051 -188 -1116 2423 -202 -2544 2087 2607 -2657 -61 2459 -490 -730 1915 -679 -633 2762 -441
4067 -441 -2175 2219 2068 -2186 152 2235 -787 91 1723 -1042 -183 3514 -264 -2076 2778 1680
4083 1680 -2192 674 1952 -1079 782 2149 -1803 44 3693 -507 -2078 2527 1349 -1338 1169
4098 1169 1023 -1382 1401 1871 -2479 160 3533 -1061 -1981 2398 754 -1731 1155 532 -1907 1734
4114 1734 1382 -3049 -54 3078 -1397 -1854 1567 -70 -1271 1069 -663 -2516 1725 961 -3539 -713
4130 -713 1822 -1817 -1697 964 -1075 -1635 1289 -1276 -2654 1808 908 -3490 -457 1364 -1898 -1245
4146 -1245 1001 -1798 -1065 1792 -1483 -2769 1870 674 -3020 175 1578 -1919 -184 842 -2324
4161 -2324 -73 2401 -1476 -2330 2399 811 -2722 614 1194 -1543 796 967 -2130 130 2545 -1606
4177 -1606 -2198 2745 400 -1650 1243 859 -1408 1129 1354 -2184 579 2810 -1450 -1621 2610 429
4193 429 -1318 1255 570 -1171 2072 1089 -2318 1105 3148 -1597 -1070 2809 419 -510 1870 114
4209 114 -854 2502 1290 -2298 1338 2752 -1560 -450 2530 -194 -262 2025 -539 -1355 2847 627
4225 627 -2387 1436 2209 -1992 -451 1716 -642 -150 1798 -1495 -1582 2652 408 -2861 933 1927
4241 1927 -1935 -303 1230 -1506 -157 2192 -2184 -1532 2498 -347 -3120 717 1020 -1838 340
4256 340 728 -2307 89 1573 -2363 -1679 2222 -382 -2760 760 249 -2166 408 209 -2763 439
4272 439 1435 -2912 -1792 2102 -838 -2547 762 -312 -1600 1179 -128 -2775 784 1616 -2588 -1182
4288 -1182 2228 -908 -1756 1402 -455 -1320 1719 -321 -2519 1546 1955 -2485 -423 2191 -912 -794
4304 -794 1548 -627 -788 2373 -241 -2599 1828 2056 -1824 184 1974 -945 -69 1884 -1061 -571
4320 -571 2867 -1 -2182 1985 2000 -1684 324 1774 -700 770 2116 -964 -276 3136 -59 -1834
4336 -1834 2144 1778 -1247 929 1431 -1288 1148 1997 -1724 -245 3152 -542 -1853 2155 1022 -1035
4352 -1035 1087 569 -1624 1566 1816 -2387 -367 3029 -719 -1615 1624 236 -1304 1196 -42 -2004
4368 -2004 1527 1241 -2923 -130 2292 -1353 -1547 1470 -411 -1516 1342 -854 -2212 1421 885 -2676
4384 -2676 -428 1768 -1373 -1645 956 -1376 -1034 1771 -1292 -2571 1542 699 -3124 -139 1508 -1544
4400 -1544 -705 817 -1537 -975 1753 -1419 -2352 1467 428 -2594 225 1034 -1601 163 843 -2244
4416 -2244 -498 2106 -1253 -2016 2061 351 -2069 534 1063 -1473 911 1001 -2092 191 2492 -1217
4432 -1217 -1698 2218 433 -1499 1055 631 -1485 1523 1082 -1650 812 2524 -1120 -1232 2105 151
4448 151 -978 1759 236 -1072 1981 1288 -1942 1038 2449 -1196 -558 2231 -104 -441 2183 -63
4464 -63 -1020 2568 1030 -2167 717 2580 -1038 -536 1985 -550 -87 2172 -692 -1317 2153 569
4480 569 -2234 961 1911 -1188 174 1336 -1144 -138 1889 -1256 -1730 2195 -26 -2227 820 1181
4496 1181 -1561 256 977 -1496 149 1729 -1788 -1658 2064 -237 -2315 809 496 -1674 414 390
4512 390 -2161 272 1596 -1892 -1650 1759 -632 -2156 1013 43 -1533 795 165 -2537 486 1589
4528 1589 -2194 -1624 1759 -681 -1876 822 -551 -1460 1260 -159 -2404 727 1632 -2168 -964 1590
4544 1590 -875 -1169 1358 -558 -994 1781 -93 -2360 1039 1656 -1776 -232 1520 -459 -484 1774
4560 1774 -849 -950 2304 -232 -2145 1674 1477 -1591 13 1577 -651 447 1668 -1088 -534 2704
4576 2704 49 -2102 1786 1316 -1277 685 1394 -872 797 1914 -934 -441 2647 -21 -1495 1999
4592 1999 1034 -906 818 974 -1045 905 1893 -1635 -298 2540 -217 -1290 1448 509 -1049 1205
4608 1205 560 -1743 1085 1508 -1983 -178 2154 -898 -976 1164 -249 -896 1439 -205 -2066 920
4624 920 1189 -2421 -217 1728 -1323 -1145 873 -902 -1285 1294 -532 -2125 1301 846 -2655 -340
4640 -340 1164 -1806 -921 721 -1566 -1031 1632 -1058 -2125 1414 516 -2466 -202 914 -1242 -400
4656 -400 800 -1746 -828 1752 -1019 -1929 1337 685 -1825 234 615 -1380 257 890 -1819 -224
4672 -224 1890 -1054 -1794 1355 454 -1333 609 343 -1222 806 1053 -1495 67 2276 -764 -1309
4688 -1309 1489 612 -1017 1003 266 -799 1264 1221 -1555 609 2310 -740 -551 1805 139 -669
4704 -669 1504 217 -737 1962 1071 -1650 568 1772 -824 -462 1689 -66 -340 1864 -127 -1178
4720 -1178 1694 1007 -1526 452 1628 -881 -58 1221 -854 -164 1923 -733 -1172 1804 616 -1750
4736 -1750 550 1301 -1286 57 1091 -1261 -359 1539 -1087 -1236 1953 130 -2038 331 394 -1302
4752 -1302 453 859 -1512 123 1695 -1345 -1384 1435 -292 -1612 670 347 -1353 202 183 -2042
4768 -2042 80 1154 -1788 -1058 1413 -480 -1509 547 -393 -1570 750 -15 -2015 560 1406 -1808
4784 -1808 -1156 1328 -762 -1211 911 -867 -1179 1106 88 -2064 438 1490 -1610 -656 967 -645
4800 -645 -681 1134 -709 -837 1770 -14 -1734 1028 1045 -1341 -127 1343 -734 36 1539 -582 -593
4817 -593 2139 409 -1502 1229 1105 -1122 462 1117 -773 512 1786 -1085 -427 2383 -28 -1499
4833 -1499 1311 945 -1022 633 761 -698 827 1610 -1243 -413 1956 -52 -1236 1053 733 -885
4849 -885 731 601 -970 929 1249 -1193 -348 2049 -328 -1201 1037 213 -672 1176 88 -1355 1188
4866 1188 1165 -1506 -547 1544 -744 -950 615 -589 -702 1069 -6 -1760 1151 794 -1704 -445
4882 -445 1208 -846 -859 903 -800 -931 1266 -554 -1616 850 742 -1724 -384 809 -1034 -346
4898 -346 585 -1341 -704 1554 -577 -1894 1078 558 -1396 -127 430 -1142 92 772 -1743 -405
4914 -405 1697 -911 -1454 766 282 -1469 259 692 -1158 375 890 -1685 -159 1674 -841 -1314
4930 -1314 1221 309 -894 683 418 -1243 780 1011 -1521 232 1815 -794 -722 1274 236 -469
4946 -469 988 -24 -1226 1370 1268 -1327 290 1624 -433 -458 1412 0 -400 1617 -11 -726
4962 -726 1576 1074 -1564 525 1936 -284 -63 1386 118 -47 1401 -226 -974 1534 650 -1310
4978 -1310 631 956 -613 220 1066 -745 -62 1313 -552 -1037 1598 557 -1369 473 791 -896
4994 -896 16 474 -1107 -46 1518 -752 -1232 1134 277 -1343 381 327 -1260 446 331 -1530 86
5011 86 1193 -1264 -1320 994 -181 -1385 712 -107 -1151 393 207 -1458 236 1258 -1402 -1343 1004
5028 1004 -762 -1396 686 -505 -1147 871 90 -1820 25 985 -1644 -910 983 -339 -402 635 -614
5045 -614 -1028 1258 206 -1587 370 1134 -1020 -269 1015 -706 -320 1217 -757 -789 1217 67 -1387
5062 -1387 853 1029 -738 -122 707 -660 -34 1323 -594 -204 1354 156 -1303 1009 875 -589
5078 -589 576 664 -716 510 1299 -608 -148 1459 -129 -786 1102 690 -572 927 482 -895 736
5095 736 1377 -969 -261 1841 -2 -871 1079 324 -730 997 335 -999 660 1268 -1094 -310 1521
5112 1521 -253 -549 1080 -47 -486 1174 -37 -1010 933 912 -1293 -266 1293 -723 -427 741
5128 741 -313 -878 1197 -181 -1553 643 510 -1514 -149 338 -853 -436 746 -913 -875 1006 -554
5145 -554 -1700 475 843 -1062 -387 738 -1094 -108 268 -1215 -699 1340 -675 -1559 773 418 -1254
5162 -1254 -233 268 -1066 107 612 -1177 -576 1254 -675 -1409 865 -47 -1079 198 283 -736 358
5179 358 716 -1285 -199 1395 -562 -827 1052 117 -749 819 444 -1111 767 860 -1055 -106 1574
5196 1574 -146 -448 1235 355 -509 1188 10 -994 1035 856 -1222 401 1502 -428 -316 1020
5212 1020 -230 -61 1118 -5 -796 1358 818 -917 334 1554 -415 43 1098 -519 -44 1137
5228 1137 -431 -1207 946 453 -832 422 925 -752 230 830 -816 28 1228 -457 -884 1224 -74
5245 -74 -1025 486 462 -920 61 543 -1163 -113 1308 -857 -882 1227 42 -1110 239 519 -984
5262 -984 555 237 -1424 -42 1175 -719 -888 619 -249 -1064 178 -519 -1052 718 374 -1851 59
5279 59 1073 -1071 -746 611 -450 -964 714 -379 -900 438 332 -1804 251 1007 -1102 -424 639
5296 639 -555 -315 567 -594 -828 1057 287 -1194 344 816 -1077 -34 705 -253 -273 823 -675
5313 -675 -689 1372 43 -739 905 896 -865 -24 492 -528 155 1172 -532 -289 1482 229 -830 847
5331 847 578 -591 422 367 -684 449 1198 -806 -378 1573 0 -825 726 752 -496 671 713 -996
5349 -996 697 1154 -572 -365 1159 26 -621 729 259 -716 954 290 -902 692 771 -1264 -468
5366 -468 1043 -230 -539 605 -432 -676 770 -135 -1208 579 697 -1192 -177 695 -390 -206 503
5383 503 -625 -884 996 -491 -1246 731 609 -1290 -158 333 -697 -304 601 -648 -786 932 -319
5400 -319 -1487 395 204 -1159 -24 40 -951 -167 531 -1122 -477 1059 -403 -1012 713 301 -928
5417 -928 208 132 -1079 110 638 -1344 -366 1362 -207 -1039 737 135 -757 712 190 -793 550
5434 550 770 -894 -108 1192 -276 -480 1012 333 -768 735 318 -1150 851 628 -770 3 1198
5451 1198 -350 -149 1079 -245 -444 1104 -14 -741 1232 714 -846 388 1282 -179 45 876 -143
5468 -143 62 931 -127 -542 1166 443 -988 430 989 -697 46 743 -457 -246 1141 -405 -726
5485 -726 739 759 -860 417 865 -347 344 745 -1003 -281 1235 -336 -689 809 177 -1013 196
5502 196 321 -461 476 467 -1158 -119 1116 -507 -762 718 -234 -1024 424 109 -997 454 380 -1032
5520 -1032 -1 1102 -958 -875 493 -291 -812 312 -354 -831 505 -7 -1328 -172 546 -934 -451
5537 -451 662 -436 -289 703 -226 -756 565 10 -1307 138 424 -942 -461 635 -657 -499 747
5554 747 -395 -558 913 379 -1025 498 470 -923 84 660 -554 1 746 -416 -694 1155 50
5571 50 -836 526 723 -404 66 815 -469 140 761 -533 -504 1239 361 -665 921 373 -271 608
5589 608 682 -402 355 982 -715 -621 960 158 -553 632 -58 -585 678 530 -1002 507 1295 -821
5607 -821 -223 940 -63 -179 820 -59 -519 1192 247 -585 295 987 -760 -54 691 -392 -397 590 -144
5626 -144 -758 765 52 -981 581 820 -753 -269 444 -614 -297 766 -662 -401 979 -240 -1036
5643 -1036 445 615 -1265 101 212 -960 -3 629 -998 -779 711 -484 -1164 592 163 -1136 -98
5660 -98 404 -957 123 764 -1006 -295 927 -266 -1000 344 262 -832 199 -99 -1034 291 604 -947
5678 -947 -488 998 -501 -714 636 -98 -690 513 149 -944 468 708 -861 -216 958 -466 -278
5695 -278 736 197 -395 684 82 -503 892 842 -631 155 960 -303 85 803 -381 79 1125 71
5713 71 -624 656 615 -680 264 774 -563 52 805 -327 -75 1019 -54 -544 759 536 -743 244
5731 244 526 -631 312 588 -643 -167 1060 -294 -522 771 349 -584 534 344 -440 181 484 -705
5749 -705 -122 1066 -212 -645 910 142 -636 488 447 -615 568 356 -1160 5 903 -801 -684
5766 -684 690 -250 -414 644 -65 -701 339 435 -934 -142 786 -858 -497 397 -197 -499 489 -414 -828
5785 -828 500 385 -1152 -139 733 -728 -269 345 -541 -482 681 -483 -851 544 68 -783 232 521
5803 521 -457 -73 693 -590 -417 832 -357 -734 1014 -274 -675 262 424 -663 369 661 -612
5820 -612 156 621 -189 -789 658 313 -796 398 663 -364 176 608 -736 52 957 -345 -485 872
5838 872 189 -568 681 449 -637 780 543 -685 727 1016 -473 -193 985 -69 -487 561 204
5855 204 -357 805 261 -741 562 1148 -349 44 927 -360 -104 749 -280 -207 551 186 -694 218
5873 218 604 -897 66 640 -189 -139 260 -524 -242 760 -190 -813 451 458 -691 -272 509 -739 -203
5892 -203 708 -755 -868 750 -183 -806 385 229 -690 -6 354 -916 -162 538 -697 -647 1076 -129
5910 -129 -997 -88 56 -675 -152 -62 -922 55 422 -721 -593 901 -579 -564 629 -133 -537 319 301 -1086
5930 -1086 389 366 -790 -335 467 -529 -316 364 -243 -418 666 -4 -611 459 637 -510 -89 464
5948 464 44 -441 913 -93 -368 683 64 -394 551 733 -603 217 651 -365 55 580 -170 -123 1062
5967 1062 -110 -697 438 704 -237 227 605 -385 314 583 -589 18 652 -173 -375 721 548 -629
5985 -629 -17 338 -87 225 825 -533 1 669 -159 -507 441 298 -803 294 257 -740 203 542 -684
6004 -684 -300 832 -596 -761 558 -2 -674 293 -227 -558 436 248 -914 -34 614 -211 -371 357 -376
6023 -376 -290 383 -349 -626 379 121 -908 -129 390 -505 -424 321 -487 -414 301 -234 -798 683 -15 -1304
6043 -1304 62 881 -380 22 112 -596 -143 739 -144 -717 558 -54 -1073 172 688 -429 83 230
6061 230 -559 -132 285 -247 -646 581 223 -681 515 544 -438 -10 513 -167 131 996 -631 -550 743
6080 743 570 -344 268 350 -149 589 315 -786 192 934 -398 -415 601 -28 -294 317 263 -178 755 556
6100 556 -651 89 810 -422 -9 629 5 16 381 -196 -494 653 97 -510 499 574 -350 -140 698
6119 698 -82 -118 755 -111 -590 734 101 -851 345 512 -503 -247 414 -354 -64 356 -295 -329 717
6138 717 -179 -741 -2 520 -286 -304 -45 -740 -100 552 -354 -174 691 -244 -822 62 83 -549 448 171 -905
6159 -905 -128 320 -729 -479 396 -168 -943 399 -80 -361 -182 -45 -675 197 323 -599 -542 445 14 -569
6179 -569 333 112 -157 238 -48 -683 272 211 -525 -209 460 -47 -298 459 93 -536 318 122 -543 370
6199 370 75 -576 -198 778 -26 43 722 151 -190 521 66 -694 583 337 -326 169 744 -225 -9 570
6219 570 -275 -229 522 114 -574 562 285 -379 424 518 -131 254 469 -459 -137 884 -22 -312 376 390
6239 390 -389 370 284 -152 73 560 -237 -120 655 -244 -520 192 71 -627 125 332 -604 292 251 -491 -150
6260 -150 511 -272 -478 474 -128 -526 258 126 -668 385 497 -861 30 180 -567 -412 326 -415 -589
6279 -589 266 -291 -707 332 311 -594 168 375 -251 -464 158 -561 -330 77 -413 -555 228 208 -764 -246
6299 -246 439 -226 -90 237 -662 -83 330 -309 -440 353 108 -364 67 74 -499 58 682 -630 -196 663
6319 663 -35 -608 838 128 -551 82 160 -432 196 79 -363 1 849 -112 -139 457 228 -373 256 206 -433
6340 -433 644 218 -341 23 677 -213 -177 760 18 -188 499 112 -208 340 299 -462 131 573 -218 -300 609
6361 609 189 -265 419 43 -304 362 509 -432 153 321 -239 -58 652 -163 120 251 -86 -146 382 190
6381 190 -780 -76 274 -661 -54 278 -240 -3 530 -332 -589 731 -65 -521 128 558 -802 137 64 -350
6401 -350 178 505 -406 -561 555 -12 -612 272 169 -360 177 273 -493 77 372 -475 -447 248 -88 -826
6421 -826 25 38 -251 395 269 -447 117 363 -606 -254 257 -493 -367 498 -66 -451 230 -63 -567 323
6441 323 417 -570 -185 306 -178 -178 631 -103 -89 537 -53 -386 292 556 -460 -3 620 -348 -132 305 -90
6462 -90 -33 572 73 -328 299 441 -217 230 393 -456 -58 750 -74 -254 738 -152 -300 338 459 -177 245
6483 245 474 -110 365 479 -349 -346 275 -94 -308 347 189 -245 322 390 -99 458 682 -345 -182 572 99
6504 99 -394 328 -100 -528 12 68 -378 -105 561 -393 189 244 -147 -190 417 17 -201 99 -99 -476 -145
6525 -145 162 -523 -93 277 -147 -294 70 -368 -513 280 -17 -140 -35 -140 -672 -51 -81 -440 24 464
6545 464 -134 -297 379 -382 -748 228 68 -421 67 239 -275 -432 470 -108 -133 368 -235 -326 254 298 -467
6566 -467 -76 342 -312 53 238 -487 246 409 -115 -312 247 37 -212 228 402 -172 37 334 -418 -25
6586 -25 424 73 -251 256 81 -3 370 139 -419 354 279 -241 39 523 137 -147 197 -40 -148 564 -35
6607 -35 -481 699 303 -387 305 386 -77 -91 344 -103 136 448 92 -34 339 -51 -462 358 97 -574 0
6628 0 258 31 -79 339 11 -247 495 60 -620 -10 69 -303 260 125 -562 -6 384 -261 -452 217 -19
6649 -19 -431 64 -42 -300 405 275 -326 -159 272 -226 -204 322 -131 -518 -117 110 -92 130 -238 -381 38
6670 38 365 -283 -323 104 111 -215 101 108 -541 -28 171 -584 -16 168 -316 -172 308 -358 -536 164 -194 -162
6692 -162 148 -154 -304 186 286 -491 -32 473 -67 -244 291 1 -25 77 165 -258 139 395 107 -231 307
6713 307 -5 -155 487 77 -13 279 267 -357 441 390 -10 313 462 -176 320 546 -122 -62 581 -88 -346
6734 -346 -65 170 -367 115 244 -110 226 400 -300 -61 383 -261 -215 347 49 -196 234 0 -404 28
6754 28 350 -81 26 368 82 -323 614 90 -383 292 115 -338 -59 -17 -302 -129 454 -163 -441 -33 -130
6775 -130 -232 180 45 -663 -78 -119 -310 61 307 -307 -372 186 -194 -466 209 -2 -245 251 46 -637 -355
6796 -355 151 -131 -131 226 -133 -88 405 -112 -546 272 -73 -586 302 302 -306 -11 467 -420 -134 320 45 -170
6818 -170 216 -49 -568 -121 209 -247 24 322 -256 15 296 268 -197 430 446 -384 183 172 -290 43 142
6839 142 52 280 486 -18 -410 215 173 -199 186 201 -26 253 200 -88 34 180 -497 57 503 -53 -71 270
6861 270 -165 -550 291 287 -217 55 75 -182 -6 98 -81 -55 387 128 -311 421 278 -538 59 143 -290 219
6883 219 76 -57 -203 170 -247 -514 404 236 -279 275 76 -82 77 453 -205 202 355 -93 -270 128
6903 128 -7 -398 161 -148 -415 -97 131 -376 160 390 -308 -282 186 -219 -255 331 0 -380 81 77 -410
6924 -410 -54 260 -542 -443 454 260 -261 298 -162 -352 92 190 -216 11 79 -106 25 389 -97 -110 304
6945 304 127 -361 312 -122 -640 253 459 2 -79 529 -467 -99 341 -33 -31 154 134 -481 156 281 -200
6966 -200 66 240 -117 -125 516 -12 -339 310 180 -65 133 106 -502 102 194 -361 24 505 -56 -372 275
6987 275 105 90 225 178 -16 428 -3 -383 235 369 -330 -135 460 300 -314 9 246 -154 157 34 -519
7008 -519 -149 421 -45 69 110 -134 -21 319 91 -114 57 76 -240 354 548 -510 129 343 -108 -139 402
7029 402 -359 13 383 108 -67 6 94 -394 -144 284 -59 -292 126 151 -225 63 111 -360 262 246 -142 144
7051 144 481 -391 -52 196 -222 -198 438 101 -296 30 53 -218 125 141 -161 268 409 -326 168 525 105
7072 105 -126 266 -205 -419 152 189 -407 12 194 -170 -175 519 207 100 561 -118 -584 245 43 -545 273
7093 273 121 -168 244 321 -391 207 66 12 37 241 212 -333 248 479 -85 380 83 59 4 369 -321 274
7115 274 442 36 -322 510 190 -328 53 241 -142 -71 548 -211 82 379 -205 -71 211 162 -305 -71 298
7136 298 -234 -4 262 -356 217 364 -94 -209 370 54 -323 224 -221 -414 -35 146 -284 -133 287 -56
7156 -56 -353 122 110 -260 14 179 -326 162 22 -482 88 453 -497 -202 205 146 -99 -66 -102 -443 -155 138
7178 138 -292 258 -10 -287 -170 132 -68 -133 4 -63 -84 189 280 -296 51 363 -69 -344 296 -147 -328
7199 -328 167 18 -122 109 67 -155 357 390 -63 222 233 -397 178 81 -2 -219 163 -114 -350 354 200 -259
7221 -259 62 162 -370 63 256 144 18 353 -139 -221 208 234 -49 417 213 -118 -269 399 -312 -22 315
7242 315 58 -169 152 232 -275 117 -3 -448 78 144 -229 78 290 67 -192 305 26 -177 220 70 -290
7263 -290 144 615 -156 -95 271 -357 -123 160 240 -123 231 -75 -14 127 174 -91 80 242 -266 -304 393 -143
7285 -143 -24 110 -217 -87 288 163 -262 11 442 -418 -190 436 41 -55 193 224 -243 -39 300 -247 158
7306 158 110 -197 -132 -208 -366 -305 26 -27 -395 427 58 -155 -87 160 -139 161 263 -33 -267 119 -274 -232
7328 -232 454 -5 -284 263 -140 -173 -23 211 39 -13 354 214 130 234 156 -377 87 216 -162 128 225 70
7350 70 27 375 -332 -131 467 22 26 64 -48 -248 369 289 -164 209 255 -251 51 52 -72 -161 322 209 -162
7373 -162 285 329 -235 178 485 -19 -5 249 -74 -7 273 11 -95 202 -53 -34 135 -192 -77 -93 137 -180
7395 -180 -44 352 -136 -75 -18 -48 -218 313 100 -384 123 130 -317 -119 407 -261 -259 164 44 -67 27 151 -180
7418 -180 149 37 -415 48 237 59 -57 257 -57 -184 176 -217 -290 164 53 -230 -77 230 -58 91
7438 91 244 -73 -395 285 180 -248 294 107 -302 33 347 -389 -45 362 -220 -308 11 -23 -529 227 106
7459 106 -296 -79 316 119 -198 12 -123 335 81 1 -293 61 334 -406 77 92 -169 176 25 -276 284
7480 284 304 -328 -74 323 273 -263 158 188 66 115 301 -41 107 104 191 -76 390 -4 -111 55 2 253 -171
7503 -171 392 -152 14 236 -71 252 436 -46 -167 -15 -78 -57 168 90 -274 -75 113 44 -46 83 -62 84
7525 84 432 71 -246 168 238 -441 158 -156 71 -70 135 -90 -141 -56 -444 29 -184 97 -232 9 131
7546 131 -53 -148 207 -142 -55 211 -263 -169 92 94 -460 180 33 67 20 156 -231 -125 211 -22 -46 419 -258
7569 -258 38 324 325 -473 161 102 32 142 457 305 -514 32 62 -165 169 -2 -223 -205 82 -340 52 272
7591 272 -443 -26 64 -118 -37 240 -31 -68 298 177 -139 -119 159 -36 183 304 63 32 309 -305 -357 192
7613 192 -127 7 524 182 -260 159 381 41 -411 217 4 -33 230 -51 173 341 209 -257 125 -34
7633 -34 -192 63 57 -90 -134 179 53 29 167 407 69 -120 54 -81 -10 -11 -56 84 98 204 -33 -67 369 144
7657 144 -138 182 -110 -265 31 -197 -167 122 -123 -391 10 -183 -351 194 20 -230 -173 204 21 -125 74
7678 74 -125 -44 191 19 -244 123 65 -297 -35 -39 -13 -89 366 -531 -275 139 -43 -234 -302 148 -44 214 175
7701 175 -211 188 250 -81 -59 415 7 -85 171 -8 144 150 166 -68 295 136 -163 -73 138 -136 -174 254 -5
7724 -5 -365 -93 290 -231 -99 59 146 241 -15 -69 108 180 -197 -182 278 324 -368 73 228 -68 52 -61 -369
7747 -369 21 -8 -73 33 182 158 -117 401 225 41 43 377 63 -78 176 -56 -162 347 63 38 2 178
7769 178 -264 -12 196 -284 302 -28 -230 179 36 -45 14 316 -136 -191 72 -11 -450 -71 -44 66 -501 62
7791 62 -46 192 332 -11 -188 459 61 -119 -9 169 -92 404 170 -268 32 315 -17 -32 49 -345 -309
7812 -309 145 460 -103 -337 338 -163 148 70 -72 -263 133 -122 -323 171 145 -189 87 276 -256 -19 263
7833 263 -534 59 229 62 -51 82 116 -109 99 142 -123 104 164 -111 -10 81 217 -260 127 -80 -152 -19
7855 -19 12 -220 -3 96 38 38 -173 28 182 83 -284 19 29 86 -120 -84 90 0 -6 252 40 6 185 298 -433
7880 -433 312 19 31 10 -101 -283 49 -85 -128 -17 242 41 48 213 -26 -373 301 351 -152 118 42 -143
7902 -143 -39 272 22 -1 289 92 -150 -130 -235 -149 99 -8 -65 -48 -8 -181 30 148 -133 53 235 30
7924 30 -201 -44 -63 -105 220 -72 -148 -203 80 -105 92 -86 210 -139 133 93 -157 213 72 -133 321 41
7946 41 -253 -142 255 -112 149 300 -88 -23 53 131 -242 43 134 -99 -150 -198 29 23 -12 -276 -133 -82 28 -93
7970 -93 117 -111 189 0 223 -35 94 -170 -45 35 31 105 -52 10 13 266 310 276 -35 -293 39 -27 -189 -59
7994 -59 -50 -63 48 295 -7 362 20 39 -132 159 -147 115 -7 -35 6 123 189 -64 130 114 -192 -276 11
8017 11 -22 78 -212 -221 -168 301 14 -190 334 -42 7 -157 90 -10 163 98 54 -35 186 190 -194 -54 46 -29
8041 -29 65 217 -324 -141 -192 -61 13 257 272 -109 10 -99 117 118 28 -522 114 -33 6 294 -40 88 -25
8064 -25 -180 203 -166 -93 95 -44 48 159 -135 -145 162 106 -325 210 72 23 -125 340 251 -37 210 -158
8086 -158 -118 35 -89 -45 -69 160 -364 -6 -269 -98 -75 -195 -238 -170 126 -33 -46 -61 53 -24 -18 151 78 -145
8110 -145 69 -121 190 101 -42 -18 49 23 316 -122 14 -15 -200 221 -130 86 -26 -90 -337 437 -17 -40
8132 -40 -202 -9 -73 16 322 -104 145 117 55 -73 41 -108 -291 -113 50 -367 -61 276 -217 67 125 -241
8154 -241 -179 -67 91 5 97 -99 -329 323 175 -262 399 168 39 -53 325 -284 -217 183 121 -334 119 109
8176 109 -174 -29 42 -43 -82 -25 -383 105 259 -120 -392 -155 127 158 -54
8191e4
$$ Imaginary data points
##PAGE= N=2
##DATA TABLE= (X++(I..I)), XYDATA
0 0 0 0 0 0 -8 0 -8 8 -8 8 -16 16 -17 24 -32 37 -40 48 -58 71 -80 92 -108 125 -141 161 -184 208 -235 264
30 264 -298 334 -373 417 -466 517 -576 639 -705 783 -866 959 -1062 1177 -1304 1448 -1612
47 -1612 1801 -2018 2274 -2582 2955 -3422 4022 -4833 5980 -7728 10698 -16690 33393 -171637
61 -171637 -579175 15792 425409 64982 -280944 -42504 227822 71340 -258686 -199091
71 -199091 116845 64722 -269788 -180028 116220 -43390 -313894 -96644 198357 115626 -76122
82 -76122 -88704 20425 119817 61756 -66829 -28272 55359 -23838 -74875 -37948 -88277 -75125
94 -75125 90603 55626 -137669 -54270 154862 88060 -67305 -28099 88532 101210 -34062
105 -34062 -163067 -37877 140369 -17591 -221143 -56785 113134 -24406 -96231 51226
115 51226 104404 10324 -44563 7963 129042 120148 -85584 -116052 121868 124329 -150988 -160776
127 -160776 82371 128210 -8848 -76134 -35160 64279 95743 7823 15024 112887 22263 -101814
139 -101814 29096 113773 -59837 -113159 53321 86297 -43400 -96660 -22075 96762 108280
150 108280 -24952 -27587 136086 88148 -101640 -5080 177358 50865 -114087 -24970 79054
161 79054 25498 -56123 -50787 56006 110241 -23461 -89909 78981 122102 -67015 -71904 100471
173 100471 61243 -91974 -82642 -10729 3600 -11183 -67273 -84882 -5064 15793 -34565 -8498
185 -8498 -1978 -65409 2837 98362 -28782 -132805 7212 81495 -47241 -100996 -19808 28633
197 28633 986 -57318 -39340 76178 52045 -114554 -45203 177476 82181 -158037 -72318
208 -72318 131975 68351 -103448 -104845 33972 105843 -27340 -157495 -10568 150020 -2931
219 -2931 -134760 31894 129080 -20071 -93325 -4288 52493 31166 -35418 -72331 3518 47972
231 47972 -46234 -58883 48940 28981 -47559 13576 49903 -21215 -10496 42941 6169 -10876
243 -10876 21698 -5492 -30409 -5768 -4177 14290 41177 -38322 -75099 67142 106996 -52581
255 -52581 -76057 70035 87318 -14564 -47478 -8663 46591 44598 -45935 -51060 63233 41366
267 41366 -76988 -12117 99592 18831 -60524 8897 56797 29665 1383 -26561 -4525 52851
279 52851 7589 -57779 6373 42741 -29520 -17852 42924 -7916 -34954 37193 35570 -21748
291 -21748 -2141 19117 1473 5846 -10045 -25630 33346 27902 -73646 -39647 80072 26921
303 26921 -74144 -16080 54566 22186 -16704 -28110 -1986 55971 16245 -76441 -16537 71795
315 71795 -13290 -78441 13257 49391 -19887 -39174 -13009 13801 41707 -3196 -63599 2013
327 2013 60098 -20258 -54605 14720 12530 -26496 -3084 -9709 -36429 9752 25535 -29153 -19192
340 -19192 19848 -3458 -10489 4287 -17262 3774 40692 -33597 -75846 33792 65914 -48463
352 -48463 -65112 26525 41305 -12095 -43935 -22332 51983 51095 -64468 -63712 71952 49651
364 49651 -85095 -41508 71996 26050 -60558 -45010 15132 50441 10225 -64257 -19875 72682
376 72682 11949 -69512 5438 58543 -9002 -24031 12956 -6480 -8481 23690 3041 -9566
388 -9566 19357 5565 -9641 21183 10770 -5906 42570 29349 -46997 -2715 74342 7992
400 7992 -49594 18972 53953 4559 -25006 -14302 29661 62368 -5518 -59143 32625 80508
412 80508 -28740 -56669 47907 57550 -20113 -30765 -359 21664 28491 -15851 -35783 31469
424 31469 40135 -40306 -28367 40572 12178 -23484 6674 1 -20356 8920 2836 -30830 -430
437 -430 16970 -22492 -19413 1696 -18313 -970 24259 -28461 -41466 30433 20964 -48107 -21462
450 -21462 27896 5624 -16702 -21474 -20132 23636 29045 -45163 -35179 54996 26352 -55825 -17450
463 -17450 40794 14354 -14368 -18937 -11074 27417 17525 -50387 -24310 51719 4823 -60109 -7779
476 -7779 29013 -10536 -20508 -11250 -14322 9571 5905 -43206 -23358 28768 -5567 -36257 -830
489 -830 -1704 -19999 11775 5590 -34912 2324 38748 -10421 -27108 17104 21433 5338 3336
502 3336 -11351 9777 49180 -725 -47682 30241 71077 -15060 -40776 29982 45053 5686
514 5686 -12732 -8134 28270 44882 -20055 -42059 40841 49858 -35893 -27501 39505 20088 -16545
527 -16545 -5739 345 14532 28776 -12795 -29132 25983 28683 -20410 -4642 18973 -6563
539 -6563 3205 20004 -18331 -16105 33982 10218 -31378 1424 20519 -5329 -5559 -5347 -10259 20175
553 20175 11739 -46976 -18433 49759 5120 -52183 -7611 28085 1288 -13712 -16914 -6405
565 -6405 30176 11642 -44590 -8411 48986 -26 -39322 10202 27381 -4144 -7100 -6846 -2942
578 -2942 28577 12349 -38266 -8204 36920 -2806 -27910 4360 2360 -10827 4340 -13620
590 -13620 -31065 8858 12315 -35601 -22665 12447 -11007 -23893 -7627 -14456 -4277 15295
602 15295 -26900 -45819 19998 31587 -31687 -30692 15074 11677 -2803 -8703 -17959 13919 38948
615 38948 -14377 -34185 30154 33383 -24411 -8528 31845 13218 -5152 -5502 -8675 20788 34317
628 34317 -20156 -29980 31160 26258 -24812 -9953 15523 3679 9519 3741 -25962 -370 33609
641 33609 -4920 -24038 16927 16548 -12797 -1900 3092 524 24812 10721 -32119 1500 44360
654 44360 -832 -28800 13804 26528 2993 -2635 -11567 -2022 34050 11981 -34436 4102 41610
667 41610 -9198 -31450 15522 25863 1958 -5943 -16015 -1064 34665 5914 -38404 4309
679 4309 40926 -5066 -24533 5723 8601 6530 13326 -11102 -14672 22590 9534 -26951 4263
692 4263 26797 -9687 -16646 2995 -3423 3868 11604 -23348 -22697 26642 9955 -39863 -15891
705 -15891 17302 417 -10340 -14568 -23902 4926 17511 -29391 -30051 23986 7596 -39091 -13548
718 -13548 15461 -1140 -7943 -12142 -17637 13307 18387 -31793 -25279 30613 14397 -26836 -9085
731 -9085 6089 -1830 8666 304 -20017 7944 20873 -20181 -17526 24166 8294 -18103 -547
744 -547 3635 -1321 12636 -5328 -25885 15415 33484 -18117 -27328 15552 16158 -255 1083 -9792
758 -9792 -1465 26894 2321 -28888 12142 33328 -10186 -15349 16607 10937 174 4401 -7406
771 -7406 5325 32882 -369 -31009 14028 35469 -6229 -11895 11982 6952 7475 9387 -12808
784 -12808 -830 32081 2808 -25527 12907 25919 -9384 -8390 9296 3830 11888 8412 -23603
797 -23603 -6884 36189 7234 -29662 351 18594 -159 -137 -3705 -12615 13574 17306 -23494
810 -23494 -14035 26012 2052 -25670 2843 13087 -5573 -5124 -8925 -10482 18409 11103 -34688
823 -34688 -15852 29756 4011 -26720 -5463 4410 -1249 4550 -12213 -22168 14061 15726 -27543
836 -27543 -16132 19064 -1164 -19108 -2562 -2306 -1582 9575 -14641 -26814 14762 19341 -25024
849 -25024 -17948 14030 1170 -9247 -1763 -11629 -2592 18194 -9189 -25956 13500 16701 -22141
862 -22141 -11458 16175 2909 -4578 -3486 -14783 5110 27282 -10851 -30646 15648 25125 -13010
875 -13010 -12170 5840 2931 10655 5449 -20125 -719 28341 -4259 -22563 15807 18855 -11889
888 -11889 -5354 6590 2162 12995 4990 -20891 3763 32502 -4214 -24121 11930 18499 -1700
901 -1700 513 -2364 -4450 19617 11801 -22034 1024 30706 -2262 -20034 10385 15646 1797
914 1797 3068 -6497 -4901 25770 12279 -26915 -1878 31908 3407 -16030 2845 5655 6216
927 6216 12942 -8459 -13053 20567 12376 -23108 -1076 24792 -2082 -13815 2434 1621 5065
940 5065 9719 -16311 -14921 25302 11256 -30427 -8777 20062 1844 -8832 -5033 -10863 4574
953 4574 14968 -17594 -21113 18804 9016 -25975 -8488 10820 -3293 -3867 -4461 -16929 2461
966 2461 15789 -19572 -23084 17109 9472 -22383 -10006 2406 -4045 3022 -4017 -21383 2868
979 2868 17073 -20304 -22735 16840 9820 -17859 -8890 -1367 -1870 9085 -5136 -24527 6957
992 6957 23810 -16178 -23704 11275 10157 -6107 -756 -6277 -6025 14764 1861 -21316 7095
1005 7095 22890 -11602 -14875 13038 7649 -2135 4303 -4665 -580 22232 1993 -23059 10040
1018 10040 28187 -4676 -10229 9599 6262 7265 11623 -8418 -3096 27267 8420 -20314 8021
1031 8021 25439 -239 -3911 7713 2768 12015 14075 -12784 -4477 30134 9024 -20814 5812
1044 5812 20985 819 -821 3086 -3647 11595 14131 -15495 -6554 25844 4082 -21331 3217
1057 3217 14383 -1679 -346 -2903 -10918 10488 13536 -20343 -13193 20738 4252 -19123 -3103
1070 -3103 2197 -3213 5395 -6426 -20304 6808 13393 -21002 -15973 15077 819 -17147 -4974
1083 -4974 -4292 -4030 7353 -9918 -23975 7851 13074 -23800 -18556 11734 1189 -12636 -6153
1096 -6153 -11248 -5171 10686 -10315 -25236 8471 13231 -22056 -16159 9538 237 -6010 -1866
1109 -1866 -13087 -3585 16324 -7225 -22786 10826 16860 -13922 -9219 6942 268 4886 7570
1122 7570 -11689 -1332 22235 -2011 -18197 13375 19865 -5284 -2906 5204 675 12563 10448
1135 10448 -13948 1801 27893 203 -18814 10724 18894 -201 1559 1687 -1908 14967 10896
1148 10896 -15639 2213 28076 616 -16414 9559 13622 690 5937 754 -4664 16106 11202
1161 11202 -17065 -133 25117 1643 -12187 6400 5561 614 9031 -3497 -9712 15985 10825
1174 10825 -20642 -5212 19345 314 -10394 543 -2817 407 10001 -10280 -16682 15069 10917
1187 10917 -22275 -9666 13279 -1139 -7699 -1765 -8927 -118 10953 -14368 -19182 14911 9728
1200 9728 -22320 -10153 8779 -2929 -4867 -3052 -12841 294 12423 -15352 -20829 12748 8160
1213 8160 -18435 -7677 3386 -5740 -69 -887 -16250 348 15425 -12571 -20472 10068 8709
1226 8709 -10906 -3215 4 -4743 8138 2268 -18237 3129 21852 -7548 -17388 9986 10131
1239 10131 -4473 1005 -1171 -1575 14387 2436 -19417 5684 24403 -6313 -14615 9789 7693
1252 7693 -2008 3398 -3527 -2926 16574 3769 -19814 4245 21296 -4821 -9338 8690 3390
1265 3390 359 6862 -6663 -4552 20442 6196 -19434 2674 19216 -1855 -4835 5632 -590
1278 -590 4837 10345 -10237 -7419 21500 8029 -17941 1020 14387 -2209 -2166 3054 -3681 7228
1292 7228 10937 -15010 -10432 21338 7700 -17304 -486 10410 -2311 -637 -576 -7836 8857
1305 8857 13177 -16215 -12142 17108 5082 -14836 1380 6807 -3638 1485 -2499 -11746 8213
1318 8213 13988 -15040 -12956 13388 3194 -11172 597 719 -3247 7383 -3894 -18083 6302
1331 6302 15606 -13320 -12873 10447 1881 -9006 -1107 -4453 -1886 11380 -5691 -21617 6891
1344 6891 15994 -13912 -12570 8639 840 -5497 -654 -8978 -3118 14379 -4232 -20685 6172
1357 6172 13182 -12281 -8441 7660 -960 -1996 2012 -11376 -3226 17119 -2250 -19326 5986
1370 5986 12605 -8470 -4443 4519 -2431 5141 6894 -12947 -4714 18970 950 -15606 5983
1383 5983 10877 -5372 -693 1953 -3478 9420 8732 -15571 -4594 20891 1515 -14847 5186
1396 5186 9930 -1673 2140 -1430 -6144 12218 10555 -15383 -3986 20023 829 -12058 6075
1409 6075 7192 -605 5430 -2047 -7270 13895 12099 -14491 -3458 18183 2364 -7244 5060
1422 5060 1933 1182 11716 -2539 -10752 13434 13500 -13003 -3525 15019 1663 -4336 3553 -2549
1436 -2549 1875 12406 -7128 -14861 13076 12074 -14677 -6665 9256 -1188 -2699 184 -9736
1449 -9736 -531 12763 -9409 -17907 9368 7943 -14873 -6156 4452 -4746 -1672 -1061 -13631 -1052
1463 -1052 13389 -10112 -18623 7630 6704 -12042 -4584 596 -5116 3398 864 -16003 -1843 14861
1477 14861 -7444 -15555 6690 5380 -7906 -1366 -1579 -5069 8783 2913 -17694 -216 17712
1490 17712 -4811 -13868 5785 5407 -2704 2199 -4638 -5615 12803 4839 -17043 497 16936 -4468
1504 -4468 -10373 6329 2956 -1177 4244 -5948 -6179 14586 5336 -16904 685 15251 -3255
1517 -3255 -6871 4291 -723 1699 8806 -6650 -7881 15401 7450 -13499 1726 13927 -465
1530 -465 -1031 4841 -1504 7019 14462 -7206 -7207 18957 10454 -10654 2565 12477 2255 3650 3909
1545 3909 -5253 7782 14750 -8423 -8534 16293 6831 -12221 694 6982 -1616 1707 -1912 -11421
1559 -11421 4905 11338 -13277 -12991 11052 3049 -12130 -2209 -434 -4795 4550 -2211 -15107 2716
1573 2716 11774 -11830 -11577 9190 2067 -8043 217 -2577 -3678 9006 -1374 -16223 4462
1586 4462 13657 -9803 -10670 6756 1610 -3596 1004 -7302 -4816 11390 -1782 -17844 3725 12161
1600 12161 -10061 -9655 4902 -587 -1630 1790 -9680 -4484 13512 -1636 -17112 4066 11879
1613 11879 -7606 -5692 2995 -2753 2341 5622 -10375 -5387 13901 -806 -14952 3791 8822
1626 8822 -6149 -3072 1021 -5085 4634 6108 -12528 -5903 14959 439 -14159 2513 7668
1639 7668 -2385 1697 354 -6323 8722 10184 -10882 -2739 17658 3754 -8955 5899 8359
1652 8359 1893 7272 1541 -4545 12535 12519 -10249 -2070 17152 3773 -6437 3966 2716 60
1666 60 7979 -1561 -9493 9659 9031 -12731 -5149 10921 -1198 -6725 1660 -3651 -2205 8473
1680 8473 -4873 -13102 9036 10028 -11873 -5180 8199 -69 -1226 3345 -5484 113 12241 -3657
1694 -3657 -12215 9776 10369 -9364 -3009 6758 -1171 858 2228 -8412 -274 12551 -6113 -14793
1708 -14793 6851 7379 -9582 -4116 1649 -4786 1299 910 -12715 -2425 11712 -6236 -14332 4891
1722 4891 4246 -8122 -1861 -1042 -5302 5009 2066 -14736 -2483 12863 -4308 -12467 3607 2692
1736 2692 -4765 691 -3782 -7072 7251 3370 -15070 -3166 12132 -4391 -10416 3150 1422
1749 1422 -2346 3175 -4872 -7140 10533 5368 -14006 -1031 13066 -1542 -5782 4667 807
1762 807 1494 7782 -4161 -6166 13195 7867 -10936 918 12743 -488 -1976 4502 -1055 3548
1776 3548 10416 -5277 -7495 12829 8047 -10200 471 9001 -627 521 2602 -4972 3867 11974
1790 11974 -6385 -8640 12264 7081 -9079 395 6661 -154 3305 1724 -7282 5106 13081 -6612
1804 -6612 -8390 11395 5896 -7435 328 3543 -1208 5573 948 -10043 3600 11883 -7425 -9085
1818 -9085 8372 3125 -6823 37 -1392 -3574 6558 -336 -13184 2041 10548 -8237 -9638 5525
1832 5525 765 -4542 566 -5087 -5038 8159 -417 -14483 1291 10135 -7596 -8562 3819 -903
1846 -903 -1880 1808 -7856 -5610 9944 -196 -14849 1107 9030 -6457 -6288 1832 -2857 45
1860 45 3812 -9203 -6048 10636 -26 -13833 1567 7812 -4900 -3992 704 -4160 2609 5424
1874 5424 -9631 -5916 11713 1306 -11884 1443 6635 -3030 220 218 -5310 5206 8333 -8707
1888 -8707 -4804 12883 2861 -8440 3202 5568 -236 4550 842 -5897 8057 10683 -7870
1901 -7870 -3267 13138 3723 -5662 3730 3597 951 7291 251 -6929 8233 10417 -7875 -3566
1915 -3566 10964 2278 -4078 2598 -471 -265 8215 -1514 -9750 7066 9395 -8579 -4163 7704
1929 7704 337 -2279 2344 -4039 -1190 9219 -2229 -10809 6761 8610 -8121 -3973 5379 -585
1943 -585 325 2690 -6754 -1080 10911 -2262 -10958 6445 7783 -6248 -2837 2949 -2249 2253
1957 2253 2666 -8818 -1722 10515 -3073 -11689 4394 5414 -6037 -2323 -255 -4587 2837 2159
1971 2159 -11522 -3452 9345 -4268 -11590 1880 2047 -5613 -1309 -3267 -7182 3421 2433 -13121
1985 -13121 -4307 8990 -4063 -10125 842 422 -3610 1315 -3831 -7378 6483 4689 -11499 -2726
1999 -2726 9856 -1361 -6137 2897 480 -348 5396 -3190 -6154 9160 6789 -9542 -542 10115
2013 10115 -388 -2951 3656 -790 1932 8402 -3244 -6667 9955 7293 -7863 -93 8675 208
2027 208 27 2840 -2846 2866 10005 -3776 -7467 9798 6922 -7310 -102 6107 -512 2017 2343
2042 2343 -5956 2266 10421 -3964 -7871 8308 5477 -6007 446 2948 -1261 4304 2427 -7530
2056 -7530 2764 11283 -3814 -6976 8379 5515 -3670 1724 1657 -1311 7191 3062 -8510 2838
2070 2838 11639 -3740 -6680 6482 3146 -2829 1766 -2182 -3821 6722 897 -11544 -162 8077
2084 8077 -6271 -8488 1879 -1867 -3927 130 -7209 -7680 5399 -989 -14153 -1913 5563 -6743
2098 -6743 -7407 77 -3241 -1885 1876 -7685 -6550 7347 407 -11885 -159 6838 -3708 -3292
2112 -3292 1172 -3071 1555 5628 -6764 -5530 9276 2524 -9359 841 5743 -2223 -181 969
2126 969 -4690 3282 6859 -7184 -5595 9675 2465 -7656 1171 4329 -1280 2677 1142 -5454
2140 -5454 4686 8927 -6030 -4500 9987 3341 -5053 2698 3330 -49 5554 1077 -6075 5994
2154 5994 9633 -5719 -4208 9079 2778 -3281 2609 411 -433 6806 157 -7399 5877 8941
2168 8941 -6152 -3554 7728 1817 -1220 3313 -1223 -56 9184 590 -7395 6135 9554 -4536
2182 -4536 -2317 6088 1113 569 3646 -4130 -804 9335 -832 -9529 4199 6391 -5940 -3745
2196 -3745 1909 -2779 -438 1427 -8312 -3978 6982 -3314 -11445 1568 3197 -6445 -3387 -1171
2210 -1171 -4925 667 1825 -9345 -3989 7980 -2323 -9753 1892 3306 -3960 -433 -909 -4470
2224 -4470 3677 3841 -9012 -2650 8951 -1325 -7837 2112 1814 -2773 1663 -1755 -5844 4652
2238 4652 4216 -9612 -3348 7789 -1459 -6505 1714 -130 -1816 3523 -2742 -6432 6275 5308 -8509
2253 -8509 -2070 8125 -243 -3134 2583 -717 195 6300 -2531 -5984 7838 6082 -7103 -665
2267 -665 7462 -82 -856 3061 -2240 1341 7728 -2728 -6300 7250 5788 -6001 -475 5067 -335
2282 -335 1243 2753 -4251 1212 9193 -2562 -6582 7134 5534 -4994 279 3741 -592 3539
2296 3539 2820 -5684 1569 9677 -2635 -6495 6322 4231 -3905 1014 1052 -2298 4162 2411 -7866
2311 -7866 584 8712 -3512 -6548 4279 2023 -3526 1005 -1544 -3760 5226 1653 -8782 540
2325 540 8534 -3825 -6303 3166 519 -2128 2399 -2963 -4420 6337 1706 -9611 -114 7273
2339 7273 -3683 -4774 1942 -1863 -1372 3027 -4796 -5385 6190 1382 -9804 -475 5804 -3316 -3384
2354 -3384 904 -3461 -357 4039 -5561 -5737 6910 1835 -9005 -344 4601 -2989 -1218 1024 -4219
2369 -4219 1127 5384 -5918 -5392 7564 2263 -7637 190 3251 -1841 1437 743 -5381 2340 6466
2384 6466 -5954 -5145 7497 2478 -5403 1164 2011 -1687 3340 533 -5921 3538 7728 -5687 -4726
2399 -4726 7150 2111 -3226 2382 188 -1362 5599 579 -6485 4220 8381 -4602 -3249 6448
2413 6448 1695 -1306 3362 -641 -896 7192 887 -6831 4647 8520 -3868 -2309 5325 921 425
2428 425 4001 -2213 -945 8420 841 -7383 4158 7225 -3494 -1479 3924 -1099 839 3330 -4703
2443 -4703 -2154 8255 -200 -8353 2407 4775 -4201 -1263 1266 -3241 1247 2901 -7067 -3603
2457 -3603 7220 -1596 -8668 1293 2782 -3706 -645 -218 -4417 2067 3201 -7901 -3774 7396
2471 7396 -1237 -7268 1662 1428 -3375 1098 -1498 -6081 3444 4039 -8399 -3523 6729 -1275 -5784
2486 -5784 994 92 -2464 2727 -2070 -6368 4260 4144 -8122 -3368 6076 -1423 -4505 1154 -1864
2501 -1864 -1517 4088 -2530 -7044 4574 4519 -7335 -2134 5113 -1361 -1918 1827 -3025 -330 6439
2516 6439 -1999 -6628 6002 5340 -5531 -1019 4865 -401 915 3277 -3073 796 8177 -1535 -5404
2531 -5404 6286 5682 -3854 882 4627 -161 2899 3534 -4005 1591 9131 -1204 -5228 6018 4790
2546 4790 -2926 1659 2728 -1356 3961 3126 -5784 966 8271 -1974 -5391 5100 2891 -2992 1419
2561 1419 243 -3005 4527 2452 -7253 -153 7665 -2621 -5215 3524 803 -2548 2019 -2271 -4532
2576 -4532 5154 2064 -8201 -958 6319 -3303 -4505 2023 -1047 -1580 2762 -3581 -5126 5430 1975
2591 1975 -8206 -440 5342 -3044 -3262 1657 -2629 -900 3819 -4529 -5705 5362 1888 -8181
2605 -8181 -814 3964 -3131 -2132 802 -4504 -334 4390 -5308 -6321 5182 1487 -7747 -610 2313
2620 2313 -3335 -25 404 -5436 660 5376 -4976 -5577 5794 2035 -5845 1033 1821 -1988 2497
2635 2497 1466 -5458 2304 6800 -3992 -4099 6617 2307 -3287 2331 1444 -895 5045 1671 -5734
2650 -5734 3237 7614 -3651 -3306 5854 1539 -1661 2730 -426 -1765 5985 1606 -6382 3217 7392
2665 7392 -3429 -2404 4796 601 -542 3594 -1940 -1808 6917 1028 -6657 3190 6814 -3269 -1427
2680 -1427 3814 -513 580 3835 -3411 -2134 7282 820 -6833 2608 5383 -3209 -980 2245 -1987
2695 -1987 1210 3831 -5187 -3170 6865 -160 -7060 1787 3715 -3177 -243 758 -3722 2049 4034
2710 4034 -6431 -3480 6429 -198 -6752 1567 1720 -3132 648 -511 -5213 2192 4017 -6986 -3920
2725 -3920 5819 -1261 -5862 939 -174 -3036 1741 -1499 -6557 2239 3906 -6954 -3561 4998 -1540
2740 -1540 -4375 1142 -1373 -2371 3475 -1840 -6547 3449 4502 -6218 -2340 5004 -1170 -2177 2208
2755 2208 -2145 -1027 5834 -1561 -6444 4638 5040 -5241 -1107 4287 -746 -615 2520 -3227 -601
2770 -601 6701 -1239 -5863 4828 4822 -4333 -96 3448 -1080 1542 3472 -3567 5 7770 -1129 -5050
2786 -5050 4652 4293 -3330 1091 2623 -1309 3269 3673 -4803 422 7835 -912 -4715 4683 3644
2801 3644 -2074 1908 1417 -2240 3877 3707 -5711 32 7428 -1276 -4321 4003 1463 -2017 2615
2816 2615 -443 -3794 4640 3094 -6302 -471 6766 -2011 -3640 2949 -237 -1497 2974 -2078 -4627
2831 -4627 4774 2437 -7193 -1035 5321 -2627 -3156 2019 -2189 -1572 3312 -3604 -5667 4498 2079
2846 2079 -7773 -932 3762 -3116 -2280 1048 -3762 -982 3997 -3872 -5961 4573 1554 -6878 -626
2861 -626 2496 -2906 -940 758 -4994 -250 4758 -4220 -5528 4807 1731 -5907 201 1467 -2744
2876 -2744 1205 1208 -5373 775 5749 -4040 -4827 4995 1613 -4075 1273 908 -2276 3321 1488 -5784
2892 -5784 1642 6522 -3463 -3551 5030 1140 -2199 2527 124 -1640 5173 1609 -5667 2461 6846
2907 6846 -2837 -2147 4653 904 -963 3729 -1004 -1599 5909 2038 -5464 2724 6170 -2569 -1370
2922 -1370 4356 -413 228 4080 -2147 -1874 6676 1624 -5865 2334 5599 -2141 -564 3163 -1417
2937 -1417 886 4194 -3585 -2599 6681 1213 -5921 1906 3907 -2349 219 1616 -3079 1238 4140
2952 4140 -4684 -3700 5580 403 -5718 1082 2201 -3114 528 331 -4733 1309 4325 -5533 -3846
2967 -3846 5189 -519 -5359 1064 393 -3161 1394 -722 -5700 1486 3926 -5638 -3818 4052 -1046
2982 -1046 -4370 1083 -1305 -2898 2628 -1141 -6322 2012 4076 -5912 -3285 3980 -1063 -2896 1582
2997 1582 -2234 -2383 4205 -1147 -6290 2797 4083 -5194 -1970 3794 -1377 -1200 2465 -2513 -1594 5385
3013 5385 -688 -5494 3347 3901 -4065 -579 3144 -1151 772 2840 -3245 -786 6460 -247 -5154
3028 -5154 3955 4494 -2912 800 2365 -1258 2039 3690 -3715 -379 6999 38 -4236 3757 3415
3043 3415 -2204 1821 1574 -1989 3520 3943 -4102 -313 6810 -474 -3787 3690 1985 -1650 2394
3058 2394 805 -3094 3830 4003 -5001 -541 6136 -1046 -3214 2698 528 -1676 3253 -843 -3984
3073 -3984 4197 2826 -5903 -613 5212 -1968 -2839 2009 -1076 -1539 3501 -2140 -4806 3939 2559
3088 2559 -6144 -997 3747 -2342 -2105 1585 -2606 -1263 3568 -2877 -5416 3448 2048 -6058 -1068
3103 -1068 2464 -2590 -1118 952 -4146 -1051 3953 -3430 -5694 3626 1502 -5696 -628 1631 -2858
3118 -2858 238 949 -4719 -767 4465 -3340 -5106 3804 1218 -4174 472 681 -2573 1897 1214 -5040
3134 -5040 483 5360 -2813 -3908 4166 1388 -2470 1943 275 -1878 3415 2315 -4661 1384 5830
3149 5830 -2043 -2521 4212 857 -1168 2983 -218 -1761 4979 2481 -4846 1813 5938 -1686 -1391
3164 -1391 3473 57 100 3630 -1038 -2187 5514 2313 -4652 1789 5175 -1923 -946 2974 -952 390
3180 390 4049 -2101 -2498 5542 1503 -4695 1720 4152 -1735 -7 2100 -2277 833 3855 -3236
3195 -3236 -3180 5299 1239 -4808 1310 2533 -2619 535 905 -3497 1059 3666 -4208 -3754 4540 135
3211 135 -4495 1020 755 -2811 922 200 -4549 974 3496 -4731 -3711 3739 -574 -4094 711 -511
3227 -511 -2778 2024 -310 -5368 1058 3755 -4762 -3324 3286 -908 -3137 1182 -1938 -2967 2576
3242 2576 -661 -5676 1898 3720 -4494 -2326 2657 -1310 -1492 1953 -2194 -1859 4140 -427 -4993
3257 -4993 2114 3691 -3330 -1000 2727 -1205 242 2732 -2776 -1561 5169 173 -4572 2332 3677
3272 3677 -2683 160 2326 -1407 1536 3240 -3011 -1086 5642 129 -4158 2613 2918 -2252 955
3287 955 1695 -1786 2175 3766 -3365 -894 5933 -26 -3254 3205 2035 -1353 2142 1303 -2480 3072
3303 3072 4051 -3759 -822 5674 -269 -3054 2821 1428 -994 2757 192 -3158 3251 3550 -4324
3318 -4324 -1010 4771 -837 -2481 1912 -713 -1289 3035 -721 -4155 3205 2919 -4353 -906 3577
3333 3577 -1205 -1749 1821 -1907 -1486 3476 -1779 -4511 2818 2157 -4805 -923 2632 -2084 -933 1078
3349 1078 -2960 -1298 3773 -2436 -4473 2791 1881 -4377 -700 1782 -2754 -94 951 -4084 -830
3364 -830 3828 -2907 -4631 2692 1344 -4034 -217 689 -2576 978 1117 -4157 -437 4497 -2418 -3896
3380 -3896 2794 1188 -2749 704 208 -2370 2194 1774 -4357 98 4767 -1754 -2746 2916 677 -1702
3396 -1702 2037 236 -2193 3497 2058 -4237 752 4812 -1549 -2075 2885 124 -532 3024 -983
3411 -983 -2261 4317 1943 -4284 1052 4374 -1483 -939 2774 -445 61 3490 -1205 -2246 4343 2160
3427 2160 -3783 1019 4079 -1070 -374 2063 -1323 702 3925 -1582 -2250 4515 1792 -3722 1180
3442 1180 3031 -1496 474 1749 -2554 718 3712 -2409 -2711 4075 1014 -3564 950 1641 -1917
3457 -1917 1023 702 -3737 511 3688 -3174 -2924 3710 415 -3143 859 37 -2392 1448 -35 -4333
3473 -4333 739 3098 -3863 -2745 2758 -421 -3157 711 -975 -2865 1970 -394 -5296 713 2762
3488 2762 -3830 -2693 2466 -1228 -2124 1245 -1943 -2355 2876 -208 -5145 1183 3374 -3238 -1691
3503 -1691 2261 -1217 -792 1823 -1867 -1939 3610 -39 -4445 1627 3063 -2535 -320 2110 -1474 310
3519 310 2876 -2494 -1515 4322 43 -3959 1853 2605 -2024 418 1461 -1697 1578 3143 -2898 -995
3535 -995 4752 269 -3298 2394 2303 -1395 1348 1582 -1798 2380 3819 -2560 -769 4852 329 -2071
3551 -2071 2555 1417 -943 2582 850 -2346 2901 3421 -2637 -662 4478 173 -1574 2380 255
3566 255 -953 2962 99 -2852 2740 2971 -3165 -514 3398 -718 -1532 1823 -1066 -1031 2901 -877
3582 -877 -4021 2221 2522 -3352 -1009 2526 -1315 -1032 1341 -2215 -1569 3015 -1258 -4436 1898 2016
3598 2016 -3726 -1033 1361 -2111 -429 1013 -3294 -1242 3153 -1711 -4036 2166 1228 -3591 -358
3613 -358 852 -2251 457 1178 -3316 -1062 3690 -1873 -3846 2190 842 -2481 178 270 -2216 1184
3629 1184 1272 -3727 -374 3944 -1729 -3282 2088 476 -2025 1074 -101 -2426 2201 1824 -3820 -203
3645 -203 3841 -1263 -2000 2127 40 -1040 2028 -334 -2495 3206 1933 -3606 499 4006 -1003
3660 -1003 -1072 2396 -117 -151 2901 -717 -2057 3833 2277 -3123 1071 3372 -652 188 2415 -428
3676 -428 443 3654 -1037 -1933 3882 2195 -2847 1027 3011 -900 617 1586 -1945 401 3559 -1897
3692 -1897 -2312 3616 1219 -3217 821 1681 -1262 649 1434 -2896 279 3234 -2330 -2437 2742 798
3708 798 -2802 709 646 -1858 1439 597 -3399 605 3321 -2388 -2564 2672 -55 -2355 766 -565
3724 -565 -1970 1693 100 -4084 453 2954 -3165 -2520 2030 -808 -2192 706 -1267 -2481 2101
3739 2101 -181 -4146 530 2561 -2966 -1860 1676 -1347 -1374 1414 -1810 -2087 2823 92 -3930 723
3755 723 2532 -2248 -850 1948 -1462 -204 2047 -2344 -1808 3563 158 -3652 1206 2142 -1628 190
3771 190 1442 -1482 582 2669 -2382 -1473 3755 624 -2528 1805 2076 -1431 973 1091 -1392 1543
3787 1543 3141 -1861 -1173 4023 491 -2091 2155 1451 -711 1991 1046 -1866 1874 3293 -2533 -398
3803 -398 3649 300 -1606 1866 527 -778 2628 545 -2390 2027 2954 -2817 -773 3243 -316
3818 -316 -1138 1708 -345 -1118 2656 -241 -3078 1874 2572 -2388 -610 2455 -812 -953 1719 -1215
3834 -1215 -1180 2999 -429 -3258 1788 1945 -3010 -789 1537 -1751 -893 1110 -2429 -1447 2835 -1201
3850 -1201 -3653 1510 1363 -2841 -414 859 -2194 203 1149 -3082 -1411 3075 -1521 -3361 1284
3865 1284 797 -2670 90 346 -2018 857 1261 -3380 -988 2930 -1410 -3144 1872 691 -1988 806
3881 806 -213 -2133 1502 1564 -3199 -875 2877 -1392 -2384 1997 -210 -1506 1512 -443 -2628 2141
3897 2141 1434 -3215 -406 3178 -1211 -1257 1677 -384 -675 2262 -555 -2029 3040 2226 -2646 175
3913 175 3256 -617 -522 2359 -448 61 3147 -556 -1741 3492 2066 -2631 836 2780 -541 107
3929 107 2113 -1006 265 3258 -1104 -2333 3195 1644 -1897 784 1852 -1108 667 1459 -1893
3944 -1893 56 3180 -1501 -2071 2678 928 -2066 674 927 -1460 1025 793 -2698 207 2956 -2049
3960 -2049 -2626 2402 342 -2133 891 26 -2207 1446 509 -3170 185 2558 -2152 -2379 1922 -406
3976 -406 -1629 1096 -654 -2478 1594 372 -3593 160 2262 -2538 -1983 1503 -787 -1369 1079 -1367
3992 -1367 -2375 1921 115 -3911 118 2356 -2508 -1229 1248 -1427 -492 1363 -1521 -1977 2416
4007 2416 392 -3504 769 2100 -2066 -442 1066 -1508 -202 2120 -1987 -2076 3076 393 -2919
4022 -2919 1413 1464 -1540 692 1083 -1596 800 2775 -1740 -1478 3706 532 -1954 1946 1537 -996
4038 -996 1610 1354 -1614 1173 3249 -1616 -785 3579 437 -1440 1753 618 -784 2108 817 -2205
4054 -2205 1732 2711 -1780 -882 2873 158 -1095 1719 17 -1158 2605 246 -2523 1365 2682
4069 2682 -2068 -461 2550 -544 -944 1802 -540 -1186 2713 -36 -2611 1783 2361 -2215 -664 1858
4085 1858 -1058 -254 1538 -1615 -1128 2556 -368 -2919 1279 1098 -2586 -376 909 -1746 -437 922
4101 922 -2335 -1387 2602 -1021 -3388 1230 1168 -2328 -146 397 -2310 109 1068 -3351 -1441 2878
4117 2878 -1149 -2924 1156 292 -2199 197 195 -1994 626 1467 -2941 -992 2486 -1236 -2405 1175
4133 1175 228 -1802 1381 -115 -2616 1601 1513 -2888 -496 2470 -878 -1421 1760 -32 -1014 2165
4149 2165 -241 -2232 1959 2261 -2517 -112 2868 -619 -832 1809 -573 -665 2720 -493 -2213 2478
4165 2478 2076 -2375 398 2365 -836 97 1890 -1126 -148 3129 -720 -2164 2699 1688 -2337 677
4181 677 2026 -1240 672 1831 -1464 -66 3082 -860 -1712 2853 1420 -1756 1049 1176 -1237 953
4197 953 1497 -2029 110 2915 -1031 -2111 2486 598 -1591 1086 493 -1355 1347 1223 -3044 -135
4213 -135 2550 -1802 -2094 1900 -256 -1594 760 -368 -2109 1532 782 -3242 -284 2170 -2141 -1991
4229 -1991 1360 -898 -1355 1075 -1187 -2142 1393 408 -3218 -118 1546 -1995 -1209 1343 -904 -1176
4245 -1176 1375 -1408 -2152 2099 326 -3030 426 1728 -2047 -798 1308 -1280 -671 2023 -1529
4260 -1529 -2097 2578 545 -2893 704 1465 -1491 -66 1072 -1658 258 1792 -2001 -1729 2460 565
4276 565 -2501 1106 1041 -1086 908 1406 -1906 834 2759 -1318 -990 2944 639 -1693 1700 1027
4292 1027 -1118 1476 1022 -2180 823 3194 -1702 -738 3127 -87 -944 1597 315 -1056 1941 848
4308 848 -2240 1460 2602 -1655 -650 2397 -33 -801 1959 -189 -595 2408 496 -2725 900 2512
4324 2512 -1660 -339 1777 -330 -464 1650 -1239 -1220 2586 223 -2765 1265 1648 -1847 -469 1182
4340 1182 -1196 -307 1462 -1679 -1429 2151 -367 -2836 1052 1091 -2374 -6 604 -1918 74 1540
4356 1540 -2373 -1410 2171 -914 -2846 886 519 -2089 -27 30 -2293 182 1314 -2387 -1333 2177
4372 2177 -1276 -2328 983 38 -1715 795 -41 -2236 1104 1334 -2347 -820 2226 -916 -1580 1387
4388 1387 13 -1223 1133 -19 -2290 1274 1445 -2352 -615 2273 -993 -1154 1669 -182 -938 2312
4404 2312 -118 -1915 1782 1712 -2043 -84 2033 -767 -175 1645 -696 -273 2473 -145 -1734 2024
4420 2024 1406 -1876 745 1795 -489 194 1759 -1118 -199 2726 -531 -2048 2131 1084 -1598 575
4436 575 1262 -802 658 1913 -1683 335 3016 -815 -1709 1999 712 -1609 1196 846 -1105 1328
4452 1328 1509 -2179 -160 2669 -970 -1530 1830 696 -1519 886 389 -1563 1066 1010 -2560 -143
4468 -143 2416 -1232 -1845 1257 -197 -1344 1067 -520 -1945 898 728 -2764 -168 1849 -1498 -1270
4484 -1270 954 -946 -1316 1305 -1461 -2427 1501 469 -2741 90 1568 -1663 -755 979 -1352 -565
4500 -565 1628 -1131 -2272 1729 382 -2452 268 1513 -1695 -481 1127 -1340 -290 1806 -1380
4515 -1380 -1752 2103 649 -1981 938 987 -1394 354 972 -1634 226 2146 -1212 -1386 2132 519
4531 519 -1329 1272 791 -973 1364 1112 -1815 443 2330 -1165 -1079 2102 587 -1062 1233 493
4547 493 -1036 1374 934 -1713 877 2405 -1150 -818 2358 196 -826 1747 21 -778 1859 916
4563 916 -1972 1287 2734 -1282 -468 1997 -143 -402 1514 -485 -863 2274 432 -1843 1001 1702
4579 1702 -1401 -512 1546 -639 -348 1694 -838 -1594 2107 -140 -2284 932 1200 -1825 -236 1084
4595 1084 -1511 -73 1248 -1637 -1442 1997 -193 -2297 768 507 -1855 -109 529 -1708 -72 1171
4611 1171 -2072 -1402 1779 -607 -2421 618 311 -1632 320 66 -2308 413 1300 -2025 -1112 1780
4627 1780 -662 -1709 835 -80 -1624 802 108 -1858 761 1239 -2004 -1027 1696 -776 -1297 839
4643 839 -287 -1184 1149 -33 -1899 1394 1514 -1872 -86 1514 -284 -541 1388 -282 -555 1994
4659 1994 289 -1562 1665 1439 -1546 307 1973 -681 189 1708 -729 -420 2303 23 -1720 1524
4675 1524 1368 -1286 514 1383 -508 296 1494 -983 -195 2189 -56 -1324 1840 1216 -1464 577
4691 577 899 -1021 832 1389 -1162 3 2284 -588 -1285 1576 732 -964 803 508 -1287 914
4707 914 1178 -2054 -399 2093 -1020 -1261 1323 148 -1149 1002 -64 -1610 1124 1092 -2096 -506
4723 -506 1705 -1310 -1111 1084 -967 -872 1038 -706 -1944 1187 683 -2365 -286 1562 -1243 -851
4739 -851 433 -1077 -810 880 -1196 -1953 1081 477 -2078 -212 827 -1658 -786 766 -1075 -542
4755 -542 1358 -1351 -1485 1536 489 -2296 109 689 -1327 -48 725 -1517 -519 1936 -1186 -1546
4771 -1546 1315 815 -1810 661 1155 -803 608 616 -1470 313 1819 -776 -1233 1618 438 -1112
4787 -1112 917 487 -962 882 891 -1488 874 2103 -792 -558 1751 91 -754 1065 243 -586 1389
4804 1389 734 -1492 522 1976 -1204 -556 1512 62 -403 1381 102 -1028 1901 606 -1342 752
4820 752 1697 -953 107 1577 -280 -224 1280 -575 -989 1827 513 -1799 873 1575 -1127 -259 1058
4837 1058 -806 -94 1292 -1121 -933 1586 219 -1688 591 890 -1624 -58 489 -1051 161 1214
4853 1214 -1662 -962 1751 7 -1749 316 515 -1350 51 181 -1897 -1 1001 -1749 -1440 1410
4869 1410 -467 -1532 664 -103 -1469 316 -26 -1799 172 1194 -1841 -1081 1548 2 -1291 525
4885 525 -247 -1242 733 -88 -1661 777 1057 -1717 -644 1279 -516 -847 900 -213 -877 1462 -375
4902 -375 -1294 1081 1349 -1470 39 1393 -520 -296 1079 -336 -481 1690 -342 -1647 876 1095
4918 1095 -1104 653 1156 -441 263 1322 -601 -368 1840 30 -1250 1173 872 -769 452 1062
4934 1062 -760 639 1244 -885 -16 2344 59 -1062 1220 796 -805 660 500 -687 468 1225
4950 1225 -1473 -165 1786 -191 -1016 1237 323 -1039 662 164 -1242 875 1318 -1623 -51 1762
4966 1762 -876 -1237 864 -314 -631 1039 -29 -1363 625 711 -1758 -168 1448 -1062 -658 870
4982 870 -779 -762 991 -686 -1564 880 951 -1799 88 786 -870 -517 374 -989 -815 735 -926
4999 -926 -1662 951 458 -1567 -123 1123 -1110 -577 494 -986 -368 1092 -677 -1399 1091 135 -1472
5016 -1472 327 477 -1416 401 957 -1236 -43 1183 -651 -1244 1263 378 -850 801 231 -639
5032 -639 868 778 -1173 221 1638 -755 -773 1261 365 -978 1031 346 -753 1255 876 -1037 489
5049 489 1906 -489 -181 1234 305 -242 908 -4 -554 1456 776 -1273 597 1714 -452 -175 963
5066 963 -17 -167 1166 -33 -639 1587 430 -1405 312 1407 -631 -36 791 -663 152 1372 -685
5083 -685 -647 1369 274 -1380 596 867 -730 -72 611 -697 -207 1088 -853 -1119 1228 376 -1767
5100 -1767 356 344 -983 -31 412 -1259 313 1099 -1416 -1252 1364 61 -1547 364 209 -1016 459
5117 459 6 -1647 6 902 -1185 -1244 1063 -350 -1317 365 -213 -1186 704 -229 -1655 301 1161
5134 1161 -1514 -823 754 -551 -696 602 -444 -677 1081 -128 -1446 351 1333 -1118 -350 1032
5150 1032 -496 -402 963 -432 -457 1511 -45 -945 814 1122 -1017 87 1068 -380 261 1094 -584
5167 -584 -293 1734 134 -829 976 1423 -720 379 1448 -567 350 1153 -563 -78 1932 238 -1469
5184 -1469 1136 612 -668 514 637 -495 273 1066 -973 -255 1490 90 -882 845 546 -449 528
5201 528 420 -1033 800 1060 -1329 -22 1625 -347 -768 763 56 -433 529 -10 -1242 647 750
5218 750 -1476 -363 1044 -654 -786 894 -168 -561 813 -235 -1053 777 363 -1628 -326 842
5234 842 -567 -693 511 -719 -574 898 -216 -1478 759 364 -1379 -174 581 -842 -176 198 -878
5251 -878 -540 1125 -570 -1288 616 444 -1260 -73 424 -1111 58 436 -1492 -444 1112 -459
5267 -459 -1008 768 160 -1226 186 385 -946 344 506 -1165 -163 1294 -599 -741 1049 173 -884
5284 -884 564 197 -679 546 664 -1210 92 1533 -357 -461 1112 498 -579 917 232 -542 1152
5301 1152 783 -1079 474 1370 -563 -633 1124 43 -432 654 37 -624 1342 847 -977 518 1338
5318 1338 -614 -98 1046 -257 204 1168 -56 -672 1240 416 -663 329 816 -723 16 791 -490
5335 -490 -298 1297 -438 -785 1029 203 -976 357 443 -664 375 538 -847 20 647 -694 -1040
5352 -1040 790 78 -1037 725 247 -653 323 40 -1258 -281 905 -964 -801 760 -353 -1071 336
5369 336 38 -854 433 34 -1309 -98 1089 -971 -645 771 -589 -1094 524 -197 -1076 834 76
5386 76 -1380 152 911 -1079 -575 812 -436 -706 803 -539 -565 905 101 -1339 433 1207 -925
5403 -925 -250 852 -555 -130 988 -222 -502 1248 383 -1097 693 594 -574 165 792 -540 285
5420 285 1119 -622 -296 1228 183 -795 1058 823 -766 457 635 -426 642 1339 -589 -102 1398
5437 1398 -214 -685 528 539 -642 742 948 -654 281 1031 -641 -7 1232 -24 -577 811 121
5454 121 -603 658 132 -791 394 928 -831 -223 1084 -268 -704 582 -182 -737 669 -20 -971 463
5472 463 846 -1284 -296 813 -597 -617 560 -464 -527 892 -182 -1143 278 281 -1321 -74 704 -552
5490 -552 -495 518 -915 -920 564 -492 -1306 589 237 -996 -442 492 -708 -312 671 -904 -505 880
5508 880 -192 -1024 457 217 -990 30 260 -726 64 661 -1116 -380 1070 -326 -957 590 -45
5525 -45 -992 474 291 -871 84 698 -1089 77 1195 -196 -370 840 218 -554 854 13 -855 682
5543 682 610 -957 211 1213 -276 -291 894 68 -236 1127 -281 -559 848 614 -879 223 1101
5560 1101 -316 -204 989 -192 -100 764 -57 -593 1119 768 -929 447 850 -487 -177 1073 -323
5577 -323 -73 1151 -219 -627 946 501 -988 388 592 -550 38 669 -834 49 1038 -603 -680 764
5595 764 417 -799 357 491 -993 -80 612 -951 14 768 -750 -872 1031 241 -752 22 39 -891
5613 -891 203 230 -1220 147 505 -921 -826 313 -672 -988 540 -283 -875 407 -38 -1251 307 591
5631 591 -1114 -535 517 -172 -580 631 -585 -563 705 -96 -1210 263 465 -765 -370 726 -371
5648 -371 -570 622 -606 -759 977 106 -1218 260 966 -912 23 337 -420 -177 900 -545 -630 1020
5666 1020 -10 -669 368 893 -399 536 832 -463 147 798 -239 1 1198 -129 -567 786 606
5683 606 -692 534 574 -460 333 1057 -254 -121 1118 -68 -268 739 165 -549 694 337 -632 758
5701 758 801 -606 -384 981 -497 -446 615 -223 -482 681 103 -576 945 620 -747 -36 779 -333
5719 -333 -368 469 -325 -777 866 138 -995 124 514 -618 -259 647 -534 -314 569 -681 -483 647
5737 647 185 -962 137 419 -997 -41 466 -739 -368 788 -633 -538 524 -61 -770 529 233 -1229
5755 -1229 84 189 -747 -176 382 -789 -405 779 -601 -917 603 215 -744 351 420 -644 149 549
5773 549 -1031 -224 854 -681 -677 616 -39 -932 781 380 -723 529 540 -807 81 1071 -292 -389
5791 -389 667 -72 -37 611 271 -535 575 236 -735 184 948 -145 -205 912 -104 -312 816 -29 -850
5810 -850 853 715 -928 144 1097 -315 -181 879 -193 -144 638 -160 -453 907 427 -903 209
5827 209 863 -643 12 1048 -262 -231 960 -158 -698 851 38 -791 90 219 -555 333 772 -619
5845 -619 -62 1005 -782 -801 608 324 -974 459 192 -903 -12 421 -788 145 849 -600 -820 707
5863 707 -202 -721 493 161 -723 286 281 -986 -163 594 -671 -574 632 -329 -501 379 -223 -866 127
5882 127 39 -884 21 550 -662 -446 246 -430 -539 634 -461 -824 273 164 -813 197 614 -626
5900 -626 -278 577 -689 -56 564 -348 -214 476 149 -677 342 444 -713 -31 561 -437 67 470 -384
5919 -384 -511 1122 -145 -738 346 435 -634 385 607 -388 133 740 -312 -210 1029 -177 -461 600
5937 600 469 -864 590 277 -480 214 864 -267 -120 1075 -123 -313 820 221 -195 451 349 -546
5955 -546 287 621 -585 -59 785 -85 -243 576 107 -298 525 -8 -767 348 494 -771 -187 388 -311
5974 -311 -391 484 -543 -708 845 166 -999 406 472 -984 93 270 -439 -199 712 -479 -735 520
5992 520 -518 -866 358 343 -1046 139 219 -430 -94 226 -688 -688 519 38 -622 120 182 -1051 -302 99
6012 99 -682 31 414 -742 -490 406 -85 -655 219 177 -533 161 -45 -722 -44 553 -651 85 689 -231
6032 -231 -659 669 223 -569 440 -84 -864 622 334 -529 89 649 -376 -508 551 -135 -348 690
6050 690 6 -483 633 691 -601 72 875 -338 -51 498 84 43 598 21 -808 658 432 -570 271
6069 271 800 -203 -274 753 -105 -91 843 -13 -567 422 323 -601 241 275 -537 23 393 -491 -96 447 -43
6090 -43 -390 738 230 -702 326 377 -200 -117 490 -555 -277 617 -436 -475 451 107 -657 101 160 -646
6110 -646 173 193 -773 166 918 -439 -424 456 -145 -439 550 113 -523 478 340 -822 -163 159 -673 -457
6130 -457 493 -277 -759 283 -146 -593 395 -11 -752 -262 383 -329 -192 360 -315 -350 728 -105 -638 611
6150 611 -285 -475 -14 621 -610 -140 532 -321 -107 665 -241 -574 633 112 -618 481 350 -466 302
6169 302 333 -617 17 782 -515 -660 713 89 -714 447 588 -507 385 232 -398 256 677 -321 -136
6188 -136 914 26 -236 519 182 -373 388 346 -517 382 419 -377 -238 683 179 -157 364 114 -226 483
6208 483 197 -571 408 791 -447 1 558 -261 -313 491 -47 -422 638 175 -649 55 259 -470 115 271
6228 271 -107 -272 526 -434 -374 515 -44 -490 38 471 -436 -94 538 -272 141 247 -407 -360 561 -235 -583
6249 -583 219 29 -752 22 301 -178 128 238 -624 -504 555 -391 -413 361 67 -618 272 152 -590 36
6269 36 459 -509 -423 638 -390 -590 309 -76 -569 415 -151 -473 50 159 -531 -73 426 -238 -14 362
6289 362 99 -532 373 4 -443 399 534 -668 253 477 -51 -324 555 -343 -254 524 238 -380 254 470
6309 470 -242 350 431 -250 18 611 112 93 586 84 -257 557 464 -317 122 329 -40 235 439 -273 -121
6330 -121 490 62 -364 756 405 -558 200 469 -668 207 23 -449 -3 468 -177 -559 380 68 -413
6349 -413 36 153 -646 41 511 -353 -259 614 -396 -371 524 -132 -160 215 -140 -688 325 63 -755 86
6369 86 449 -282 -401 522 -198 -229 539 -68 -501 141 148 -522 -104 456 -505 -388 304 -338 -184 271 -177
6390 -177 -391 160 298 -574 130 483 -377 -325 314 -229 -199 223 -225 -406 246 126 -501 244 250 -341 -60
6411 -60 114 -151 130 487 -322 -448 594 335 -497 -146 -40 123 416 265 -57 48 651 -388 -236 486
6431 486 -141 -566 479 170 -378 237 19 -263 -176 540 -241 -76 532 89 -236 507 478 -340 409 190
6451 190 -132 260 725 -219 -168 435 118 134 308 -183 -322 304 408 -565 -13 161 -566 102 273 -240 -335
6472 -335 380 -137 -460 628 268 -461 96 246 -409 -349 248 -338 -194 330 -369 -580 606 131 -531 103
6492 103 147 -436 83 285 -361 -278 51 -367 -271 152 -1 -363 187 280 -297 -88 29 -454 28 243 -677
6513 -677 -402 446 -236 -346 266 -56 -571 99 149 -374 107 419 -279 -40 577 -105 -289 356 -124 -544
6533 -544 183 101 -491 -71 326 -326 -217 488 -127 -236 297 62 -84 542 343 -408 287 370 -339 16 555
6554 555 -581 -198 670 -87 -587 429 142 -445 579 430 -429 174 267 -71 -88 631 -210 -286 584 -212
6574 -212 -265 627 120 -60 370 244 -8 77 171 1 -22 297 -2 -424 715 -24 -265 272 258 -464 494
6595 494 465 -99 -234 568 -63 -676 312 64 -329 460 223 -373 -103 35 -100 17 683 -132 -535 183
6615 183 -3 -344 124 -178 -55 251 -28 -625 90 302 -304 -354 306 -29 -337 -54 -82 -180 355 387 -238
6636 -238 -107 334 -293 -195 -164 122 -48 53 213 -199 261 81 -313 66 -53 -492 -119 332 -127 -30 322
6657 322 -291 -281 85 18 -418 263 238 -204 80 90 -357 -240 443 -18 -178 211 -35 -273 461 153 -263
6678 -263 111 117 -90 59 652 -182 -263 277 -55 -198 403 -116 -319 72 133 -469 31 325 -262 -65 469
6699 469 125 -72 193 -11 -346 260 357 -360 99 447 -362 -62 276 1 -22 429 -15 -326 344 353 -356
6720 -356 321 279 -432 -32 248 -160 -32 199 -184 -479 49 6 -572 215 135 -349 36 237 -58 36 359
6741 359 -165 -189 206 113 -180 -48 204 -162 86 -132 -123 -266 193 -62 -202 220 72 -298 210 -133 -377
6762 -377 -1 -80 -219 80 405 -602 -332 235 -235 -447 427 -47 -419 -23 329 -426 7 458 -409 -211
6782 -211 129 -288 -416 109 -20 -36 196 272 -269 148 387 -272 -361 389 -86 -226 368 -316 -110 85 300
6803 300 -420 263 57 -348 -223 -123 -145 -9 329 -4 -63 536 148 -441 -18 443 -134 -311 436 -219 -36
6824 -36 450 -284 107 447 -156 -141 486 219 -146 24 109 -250 81 440 -41 -182 421 76 -200 296 137
6845 137 -312 163 213 -295 37 330 -372 -91 508 -445 -539 135 74 -244 196 -136 -683 112 256 -388 -237
6866 -237 126 -169 -288 323 -100 -318 114 61 -206 10 93 -393 -74 221 -229 -230 252 -239 -102 242 -17
6887 -17 -23 198 137 -85 51 307 -281 -26 6 -356 57 354 -248 -356 200 -60 -323 302 204 -317 -150 211
6909 211 -314 -344 371 -160 -279 290 54 -314 309 163 -218 -41 233 -224 -132 348 112 -300 195 446 -307
6930 -307 249 -159 -254 37 398 34 -119 486 3 -292 297 7 -316 169 190 -39 170 269 -348 165 568
6951 568 -169 -129 309 189 -142 283 -66 -215 190 296 -274 114 443 -369 -71 195 -124 35 389 -338
6971 -338 -178 248 -64 -438 71 416 -188 -53 190 -571 -49 495 -265 -5 380 -3 -329 5 223 -373
6991 -373 -118 292 -197 -36 439 -108 -171 255 15 -309 57 3 -397 36 159 -280 -93 403 -271 -21 192
7012 192 -230 -454 20 -174 -262 -183 -137 -582 122 426 -283 -302 333 -30 -426 -147 -104 -160 113 122 -363 179 233
7035 233 -214 -455 -14 -75 -273 191 69 -170 180 110 -343 110 451 -410 -18 450 -339 -207 184 98 -140
7056 -140 229 6 -535 246 -84 37 139 255 144 -325 345 -199 27 207 349 -178 56 296 73 34
7076 34 234 -492 322 400 -287 -198 300 105 -330 196 84 -208 231 194 -194 -5 440 -228 -231 320 143 51
7098 51 271 149 -113 387 230 105 -66 11 -236 -476 135 -81 -28 125 -25 -217 231 176 -178 -85 297 -82
7120 -82 -106 126 -450 -70 -92 184 -394 218 4 -146 22 141 -315 8 113 -183 -152 149 -138 -239 106
7141 106 -195 -105 1 39 -374 -277 -6 -254 -156 275 -299 -128 329 -12 -188 111 186 -176 88 241 -203 -148
7163 -148 103 -404 -105 279 -130 -504 45 -19 76 594 298 66 29 91 -305 216 455 -97 -67 380 64 -42
7185 -42 108 348 -118 -77 279 38 10 260 -121 -59 305 193 -149 219 209 -121 194 -41 -91 43 418 -30
7207 -30 43 291 262 -225 229 75 -321 297 298 -225 264 359 -321 86 444 -50 34 280 -83 -408 397 299 -401
7230 -401 87 147 -272 114 211 -227 -488 232 -1 -396 163 157 -54 -15 99 -405 308 175 38 -275 151 -7
7252 -7 -290 138 64 -271 -28 135 -47 -140 -165 -173 100 193 -266 71 129 55 95 -153 140 -132 -83 -215 -352 47
7276 47 151 -280 1 158 -260 -194 137 -43 -185 70 -170 -265 182 141 -154 -265 117 -5 55 341 -82 -211
7298 -211 -33 259 -67 186 361 -420 -102 33 -124 44 478 93 -282 202 167 -103 326 27 -15 8 257
7319 257 -509 -119 436 -170 -72 98 -84 -103 202 93 -185 315 223 -352 109 122 -170 40 325 -253 -29
7340 -29 181 84 99 225 277 -383 -201 270 -268 -8 270 203 -26 77 -36 -128 126 106 -27 162 216 -383 -58
7363 -58 -58 -131 -202 270 -29 -418 189 150 -19 68 98 -434 44 28 17 -135 168 -106 -124 210 242 -361 31 250
7387 250 -461 -54 150 -367 46 243 -285 -321 35 7 -240 -79 60 -20 -164 314 -146 168 63 -196 -289
7408 -289 369 219 -472 208 132 -109 402 93 -150 -7 344 -404 13 543 256 -25 156 69 -379 8 98
7429 98 45 35 735 -255 -147 334 -39 198 50 -161 74 110 -6 -137 101 458 -81 -64 298 -77 -41 -27
7451 -27 251 164 395 343 -226 151 100 -44 207 140 268 60 266 129 56 429 123 22 246 146 -447 -147
7473 -147 -105 -35 -195 135 42 104 271 -232 -10 173 363 -154 -114 -157 -455 8 54 -178 -188 183 -187 108 259
7496 259 93 -155 -25 -71 -98 -139 -191 -193 -103 -31 -24 -429 421 -124 -437 47 207 -208 -80 80 -122 -238 337
7519 337 -199 115 213 69 -265 51 -143 -273 202 59 -85 -271 -140 -180 55 -96 89 -268 315 268 -160
7540 -160 63 261 -127 -87 130 -432 -122 -59 -287 -91 101 -226 -248 354 -16 -185 -131 40 -143 -78 561 -294
7562 -294 -153 62 166 -128 -117 136 -56 193 138 -145 -52 326 5 -159 176 -191 -49 63 79 -271 -25
7583 -25 -29 5 156 259 54 -48 98 23 -303 177 245 -247 77 -40 31 90 122 114 272 298 192 155 120 -95 -157
7608 -157 58 266 98 182 165 -178 6 320 -103 -166 194 -174 -185 9 -53 -249 3 -49 -439 75 95 5 93
7631 93 295 -147 -41 274 -139 -329 282 98 -285 -118 294 -48 -322 5 -90 -195 -102 -155 -137 162 48 -369
7653 -369 287 102 -299 -48 108 -341 -22 -68 -51 -41 17 12 3 -57 59 64 63 -113 -228 218 334 -205 -31 125
7677 125 -286 -344 15 16 -107 26 67 -28 -93 41 -334 -291 207 145 34 219 -129 -263 91 -49 -298 75 150
7700 150 -305 240 331 43 121 391 339 188 251 283 255 174 140 95 -112 210 -57 116 461 -255 -172 157 121 -41
7724 -41 148 49 -240 179 61 -108 -170 4 -251 85 60 79 -127 64 -69 87 -29 10 81 129 133 285 -21
7747 -21 -144 43 -113 -251 282 -40 98 -50 -185 -173 29 -12 -95 37 -8 172 -213 -34 -365 43 -28 93
7769 93 301 -47 -129 -28 54 -154 -99 7 -145 -20 -218 115 -56 210 254 4 -132 105 71 -63 240 -87
7791 -87 -368 220 185 -145 -103 -74 -126 325 233 -299 -242 234 -89 -75 228 117 -244 112 -72 -286 -3 -94 7
7814 7 -44 178 -173 -42 236 227 -193 331 54 -264 -135 74 -241 103 -12 -82 -104 403 506 -122 57 59 -93
7837 -93 106 28 202 -151 149 35 -25 181 49 -32 229 85 -211 -111 232 -307 275 201 91 -53 146 -225
7859 -225 -82 6 -128 -24 50 -97 -37 6 37 -34 -281 152 127 -203 300 50 -231 79 52 -161 200 254 151
7882 151 -115 282 113 43 133 23 -208 226 22 8 71 -256 -429 -32 165 -192 109 -136 -63 -159 -47 -60
7904 -60 43 39 41 95 -216 30 -317 -19 263 2 45 141 -161 -67 196 185 -152 62 157 -83 236 288 -286 -2
7928 -2 -100 43 -243 307 -185 -159 172 -212 23 -119 171 -145 -21 287 -165 71 332 -28 -140 156 352
7949 352 -213 -193 373 -161 237 116 -26 -79 124 -52 -23 145 189 -117 577 156 -67 149 11 -97 -197
7970 -197 -91 211 -193 301 -29 -72 345 23 -244 -141 34 -128 200 -338 -51 -23 156 -207 -302 180 -281
7991 -281 -254 20 69 45 -257 -68 -36 -250 127 -103 -19 80 -17 -178 -47 136 -151 -272 23 -254 171 20
8013 20 -234 -167 44 37 -256 78 -274 -39 95 92 221 -185 78 -144 -202 32 153 -299 88 9 -139 154 39
8036 39 -108 -100 -128 -60 82 -17 -87 108 -37 -46 -251 48 -16 -117 -117 -90 -5 83 -186 -27 -161 -300 -44 -186 -63
8061 -63 -87 -67 105 247 -169 247 15 -67 -6 127 49 212 -57 -40 161 140 194 -199 -92 193 -68 45 136
8084 136 46 107 -61 202 -271 -243 94 88 -127 247 -191 265 170 -335 -176 74 25 3 70 -21 -294 -201 -51 -270
8108 -270 -85 267 -312 171 87 -21 -184 84 213 -220 -116 -336 -151 60 -63 87 107 186 0 -295 31
8129 31 56 71 22 152 -219 -168 359 -64 -317 -96 325 -34 -137 -36 28 -4 83 143 -98 30 -184 -145 82
8152 82 40 -89 101 -168 -83 277 68 -152 149 151 -43 -143 -157 187 42 17 48 -13 162 131 -114 -111 15 -62
8176 -62 26 110 160 -221 -22 134 -230 80 -231 -284 97 -43 -126 -382 84
8191H4
##END NTUPLES=NMR FID
##END=
