##TITLE=1H_CA-8652-1
 CDCl3, 8 sc, 
 26.9.2019
##JCAMPDX= 6.0         $$ Bruker NMR JCAMP-DX V2.0
##DATA TYPE= NMR FID
##DATA CLASS= NTUPLES
##ORIGIN= UXNMR, Bruker Analytische Messtechnik GmbH
##OWNER= root
$$ XWIN-NMR		Version 3.5
$$ Thu Sep 26 13:50:27 2019 Russian Standard Time (UT+4h)  she@DPX200
##.OBSERVE FREQUENCY= 200.1315
##.OBSERVE NUCLEUS= ^1H
##.DELAY= (6, 6)
##.ACQUISITION MODE= SIMULTANEOUS
##.ACQUISITION SCHEME= undefined
##.AVERAGES= 8
##.DIGITISER RES= 18
##SPECTROMETER/DATA SYSTEM= spect
##.PULSE SEQUENCE= zg30
##.SOLVENT NAME= CDCl3
##.SHIFT REFERENCE= (INTERNAL, CDCl3, 0, 15.7039)
##AUDIT TRAIL= $$ (NUMBER, WHEN, WHO, WHERE, WHAT)
$$ ##TITLE= Audit trail, XWIN-NMR		Version 3.5
$$ ##JCAMPDX= 5.01
$$ ##ORIGIN= Bruker BioSpin GmbH
$$ ##OWNER= she
$$ F:/spectra/data/she/nmr/H-F/1/audita.txt
$$ ##AUDIT TRAIL=  $$ (NUMBER, WHEN, WHO, WHERE, WHAT)
(   1,<2019-09-26 13:49:09.29 +0400>,<she>,<DPX200>,
      <created by zg, POWCHK disabled, PULCHK disabled
       configuration hash MD5:
       00 E9 B6 7A A2 85 ED C7 34 08 36 98 17 FE 4E 26
       data hash MD5: 16K
       64 FD 77 FD 66 C9 52 3E 85 3F 6E B0 5D EB 0A 4E>)
$$ ##END=
$$ 
$$ hash MD5
$$ E3 52 BC A1 7E F5 C5 BE A5 18 44 EE 4A BC C4 45
##$RELAX= 
##$RELAX= 
##$RELAX= 
##$RELAX= 
##$RELAX= 
##$RELAX= 
$$ Bruker specific parameters
$$ --------------------------
##$DU= <F:/spectra>
##$EXPNO= 1
##$NAME= <H-F>
##$PROCNO= 1
##$TYPE= <nmr>
##$USER= <she>
##$AMP= (0..31)
100 100 100 100 100 100 100 100 100 100 100 100 100 100 100 100 100 100 
100 100 100 100 100 100 100 100 100 100 100 100 100 100 
##$AQSEQ= 0
##$AQ_mod= 1
##$AUNM= <au_zg>
##$AUTOPOS= <>
##$BF1= 200.13
##$BF2= 200.13
##$BF3= 200.13
##$BF4= 200.13
##$BF5= 200.13
##$BF6= 200.13
##$BF7= 200.13
##$BF8= 200.13
##$BYTORDA= 1
##$CFDGTYP= 0
##$CFRGTYP= 5
##$CHEMSTR= <none>
##$CNST= (0..31)
1 1 145 1 1 1 1 1 1 1 1 1 1 1 1 1 1 1 1 1 1 1 1 1 1 1 1 1 1 1 1 1 
##$CPDPRG= <>
##$CPDPRG1= <>
##$CPDPRG2= <>
##$CPDPRG3= <>
##$CPDPRG4= <mlev>
##$CPDPRG5= <mlev>
##$CPDPRG6= <mlev>
##$CPDPRG7= <mlev>
##$CPDPRG8= <mlev>
##$CPDPRGB= <>
##$CPDPRGT= <>
##$D= (0..31)
0 1.2 0 0 0 0 0 0 0 0.06 0 0.03 0 0 0 0 0.0002 0 0 0 0 0 0 0 0 0 0 0 0 
0 0 0 
##$DATE= 1569491348
##$DBL= (0..7)
120 120 120 120 120 120 120 120 
##$DBP= (0..7)
150 150 150 150 150 150 150 150 
##$DBP07= 0
##$DBPNAM0= <>
##$DBPNAM1= <>
##$DBPNAM2= <>
##$DBPNAM3= <>
##$DBPNAM4= <>
##$DBPNAM5= <>
##$DBPNAM6= <>
##$DBPNAM7= <>
##$DBPOAL= (0..7)
0.5 0.5 0.5 0.5 0.5 0.5 0.5 0.5 
##$DBPOFFS= (0..7)
0 0 0 0 0 0 0 0 
##$DE= 6
##$DECBNUC= <off>
##$DECIM= 24
##$DECNUC= <off>
##$DECSTAT= 4
##$DIGMOD= 1
##$DIGTYP= 9
##$DL= (0..7)
0 120 120 120 120 120 120 120 
##$DP= (0..7)
150 150 150 150 150 150 150 150 
##$DP07= 0
##$DPNAME0= <>
##$DPNAME1= <>
##$DPNAME2= <>
##$DPNAME3= <>
##$DPNAME4= <>
##$DPNAME5= <>
##$DPNAME6= <>
##$DPNAME7= <>
##$DPOAL= (0..7)
0.5 0.5 0.5 0.5 0.5 0.5 0.5 0.5 
##$DPOFFS= (0..7)
0 0 0 0 0 0 0 0 
##$DQDMODE= 0
##$DR= 18
##$DS= 0
##$DSLIST= <SSSSSSSSSSSSSSS>
$$ [...]
##$SUBNAM2= <"">
##$SUBNAM3= <"">
##$SUBNAM4= <"">
##$SUBNAM5= <"">
##$SUBNAM6= <"">
##$SUBNAM7= <"">
##$SUBNAM8= <"">
##$SUBNAM9= <"">
##$SW= 24.0689530833862
##$SWIBOX= (0..15)
0 0 2 0 0 0 0 0 0 0 0 0 0 0 0 0 
##$SW_h= 4816.95568400771
##$TD= 16384
##$TD0= 1
##$TE= 0
##$TE2= 300
##$TE3= 300
##$TEG= 300
##$TL= (0..7)
0 120 120 120 120 120 120 120 
##$TP= (0..7)
150 150 150 150 150 150 150 150 
##$TP07= 0
##$TPNAME0= <>
##$TPNAME1= <>
##$TPNAME2= <>
##$TPNAME3= <>
##$TPNAME4= <>
##$TPNAME5= <>
##$TPNAME6= <>
##$TPNAME7= <>
##$TPOAL= (0..7)
0.5 0.5 0.5 0.5 0.5 0.5 0.5 0.5 
##$TPOFFS= (0..7)
0 0 0 0 0 0 0 0 
##$TUNHIN= 0
##$TUNHOUT= 0
##$TUNXOUT= 0
##$USERA1= <user>
##$USERA2= <user>
##$USERA3= <user>
##$USERA4= <user>
##$USERA5= <user>
##$V9= 5
##$VALIST= <valist>
##$VCLIST= <CCCCCCCCCCCCCCC>
##$VD= 0
##$VDLIST= <DDDDDDDDDDDDDDD>
##$VPLIST= <PPPPPPPPPPPPPPP>
##$VTLIST= <TTTTTTTTTTTTTTT>
##$WBST= 1024
##$WBSW= 4
##$XGAIN= (0..3)
0 0 0 0 
##$XL= 0
##$YL= 0
##$YMAX_a= 545961
##$YMIN_a= -687709
##$ZGOPTNS= <>
##$ZL1= 120
##$ZL2= 120
##$ZL3= 120
##$ZL4= 120
##$ABSF1= 10
##$ABSF2= 0
##$ABSG= 5
##$ABSL= 3
##$ALPHA= 0
##$AQORDER= 0
##$ASSFAC= 0
##$ASSFACI= 0
##$ASSFACX= 0
##$ASSWID= 0
##$AUNMP= <proc_1d>
##$AZFE= 0.1
##$AZFW= 0.1
##$BCFW= 1
##$BC_mod= 2
##$BYTORDP= 1
##$COROFFS= 0
##$CY= 11.3945322036743
##$DATMOD= 1
##$DC= 2
##$DFILT= <>
##$DTYPP= 0
##$F1P= 20.1720416913024
##$F2P= 0.152960286110954
##$FCOR= 0.5
##$FTSIZE= 0
##$FT_mod= 4
##$GAMMA= 1
##$GB= 0.15
##$INTBC= 1
##$INTSCL= 1
##$ISEN= 128
##$LB= 0.24
##$LEV0= 0
##$LPBIN= 0
##$MAXI= 10000
##$MC2= 0
##$MEAN= 0
##$ME_mod= 0
##$MI= 1.114404
##$NCOEF= 0
##$NC_proc= 0
##$NLEV= 6
##$NOISF1= 3.799351
##$NOISF2= 2.8
##$NSP= 1
##$NTH_PI= 0
##$NZP= 0
##$OFFSET= 15.70392
##$PC= 1
##$PHC0= -9572.333
##$PHC1= 17.40095
##$PH_mod= 1
##$PKNL= yes
##$PPARMOD= 0
##$PSCAL= 0
##$PSIGN= 0
##$REVERSE= no
##$SF= 200.130013532006
##$SI= 16384
##$SIGF1= 3
##$SIGF2= 2
##$SINO= 400
##$SIOLD= 16384
##$SREGLST= <1H.CDCl3>
##$SSB= 0
##$STSI= 0
##$STSR= 0
##$SW_p= 3612.71676300578
##$SYMM= 0
##$S_DEV= 0
##$TDeff= 0
##$TDoff= 0
##$TI= <>
##$TILT= no
##$TM1= 0
##$TM2= 0
##$TOPLEV= 0
##$USERP1= <user>
##$USERP2= <user>
##$USERP3= <user>
##$USERP4= <user>
##$USERP5= <user>
##$WDW= 1
##$XDIM= 8192
##$YMAX_p= 0
##$YMIN_p= 0
$$ End of Bruker specific parameters
$$ ---------------------------------
##NTUPLES= NMR FID
##VAR_NAME=  TIME,          FID/REAL,        FID/IMAG
##SYMBOL=    X,             R,               I
##VAR_TYPE=  INDEPENDENT,   DEPENDENT,       DEPENDENT
##VAR_FORM=  AFFN,          ASDF,            ASDF
##VAR_DIM=   8192,          8192,            8192
##UNITS=     SECONDS,       ARBITRARY UNITS, ARBITRARY UNITS
##FACTOR=    0.0002076,     1,               1
##FIRST=     0,             0,               0
##LAST=      1.7004516,     0,               0
##MIN=       0,             -687709,         0
##MAX=       1.7004516,     545961,          0
$$ Real data points
##PAGE= N=1
##DATA TABLE= (X++(R..R)), XYDATA
0 0 0 0 0 -8 8 -8 8 -16 21 -24 32 -41 53 -65 74 -95 115 -131 157 -188 217 -254 295 -341 392 -448 510
27 510 -583 658 -741 840 -944 1055 -1182 1320 -1472 1636 -1815 2018 -2237 2473 -2743 3036
43 3036 -3360 3724 -4133 4589 -5110 5708 -6403 7223 -8201 9401 -10917 12880 -15558
56 -15558 19445 -25615 36960 -64718 271063 146508 -571875 -291337 172081 255006 10175
67 10175 81193 180066 -75827 -465295 -217339 426159 545961 -80944 -494712 -226315 177012
78 177012 160155 34490 119448 149846 -187450 -430007 -56131 514588 413410 -203916 -429985
89 -429985 -67467 197614 83836 8376 157007 111589 -273368 -421703 52781 524890
99 524890 277077 -311634 -390712 346 190804 52878 18260 152657 55412 -296465 -327903
110 -327903 163148 498617 158146 -335793 -298352 53602 148106 29414 61076 147844 -47847
121 -47847 -351783 -230618 264193 423240 2306 -356586 -194788 100582 98240 809 94310
132 94310 154332 -99483 -359495 -136948 341836 369435 -95852 -350916 -113633 131232
142 131232 70076 -9092 97564 111443 -152930 -327123 -46227 346215 263652 -158902 -293520
153 -293520 -50311 110835 42225 25607 122492 57312 -203516 -263108 66535 347322 154209
164 154209 -210055 -223797 16399 88765 3128 39884 137864 13809 -245410 -219978 141728
175 141728 333503 68110 -241258 -172281 57202 80346 -1468 53660 123441 -27065 -240634
186 -240634 -149866 186859 285393 858 -227729 -116348 61289 50795 8970 81068 93375
197 93375 -87662 -229898 -64419 222606 212659 -71719 -198771 -48842 65599 15397 9251
208 9251 102863 76213 -126538 -216391 -1256 242430 153817 -122310 -175265 -4392 68546
219 68546 1884 12897 98113 44648 -140554 -175336 46164 223655 94566 -133707 -134041
230 -134041 11584 46221 940 38078 88395 -5419 -155314 -120821 95234 191479 27562
241 27562 -137879 -83512 31397 21199 -6756 59955 88176 -38499 -164677 -78406 132295
252 132295 166561 -21686 -140720 -50195 44117 11240 -8281 59898 67956 -59130 -148965
263 -148965 -39834 138590 128489 -46634 -118398 -24572 37537 5206 11522 67323 37624
274 37624 -81370 -117955 9762 135252 76146 -70310 -86090 2389 21695 -12803 21242
285 21242 73247 15430 -99392 -96650 44827 132913 39811 -85342 -61609 25013 20906 -14181
297 -14181 27116 66771 157 -95535 -70363 59545 112749 13097 -81920 -44642 20835 8361
309 8361 -5984 36280 46672 -27228 -86904 -33389 72987 83592 -13589 -65670 -15052 20503
321 20503 -5306 906 49778 37640 -45546 -81862 -7990 81310 58911 -38254 -60936 88
333 88 19620 -12981 -667 44535 24671 -48620 -66977 6828 76061 41200 -40478 -45460 7168
346 7168 13916 -8822 11789 38163 3486 -50819 -44149 21598 57996 13504 -41452 -26851 9302
359 9302 -1710 -12410 21119 35503 -11350 -54025 -27631 36224 51941 -2784 -41858 -11736
371 -11736 17330 -3960 -12234 21645 28806 -16423 -48021 -18384 35188 39908 -10754 -37917 -8237
384 -8237 11324 -5560 -3015 22083 14354 -22209 -32853 -1280 32749 24303 -14138 -22859 1776
397 1776 4563 -9592 5792 26378 4929 -29774 -26451 9271 31772 11325 -22450 -17016 8983
410 8983 3764 -11653 6523 23686 2289 -25493 -19084 12112 29382 9236 -19476 -12361 8055
423 8055 2280 -5288 9778 14881 -6664 -19666 -8102 12451 18638 1654 -14156 -5014 4259
436 4259 -4399 -1300 16536 11085 -13477 -18122 100 16820 14398 -5324 -13842 1112 6084 -6700
450 -6700 -2113 15481 8232 -13890 -16592 -138 15451 13255 -6401 -14197 -245 4377 -3701 2746
464 2746 11873 68 -13017 -8624 2632 10579 7709 -5402 -9328 -1131 -1709 -3489 8835 11386
478 11386 -6939 -16012 -4914 7413 10328 2482 -8563 -5942 2549 -2879 -4567 9079 10503 -7876
492 -7876 -15690 -5268 7481 11977 2434 -10943 -7428 1801 -1251 -614 9380 5237 -9869 -10823 -1001
507 -1001 7066 9690 1883 -8379 -5744 -1399 -2757 5054 13512 512 -15511 -9833 3782 9843
521 9843 7305 -2241 -7536 -1874 -309 -3230 7027 15326 125 -15950 -9291 6169 13971 9535
535 9535 -4658 -9546 -1296 523 -922 9412 12386 -5025 -15343 -5589 7054 12341 7920 -3932
549 -3932 -7889 -2394 -1409 3093 15587 11486 -10625 -16124 -348 12477 12422 2880 -6964 -4981 -1272
564 -1272 -4585 2682 18181 9761 -15482 -18483 863 15339 13474 83 -9776 -5275 -295 -2075
578 -2075 7010 18580 4695 -18133 -15534 4344 15562 11552 -1801 -9827 -6593 -4355 -2753 12082
592 12082 18606 -4040 -24504 -12338 10268 16477 7260 -5232 -8517 -4523 -5484 -2056 16191 19724
606 19724 -7958 -27099 -10491 13966 18005 4025 -10033 -9973 -4098 -5992 -504 18244 15620 -14968
620 -14968 -27414 -5363 16738 16058 1881 -8535 -7767 -5727 -6730 5810 24130 10777 -23217
633 -23217 -25877 2785 20737 12457 -3442 -9133 -5406 -7068 -9014 9756 28231 6046 -29773
646 -29773 -24511 10202 24397 11009 -5887 -9209 -4270 -6207 -5001 15940 27374 -1284 -31827
659 -31827 -18534 14649 23587 8244 -6716 -8601 -5838 -8215 -681 22954 24938 -11252 -33780
672 -33780 -9701 21676 21432 3316 -6569 -5315 -5696 -9949 2965 28724 21629 -19617 -34524 -2777
686 -2777 25772 19101 -1112 -8988 -4990 -6026 -9834 7059 31394 15709 -27119 -32009 5512
699 5512 27942 14671 -3938 -7214 -4601 -9687 -9498 15206 33892 5318 -35744 -26301 14349
712 14349 26890 7924 -6733 -6057 -5619 -12938 -7116 22174 33178 -4989 -40765 -19927 21048
725 21048 25856 3484 -8998 -6002 -6932 -13833 -3170 26875 28163 -15327 -41018 -11476 24246
738 24246 21078 -13 -8192 -6212 -10055 -13806 3650 31146 20568 -25117 -38282 -1864 26497
751 26497 15661 -3539 -7066 -5329 -12675 -14002 9929 34372 12714 -33313 -34293 7582 28125
764 28125 10776 -5912 -5780 -5563 -13983 -11094 17140 34761 3004 -38451 -27088 15298 26520
777 26520 6533 -6200 -4594 -7787 -15747 -5860 24872 32449 -8210 -41197 -16833 22622 23019
790 23019 1813 -4774 -2909 -9785 -16660 412 30943 27327 -18247 -40053 -7411 25911 18672
803 18672 -907 -4414 -3580 -11238 -14258 6474 32659 19517 -24554 -35215 726 26186 14395
816 14395 -1700 -3377 -5114 -13542 -10977 13441 32743 9423 -30537 -28434 8692 23950 8873
829 8873 -2158 -2076 -7239 -15776 -7318 19683 30818 174 -33996 -21373 14864 22145 5087 -3041
843 -3041 -2695 -9226 -15552 -2831 23745 26479 -8956 -35142 -13766 18218 17980 2318 -2444 -4031
857 -4031 -12153 -14121 3463 26030 19149 -16670 -31981 -5397 19301 13296 694 -1546 -5397
870 -5397 -13951 -11703 8452 26201 11995 -22116 -27515 1390 18617 9049 -355 -1300 -6915 -13849
884 -13849 -7828 12417 24495 5271 -24040 -21701 6147 17105 6801 177 -2025 -9094 -13017
897 -13017 -3031 15741 21023 -1765 -24829 -15021 10189 14453 4546 658 -2366 -10585 -11292 1931
911 1931 18639 17112 -7359 -23726 -8585 12588 12076 3401 644 -3914 -10910 -8341 5464 18294
925 18294 12125 -11179 -20764 -3270 13159 9904 2797 457 -5591 -10523 -5089 8639 17242 7053
939 7053 -13632 -16384 1504 11918 6491 2630 152 -6987 -10065 -1953 10658 14996 2444 -14869
953 -14869 -12632 4483 10396 4494 1885 -844 -7578 -8217 479 10816 11940 -1356 -14902 -9210
967 -9210 6138 8531 3327 1285 -2490 -8535 -6232 3134 10326 8124 -4750 -13758 -5181 6893
981 6893 6314 1986 897 -3715 -8594 -4261 4817 9607 5112 -7210 -12283 -2071 7196 4382 1052
996 1052 419 -4509 -7511 -2125 5239 8258 2887 -8054 -10060 605 6498 2631 719 -124 -4997
1011 -4997 -6042 2 5206 6567 287 -8297 -7170 3028 5278 1173 974 -118 -4904 -4693 1283
1026 1283 5713 5326 -1297 -7918 -3895 4745 4220 -11 1109 -67 -4525 -3317 2414 5551 4333
1041 4333 -2371 -7277 -1417 5374 2990 -636 1373 -461 -3941 -1474 3286 4997 2715 -3275 -5720
1056 -5720 1052 5475 1101 -697 1743 -617 -3558 -641 3543 4321 1024 -4344 -4129 3077 4468
1071 4468 -819 -753 2484 -451 -3535 -8 3529 3504 -33 -4645 -2532 4223 3122 -2294 -382 2410
1087 2410 -1335 -3075 433 3063 2644 -1285 -4712 -620 4645 928 -3500 206 2510 -2036 -3105
1102 -3105 1000 3170 1455 -2758 -4236 1160 4572 -1240 -4243 1224 2269 -2631 -2757 1498 2789
1117 2789 275 -3854 -3513 2706 3890 -3035 -3741 2367 1801 -3443 -2199 2007 2283 -867 -4092 -1977
1133 -1977 4043 2527 -4418 -2796 3594 1021 -3853 -1302 2794 2098 -1908 -4155 -253 4993 734
1148 734 -5698 -1225 4688 135 -4302 -480 3334 1410 -2666 -3537 1607 5070 -852 -5434 735
1163 735 5108 -1031 -3944 858 3794 982 -3413 -2958 3335 5006 -2741 -4843 2912 4697 -2785
1178 -2785 -3646 2427 4131 -485 -4091 -1476 4693 3750 -4252 -3622 4697 3293 -4061 -2910 3735 4120
1194 4120 -1483 -4392 -296 5568 2223 -5605 -2148 6001 1950 -5474 -1735 4722 3195 -2810 -4413
1209 -4413 1179 5647 140 -5851 253 6236 -713 -6506 -67 5782 1917 -4511 -4330 2528 5229
1224 5229 -2205 -5876 2769 6058 -3528 -7002 1780 6598 523 -5608 -3572 3964 3990 -3810 -4700 4602
1240 4602 4236 -5983 -6030 4087 6493 -1245 -6618 -2406 4890 2639 -5293 -2870 6162 2211 -8349
1255 -8349 -4744 6578 6017 -3447 -7147 -458 5662 785 -6139 75 7396 -700 -9884 -2273 8669
1270 8669 4953 -5462 -6682 1523 5618 -1135 -5572 2760 7674 -3578 -10355 983 10491 3466
1284 3466 -7352 -5546 3543 5207 -3198 -4344 6037 6651 -7123 -9945 4688 11485 808 -8470
1298 -8470 -4091 5407 3974 -4560 -2112 8323 4196 -10336 -7999 8294 11386 -1994 -9368 -1867
1312 -1867 6442 2281 -5347 379 9548 728 -12824 -5195 11775 9952 -5279 -9319 388 6480
1326 6480 48 -5251 3396 9655 -3323 -14204 -1482 14287 7550 -8157 -8520 2803 5979 -2629
1340 -2629 -4759 6755 8837 -7941 -14671 3095 15845 3681 -10667 -6894 4832 4404 -4830
1353 -4830 -2876 9468 6307 -12538 -13288 7970 15673 -376 -12224 -4204 6385 2313 -6198 -31
1367 -31 11514 2276 -16350 -10145 12707 14412 -4716 -12723 -1244 6909 -406 -6450 3427 11919
1381 11919 -2566 -18327 -5279 16332 11431 -8572 -11719 1548 6629 -2753 -5429 6951 10967
1394 10967 -7522 -18636 260 18906 7729 -11486 -9666 4190 5135 -4931 -3336 10435 8922
1407 8922 -12274 -17229 5952 19693 3033 -13489 -6134 6894 3108 -6528 -227 13314 5250
1420 5250 -16586 -14125 11927 19026 -1983 -13986 -2654 7303 394 -6620 3923 14463 283
1433 283 -19727 -9161 16941 16280 -6759 -13392 720 7026 -2263 -5754 7756 13747 -5427 -20856
1447 -20856 -3159 20463 11932 -10634 -11014 3629 5614 -4988 -3904 10957 11119 -11235 -20283
1460 -20283 2782 21615 6560 -13404 -8178 5864 3029 -6577 -788 13454 7387 -15994 -17729
1473 -17729 8871 20665 1110 -14302 -4540 6548 82 -7370 2744 14720 2441 -19862
1485 -19862 -13283 14094 18343 -4145 -14053 -893 6227 -2957 -6728 6890 14535 -3533 -21558
1498 -21558 -7500 18453 14423 -8771 -12240 1927 4993 -5166 -4585 10120 12041 -9225 -21608
1511 -21608 -1067 20505 9659 -11856 -9521 4209 2778 -6518 -1551 12982 8948 -14077 -19186
1524 -19186 5398 20698 4430 -13008 -6017 5351 218 -6747 2321 14504 4701 -17293 -15304
1537 -15304 10930 19145 -823 -12971 -2258 5754 -2185 -6217 6156 14767 -523 -19562 -9888
1550 -9888 15353 15958 -5039 -11137 889 4534 -4793 -4233 9433 12978 -5825 -19623 -4074 17988
1564 17988 11684 -8517 -9061 3140 2747 -5747 -1345 11795 9734 -10497 -18335 1802 18834 6688
1578 6688 -10521 -6199 4563 468 -6219 1603 13034 5728 -14084 -15208 6697 17473 1880
1591 1880 -10908 -3260 4539 -2111 -5717 4756 12756 1377 -15971 -11306 10845 15168 -2503
1604 -2503 -10367 -330 3649 -4248 -4571 7385 11556 -3420 -16666 -6482 13168 11229 -5792
1617 -5792 -8527 1699 2189 -5557 -2480 9471 9190 -7233 -15812 -1540 14480 7115 -7938 -5940
1631 -5940 3363 236 -6110 252 10389 5806 -10337 -13643 2937 14150 3253 -8654 -3314
1644 -3314 3604 -1550 -5299 2972 10593 2647 -12116 -10363 6632 12589 -380 -8097 -701 3380
1658 3380 -3278 -4425 5182 9795 -691 -12405 -6802 8861 10068 -2913 -6649 1322 2354 -4305
1672 -4305 -2519 7150 8144 -3590 -11991 -2934 10355 7376 -4971 -5109 2897 921 -4792 -650 8007
1687 8007 5879 -6064 -10498 435 10475 4128 -5877 -2986 3282 -487 -4741 1600 8236 3326
1701 3326 -7859 -8704 3326 9806 1149 -6177 -718 3010 -2287 -3812 3327 7560 601 -8540 -5845
1716 -5845 5492 7823 -1323 -5384 925 2290 -3196 -2822 4776 6323 -1731 -8417 -3357 6477 5896
1731 5896 -2920 -4258 1800 871 -4041 -1391 5468 4702 -3641 -7821 -1141 6762 3578 -4160 -2526
1746 -2526 2301 -187 -4272 170 5807 2640 -4901 -6436 958 6349 1705 -4172 -1178 2180 -1615
1761 -1615 -3553 1869 5532 1034 -5537 -4636 2616 5722 -22 -3784 118 1893 -2199 -2477 2946
1776 2946 4591 -556 -5104 -2892 3686 4497 -1229 -3182 1079 1199 -2775 -1154 3941 3499 -1949 -4839
1792 -4839 -1230 4336 3222 -1845 -2081 1572 313 -2822 -85 4204 2458 -2629 -3821 -97 4071
1807 4071 2091 -2163 -1148 1762 -403 -2503 1215 3990 1149 -3124 -2958 919 3805 903 -2129
1822 -2129 -122 1366 -1316 -2009 2081 3404 -278 -3161 -1864 1763 3194 82 -1857 371 877
1837 877 -1764 -1277 2443 2212 -1179 -2849 -1232 1759 2171 -588 -1763 500 192 -1970 -430 2647
1853 2647 1361 -1717 -2598 -634 1763 1622 -1008 -1420 684 -543 -2211 279 2320 199 -1989 -2030
1869 -2030 -203 1415 907 -1194 -914 576 -1025 -1699 1111 1972 -336 -1781 -1300 100 1413 488
1885 488 -1277 -486 393 -1058 -1144 1396 1526 -731 -1553 -930 420 1474 184 -980 -2 394 -1453
1902 -1453 -406 1662 1050 -985 -1180 -434 727 1235 186 -859 184 -104 -1054 219 1836 535
1918 535 -1065 -887 -360 746 1323 62 -473 298 -185 -773 735 2035 128 -912 -425 61 830 1108
1936 1108 -17 -284 426 -604 -712 1265 1542 -156 -823 -445 3 843 1225 -95 -307 15 -844 -536
1954 -536 1561 1208 -470 -857 -177 -32 1042 739 -290 -232 71 -915 84 1651 744 -834 -819 -331 88
1973 88 1035 600 -476 -454 -197 -1010 235 1773 398 -1372 -893 -378 369 986 3 -558 -322 -750 -1221
1992 -1221 628 1524 -326 -1617 -771 -336 270 928 -204 -571 -195 -1000 -871 1365 1818 -487 -1595
2009 -1595 -864 -69 695 762 -176 -274 -292 -1417 -608 1785 1407 -1014 -1899 -746 264 983 832 -267 -180
2028 -180 -664 -1550 31 2365 1075 -1520 -1580 -537 776 1362 485 -445 -51 -547 -1431 555 2899 820
2046 820 -2022 -1807 39 1048 1090 271 -217 -194 -1096 -1275 1523 3193 278 -2342 -1212 521 1142 1036
2064 1036 255 -135 -214 -1549 -1242 2327 3215 -638 -2773 -1070 1278 1199 651 229 401 -451 -2048 -592
2082 -592 3154 2836 -1598 -2979 -459 1316 971 334 178 148 -946 -2610 16 3900 1968 -2498 -3045
2099 -3045 89 1613 788 72 223 15 -1768 -2520 1230 4139 887 -3685 -2649 697 1649 721 -29
2116 -29 174 -178 -2304 -2220 2387 4418 -179 -4173 -2210 1455 1656 148 -106 678 -598 -2963 -1658
2133 -1658 3653 4214 -1405 -4535 -1070 2047 1201 -95 320 845 -1261 -3230 -627 4703 3410 -2989
2149 -2989 -4411 -170 2221 998 -172 659 738 -2073 -3505 636 5337 2363 -4057 -3671 995 2184
2165 2184 639 -104 821 572 -2814 -3319 2304 5835 823 -4814 -3039 1927 2668 -79 93 1566
2181 1566 -150 -3453 -2466 3821 5785 -436 -5409 -1675 2562 1790 -188 747 1467 -1044 -3897 -1289
2197 -1289 5015 4802 -2488 -5196 -513 2879 1209 -556 1232 1262 -2098 -4418 52 5912 3732 -3971
2213 -3971 -4773 610 2808 389 -321 1584 829 -3270 -4094 1671 6449 1857 -5306 -4043 1701 2573
2229 2573 -230 -156 1682 -47 -3817 -3520 3098 6397 7 -5829 -2626 2405 1830 -556 432 1637
2245 1637 -1022 -4449 -2318 4697 5531 -1747 -6197 -1459 2868 1020 -534 795 1349 -2076 -4825
2260 -4825 -817 5529 4550 -3414 -5466 -57 2838 504 -510 1584 1253 -3053 -4649 932 6459
2275 6459 2867 -4465 -4446 1226 2516 -159 197 2220 466 -3977 -3699 2615 6482 1106 -5305 -3287
2291 -3287 2128 1998 -601 539 2220 -550 -4306 -2703 4030 5995 -714 -5637 -1897 2680 1269
2306 1269 -647 1396 1831 -1554 -4481 -1200 5155 4889 -2290 -5306 -692 2984 860 -447 1646
2321 1646 1519 -2544 -4376 348 5749 3725 -3702 -4807 744 2513 93 -144 2075 855 -3598
2336 -3598 -3961 1764 5884 1725 -4633 -3463 1660 1911 -429 303 1957 -168 -3963 -3080 2758 5532
2352 5532 112 -4845 -2399 2164 1144 -778 968 2048 -1039 -4210 -1659 3975 4491 -1318 -4796
2367 -4796 -976 2257 324 -798 1346 1842 -2021 -4225 -516 4668 3469 -2468 -4348 340 2156
2382 2156 -211 -587 1840 1143 -2721 -3649 836 4708 2046 -3409 -3278 1131 1576 -741 102 2177
2398 2177 498 -3071 -2726 1811 4778 859 -3606 -2130 1706 1307 -1072 771 2356 -117 -3221
2413 -3221 -1888 2807 4114 -205 -3752 -989 2263 623 -794 1157 1994 -1123 -3122 -534 3643
2428 3643 3107 -1390 -3275 190 2133 -75 -649 1662 1560 -1883 -3188 197 3824 2224 -2326 -2758
2444 -2758 953 1723 -570 -433 1730 807 -2340 -2368 1150 3436 1132 -2793 -1860 1386 1237 -1027 138
2461 138 1906 220 -2467 -1751 1882 3053 -39 -2943 -885 1659 549 -1257 483 1877 -551
2476 -551 -2547 -1125 2058 2225 -788 -2555 -66 1522 -370 -1325 865 1312 -1132 -2213 -69 2370
2492 2370 1348 -1719 -2023 215 1311 -891 -908 1208 1128 -1567 -2063 334 2301 826 -1909 -1452 1140
2509 1140 881 -1077 -534 1414 556 -1970 -1312 1039 1986 -46 -2110 -936 1537 623 -1294 -48
2525 -48 1622 252 -1987 -742 1397 1662 -393 -1962 -194 1243 30 -1199 388 1451 -422 -1696
2541 -1696 -205 1738 1241 -699 -1321 680 1493 -421 -1039 934 1260 -856 -1219 135 1719 747 -993
2558 -993 -908 848 1075 -892 -753 1279 722 -1075 -849 696 1420 146 -1347 -630 1205 669 -1068
2575 -1068 -184 1295 376 -1301 -742 1035 922 -371 -1036 -43 1245 254 -1050 143 1340 -78 -1172
2592 -1172 -335 1199 729 -645 -871 409 1271 -402 -1052 450 1197 -560 -1064 159 830 270 -902
2609 -902 -657 531 745 -765 -781 649 729 -701 -930 485 828 -178 -756 -400 776 464 -996 -700
2627 -700 817 498 -976 -752 703 684 -503 -1106 -47 835 66 -1069 -233 1081 171 -1169 -31
2644 -31 871 349 -338 -725 109 793 -239 -1216 185 891 -83 -1111 -31 1081 118 -491 -556 742 771
2663 771 -572 -995 735 1104 -499 -529 419 731 -128 -763 -454 797 461 -616 -612 827 704 -920 -608
2682 -608 563 669 -282 -506 43 849 309 -769 -198 1079 299 -1205 -280 928 383 -571 -661 163 841
2701 841 34 -965 108 1125 -212 -1170 -10 1016 309 -839 -437 509 693 -303 -896 533 1152 -432
2719 -432 -1215 460 1206 -201 -755 -338 530 477 -788 -646 664 611 -1007 -1044 737 995 -318 -1098 -108
2738 -108 674 72 -843 -398 1264 400 -1567 -838 1159 934 -614 -818 -35 736 -235 -942 191 1142
2756 1142 -112 -1621 -322 1325 759 -1066 -740 386 732 -497 -814 702 1393 -699 -1660 393
2772 393 1545 433 -1112 -422 623 264 -656 -732 1135 1080 -1286 -1312 900 1515 -107 -1197 -144 748
2790 748 227 -873 -233 1331 686 -1703 -991 1107 1275 -422 -1068 244 1009 -72 -1041 352 1842
2807 1842 250 -1911 -592 1747 1183 -900 -944 470 854 -445 -886 683 1578 -526 -1940 20
2823 20 1963 857 -1276 -572 697 430 -756 -722 1098 1376 -1357 -1864 645 2030 -28 -1254 -256
2840 -256 666 215 -924 56 1474 832 -1855 -1718 1176 1634 -397 -1329 240 898 -202 -1243 112
2857 112 1787 176 -2438 -964 1690 1508 -1016 -1209 553 682 -684 -1141 814 1812 -639 -2411
2873 -2411 -375 2086 928 -1465 -875 569 667 -891 -419 1108 1167 -1112 -2408 439 2366 350
2889 350 -1455 -290 648 45 -790 -180 1442 1045 -1965 -1965 1128 2132 -206 -1617 -50 779 -73 -1062
2907 -1062 257 1960 362 -2196 -1234 1953 1745 -879 -1300 404 757 -540 -526 803 1749 -265 -2309
2924 -2309 -787 2123 1190 -1318 -761 673 573 -774 -629 1184 1444 -936 -2389 321 2377 358
2940 358 -1481 -407 1038 -27 -1073 -226 1626 1057 -1625 -1919 922 2239 -185 -1289 -58 858
2956 858 -200 -1080 221 1596 469 -2217 -1453 1499 1835 -653 -1304 412 723 -573 -902 826 1680
2973 1680 -152 -2209 -905 1778 1254 -1206 -1243 710 397 -809 -485 990 1453 -1024 -2195 -80
2989 -80 2089 783 -1476 -610 847 68 -1198 -277 1369 843 -1508 -2065 479 2036 -41 -1508 -204
3006 -204 852 -265 -1057 180 1539 634 -1722 -1557 1249 1793 -417 -1518 273 805 -733 -902 855
3023 855 1589 17 -1641 -752 1626 1413 -983 -1009 622 540 -746 -514 973 1458 -405 -1953 -241
3040 -241 1718 740 -1146 -474 822 228 -1009 -219 1175 1188 -924 -1637 295 1921 303 -1266 -181
3057 -181 794 -136 -839 -2 1221 615 -1210 -1344 907 1510 -238 -1112 213 699 -469 -849 297 1089
3075 1089 209 -1327 -875 1218 1150 -625 -905 299 473 -475 -710 630 1235 -312 -1675 -479 1400
3092 1400 726 -999 -653 711 259 -973 -455 876 509 -847 -1251 234 1207 133 -1057 -187 908
3109 908 -96 -973 -101 893 356 -909 -989 366 1153 -78 -1120 18 921 -222 -799 265 744 129
3127 129 -1027 -749 983 1145 -489 -859 311 621 -474 -509 471 666 -119 -904 -306 787 644 -712
3145 -712 -502 811 411 -647 -325 593 596 -598 -631 36 1159 433 -827 -331 752 199 -505 66 665
3164 665 406 -322 -597 300 861 -49 -574 25 692 -27 -590 234 679 85 -564 -376 364 727 -203 -771
3184 -771 380 642 -386 -405 285 429 -113 -374 -180 613 305 -604 -600 439 711 -242 -374 72 322 -266
3204 -266 -300 -266 448 251 -748 -422 374 274 -497 -282 394 170 -132 -411 -42 366 -157 -675 -89 601 103
3225 103 -557 -281 196 -188 -304 -410 162 264 -279 -793 97 480 -36 -454 71 184 -224 -300 2 449
3245 449 209 -284 -798 257 619 -346 -513 179 334 -347 -305 -83 188 90 -482 -390 454 370 -379 -120 228
3266 228 -11 -66 -139 109 330 132 -389 -119 692 13 -514 -9 331 -28 -212 61 310 318 -3 -421 165
3287 165 544 -139 -345 296 400 -92 -364 -58 131 250 25 -422 188 514 -33 -314 354 241 -277 -210
3307 -210 -6 41 193 25 -202 419 26 -337 -66 455 254 -214 -9 94 222 108 -82 -289 157 70 -619
3328 -619 9 493 156 -266 -289 -89 393 234 -98 -60 285 -109 -445 55 598 -91 -419 -340 -170 251 85
3349 85 -263 97 120 -363 -564 378 541 -155 -540 -107 158 147 145 -206 86 75 -517 -374 520 663 -147 -490
3371 -490 -29 136 218 101 -114 94 -79 -701 -52 641 313 -511 -425 -18 183 581 -60 9 75 -433 -723
3392 -723 316 1030 216 -690 -496 45 416 289 -34 70 -47 -529 -560 557 1186 89 -716 -460 -17
3411 -17 549 319 -59 -80 -214 -694 -531 907 1149 -222 -831 -518 387 583 197 -60 156 -262 -846 -180
3431 -180 1151 1028 -305 -980 -529 253 514 306 79 33 -304 -1033 10 1668 708 -838 -1075 -149 303
3450 303 465 116 107 -167 -740 -888 513 1645 258 -1222 -1019 58 360 303 177 133 -404 -995 -1030 972
3470 972 1659 23 -1603 -1006 39 471 479 247 70 -675 -1255 -390 1429 1490 -488 -1650 -757 278 612
3489 612 563 337 250 -781 -1374 -208 1784 1326 -916 -1634 -729 637 492 174 255 -63 -943 -1231 308
3508 308 2235 957 -1293 -1677 -290 692 704 479 393 -436 -1244 -1295 1150 2337 427 -1645 -1436 94
3526 94 750 708 426 200 -574 -1733 -1149 1638 2276 -197 -1979 -1221 324 730 650 546 180 -700 -1619
3545 -1619 -267 2235 1943 -744 -2116 -579 625 765 794 529 304 -1175 -1622 121 2660 1401 -1430
3562 -1430 -1934 -396 832 622 675 704 -158 -1550 -1559 880 2653 874 -1923 -1837 -5 944 524 409 636
3581 636 -503 -1975 -1376 1554 2562 324 -2366 -1358 250 656 352 584 551 -927 -2152 -896 1960
3598 1960 2380 -358 -2378 -1262 503 623 371 754 351 -1131 -2212 -164 2591 2184 -1236 -2296
3614 -2296 -498 524 576 532 771 162 -1689 -1952 547 2865 1655 -1768 -2115 5 754 464 790 867
3632 867 -305 -1703 -1781 1322 2779 668 -2187 -1547 265 617 511 744 766 -539 -2255 -914 2001
3649 2001 2546 -87 -2285 -1093 546 474 439 945 936 -929 -2192 -485 2100 2382 -823 -2107 -708
3666 -708 628 502 618 1075 226 -1576 -1925 113 2654 1717 -1133 -2047 -149 740 329 835 1051 -137
3684 -137 -1717 -1606 676 2708 1097 -1850 -1757 333 494 114 679 1184 -480 -1828 -1332 1371 2522
3701 2522 194 -1956 -1126 392 319 121 917 601 -789 -2057 -817 1836 2190 -358 -1861 -796 528
3718 528 341 165 870 469 -1182 -1881 -141 2037 1587 -1105 -1879 -426 536 103 329 989 144 -1450
3736 -1450 -1776 356 2162 1070 -1293 -1681 162 349 21 473 774 -112 -1526 -1505 732 2087 546
3753 546 -1579 -986 381 179 -140 560 909 -492 -1548 -914 1353 1843 192 -1675 -554 533 73
3770 73 104 899 788 -641 -1374 -458 1660 1861 -813 -1589 -163 551 -222 159 1032 464 -878 -1398 23
3789 23 1539 1118 -861 -1207 179 481 -98 250 1258 329 -1118 -1028 435 1643 655 -1022 -960 456
3807 456 389 -142 684 913 -58 -1473 -963 725 1518 295 -1196 -631 642 136 -407 514 783 -373
3825 -373 -1184 -563 939 1116 -267 -1200 -361 275 -235 -296 592 401 -781 -1075 -104 1058 972 -517 -1245
3844 -1245 167 396 -310 -115 816 182 -937 -967 156 846 454 -741 -645 230 204 -356 -15 887 140
3863 140 -867 -831 511 877 170 -927 -513 437 133 -449 203 647 -338 -906 -332 535 851 -211 -681
3882 -681 -331 583 3 -433 736 560 -407 -509 -157 745 798 -290 -637 -10 464 -316 -87 811 345 -429
3902 -429 -570 42 616 518 -141 -453 373 417 -255 -42 705 159 -511 -461 241 506 442 -542 -312 427 147
3923 147 -347 3 663 -10 -670 -301 296 400 224 -581 -93 386 58 -206 163 462 -197 -465 9 119
3943 119 404 -45 -532 -6 407 -248 -295 428 435 -230 -607 14 192 237 9 -478 -42 187 -277 -255 489 167
3965 167 -459 -595 113 227 205 -140 -170 27 0 -362 -177 640 -21 -602 -311 282 157 81 -426 -333 324 -179
3987 -179 -541 -79 432 -102 -397 -204 280 321 244 -135 -288 375 -99 -387 373 236 -428 -448 -119 132 169
4008 169 -121 -311 -48 186 59 -151 436 504 -521 -480 3 123 -37 48 -60 43 90 -365 -78 450 -18
4029 -18 -604 -352 281 342 320 -126 -217 -24 243 -95 167 650 25 -596 -272 551 340 -28 -252 -144 -156 -58
4051 -58 -56 419 635 -183 -678 -144 423 260 65 -50 -352 336 -6 -287 850 585 -480 -646 -8 435
4071 435 335 199 -386 -238 8 -238 -16 451 444 -787 -762 261 462 473 -28 -253 -241 -183 -276 169 564 239
4093 239 -955 -751 346 468 309 -123 -571 -286 -51 -250 452 752 -63 -925 -432 432 476 170 -298 -513
4113 -513 -321 -414 -250 569 685 -356 -1363 -262 668 533 15 -213 -193 -266 -84 73 717 750 -607 -1234
4133 -1234 -111 723 503 122 -291 -369 -144 -305 153 1011 541 -1026 -925 276 792 474 17 -200 -446
4152 -446 60 -226 562 1086 231 -1201 -1051 543 914 307 -116 -446 -170 -159 -48 807 1245 -53 -1444
4171 -1444 -624 1024 983 173 -301 -386 -325 -350 -88 1001 1272 -467 -1373 -286 1077 858 54 -431 -432 -271
4191 -271 -406 36 1308 890 -874 -1583 119 1335 833 155 -472 -626 -252 -341 379 1375 708 -1486 -1579
4210 -1579 274 1145 500 -98 -397 -456 -482 -264 772 1514 250 -1696 -1253 720 1258 204 -274 -425
4228 -425 -517 -708 -240 1241 1578 -446 -1752 -1007 1038 1173 197 -488 -440 -407 -492 -39 1452 1363 -1030 -1958
4248 -1958 -397 1333 1132 -146 -281 -722 -489 -321 317 1545 917 -1403 -1985 -54 1576 851 -77
4265 -77 -446 -462 -539 -392 662 1623 589 -1764 -1899 705 1710 749 -80 -356 -448 -701 -348 975 1837
4284 1837 77 -2173 -1447 1099 1679 371 -196 -164 -583 -744 -109 1368 1887 -622 -2420 -973 1355
4301 1355 1385 261 -302 -273 -429 -880 255 1672 1376 -1203 -2240 -387 1459 1035 -7 -139 -364 -767
4319 -767 -613 354 1958 972 -1647 -2287 309 1686 679 -304 -376 -618 -768 -339 906 2036 457 -2232
4337 -2232 -1953 772 1592 397 -300 -301 -548 -1094 -520 1133 1818 -249 -2635 -1583 1296 1521 -29 -495
4355 -495 -181 -764 -1077 24 1747 1682 -563 -2473 -568 1480 1374 121 -277 -203 -835 -1125 351 1736
4373 1736 1262 -1257 -2470 -167 1945 831 -449 -187 -247 -1095 -657 811 2065 703 -2105 -2028 355
4390 355 1826 467 -327 -69 -466 -1122 -598 1257 2075 393 -2109 -1775 888 1628 143 -458 42 -364
4408 -364 -1164 -268 1428 1721 -221 -2358 -1033 1374 1221 -57 -40 -23 -576 -953 262 1755 1423 -792
4426 -792 -2387 -415 1772 970 -209 65 153 -763 -937 413 1749 1005 -1562 -2080 89 1643 728
4443 728 -265 96 -209 -1037 -763 707 1769 741 -1686 -1784 592 1556 375 -589 358 -166 -1194 -641
4461 -641 1056 1659 20 -2070 -1495 943 1352 -23 -313 122 -627 -1210 -92 1433 1484 -558 -2019
4478 -2019 -937 1163 1086 -230 -175 77 -681 -999 119 1530 1232 -967 -2088 -231 1278 677 -271
4495 -271 -57 150 -906 -987 582 1533 763 -1305 -1682 200 1156 416 -272 183 -239 -827 -457 638 1505
4514 1505 298 -1392 -1374 627 1354 149 -142 205 -137 -843 -343 1078 1284 -10 -1612 -907 851
4531 851 989 -172 -153 317 -258 -987 21 1287 1035 -444 -1514 -404 1107 667 -188 -125 222 -366
4549 -366 -655 504 1120 899 -806 -1254 -19 1048 486 -44 242 194 -611 -340 661 998 374 -917
4567 -917 -1010 227 959 65 -437 383 -148 -735 -172 565 893 -114 -979 -878 420 910 -204 -273 280
4586 280 -50 -753 -181 719 682 -416 -881 -539 890 574 -357 -155 381 -469 -777 29 642 686 -333 -1081
4606 -1081 -294 677 278 -349 84 425 -540 -552 165 635 328 -621 -670 169 554 118 -326 129 217 -412 -350
4627 -350 369 572 77 -407 -449 252 627 44 -321 384 149 -428 -103 445 442 -98 -512 -223 516 557 -172
4648 -172 -246 104 77 -475 125 362 391 -143 -363 -188 514 361 -399 41 530 -63 -423 153 370 37 -351
4669 -351 -218 -92 328 226 -291 -105 397 -138 -252 289 321 63 -178 -337 130 340 -155 -413 186 215 -64
4690 -64 -194 298 234 -22 -67 -121 428 350 -77 -266 96 128 -197 -114 259 95 -5 -293 -365 -7 30 -339 -272
4713 -272 256 -151 -419 -35 83 -132 37 -187 -162 268 245 -472 -209 41 -26 -81 53 26 5 -99 -213 -121
4735 -121 228 60 -255 -176 105 -32 -333 310 237 -132 -135 -223 98 61 70 -444 47 240 -300 -93 187 17 -42
4758 -42 -58 13 5 85 -43 -194 205 166 -220 39 144 178 -255 28 -4 -71 169 23 -99 384 190 -85 150
4781 150 360 26 -101 83 -81 252 313 -139 -135 377 -235 -192 111 189 15 71 -18 -58 123 164 -265 191 268
4804 268 -22 -273 473 383 -179 9 -204 43 247 -122 -202 134 269 -419 -39 450 237 -84 -140 146 0
4825 0 359 -151 -230 13 172 -386 -24 447 272 -572 -259 287 122 -6 -73 -198 275 -107 -543 281 535
4846 535 64 -239 -231 74 43 138 -126 112 126 -239 -404 186 363 -119 -417 -289 -39 -68 19 22 177 137 -553
4869 -553 -293 671 577 -163 -586 -145 347 123 -45 -42 138 -28 -517 -231 817 538 -374 -368 65 164 145 62
4891 62 -36 305 -200 -855 -68 923 769 -578 -162 104 186 104 125 201 347 -562 -765 448 899 230 -497
4912 -497 -408 65 151 242 158 310 311 -582 -703 510 989 -26 -476 -325 178 78 69 -108 329 174 -770 -602
4934 -602 782 972 -216 -769 -222 197 59 -138 340 287 -149 -971 -214 994 736 -452 -570 -31 213
4953 213 -112 60 401 364 -537 -1230 -4 1262 403 -914 -722 68 126 -213 98 411 229 -779 -1107
4972 -1107 150 1238 267 -720 -478 21 103 -152 167 553 -84 -1170 -963 751 1187 -234 -1085 -529
4990 -529 -24 -142 12 300 733 -192 -1236 -626 1181 1079 -565 -1030 -260 301 -153 -91 390 234 -443
5009 -443 -1373 -274 1351 866 -849 -766 51 350 -167 88 598 431 -652 -1298 206 1691 372 -862
5027 -862 -479 284 146 -63 292 478 362 -950 -1239 651 1724 134 -1158 -350 133 178 -28 446 764
5046 764 49 -1513 -826 1147 1566 -378 -1119 -206 491 -159 -133 646 661 -434 -1323 -568 1256 1130 -508
5065 -508 -823 53 290 -258 20 748 680 -598 -1476 -165 1673 908 -898 -780 -1 78 -373 93 717
5084 717 495 -1158 -1456 454 1736 502 -1046 -595 334 101 -208 54 909 85 -1271 -1364 745 1649
5102 1649 -108 -1236 -264 557 -309 -362 483 863 -270 -1501 -708 976 1440 -385 -1118 92 301 -304
5120 -304 -111 553 784 -404 -1529 -283 1460 1202 -700 -938 198 318 -529 -186 928 563 -742
5137 -742 -1263 53 1423 652 -1101 -588 398 331 -407 -27 818 461 -1313 -1391 550 1666 126 -987
5155 -987 -403 388 44 -457 408 842 69 -1109 -835 817 1399 -317 -904 -6 478 -243 -508 641 1082
5174 1082 -143 -1324 -590 1071 974 -704 -992 145 448 -445 -228 900 877 -596 -1324 -158 1269
5191 1269 869 -945 -727 482 158 -500 -49 734 559 -752 -1252 176 1278 450 -999 -644 517
5208 517 87 -668 123 837 246 -1003 -697 350 990 26 -1025 -192 654 -413 -586 402 909 -164
5226 -164 -1168 -849 614 918 -342 -799 64 634 -486 -367 566 687 -452 -932 -365 947 557 -658
5244 -658 -874 218 398 -490 -259 728 679 -555 -958 -43 870 561 -596 -349 303 271 -692 -42 750 210
5264 210 -693 -753 188 968 235 -778 -84 556 152 -645 208 853 117 -783 -476 419 759 -106 -415 4
5284 4 417 -97 -338 379 678 17 -633 -418 585 716 -167 -608 103 386 -458 -324 644 665 -294 -488 -89
5305 -89 761 293 -453 -283 461 367 -315 118 540 547 -380 -504 1 613 267 -577 -126 392 -45 -566 97
5326 97 463 131 -481 -269 273 462 39 -537 -171 354 -108 -288 231 241 -48 -468 -7 327 334 -77 -328
5347 -328 10 367 -264 -437 202 161 -121 -396 -77 441 142 -367 -411 206 228 -197 -462 341 233 -334 -12
5368 -12 58 423 -26 -286 -248 406 233 -404 -47 525 98 -264 -148 178 206 -138 -398 -110 169 99 -277 120
5390 120 311 146 -381 -271 295 -23 -78 -285 29 307 -102 -238 156 220 -78 -65 189 212 265 -205 -227 124
5412 124 247 -152 -126 450 204 -187 -173 91 136 25 -207 -180 412 440 -200 -181 235 109 -70 -3 371 189
5434 189 -25 -86 -246 216 66 -90 -192 118 48 -157 99 80 -13 -62 -331 81 117 20 -224 56 10 -109 -184
5457 -184 46 251 -8 -66 -184 360 210 -291 -248 136 101 -316 -141 228 136 37 -108 -196 121 99 -257 -343 319
5480 319 36 -419 -204 242 145 -258 0 -71 167 67 -262 -217 276 251 -275 -192 245 178 -180 -126 -157 165 -21
5503 -21 -320 100 418 169 -363 15 211 16 270 -114 54 199 -10 -165 23 314 30 -316 64 348
5523 348 -25 -74 -33 91 217 -108 -315 308 532 -240 -132 215 147 250 100 -144 285 128 -221 -87 477
5544 477 255 -374 -159 302 114 126 -189 57 151 -23 -298 -14 506 204 -455 -94 342 242 148 0 46
5565 46 150 -277 -243 28 570 38 -509 -115 12 165 -248 -172 -105 -93 -316 -410 256 599 -261 -652 -165 303
5587 303 121 -66 -81 118 -1 -375 -357 438 555 -268 -577 -24 285 18 -255 -5 55 145 -564 -187 615
5608 615 545 -607 -658 106 391 -15 33 -98 -208 -218 -479 -28 921 160 -791 -429 33 235 95 -126 67
5629 67 -98 -358 -422 326 823 90 -863 -308 494 353 117 -5 -3 76 -412 -151 485 873 -196 -890 -317
5650 -317 496 355 60 289 75 -171 -447 -217 883 889 -492 -761 -89 519 373 31 167 -69 -300 -559
5670 -559 67 1116 803 -607 -875 261 653 89 -82 224 60 -641 -594 395 982 308 -884 -690 278
5689 278 515 196 54 142 -131 -642 -476 507 1326 47 -1178 -470 327 574 93 110 220 -87 -791 -599
5709 -599 722 1046 -210 -1181 -440 368 478 5 0 37 -455 -913 -380 1096 827 -552 -1460 -158 622
5728 622 459 31 31 228 -612 -1091 3 1203 527 -1078 -1065 150 467 209 118 185 19 -702 -788 466
5748 466 1308 217 -1238 -971 321 447 160 66 301 -78 -945 -499 810 1336 -157 -1121 -597 420
5766 420 473 115 279 274 -331 -856 -412 1113 1295 -228 -1303 -453 474 363 -119 217 50 -725 -1029 -169
5786 -169 1360 1048 -754 -1308 33 684 414 177 473 55 -734 -733 287 1404 718 -1036 -1178 91
5804 91 517 199 377 431 -122 -941 -819 641 1526 355 -1119 -922 248 566 161 245 238 -340 -945 -311
5824 -311 882 1318 9 -1159 -684 395 473 -56 356 220 -604 -1059 -157 1168 1205 -366 -1172 -350 478
5843 478 413 189 356 -8 -624 -940 97 1153 805 -645 -1130 31 372 35 112 437 -79 -922 -727
5862 -727 330 1293 602 -1003 -943 97 271 213 274 372 -329 -1164 -467 711 1161 124 -879 -729 108
5881 108 461 221 393 407 -376 -1141 -429 776 1074 -113 -846 -488 375 297 250 366 204 -611 -966 -142
5901 -142 1098 879 -357 -855 -147 377 72 295 570 34 -739 -771 376 1074 586 -482 -932 -39 475
5920 475 148 408 535 -90 -827 -416 473 985 413 -606 -754 -26 113 -30 253 417 -169 -845 -469 565
5940 565 1036 351 -856 -701 54 331 55 539 248 -477 -863 -23 615 798 -16 -941 -371 86 135 274
5960 274 364 380 -597 -813 11 664 809 -295 -729 -246 365 235 337 347 -40 -809 -504 58 744 494 -393
5981 -393 -524 -234 142 40 105 308 -150 -626 -374 268 764 288 -137 -548 -117 23 244 493 189 -287
6001 -287 -611 -191 335 481 124 -594 -236 31 226 -37 395 280 -444 -481 229 521 606 -131 -401 -268 166
6022 166 150 239 389 88 -477 -332 -43 326 476 107 -313 -151 75 128 156 292 95 -499 -204 74 329
6043 329 375 -163 -415 -129 87 231 172 230 -208 -447 -92 -98 552 145 -292 55 -214 155 99 335 136 -248
6065 -248 -296 45 191 311 184 -27 -285 -125 74 6 129 38 -281 -244 36 161 225 176 -12 -304 26 90
6087 90 118 164 70 -151 -51 59 32 -50 51 -191 -175 -103 173 172 -5 -152 -216 -101 14 83 170 31 -241 -205 153
6112 153 -24 85 41 -34 -287 -31 151 -9 30 127 -19 -113 114 -4 159 -21 -70 -123 89 19 83 120 -29
6135 -29 -295 -8 125 133 241 21 -36 201 274 14 -38 300 -54 -245 -54 294 180 260 45 -128 -12 31 -98
6158 -98 64 62 -210 -82 -21 194 56 119 -186 -15 240 32 -89 86 140 -34 -82 70 89 228 -33 -53 74
6181 74 157 56 145 24 131 13 51 176 -23 -16 -205 -97 106 178 15 -226 213 77 100 42 70 4 -108 -93
6205 -93 -53 12 120 -122 -130 -140 288 -24 -211 72 74 -88 -1 -18 121 90 -192 -18 275 69 -304 51 26 -15
6229 -15 -4 -18 72 163 184 -36 -77 120 26 -137 111 197 117 65 71 -51 156 -88 68 37 143 85 -34 -76 -170 85
6255 85 -136 -34 -40 231 113 -32 -47 -96 -118 105 54 171 -56 -7 -101 -23 94 55 -133 80 3 51 76 269 -63
6280 -63 79 75 -169 108 88 5 -55 -22 -173 -85 87 33 21 160 -83 -143 116 132 -24 83 49 -159 -103 121 56
6305 56 -137 149 -142 -150 32 65 36 -69 148 -71 126 188 -85 46 47 7 -202 110 159 -22 -224 62 -59
6328 -59 119 -70 83 37 -129 -194 -267 202 359 -103 -61 -120 -53 43 38 72 23 -16 -369 -83 179 -60 -261 10
6352 10 177 -99 -9 7 63 69 -10 -72 -58 149 125 -179 -94 -208 195 18 -100 121 99 -122 -275 50 143 77 -217
6377 -217 53 73 35 112 -65 123 158 -303 -458 127 351 162 -288 65 23 -76 22 -48 209 144 -168 -317 251
6400 251 242 -102 7 -95 -152 -145 -55 -10 333 45 -356 -48 341 -8 50 -132 -43 -114 7 44 176 29 -231 -343
6424 -343 -109 369 146 -73 -42 20 -9 79 165 203 236 -389 -273 29 258 115 -178 -123 -168 -144 109 6 264
6447 264 -35 -398 -374 252 290 16 -105 6 99 38 -101 36 265 -41 -375 -413 174 418 31 -191 74 -3
6469 -3 -114 -75 87 319 44 -427 -156 391 226 -198 -278 -146 -44 -135 -100 264 310 -307 -585 -58 711 232
6491 232 -346 -226 -177 -69 -267 154 284 113 -441 -583 -51 442 -9 -249 -75 -162 -234 -190 10 418 93
6512 93 -402 -412 156 517 42 -136 10 -196 -176 -37 28 328 -15 -684 -376 289 378 -110 -274 -158 -69 -239
6534 -239 -17 190 362 -65 -520 -247 286 301 -80 -88 245 -68 -42 165 454 310 -268 -551 -121 441 183
6555 183 -209 -116 155 -211 -281 71 449 149 -453 -410 33 507 109 -191 -11 -48 -143 29 313 359 26 -465
6577 -465 -369 117 457 35 -413 53 116 -278 -98 185 350 -90 -462 -266 232 461 -30 -183 29 79 -112
6598 -112 -275 266 269 -140 -448 -408 316 216 -89 -289 -72 17 -321 -54 561 122 -213 -386 -84 560 362
6619 362 -125 -48 129 -229 -319 44 283 152 -487 -346 12 79 32 -327 164 195 -106 -134 255 285 -16 -375
6641 -375 -229 270 361 -52 -18 63 -22 -298 109 291 217 -305 -526 -276 320 359 -63 31 -60 -66 -287 -67 186
6664 186 114 -137 -486 239 161 255 -213 -26 76 -72 -237 201 267 142 -112 -357 108 358 202 -272 -78
6685 -78 -114 -180 -309 37 376 92 -250 -272 -30 261 53 -325 -54 70 -225 -73 308 345 -144 -319 -284 224
6707 224 429 -147 -13 233 -130 -79 173 212 71 -70 -226 -25 163 474 -31 -213 11 -185 -241 -81 153
6728 153 58 -117 -292 -18 353 31 57 -127 0 -157 -206 57 270 17 -150 -377 -154 147 31 -148 -44
6749 -44 25 -136 -71 7 52 -80 -110 -251 1 196 130 -167 -45 -111 -222 -134 145 -24 -53 -121 -191 138 126 -89
6773 -89 -69 91 102 -122 8 112 224 -116 -134 62 220 80 -164 -163 116 111 7 196 -107 88 -216 0 -112
6796 -112 72 45 -60 123 91 -86 -53 82 13 -32 -57 -155 -29 192 1 31 -9 48 -179 -283 115 -36 123
6819 123 -86 -36 6 -9 -174 -80 112 -117 101 -97 36 108 -74 39 -4 -35 296 1 27 56 40 -258 -45
6842 -45 144 22 -28 -98 47 33 -142 -10 125 203 18 70 -97 -27 4 -175 -229 58 139 40 -43 -4 52 -49 -38
6867 -38 71 95 -251 -152 -1 -55 32 -30 -101 -189 -29 -107 -18 89 -35 28 -25 -76 -34 184 -128 -85 159 19 -140
6892 -140 -84 -13 174 -52 -154 -94 45 60 -90 -52 136 -55 -227 -185 -48 -211 74 165 -95 -38 25 -102 -88
6915 -88 -139 -50 -6 54 111 9 142 -87 -40 12 -160 -64 -7 123 48 -64 72 -118 -113 -45 135 37 31 59 -45 -122
6941 -122 41 -17 -137 69 109 148 -141 -66 136 190 -104 55 -118 28 -62 60 199 -8 -14 52 -40 93 62 76
6965 76 -228 74 143 89 47 14 -20 -223 91 112 111 -114 18 73 -29 224 -128 13 -34 21 -49 -160 -17 -129
6989 -129 -56 -231 -76 -29 -200 160 49 1 -67 -129 146 75 55 -93 -75 -248 102 -133 -132 219 192 -13 88 -121
7013 -121 363 -63 -5 11 40 164 -55 -26 145 84 -252 -70 71 132 -17 72 5 90 -82 -24 -186 64 69 77 -45
7038 -45 55 83 -32 111 79 62 27 -205 86 58 92 -18 121 133 103 152 135 -12 108 48 -2 88 169 -77 -123
7063 -123 231 33 -67 -88 223 101 3 -50 -129 249 40 12 -125 -137 4 -63 131 -19 79 -12 -88 -37 270 -14
7087 -14 -193 -69 -17 138 -88 0 -105 165 -53 40 -71 -18 48 -280 -47 -35 168 -51 46 89 17 83 -52 -105
7111 -105 29 94 -36 -107 -66 -67 23 -26 103 29 -271 -180 -77 200 -165 -214 -24 -201 63 -145 110 44 -159 -74
7135 -74 -110 158 79 -28 16 -26 -99 68 6 86 -90 -205 -237 -68 131 133 36 -73 31 -120 19 88 45 50 -175
7160 -175 -87 125 94 124 -108 -158 19 316 111 154 -54 57 -159 -93 153 143 -43 -184 -39 53 -57 7 255
7183 255 75 59 -171 38 -41 109 -9 -214 149 110 12 -67 71 -71 -100 -93 -53 35 61 -27 48 -12 284 -87 15
7208 15 -19 124 -100 -20 -36 7 169 -243 23 -142 72 28 9 68 -9 -202 -13 22 278 110 -118 18 -107
7231 -107 -104 34 -117 55 61 -201 -238 43 226 48 -50 16 -25 54 -2 -61 102 -172 -70 102 190 72 -67 35
7255 35 -11 47 15 -101 90 -123 33 36 -21 258 137 -61 -120 -25 -165 -6 -11 -72 -39 -109 -164 -150 232 -165 -194 -147
7281 -147 1 101 1 115 228 74 -68 -158 -12 128 40 26 2 27 -125 -17 -49 106 -45 -64 -148 66 239
7304 239 8 -303 -70 -20 6 -69 184 141 71 -97 -10 28 7 215 -57 104 70 183 -56 47 78 -177 -60
7327 -60 3 247 225 -63 -167 -56 -292 -279 -33 21 0 -38 -72 -6 113 88 -227 -133 44 -40 104 77 58 97 45
7352 45 -100 51 321 31 -123 15 -4 171 169 -12 -44 -83 -11 220 -3 227 241 -1 25 -95 37 -89 165
7375 165 209 -112 -153 33 146 118 -139 -9 84 84 155 194 131 -12 -269 -98 -41 37 22 79 -38 -124 102 20 21 197
7401 197 -142 -75 -133 -151 -27 -56 33 79 -136 8 46 -9 50 19 -14 -218 -83 122 68 137 -15 -98 -59 -46 218
7426 218 120 -33 -32 -99 63 288 -316 -157 140 -8 -102 65 115 23 -24 29 21 132 132 184 62 77 -1 68 207 65
7452 65 4 -20 -119 43 -24 -250 52 -2 -79 -89 -18 25 -68 35 -64 6 -69 57 39 -121 -34 -34 -188 108 -46 -72
7478 -72 103 -141 14 21 -80 -12 49 80 -6 -92 107 147 -132 -142 84 195 -48 -75 48 -218 26 -15 34 11 103
7503 103 109 179 -54 17 156 2 65 111 -19 114 47 85 89 -134 -60 -40 85 50 109 -77 12 70 -122 -67 26 0
7529 0 -55 133 103 215 57 -20 -123 -191 -62 -35 44 84 -82 -286 -1 -68 -1 34 60 -134 -2 17 38 -34 65 121
7555 121 17 28 30 -37 86 101 90 -122 12 -152 126 302 100 179 -39 74 138 -135 -152 -153 75 -11 55 -131
7579 -131 -151 -76 0 284 -45 84 77 -238 118 -125 103 -94 35 -74 -2 -102 -15 -55 -166 46 281 -56 -9
7602 -9 58 -83 -95 -103 169 77 -136 -166 -43 197 128 11 88 -38 10 -89 -85 14 26 -115 -14 -148 109 21 -17 3
7628 3 -198 -150 72 -77 -199 -65 4 116 -66 99 86 -105 30 -91 -46 -184 -40 1 14 -112 160 100 -30
7651 -30 -111 -24 31 173 186 1 -156 55 -56 37 26 -51 -15 -96 15 -57 -106 94 146 -91 52 -214 18 43 -55
7676 -55 -100 -173 -92 -188 15 77 72 -70 -169 2 113 -161 -101 91 -16 -33 148 -90 37 -5 39 -98 66 37 100
7701 100 -141 -319 157 65 -124 -106 -8 16 -65 212 77 -16 62 2 40 34 24 27 125 -200 -67 -74 48 -34 -28 -74 -83 -39
7729 -39 -62 138 104 -75 50 81 -60 159 -28 -64 -21 64 4 -91 -72 -168 -177 152 23 17 242 136 -166 -2 -44
7754 -44 -23 -53 -113 129 58 -119 -6 125 -93 139 118 24 93 22 -183 68 125 186 -84 33 -118 100 -6 133
7778 133 107 144 -43 -52 1 -107 -152 83 4 -145 -52 161 145 -48 137 106 18 -233 157 -26 -46 -146 -47 182
7802 182 -47 -222 26 -48 -206 -39 -98 70 235 151 139 148 73 78 186 314 -94 8 -116 -109 70 6 8 107 -96
7827 -96 88 -99 -86 -124 -39 103 -4 -56 19 -2 -76 11 132 26 -91 -94 -128 -54 122 -115 111 108 -90 125 45
7852 45 -118 178 -21 103 30 -246 41 44 -71 5 60 4 -1 -69 80 -66 142 65 125 -101 3 -114 -236 -197
7876 -197 128 -36 10 -135 -54 -102 0 26 -27 -78 -89 -43 83 330 -87 39 145 82 -169 171 46 107 149 -156
7900 -156 73 -105 36 -39 -87 116 -41 7 -21 153 -20 -120 -4 -168 89 -87 75 115 -18 -92 -12 -11 55
7923 55 -81 122 -46 -81 -2 -107 209 -96 24 -172 6 -18 79 -41 -134 -140 -229 105 57 -7 20 94 -65 -91 122
7948 122 164 117 179 -18 59 -101 -38 88 72 -88 -55 -51 -74 -20 -41 159 -109 -17 29 2 -94 -2 63 147 131 183 -154
7975 -154 -29 -256 -48 32 127 78 161 -1 42 -27 -86 143 47 -46 -172 179 -97 103 -146 -84 -161 229 78 83
7999 83 137 -23 -63 -113 152 -56 -192 -79 72 -65 -253 137 101 32 -7 -56 -32 -29 -91 -40 -45 34 -113 -231 1
8024 1 66 -108 125 -231 2 64 -2 -123 39 57 -80 146 24 151 -78 -21 29 -24 -57 149 -34 -176 -13
8047 -13 80 -1 -183 96 -204 -68 -8 48 83 -55 43 -55 -120 -132 -9 -25 49 154 195 206 -87 216 139 275 -56
8072 -56 -109 -138 -60 181 -190 89 -75 49 -82 -103 -128 -33 104 157 -101 12 65 -161 188 -75 73 -49 -211
8095 -211 129 -249 -91 50 -65 -104 93 80 143 -175 -82 67 9 -2 -38 152 -232 50 -115 -40 -40 308 -56
8118 -56 -27 -28 178 65 -38 18 -50 -52 -124 92 -61 -108 -27 -106 133 6 20 -93 30 165 -8 2 -1 150 122 -202
8144 -202 94 253 44 -139 -96 96 -143 91 -36 154 57 -112 6 36 -69 9 -21 -30 81 172 -16 -159 -150
8167 -150 75 -208 -45 137 -32 -246 145 211 -79 -26 107 -73 176 -134 -32 -95 -113 84 -16 75 10 -13
8189 -13 -8 250
8191B50
$$ Imaginary data points
##PAGE= N=2
##DATA TABLE= (X++(I..I)), XYDATA
0 0 0 0 0 0 0 0 -8 8 -8 8 -8 16 -16 17 -25 33 -34 44 -56 61 -71 84 -96 110 -125 142 -166 186 -207 238
30 238 -267 294 -333 373 -414 460 -511 568 -630 694 -770 857 -944 1047 -1161 1291 -1434
47 -1434 1603 -1798 2029 -2302 2634 -3056 3598 -4323 5366 -6963 9692 -15285 31235 -166615
61 -166615 -687709 -238791 362405 333673 -32687 -64484 52680 -114687 -335608 -33278
71 -33278 498856 412585 -280831 -578524 -119684 336088 223540 -46429 -39868 -38 -214684
82 -214684 -312653 87112 511885 246224 -390879 -471331 45673 334527 123247 -60055
92 -60055 31751 14283 -248612 -265543 200515 513978 116183 -458970 -386511 130533 304176
103 304176 55683 -76263 21426 -32336 -262070 -190794 262990 445635 -3957 -452821
113 -452821 -264116 191900 256491 31443 -24522 39932 -91231 -269621 -76177 345230
123 345230 352058 -143688 -431889 -135056 224204 170924 -22669 -798 45926 -136509 -274017
134 -274017 -331 387868 275611 -231134 -392842 -28413 253969 127235 -38978 16700
144 16700 35298 -153766 -225270 75484 368342 166410 -274043 -314654 34019 211596 73295
155 73295 -23615 31835 -14208 -188537 -160406 160289 334622 51239 -298577 -215710 105792
166 105792 174838 23132 -6942 57891 -40493 -212163 -113056 217542 298588 -39669 -314380
177 -314380 -147819 142924 142961 -6272 -5481 46114 -67613 -197935 -53554 237960 235863 -98433
189 -98433 -281288 -79965 144143 102719 -5209 18355 23305 -110181 -173141 21892 247089
200 247089 149592 -158866 -231091 -6250 134422 49728 -12188 42388 13712 -137031 -153242
211 -153242 75022 248443 84195 -196598 -187844 46396 127636 19528 -16635 42594 -3628
222 -3628 -137243 -112422 106958 216103 27642 -193261 -133821 65252 99448 11261 5347
233 5347 36381 -40029 -135480 -55916 139387 169501 -35163 -180574 -72237 80602 62259
244 62259 -4273 25577 39160 -65073 -135385 -13836 164917 135399 -78372 -166667 -25132
255 -25132 94562 43914 -12023 28271 28719 -73349 -114383 16533 157644 92433 -97835
266 -97835 -137673 1786 81097 27250 -1083 33236 4456 -84043 -77937 56434 141514 41321
278 41321 -106784 -90963 32406 60129 4469 9179 42188 -12994 -95724 -56903 80242 124690
290 124690 -496 -117378 -61449 52028 47343 -9399 10094 38890 -21187 -86252 -31674
301 -31674 88145 102126 -20770 -103879 -36038 50789 32895 -5313 16867 20597 -42162 -73350
313 -73350 -1979 85938 62919 -46052 -83945 -8636 42546 10638 -2640 30182 13679 -54814
325 -54814 -61816 23698 89680 38261 -62251 -67523 13905 40795 -2361 -6506 27249 4981
337 4981 -55221 -49940 29430 75294 18055 -63039 -51326 19390 31508 -2840 3194 23092 -8623
350 -8623 -48356 -23152 41111 56460 -2451 -53769 -26042 22917 14158 -7786 12891 20615 -23042
363 -23042 -49928 -8843 47740 42592 -19945 -51046 -8390 29462 7219 -10015 16015 20065
375 20065 -21655 -39202 1868 46387 33129 -22679 -42116 -1872 24738 4016 -4429 14496
387 14496 5872 -26078 -24687 12418 36074 15344 -23776 -25784 7395 16381 -1565 5084 20434
400 20434 -995 -29039 -14622 22930 32929 3504 -27679 -16485 14935 11831 -8311 3066
412 3066 17669 -4161 -26527 -10281 21050 26934 -217 -25125 -12310 14218 9884 -3939 5907
425 5907 10499 -9494 -17973 306 17871 15160 -4964 -18226 -5705 8565 962 -1902 10772
438 10772 4943 -17749 -16102 7417 18688 7716 -11517 -15977 1570 9924 -2906 -3303 11169
451 11169 3380 -17065 -13432 7103 16535 6791 -12327 -16559 1007 8746 -1248 -607 6943 -3626
465 -3626 -14635 -5104 8099 10052 2655 -9293 -10915 654 3518 -510 5626 6712 -9828 -15649
479 -15649 488 12307 8272 -2450 -11005 -6044 5055 2022 -2497 6967 7342 -10078 -14194 1803
493 1803 13127 9910 -2408 -12965 -6556 6377 4129 -134 6301 2470 -10744 -8494 5779 10997
507 10997 7116 -1729 -9387 -4142 4640 4061 5900 9983 -2230 -15075 -4560 11726 12304 3305
521 3305 -5572 -8353 -88 5181 1475 5940 10569 -3680 -16269 -3706 13785 15108 4362 -8579
535 -8579 -9761 2438 7549 3460 7049 8053 -7388 -14233 905 13331 11180 1340 -8749 -9339
549 -9339 535 4888 4946 10485 4398 -14411 -14411 6757 17401 9172 -3528 -9916 -4796 3541 2663 4495
565 4495 13061 3070 -19023 -15373 9217 18686 7232 -8332 -13874 -5058 4514 3298 5370 10859
579 10859 -2370 -20554 -10818 13090 18192 5277 -9026 -12655 -3976 3403 3752 10098 10692 -10362
593 -10362 -24675 -5330 18446 15777 -1278 -12833 -11221 -2024 1836 3267 12253 10612 -14546
606 -14546 -25649 -1155 22909 16889 -3896 -15530 -9652 2036 3313 4208 13347 7051 -19855
619 -19855 -24271 4603 23902 12053 -7567 -14736 -8102 646 2395 8665 16734 1442 -26142
632 -26142 -19593 14962 26841 7117 -11673 -12802 -3245 1233 807 11054 19316 -3940 -32095
645 -32095 -16574 21654 27291 2044 -16354 -13037 -1080 2456 2780 14120 17273 -10570 -32332
658 -32332 -8718 26159 24409 -1325 -16247 -11362 -1326 1586 5446 17890 12305 -20252 -32832
671 -32832 363 30068 18226 -8436 -16325 -7497 -896 -445 7744 21334 8537 -27136 -30661
684 -30661 9138 33048 13397 -13208 -16963 -5603 184 -742 9122 21619 2339 -33292 -26774
697 -26774 16918 32811 6469 -16942 -14635 -3753 -1773 213 15272 22071 -7642 -38868 -17759
710 -17759 26477 29445 -1747 -18651 -11213 -2789 -3504 1535 20042 19827 -17474 -41218 -8851 32922
724 32922 25881 -7716 -19493 -8784 -1514 -3107 5023 22811 14831 -24813 -38453 1426 35410
737 35410 19367 -11629 -17312 -7104 -2841 -1989 10259 24744 7348 -31448 -32407 12223 36010
750 36010 11736 -14535 -13818 -4193 -3544 -1666 14799 26157 -3 -37538 -25738 21896 35054
763 35054 4503 -17062 -11318 -2581 -3828 442 19628 24528 -8798 -39919 -16232 29346 30966
776 30966 -1828 -16993 -8745 -3158 -4556 4785 23787 19773 -19191 -40162 -5011 34872 23863
789 23863 -8490 -15181 -5510 -4184 -5268 8787 26773 13483 -27628 -36708 5376 36043 16552
802 16552 -12225 -13892 -5076 -4996 -3601 12325 25604 5367 -32225 -30620 12995 33796 9536
815 9536 -13807 -11687 -5117 -6217 -850 16684 23386 -3674 -35351 -21505 20617 29087 2058
828 2058 -13831 -9006 -6320 -7680 2071 20034 19431 -12371 -36504 -12781 25725 24578 -3586 -13885
842 -13885 -7312 -6078 -6198 5864 21852 14384 -19216 -34436 -3722 28653 18590 -7091 -11893
855 -11893 -6784 -7398 -4601 10501 21971 7297 -24614 -28797 5287 28134 12020 -8728 -9242
868 -9242 -5889 -7666 -1551 14217 21041 917 -27223 -22190 12360 26073 6048 -9410 -7278
881 -7278 -5704 -6998 1716 16050 17549 -4656 -26752 -14898 16604 22590 2782 -8291 -6277
894 -6277 -6263 -5313 5605 17478 13091 -10076 -25103 -7473 19352 17572 -1080 -7247 -5770 -7254
908 -7254 -3693 8754 17526 8277 -14712 -22289 -751 20243 13081 -3145 -6495 -5573 -6804 -980
922 -980 10779 15266 3231 -16630 -18574 3919 18948 8612 -4799 -6160 -6543 -6665 1534 11615
936 11615 12080 -1395 -17360 -13640 7890 16290 4193 -4781 -4770 -6626 -5685 3652 11989 8896 -5296
951 -5296 -17118 -8954 10205 13099 860 -4914 -4458 -6652 -4055 5008 10706 5587 -7296 -15573
965 -15573 -4988 11383 10342 -1088 -4709 -4826 -6611 -1943 6903 8953 2341 -9089 -13139 -968
979 -968 11386 6856 -2271 -3905 -4481 -5726 263 7989 7709 -22 -9651 -10190 2651 11120 4303 -3010
995 -3010 -2778 -4180 -4514 1827 7584 5837 -1616 -9194 -7200 4768 9757 2109 -3051 -2107 -3573 -2911
1011 -2911 3767 7016 3739 -2797 -8096 -4186 6304 7576 43 -2094 -1044 -3508 -2198 4553 6311
1026 6311 2373 -3684 -7076 -1250 7317 5413 -1703 -1325 -574 -2982 -1019 4734 5411 923 -3959 -6147
1042 -6147 681 7177 2974 -2620 -1007 -499 -2935 -105 4545 3555 -387 -4421 -4644 2267 6295 490
1058 490 -3046 -8 -270 -3112 460 4238 2574 -1570 -4838 -3334 3622 4573 -1999 -2982 1170 -552
1074 -552 -3345 296 3460 1577 -2136 -4421 -1888 4330 2807 -3444 -2328 1817 -999 -3005 627
1089 627 2896 312 -2691 -3969 -325 4526 721 -4502 -897 2543 -1591 -3056 1392 2792 -404
1104 -404 -3532 -3078 1713 4462 -1183 -4799 890 3125 -2348 -2886 1961 2473 -990 -3527 -2221 3059
1120 3059 4073 -2863 -4237 2681 2733 -3155 -2015 2615 2242 -1286 -3222 -820 4142 2487 -4220 -2700
1136 -2700 4435 2357 -3684 -1118 3373 1876 -2130 -2636 1015 4812 889 -5144 -966 5450 891
1151 891 -4327 -17 4025 1125 -2737 -2291 2463 4733 -843 -5180 1068 5625 -828 -4246 1283
1166 1283 4031 89 -3392 -1720 3530 4147 -2712 -4838 2904 4838 -2851 -3781 2849 3751 -1370 -3948
1182 -3948 -629 4426 2811 -4448 -3739 4350 3443 -4459 -3137 3903 3142 -2821 -3990 511 4920 1182
1198 1182 -5684 -2346 5320 1668 -6091 -1937 4977 2006 -4227 -4177 1737 4811 -700 -6010 -81
1213 -81 5866 -821 -6642 84 5857 791 -5470 -3453 3177 4182 -2308 -6090 1946 5811 -3340
1228 -3340 -6650 2522 6513 -943 -6469 -2146 4763 3799 -3927 -4538 4111 4171 -5285 -5158 5517 6495
1244 6495 -2981 -6699 -515 6031 3005 -4793 -2774 5481 2250 -7185 -3142 7710 5444 -5068
1258 -5068 -6615 1532 6574 1133 -5402 -276 6769 -169 -8725 -354 10136 3842 -6988 -5574
1272 -5574 3484 6719 -496 -5081 2194 6636 -3403 -8783 2956 11239 1596 -8605 -4464 5327
1286 5327 6031 -2585 -4314 4613 5378 -6643 -8016 6820 11563 -1718 -10059 -2473 6960 4419 -4227
1301 -4227 -2619 6036 2786 -9608 -5848 10284 10221 -5249 -11010 -596 7741 2707 -5363 -722
1315 -722 7114 -291 -11428 -2623 12985 7943 -8735 -10276 2143 7664 452 -5422 1587 6877
1329 6877 -4217 -12604 1276 14868 4726 -11688 -8917 4716 7325 -1924 -4891 4264 5974
1342 5974 -8222 -12133 5956 15944 289 -13878 -5933 7228 5710 -4224 -3311 6619 3382 -11939
1356 -11939 -9901 10925 15071 -4180 -14611 -2709 8996 3734 -5560 -758 8255 349 -14517
1369 -14517 -5929 15457 12807 -8753 -14368 1121 9856 1171 -5950 2213 8622 -3635 -15486
1382 -15486 -715 18453 9181 -12674 -12265 4430 9414 -1023 -5077 4896 7681 -7847 -15029
1395 -15029 4626 20239 4624 -15454 -9359 7684 7770 -3359 -3035 7833 5655 -12215 -13190 10207
1409 10207 19677 -815 -17074 -5516 9572 5285 -5089 -795 9802 2010 -15513 -9567 15342
1422 15342 17857 -6698 -17160 -1104 10639 2248 -5889 2150 9941 -2676 -17894 -4352 19352
1435 19352 13668 -12152 -15649 2992 10033 -720 -5341 5368 9010 -8010 -17969 1636 21698
1448 21698 8088 -16024 -12961 6004 8311 -3169 -3817 7887 6161 -12339 -16488 7714 21956
1461 21956 2275 -18453 -8803 8565 5910 -4896 -1489 9624 2799 -15974 -12883 13341 20312
1474 20312 -3536 -18846 -4212 9645 2736 -5933 1891 10409 -1636 -18474 -7784 17971 16812
1487 16812 -9164 -17417 430 9534 -310 -5405 5409 9752 -6400 -19052 -1878 21264 12167
1500 12167 -13615 -14635 4467 8616 -2520 -3304 8013 7582 -10763 -17448 4579 22538 6204
1513 6204 -16684 -10768 7278 6458 -4052 -924 10069 4272 -14534 -14320 10513 21706 208
1526 208 -17466 -6266 8799 3660 -4666 2301 10657 304 -16914 -9928 15347 18674 -5400
1539 -5400 -16892 -1715 8981 681 -4457 5275 10039 -4306 -17971 -4574 18584 14326 -9892
1552 -9892 -14524 2088 7709 -2065 -3113 7640 7852 -8777 -17184 1098 20142 8769 -13536
1565 -13536 -11610 4828 5653 -3626 -957 9194 4884 -12579 -14611 6737 19797 3153 -15211
1578 -15211 -7892 6499 3216 -4297 1594 9384 758 -14854 -10938 11136 17493 -2220 -15180
1591 -15180 -3895 6773 612 -4086 4119 9125 -2964 -15871 -6506 14222 14011 -6557 -13619
1604 -13619 -198 6271 -1629 -3027 6362 7378 -6558 -15203 -1676 16048 9723 -9828 -10971
1617 -10971 2634 4801 -3027 -1321 7967 5170 -9210 -13180 3085 16267 5262 -11471 -7633
1630 -7633 4833 3043 -3683 1020 8561 2284 -11252 -10130 7107 15200 822 -11820 -4107 5452
1644 5452 1042 -3451 3275 8185 -771 -11847 -6624 10179 12612 -2723 -10842 -819 5456 -707
1658 -707 -2856 4815 6947 -3695 -11658 -3031 11629 9573 -5602 -8939 1618 4513 -2396 -1620
1672 -1620 6360 5179 -6030 -10604 468 12066 5930 -7531 -6895 3187 2590 -3473 -101 6886
1686 6886 2643 -7686 -8646 3560 11386 2182 -8583 -4312 4059 993 -3696 1625 6381 355
1700 355 -8774 -6229 5918 9544 -868 -8376 -1594 4121 -704 -3156 3151 5505 -2052 -8576 -3612
1715 -3612 7124 7400 -3276 -7126 135 3258 -2141 -2009 4095 4151 -3846 -8135 -870 7738 5058
1730 5058 -4770 -5712 1849 2379 -2780 -938 5150 2615 -5086 -6776 1185 7660 2653 -5548 -3745
1745 -3745 2829 1010 -3012 883 5150 857 -5789 -4852 3277 6895 688 -5400 -1713 2975 95
1760 95 -2524 2155 4759 -748 -5701 -3176 4389 5771 -793 -4728 -333 2695 -1066 -1686 3131 3864
1776 3864 -2005 -5176 -1107 4939 4252 -2229 -3765 999 2133 -1538 -726 3825 2445 -2978 -4307
1791 -4307 349 4869 2720 -2670 -2814 1559 1194 -2111 388 3973 1167 -3733 -3236 1424 4501 1280
1807 1280 -3112 -1734 1765 433 -1764 1161 3597 -298 -3844 -2295 2272 3766 121 -3207 -807
1822 -807 1597 -488 -1491 1800 2606 -1347 -3604 -1079 2262 2682 -625 -2850 -116 1273 -1245 -949
1838 -949 2434 1735 -2159 -2887 -17 2590 1948 -1288 -2131 585 844 -1240 -176 2577 565 -2533
1854 -2533 -2231 427 2317 1164 -1606 -1426 744 345 -1305 390 2338 -73 -2391 -1236 939 1828
1870 1828 707 -1508 -1147 627 -39 -1155 1063 1972 -704 -2007 -582 1015 1500 417 -1513 -666
1886 -666 620 -414 -573 1428 1430 -1122 -1742 -35 1312 1649 100 -1270 -205 828 -350 -73 1636
1903 1636 711 -1547 -1220 219 951 1076 -114 -1001 -3 275 -702 275 1477 133 -1622 -611 326
1920 326 830 793 -288 -812 -31 188 -723 571 1403 -561 -1619 -347 571 859 694 -449 -954 71
1938 71 -179 -526 1136 1113 -1039 -1483 -115 268 636 761 -541 -849 -5 -547 -369 1237 692 -1402 -1399
1957 -1399 -127 419 641 392 -817 -898 -61 -395 -42 1168 188 -1425 -1066 307 394 887 -19 -1140
1975 -1140 -735 -47 -385 368 1452 -276 -1630 -755 362 773 891 5 -867 -480 -153 -426 1106 1449
1993 1449 -607 -1771 -383 548 776 664 -257 -821 -342 -255 -80 1227 1368 -810 -1694 136 990 1074
2011 1074 915 -363 -669 74 -170 364 2050 1241 -1440 -1463 289 1095 1053 358 -705 -474 -41 -441 574
2030 574 2414 917 -2062 -1456 759 1463 1263 404 -655 -422 -267 -347 1000 2518 -41 -2636 -1303
2047 -1303 1227 1621 757 -422 -790 -344 -585 -462 1748 2403 -701 -2861 -702 1551 1696 449 -617
2064 -617 -750 -352 -688 -205 2241 2307 -1868 -3406 -393 1954 1344 68 -651 -521 -598 -1370 89 2917
2082 2917 1647 -3078 -3322 424 2257 909 -469 -994 -550 -895 -1334 753 3252 700 -3726 -2975
2098 -2975 1236 2428 508 -848 -747 -422 -1085 -1211 1626 3490 -307 -4533 -2247 2133 2403 115
2114 115 -914 -621 -364 -1480 -877 2687 3575 -1521 -4720 -1132 3056 2113 -225 -700 -188 -560 -1533
2131 -1533 -474 3744 3307 -2729 -4591 106 3556 1819 -672 -529 140 -1055 -1987 620 4417 2373
2147 2373 -3800 -4132 1489 3828 900 -950 -137 181 -1475 -2071 1959 4899 926 -5103 -3303 2617
2163 2617 3583 403 -1155 108 96 -2165 -1563 2926 4772 -736 -5884 -2136 3757 3034 -500 -1048
2179 -1048 312 -402 -2431 -815 4162 4125 -2525 -5912 -785 4248 2258 -1219 -751 349 -1221 -2794
2195 -2794 222 5109 3125 -3958 -5829 655 4253 1392 -1337 -412 294 -2147 -2940 1534 5446 1875
2211 1875 -5452 -4665 2292 4090 168 -1419 156 -15 -2541 -2387 2616 5683 261 -6285 -3269 3310
2227 3310 3481 -446 -1282 636 -365 -3058 -1480 4070 5148 -1741 -6559 -1878 4388 2809 -1100
2242 -1100 -810 661 -1091 -3254 -176 5109 4146 -3451 -6298 -19 4685 1737 -1491 -97 759 -1957
2258 -1957 -3084 1269 5856 2842 -4905 -5410 1786 4579 813 -1319 454 373 -2588 -2624 2427 6206
2274 6206 1144 -5840 -3970 3017 4097 -70 -788 1172 -51 -3268 -1918 3808 5581 -746 -6545
2289 -6545 -2386 4030 3350 -879 -507 1070 -951 -3298 -763 4802 4754 -2599 -6176 -896 4548 2142
2305 2142 -1170 -22 849 -1830 -3411 411 5452 3309 -4002 -5510 556 4005 940 -1391 196
2320 196 327 -2433 -3065 1727 5483 1624 -5099 -4727 1949 3900 73 -1091 898 -46 -3112 -2326
2336 -2326 2769 5176 115 -5666 -3192 2987 2873 -834 -762 1120 -856 -3519 -1473 3747 4447 -1488
2352 -1488 -5620 -1746 3438 1672 -1298 -159 1165 -1359 -3633 -53 4541 3339 -2823 -5171 -99
2367 -99 3755 1129 -1455 374 939 -1968 -2979 1083 4763 2101 -3732 -4168 1040 3152 270 -1020
2383 -1020 862 474 -2594 -2237 2201 4583 777 -4369 -3059 2220 2750 -318 -681 1320 -50 -2814
2399 -2814 -1498 2964 4062 -387 -4397 -1803 2679 1874 -996 -10 1475 -575 -2897 -544 3473
2414 3473 3212 -1612 -4040 -551 3043 961 -1394 497 1296 -1286 -2518 294 3805 2298 -2419
2429 -2419 -3526 443 2868 315 -1051 985 896 -1831 -2257 1096 3529 1070 -3093 -2765 1620 2299
2445 2299 -578 -876 1283 547 -2348 -1920 1854 3048 57 -3252 -1766 2018 1635 -1172 -558 1351
2461 1351 -100 -2344 -863 2257 2239 -1009 -3297 -762 2288 800 -1201 18 1483 -800 -2363
2476 -2363 -226 2717 1606 -1565 -2746 316 2131 206 -1273 439 1139 -1203 -2188 674 2530
2491 2530 932 -2174 -1968 1059 1776 -365 -1064 961 789 -1692 -1642 1219 2384 119 -2116 -1248 1451
2508 1451 1400 -973 -679 1324 325 -1644 -1010 1616 1912 -334 -1974 -376 1652 896 -1122 -327 1295
2525 1295 7 -1789 -448 1851 1306 -832 -1856 56 1482 209 -1178 287 1083 -420 -1485
2540 -1485 71 1931 650 -1182 -1495 584 1524 -498 -967 581 1196 -1095 -1312 530 1590 -72
2556 -72 -1515 -820 789 911 -1035 -1008 951 566 -1091 -1033 1024 1137 -548 -1379 -331 1277 585 -1005
2574 -1005 -631 1126 148 -1401 -562 984 810 -722 -1023 -80 1117 9 -1238 -55 1307 -177
2590 -177 -1276 -92 1073 276 -888 -841 387 916 -282 -1271 343 984 -551 -1104 275 1095 -101
2607 -101 -1027 -674 768 807 -724 -822 694 850 -715 -908 710 871 -344 -908 -45 1082 599 -933
2625 -933 -521 1014 620 -1015 -550 880 742 -515 -709 362 1073 392 -903 -41 1179 184 -982
2642 -982 -101 995 531 -643 -518 303 948 -101 -818 93 1041 -228 -1062 369 999 219 -639 -300
2660 -300 663 586 -683 -699 741 921 -517 -890 690 940 -153 -690 -13 530 516 -429 -560 973 542
2679 542 -966 -597 618 665 -681 -755 200 661 226 -901 -235 871 320 -1062 -263 1079 426 -706
2697 -706 -691 275 669 -264 -1028 66 931 -192 -1399 95 1250 191 -895 -515 470 502 -389 -779
2715 -779 419 860 -649 -1314 392 1176 -404 -942 -309 707 392 -776 -522 805 522 -924 -864 1086
2733 1086 1050 -561 -947 60 660 54 -900 -159 974 281 -1345 -400 1388 749 -788 -849 306 695
2751 695 -132 -792 58 1308 -210 -1561 1 1612 506 -1001 -496 586 913 -262 -744 562 1151
2768 1151 -634 -1526 528 1631 117 -1255 -504 740 533 -519 -297 1079 922 -1171 -1172 1097 1579
2785 1579 -525 -1339 -223 836 314 -631 -75 1087 245 -1567 -817 1599 1333 -867 -1213 330 904
2802 904 -233 -786 179 1411 -294 -1761 -334 1935 958 -1465 -909 690 643 -449 -801 739 1026
2819 1026 -684 -2006 357 2147 199 -1677 -708 825 495 -756 -640 1006 714 -1387 -1573 1107
2835 1107 2049 -285 -1708 -233 1031 314 -787 -52 1232 653 -1763 -1109 1519 1722 -883 -1619 177
2852 177 999 -33 -842 192 1222 -219 -2079 -642 2160 1164 -1414 -1527 695 849 -193 -700 944
2869 944 1274 -539 -1802 263 2420 743 -1597 -1027 856 606 -813 -351 1092 1251 -1541 -1751 1038
2886 1038 2543 119 -1796 -381 1241 327 -998 116 1296 519 -1749 -1492 1529 2207 -591 -1892
2902 -1892 59 1307 128 -763 259 1391 -24 -2074 -750 2135 1396 -1453 -1602 676 970 -342
2918 -342 -642 953 1260 -599 -2136 -104 2382 1015 -1695 -1300 994 618 -847 -430 1007 865 -1112
2935 -1112 -1951 641 2546 193 -2133 -515 1116 176 -884 -48 1429 783 -1574 -1618 1443 2201 -507
2952 -507 -2047 -99 1015 -1 -841 509 1507 -50 -2139 -1112 1850 1817 -1052 -1680 395 923 -420
2969 -420 -947 778 1334 -516 -1913 -284 2088 1247 -1574 -1245 1034 771 -637 -261 944 1029 -1159
2986 -1159 -1861 435 2389 378 -1588 -605 1062 420 -873 -164 1173 684 -1225 -1490 1162 2205
3002 2205 -164 -1581 -122 1171 -256 -752 416 1396 283 -1524 -1023 1409 1936 -692 -1835 387
3018 387 1062 -321 -875 789 1349 -505 -1746 -374 1855 1262 -1214 -1488 919 717 -673 -386 882
3035 882 900 -824 -1567 125 1874 726 -1327 -704 901 478 -665 -87 1001 692 -1081 -1441 709
3052 709 1682 59 -1759 -285 1006 -63 -762 255 1089 163 -1261 -955 1207 1474 -693 -1485 174
3069 174 811 -341 -715 515 948 -191 -1309 -380 1259 1042 -874 -1169 369 665 -619 -484 648
3086 648 708 -790 -1330 -158 1468 533 -1192 -835 649 486 -950 -208 852 434 -678 -1150 542
3103 542 1453 205 -1005 -558 971 159 -846 -129 790 8 -764 -792 719 1236 -340 -1260 124 944
3121 944 -119 -667 351 979 -11 -947 -259 1061 1040 -744 -930 451 818 -374 -578 470 835 -153
3139 -153 -870 -30 1043 689 -880 -572 820 542 -521 -267 630 428 -542 -785 88 863 264 -880
3157 -880 -329 706 168 -641 -133 460 15 -454 -464 171 703 114 -919 -145 1020 -59 -550 377 425
3176 425 -74 -331 -321 430 588 -417 -700 221 830 -403 -549 248 465 -423 -379 -37 381 393 -558 -543 519
3197 519 495 -568 -355 469 168 -230 -402 21 451 167 -697 -489 563 46 -709 -326 337 54 -457 -359
3217 -359 469 312 -83 -626 -169 810 230 -433 18 264 168 -248 -40 283 239 29 -431 194 821 -240
3237 -240 -477 119 270 25 -183 -43 157 299 -208 -344 387 497 -206 -449 266 383 -123 -7 169 229
3257 229 185 -324 -139 468 442 -388 -285 258 170 -391 -183 341 306 112 -459 -211 356 185 -506 -6 430
3278 430 72 -192 53 148 357 53 -308 -70 746 -30 -543 251 356 -164 -227 45 148 140 -207 -314 130
3299 130 509 -329 -145 293 126 -456 -180 30 162 46 -321 -549 139 234 -340 -233 353 -173 -547 16
3319 16 321 265 -71 -493 -163 205 -40 -515 -66 546 149 -584 -147 156 66 62 -152 101 386 -24 -380 131
3341 131 515 -280 -476 -150 393 306 -26 -334 -139 250 -90 -527 394 613 -291 -552 -155 147 396 72
3361 72 -275 -117 248 -173 -250 677 422 -637 -481 186 268 437 -26 -355 229 195 -376 155 808 117 -649
3382 -649 -562 152 680 140 -141 -96 -9 80 -244 337 817 -101 -732 -448 495 502 45 -120 -94 -247 -388 -311 602
3405 602 926 -294 -867 -357 519 400 266 -214 -155 -223 -379 60 700 710 -759 -1077 11 608 548 204
3425 204 -246 -228 -312 -432 57 1078 689 -1104 -1121 -115 820 420 -244 -454 -232 -541 -466 291 1270 289
3445 289 -1355 -1052 293 722 447 -170 -351 -292 -517 -329 868 1631 -143 -1538 -698 505 926 463
3463 463 45 -509 -425 -660 -270 971 1412 -692 -1848 -502 862 934 142 -288 -248 -312 -718 -64 1596
3482 1596 1308 -869 -1476 -8 979 924 363 -197 -262 -751 -713 509 1822 770 -1399 -1464 352 1210 940
3501 940 300 -267 -399 -576 -594 966 1949 276 -1964 -1330 484 1427 524 5 -292 -500 -855 -293 1475
3520 1475 2034 -340 -2091 -1011 911 1177 560 -83 -362 -784 -957 -142 1963 1702 -1069 -2227 -578
3537 -578 1328 1260 190 -282 -551 -816 -1007 418 2403 1413 -1780 -2419 -204 1518 830 123 -184 -603
3555 -603 -1038 -1026 857 2247 794 -2308 -1959 529 1466 621 124 -275 -612 -1282 -827 1270 2406 -64
3573 -64 -2525 -1656 806 1323 538 211 -281 -672 -1404 -239 2065 2286 -869 -2748 -1137 1310 1158 441
3591 441 -68 -584 -863 -1393 251 2299 1696 -1353 -2481 -214 1702 1045 211 -21 -410 -1189 -1308 618
3609 618 2622 1160 -1995 -2577 203 1754 1016 217 38 -563 -1421 -1064 1249 2675 475 -2475 -1785
3626 -1785 828 1367 788 259 -2 -620 -1423 -535 1747 2489 -431 -2616 -1431 1431 1541 414 325 146
3644 146 -887 -1414 115 2203 2124 -1016 -2785 -556 1421 856 38 332 -133 -1006 -1253 353 2586
3661 2586 1448 -1779 -2465 71 1519 874 182 278 -315 -1588 -1128 923 2406 740 -2081 -2284 803
3678 803 1369 366 16 336 -633 -1624 -836 1507 2412 -5 -2464 -1499 888 1159 200 -27 210 -805
3696 -805 -1528 -357 1796 2113 -628 -2434 -891 1258 825 -72 171 134 -1292 -1527 89 2017 1537
3713 1537 -1403 -2348 -415 1194 588 -30 330 -17 -1313 -1516 741 2285 903 -1643 -2061 164 1246
3730 1246 374 121 512 -343 -1293 -938 980 2246 444 -2084 -1568 696 1267 -2 115 464 -439 -1369
3748 -1369 -593 1480 1879 -94 -2010 -996 1112 927 -132 399 353 -634 -1370 -59 1818 1586 -590
3765 -590 -2062 -433 968 393 -130 495 251 -951 -1104 279 1608 1023 -1216 -1441 70 1115 106
3782 106 -4 581 -26 -1137 -969 748 1746 714 -1245 -1431 470 1127 -145 -36 650 -265 -1268 -788
3800 -788 876 1639 93 -1564 -1011 598 712 -341 -41 361 -330 -1251 -136 1040 1137 -288 -1441
3817 -1441 -541 757 424 -379 376 466 -668 -1172 -77 1042 923 -724 -1394 -303 775 79 -278 641
3835 641 212 -747 -902 207 1211 552 -963 -1234 406 790 -92 -90 399 -60 -965 -740 496 1272 295
3854 295 -907 -715 567 535 -326 26 632 -134 -974 -285 736 859 -56 -834 -330 660 457 -254 273
3873 273 434 -278 -870 109 964 780 -322 -735 -210 585 183 -306 516 465 -538 -596 105 787 692 -542
3893 -542 -689 56 590 -101 -202 463 187 -563 -448 396 783 111 -548 -572 131 569 -185 -143 618 94 -822
3914 -822 -577 462 526 -103 -580 -499 424 282 -201 -4 461 -191 -824 -316 529 348 -59 -616 -84 362
3934 362 146 -203 72 439 -368 -668 54 620 79 -220 -444 -11 393 -187 -341 351 294 -346 -571 37
3954 37 510 -2 -222 -369 171 351 -211 -104 342 175 -441 -439 305 215 86 -401 -319 -47 554 -329 -224 390
3976 390 97 -619 -151 416 268 127 -202 -394 255 182 -249 20 514 -203 -702 19 351 172 -28 -64 -83
3997 -83 279 247 -418 47 579 -340 -457 140 495 247 -118 -107 -183 121 42 -72 207 304 -312 -324 184 407
4019 407 199 -57 -151 -111 164 53 -54 470 243 -633 -175 460 413 -115 -127 -207 -59 376 110 83 298 -276
4041 -276 -568 -248 545 229 31 -332 -319 37 174 -148 223 480 -369 -913 12 789 327 -219 -430 -302
4061 -302 21 -23 -91 234 287 -546 -786 52 627 107 -354 -273 -183 163 54 -146 87 67 -809 -900 225 619
4083 619 29 -50 -356 -8 239 -38 -22 519 -14 -947 -564 587 577 -29 -339 -473 -170 48 85 222 468
4104 468 -300 -1106 -363 773 684 -210 -410 -312 -9 378 62 619 551 -559 -949 63 1090 544 -270 -529
4124 -529 -179 142 153 303 649 338 -801 -1207 614 1023 351 -230 -414 -353 97 275 189 591 179 -1035
4144 -1035 -938 775 1242 296 -676 -467 -151 69 181 448 727 -254 -1364 -761 930 1146 -22 -556 -562
4163 -562 -174 128 252 633 695 -498 -1497 -390 1314 784 -207 -740 -506 -9 154 277 844 665 -1054
4182 -1054 -1503 168 1439 624 -402 -846 -560 -30 104 309 852 503 -1413 -1376 573 1581 370 -687
4200 -687 -699 -451 -158 59 402 894 74 -1609 -1244 1097 1569 212 -770 -858 -235 -246 257 770 1176 -398
4220 -398 -1957 -826 1320 1581 -216 -912 -678 -262 37 255 1022 896 -836 -1981 -351 1790 1287
4237 1287 -349 -845 -552 -97 12 419 909 595 -1129 -1806 94 1972 1098 -782 -878 -484 -325 153
4255 153 620 1159 430 -1464 -1740 956 2051 748 -989 -845 -445 -53 460 989 1081 27 -1947 -1188
4273 -1188 1272 1794 49 -983 -648 -240 -109 262 1196 992 -750 -2208 -773 1809 1732 -132 -901
4290 -901 -584 -366 -52 388 1305 944 -1085 -2173 -248 2127 1165 -681 -1079 -388 -238 -243 515 1351 524
4309 524 -1483 -2067 390 2141 754 -944 -790 -432 -525 -55 906 1469 144 -2272 -1901 815 2153
4326 2153 456 -1162 -651 -364 -380 223 1085 1328 -340 -2434 -1542 1770 1999 -84 -1002 -465 -412 -519
4344 -519 280 1284 1200 -793 -2439 -719 1985 1804 -527 -913 -454 -252 -313 685 1598 868 -1311 -2293
4362 -2293 -56 2151 1309 -727 -794 -14 -441 -287 896 1681 633 -1739 -1945 712 2273 756 -955
4379 -955 -391 -4 -785 -135 1182 1519 84 -1911 -1720 1355 2237 182 -960 -564 -358 -407 183 1329
4397 1329 1570 -542 -2465 -1006 1742 1944 -329 -1010 -58 -421 -460 468 1586 1198 -1003 -2263 -472
4414 -472 1883 1464 -575 -977 -221 -384 -465 694 1619 568 -1474 -1992 -72 2188 952 -962 -596
4431 -596 18 -470 -253 791 1420 172 -2017 -1854 584 1986 404 -920 -479 -65 -738 -109 1021
4448 1021 1468 -464 -2040 -1293 1259 1696 -82 -1006 -242 -160 -791 -138 1399 1042 -561 -1890 -823
4465 -823 1509 1463 -526 -1010 -70 -228 -676 148 1457 871 -969 -1955 -93 1766 1135 -501 -554 59
4483 59 -227 -592 509 1262 262 -1333 -1569 302 1895 748 -779 -589 -73 -428 -473 828 1287 245
4501 245 -1439 -1313 881 1838 211 -899 -229 -39 -542 -246 1098 1185 -189 -1571 -994 1089 1422 -190
4519 -190 -717 100 -212 -675 55 1032 814 -698 -1488 -223 1374 1233 -259 -518 120 -84 -600 365 1110
4538 1110 569 -1074 -1352 250 1320 684 -652 -434 84 -460 -497 450 1123 245 -982 -1069 132 1353
4556 1353 323 -608 -146 103 -366 -379 552 824 -305 -1104 -650 620 1241 -3 -817 24 229 -604 -366
4575 -366 800 525 -348 -1185 -492 846 760 -293 -603 194 89 -572 54 809 490 -539 -936 -367 965
4594 965 558 -408 -359 283 2 -618 275 777 194 -547 -883 14 1036 290 -496 -99 255 -265 -472 319
4614 319 695 44 -508 -520 136 847 64 -713 174 183 -200 -377 520 481 -171 -416 -239 344 630 -71 -394
4635 -394 105 236 -501 -77 640 201 -217 -302 -87 445 329 -177 -353 218 45 -453 15 473 -16 -325
4655 -325 -252 37 406 429 -254 -121 333 82 -350 17 487 56 -291 -444 -98 466 84 -434 -145 205 -277
4676 -277 -268 328 273 -319 -406 -189 -37 183 -101 -262 132 32 -199 -288 236 -34 -273 -291 -196 40 274 69
4698 69 -300 89 202 -309 -81 263 33 17 -96 -208 -46 239 -165 -249 178 182 -314 70 298 -21 -187 82
4720 82 83 187 248 -111 -148 390 158 -129 309 290 -100 -203 36 37 232 245 -272 -105 355 58 69 107 382 7
4744 7 -89 86 104 265 -144 -253 -116 160 -202 -80 301 47 -227 89 67 136 347 84 -113 77 149 -257
4766 -257 -49 143 43 -295 -51 43 222 201 -36 -192 75 280 -41 212 326 59 -179 138 343 178 260
4787 260 -368 -142 269 0 -113 109 203 52 -65 -31 125 101 5 -262 -103 21 -178 -388 313 275 -230 -296
4809 -296 -40 -22 20 -68 -311 -75 -121 -428 -170 314 -33 -364 -48 134 84 214 -103 -187 149 157 11 -234 585
4832 585 147 -597 -301 117 279 0 -202 1 188 -27 -454 69 364 3 -465 35 231 -18 124 -105
4852 -105 -209 41 -38 -427 172 497 -189 -649 -4 348 83 70 -62 -15 47 -315 -134 581 542 -229 -262 -90
4874 -90 379 122 43 68 99 -19 -416 48 699 450 -308 -361 195 542 135 123 -119 196 -40 -532 -14 1004
4896 1004 260 -681 -387 61 439 80 -44 190 255 -292 -636 416 898 -235 -963 -268 520 413 18
4915 18 71 188 115 -538 -531 741 883 -352 -952 -300 383 41 17 -167 26 -195 -643 -137 1060 738 -649
4936 -649 -709 -88 486 115 -70 87 -11 -335 -722 33 1063 599 -773 -995 280 407 -60 -184 314 45
4956 45 -602 -786 313 1138 302 -1168 -683 314 463 -57 -158 37 -177 -730 -593 830 1232 -87 -1137
4975 -1137 -497 582 299 166 118 241 -150 -891 -411 895 1189 -407 -976 -233 750 239 -127 263 252
4994 252 -395 -954 -53 1273 808 -881 -1042 233 487 299 134 72 260 -550 -881 231 1303 680 -1059
5013 -1059 -809 314 598 -165 124 505 236 -708 -730 483 1591 263 -1269 -532 733 383 29 121
5031 121 296 111 -894 -636 1028 1588 -232 -1369 -314 383 68 46 258 496 -294 -1175 -294 1324
5049 1324 1457 -652 -1316 -192 567 343 79 517 230 -472 -1352 -29 1352 945 -1031 -1078 234 427
5067 427 98 -3 348 151 -846 -1085 287 1592 447 -1240 -1084 614 282 -269 115 564 -43 -1012
5085 -1012 -990 1074 1502 -6 -1372 -461 549 267 -256 265 607 -48 -1246 -794 1146 1327 -460 -1439
5103 -1439 -132 791 232 -372 306 741 -385 -1296 -334 1364 1308 -775 -1425 176 703 -268 -93 470
5121 470 502 -805 -1202 143 1431 907 -996 -1055 534 704 -323 93 804 264 -964 -1123 480 1548
5139 1548 360 -1133 -754 638 255 -423 192 649 8 -1005 -799 816 1557 -10 -1521 -159 867
5156 867 228 -445 346 808 -150 -1119 -460 1200 1269 -549 -1275 -139 636 -205 -432 706 564 -518 -1102
5175 -1102 -170 1347 768 -1025 -1040 294 678 -252 -208 764 331 -740 -1103 268 1447 479 -1072 -872
5193 -872 646 594 -520 -168 740 99 -1067 -781 491 1244 219 -1206 -491 697 168 -523 4 565
5211 565 40 -1016 -647 692 926 -81 -1151 -208 573 -7 -493 320 684 -330 -1031 -286 966 892
5229 892 -497 -978 323 651 -305 -250 577 647 -547 -903 -68 1129 654 -784 -771 220 428 -479 -263
5248 -263 661 361 -506 -616 318 970 157 -729 -442 716 356 -572 -66 774 -58 -714 -507 607 845
5267 845 42 -791 -135 693 276 -524 194 662 124 -760 -173 691 609 -150 -816 102 695 17 -427 368
5287 368 565 -451 -604 -35 771 514 -264 -560 288 525 -419 -552 392 474 -313 -689 41 597 187 -621
5307 -621 -432 411 256 -356 -76 425 218 -671 -533 327 370 287 -673 -202 445 142 -388 -17 301 -40 -618
5328 -618 -286 124 384 -100 -429 -134 568 -210 -306 250 246 -229 -494 -51 613 429 -155 -342 31 388 -145
5349 -145 -273 391 300 -512 -345 78 350 95 -391 -277 327 294 -89 -168 313 157 -405 -211 329 232 50
5370 50 -290 -104 146 337 0 -84 478 153 -246 -38 378 199 -217 -90 124 458 248 -149 12 301 6
5391 6 -253 159 331 -17 -116 -11 220 261 88 -483 156 528 -89 -188 2 226 100 -44 -104 220 462 -7
5413 -7 -255 145 122 -217 -104 150 87 -2 -105 -65 389 277 -195 -105 153 132 -344 -10 206 -23 -240 -240 110
5436 110 159 65 -454 -164 261 -187 -190 -101 128 109 -144 -82 -205 258 -84 -395 -97 165 27 -370 161 225 -118
5459 -118 -94 -123 18 421 -144 -174 226 224 -235 -281 248 32 -77 -171 38 14 123 -16 -223 339 103 -223 -48
5482 -48 144 190 -92 -194 -163 293 -2 -246 -96 217 74 -310 -206 137 338 -40 -48 105 418 60 -27 -24 395
5505 395 -14 -290 96 164 220 -85 25 79 284 81 -220 252 422 50 -381 89 438 -33 24 -173 68
5526 68 31 18 -300 509 342 -283 -315 176 92 18 -15 116 209 87 -35 -62 386 219 -557 -239 206 237 -121
5549 -121 -249 -5 86 51 -196 25 164 -15 -409 -166 277 298 -288 -370 -56 52 -134 -271 -61 544 -11
5570 -11 -567 -351 309 147 -42 -167 -134 64 -145 -269 349 444 -107 -468 -164 576 223 -53 41 -110 -92 -130
5592 -130 52 381 419 -348 -598 144 458 -151 -182 -248 -57 -105 -263 215 564 123 -843 -715 162 511 -58
5613 -58 -252 -28 190 -118 -359 175 747 181 -890 -383 553 442 35 -287 -138 -21 -165 -198 284 692
5633 692 -216 -1087 -287 654 562 -148 -261 70 183 -444 -93 564 657 -468 -1048 9 686 496 -70 -186
5653 -186 44 -5 -378 -91 900 677 -538 -1065 61 848 344 -199 -115 -170 -272 -116 161 1068 261 -897
5673 -897 -992 398 815 55 -226 76 -158 -362 -93 543 806 -112 -1168 -601 816 707 20 -309 -150
5692 -150 -293 -393 -252 641 758 -326 -1249 -245 639 474 -128 -210 -52 -356 -645 -102 604 822 -507
5711 -507 -1155 -133 762 326 -27 -310 -219 -446 -632 292 1048 407 -1032 -1191 56 828 204 -336 39
5730 39 -149 -537 -426 491 1105 318 -1304 -1103 403 840 351 -215 -195 -91 -661 -501 557 1196 116
5749 116 -1243 -778 471 1048 74 -15 -37 -404 -754 -33 817 1149 -233 -1319 -356 921 695 -233 -160
5768 -160 -34 -479 -800 49 1370 865 -824 -1448 -135 903 568 -17 -7 -109 -660 -643 228 1248 619
5787 619 -1016 -1233 90 1076 342 -110 36 -405 -637 -519 746 1106 44 -1336 -1312 554 987 113
5805 113 -152 -2 -258 -806 -278 877 1288 -352 -1495 -837 627 720 88 18 -2 -376 -539 10 964 953
5825 953 -552 -1511 -513 794 548 -66 104 -30 -484 -733 280 1192 657 -811 -1449 -277 932 463
5843 463 34 139 -167 -664 -417 672 1065 300 -1060 -1197 162 1044 73 -119 116 -280 -854 -206 845
5862 845 1198 273 -1087 -761 467 730 336 261 -64 -635 -735 -248 796 983 4 -1056 -621 566 810
5881 810 177 290 119 -491 -638 235 1278 851 -574 -1188 -303 873 486 167 -14 -87 -489 -544 364 1067
5901 1067 527 -679 -1015 -60 802 314 178 27 -30 -828 -466 503 1040 156 -839 -980 296 775 314
5920 314 -109 122 -213 -779 -87 534 943 63 -981 -629 433 646 193 45 -18 -412 -601 64 683 991
5940 991 -200 -1045 -330 343 543 -76 34 -55 -482 -653 207 692 605 -373 -1065 -393 455 359 -82 193 -195
5961 -195 -730 -460 367 923 250 -686 -773 -131 616 300 108 19 -143 -720 -347 399 560 66 -707 -724 179
5982 179 440 247 201 137 -361 -647 6 669 656 128 -408 -533 252 499 48 156 -70 -414 -330 338 442
6003 442 321 -24 -498 -521 364 348 222 199 69 -537 -246 350 429 219 -201 -379 -195 258 260 287 55 -31 -414
6026 -414 -297 373 363 214 -235 -460 -132 252 104 -146 104 -233 -383 -155 427 309 19 -231 -320 35 204
6047 204 250 102 168 -188 -391 96 427 336 71 -129 -463 142 114 19 198 -102 -272 -283 22 205 247 142
6069 142 -130 -198 106 203 295 67 109 -531 -171 291 172 116 41 -156 -366 -139 42 -21 16 -195 -112 -131 142
6092 142 210 55 -88 -250 -128 32 184 94 47 -263 -333 39 59 181 155 -229 -210 -216 259 128 130 152 -241 -322
6116 -322 45 181 83 141 60 -167 -248 8 164 95 118 -36 4 298 131 -18 -36 76 -238 -90 93 140 279
6139 279 -254 -46 35 259 -7 -64 46 52 -182 9 50 36 -154 93 -34 8 173 -125 -82 139 -176 -101 -18
6162 -18 33 -108 -37 -40 14 -153 -12 -237 203 86 67 29 210 69 -28 -99 22 34 196 77 -147 63 264 -101
6186 -101 -81 319 -153 -116 -111 -118 -70 153 -282 -272 82 -29 -267 -174 153 19 -25 -41 -62 -28 45 -26 -57 129 40 -111
6212 -111 -32 103 -87 -44 57 -48 31 -67 -177 41 62 -128 -128 21 88 -45 -62 -51 33 171 -160 -177 -35 21
6236 21 37 -41 -38 -34 10 66 -14 -63 53 127 -323 179 23 35 -45 131 24 77 -48 -43 -135 217 157 -88 20 130
6262 130 -12 -202 164 -27 146 -112 -55 89 179 83 139 -128 171 51 84 43 -156 -186 104 -145 -123 27 -36
6285 -36 -130 -53 157 -84 -22 45 -185 -97 -9 10 180 229 -105 -89 86 -119 -267 89 -46 -232 -87 -96 -169 -32
6309 -32 339 -16 40 -9 -33 140 182 36 -134 20 -69 -101 33 -19 24 -74 -64 59 112 51 20 -114 -304 -151 -117
6334 -117 306 244 -163 -62 -2 21 -59 2 -7 -94 -54 -194 92 255 220 -144 -117 -30 -56 230 -40 -212 -6 -204
6358 -204 -126 7 365 107 -56 -185 25 -16 130 341 74 -9 -207 -113 281 193 3 -187 37 -45 125 189
6380 189 115 17 -95 -64 -93 132 211 -74 -170 -249 75 76 38 132 115 96 -350 -123 363 83 -146 -104 -122 -237 -41
6405 -41 90 72 90 77 -294 41 446 145 -186 -326 -259 194 72 29 229 102 -66 -378 -26 494 63 -254
6427 -254 -116 54 73 -13 91 236 -43 -199 -276 172 356 133 -249 -210 -108 95 -114 28 -55 45 -304 -235
6449 -235 279 317 -41 -271 -137 81 26 -26 190 318 -178 -457 -75 432 303 -40 -290 -92 70 78 241 329
6471 329 305 -327 -507 -8 424 169 -143 -339 26 -57 -39 95 198 10 -314 -328 26 493 120 -293 -260 59
6493 59 -148 -28 177 338 163 -440 -442 220 560 74 -301 -146 10 -43 -101 12 395 -148 -288 -152 386 514
6515 514 12 -298 58 118 111 -78 292 189 -13 -398 -137 495 326 -131 -208 221 194 52 55 353 366 -121 -390
6538 -390 60 563 146 -381 -314 -195 -94 -48 -13 250 124 -411 -565 20 435 180 -421 -407 75 -20 -19 247
6560 247 267 -9 -417 -365 414 619 -1 -554 -180 -2 -45 -84 106 100 -342 -578 -347 328 572 -114 -134 -124 -167
6583 -167 -96 30 298 276 -235 -550 -42 542 432 -348 -306 77 354 -61 73 249 166 -370 -541 -77 309
6604 309 163 -138 -433 45 79 -156 130 360 57 -315 -580 44 406 54 -305 -200 45 -91 -175 44 428
6625 428 39 -393 -289 286 337 20 -403 -108 -115 -181 -232 346 249 -157 -453 -265 463 576 37 -132 2 216
6647 216 47 192 282 67 -415 -401 -29 517 616 -207 -257 146 -46 -177 134 497 99 -205 -224 -177 136 322
6669 322 -238 -129 191 77 -141 62 314 73 -166 -183 54 464 110 -192 -68 89 63 -269 -33 183 -77
6690 -77 -235 -263 265 383 15 -113 57 119 -143 29 225 52 -86 -417 56 187 179 28 -89 216 143 -130
6712 -130 -129 347 54 -144 -136 -78 323 -10 -261 -23 66 -77 -14 176 43 -104 -22 -140 188 457 9 -75 126
6735 126 172 -93 56 48 73 -8 -114 -141 114 367 24 -56 -154 0 7 -110 367 108 -148 -162 -39 179 122 69
6759 69 -202 -26 131 -53 -58 121 112 -129 -311 -311 185 314 82 -91 103 192 1 53 62 -31 -205 -43 77 124
6783 124 110 -379 -179 6 166 -104 -5 159 -84 -214 -87 20 114 224 -132 -131 -62 -77 108 124 51 -271 -134
6806 -134 70 116 68 -212 -168 -72 -70 -61 -57 29 206 49 12 -65 96 -22 -130 -36 -41 31 -73 135 27 20 -36 -161 108
6833 108 207 -77 -48 -291 293 -28 10 -174 14 15 -117 4 -57 115 -53 87 13 176 29 -223 8 168
6855 168 -66 -157 127 -43 6 134 -65 -29 55 0 -76 -69 -53 96 -110 274 -52 -190 -10 -239 11 162 91
6878 91 -193 -77 -68 -177 -132 12 -17 7 -101 81 -115 131 56 -11 240 120 -1 -158 96 -45 51 -4 -145
6901 -145 115 -65 17 -184 -124 -26 79 36 148 128 5 9 -262 123 7 -40 41 173 -81 90 1 -113 -4
6924 -4 49 58 -80 307 143 21 -47 20 -80 5 35 42 -163 -7 -398 -32 71 13 57 114 -7 -53 150 -97 59
6949 59 -106 34 -117 -137 13 79 -82 101 -10 -172 121 145 -58 144 -71 -3 23 64 73 146 -20 32 -19 -23 171
6974 171 -177 63 -57 -127 -171 -11 42 -70 194 -16 -59 -40 -60 34 -140 -6 151 16 -55 -234 175 50 -73
6997 -73 -136 8 117 0 -58 -99 24 115 165 -106 50 105 -94 -100 -123 87 163 105 -95 141 -63 -134 -4 -13 -108
7022 -108 -4 -174 41 96 -95 -79 -52 -5 -36 -149 -7 173 22 -19 -14 -94 -44 -46 -177 103 -13 141 -44 96
7046 96 326 39 -25 87 56 -60 59 -132 12 162 47 -97 -14 168 -118 -78 67 178 108 94 85 -8 -45 -142
7070 -142 -65 17 116 41 -69 115 129 5 169 -101 111 -68 -281 -56 144 104 -280 -297 9 112 -7 -63 34
7093 34 -97 -115 -195 -56 239 -103 62 30 221 114 -152 50 -43 -63 -134 -168 219 -130 -125 -56 -195 -20 95 -47
7117 -47 28 155 -99 20 -41 23 88 78 -284 -145 94 161 110 41 -31 46 -48 47 366 247 23 100 -96 255 56
7142 56 74 -181 -268 -198 -68 -11 288 131 -133 -164 126 58 -94 27 63 -64 -216 -14 61 165 108 -217 -83
7165 -83 152 56 -3 -20 123 -112 -57 97 237 -6 -11 -98 -38 102 -46 20 -60 -60 28 2 74 -204 -54 50 -156
7190 -156 -24 4 11 -110 179 53 57 -252 -151 195 -19 -74 -153 26 -60 146 -30 58 38 -54 -224 34 441 -126
7214 -126 -113 -53 35 55 -9 98 9 -212 -9 -30 247 44 92 -61 21 134 -264 93 48 69 -258 -236 -132 127
7238 127 244 90 -98 -177 283 110 48 -58 96 -144 -108 11 79 72 61 -112 -22 24 -61 82 -64 -9 -71 -22
7262 -22 280 90 224 -238 -75 47 99 -210 148 118 -24 -18 -180 -67 116 -13 -77 -45 161 14 62 -123 141
7285 141 -50 -172 -10 175 151 32 -262 -163 127 -18 74 -52 176 -165 7 74 135 45 -48 -300 -37 -57 68
7308 68 21 252 32 9 -3 36 254 141 40 -270 -58 22 -51 -45 123 -67 -8 -62 -164 31 -59 -90 -159 -220 210
7333 210 -63 -44 124 55 -118 46 -28 137 -50 64 -31 14 11 30 39 68 -218 -36 -23 44 16 81 -28 -58 35 -157
7359 -157 33 -17 18 -137 11 -123 257 -33 -10 -4 -14 70 57 -48 33 10 -261 -28 79 93 -13 -30 -97 -84 15
7384 15 -160 38 146 8 -17 16 -147 149 225 -38 172 202 24 -178 -9 1 -68 -190 60 181 140 38 -45
7407 -45 278 -38 252 70 140 182 -85 -109 -200 188 121 126 -152 -32 130 70 56 -81 -78 -124 -78 -137 85 173 -10
7432 -10 -55 -17 160 -26 -92 -17 -23 -134 22 -96 53 -78 -145 10 -49 36 -160 -122 -114 -83 46 -91 141 -122 -90
7457 -90 -141 -51 -65 -33 6 -9 157 -117 95 -53 85 -75 38 -137 20 -63 -58 94 190 161 -152 -117 68 -103
7481 -103 66 39 110 -68 165 -86 -23 -87 22 -103 131 -114 -77 89 -7 -136 74 103 -149 -169 -139 -59 -78 -129
7505 -129 68 207 129 -98 142 70 -77 48 0 90 -116 -28 132 -62 7 2 49 54 22 197 -1 -174 145 39
7529 39 -125 142 28 -127 -7 -51 -72 -120 56 -102 -1 79 17 -90 -54 11 -26 75 69 -39 10 204 163 22
7553 22 41 -86 32 -89 51 36 -53 -50 -283 93 -124 8 -49 -92 199 -116 -41 -36 40 -24 22 -203 -120 308 83
7578 83 85 128 53 50 -92 245 83 59 53 -91 -102 -80 81 22 -172 -82 -79 12 113 78 -160 3 103 -4 -80 -22 35
7605 35 -87 79 5 58 106 34 62 -16 -49 131 -137 40 -5 12 39 -25 -101 172 53 8 176 44 -82 -65 28
7630 28 119 70 72 233 102 82 -26 -63 -139 249 182 -65 61 191 -14 113 113 -30 -38 6 -18 -10 15 41 64 -88 58
7657 58 87 95 19 92 -103 -9 -10 62 -46 6 -108 53 12 132 -109 -8 121 -120 141 -111 88 122 -21 -57 22
7682 22 45 -78 -15 -210 -38 65 41 113 78 -148 -161 61 83 -158 64 -96 -44 25 -22 -109 -82 -78 18 -83 -122 -71
7708 -71 -96 -7 -91 -90 44 -112 -134 177 86 22 -2 -26 -255 55 232 -42 18 213 -5 55 101 163 -168 80 128
7733 128 119 5 32 131 7 -140 148 -68 -146 186 48 8 18 -34 118 -16 36 -220 34 123 78 267 -211 52
7757 52 44 0 23 -35 -40 -54 92 -131 47 111 -51 -160 54 27 -44 75 -73 -15 108 -87 214 -30 16 -188 266
7782 266 -62 16 32 -29 -60 158 -101 56 -29 147 168 -176 135 -79 170 -96 58 36 243 27 -34 -148 186
7805 186 107 -72 -119 -26 131 -95 -12 31 -30 3 -117 35 -101 88 -117 -21 -23 -121 -142 -102 39 221 30 10 -86
7830 -86 -80 247 -1 4 -50 82 -33 21 -131 -21 -197 -38 -85 -97 -166 28 -73 -3 106 79 33 18 -16 -24 56 -128
7856 -128 65 -101 -129 -170 56 96 151 80 93 4 114 -80 -245 -63 -148 4 -47 -3 56 2 -31 57 23 -1 -9 -31
7882 -31 -145 31 -5 -50 -83 9 115 -51 -102 60 10 -13 -73 -63 71 70 68 32 116 -27 14 -228 48 -11 -119 -74
7908 -74 -54 68 -107 -72 119 176 136 148 -34 -31 -33 -148 18 -180 -165 89 60 162 -223 -158 -7 -190 -49 173
7932 173 -7 101 62 8 -98 27 36 -43 28 -24 -120 26 146 208 -80 -63 -156 -61 12 143 -47 -144 -250 -214 -79
7957 -79 239 138 -163 -6 -1 11 64 -72 -103 95 -40 63 26 8 66 -102 37 141 -40 -148 -45 -183 100
7980 100 -43 -60 -79 21 -55 103 21 -162 129 -8 54 127 -24 -94 -3 -15 -205 -21 -10 -216 23 -42 9 32
8004 32 148 -76 -85 46 -15 119 15 37 15 1 -83 8 146 -274 28 -36 -40 48 14 -104 56 -32 -33 -12 -122 -228
8030 -228 -150 -42 -81 -4 230 111 -127 59 31 -180 8 -48 18 -69 -44 -89 79 -75 137 128 224 -34 -52 125
8054 125 28 -278 -141 -2 119 -201 38 5 107 73 61 -211 23 -3 -10 -61 -66 -18 -59 -107 -46 -133 83 -1 -64 113
8080 113 67 155 -83 33 -44 -34 79 -85 192 -22 -182 -39 111 55 13 19 -63 -87 -258 18 55 49 104 14 89
8105 89 -31 -9 42 44 166 -38 62 113 -27 159 83 46 45 29 100 101 240 153 -33 16 -2 -10 -169 15 100 57 15
8132 15 38 11 149 -56 25 187 -300 90 -99 -5 3 -18 148 -135 -29 82 88 76 50 -242 4 -116 81 -7
8156 -7 188 87 -17 -20 -111 72 -45 -59 -75 53 -24 64 -17 3 224 229 75 -88 -163 112 90 -223 6 -2 -72 -31
8182 -31 53 173 14 -20 -2 239 -219 -113 40
8191D0
##END NTUPLES=NMR FID
##END=
