##TITLE=1H_CA-8651pc
 CDCl3, 8 sc, 
 24.9.2019
##JCAMPDX= 6.0         $$ Bruker NMR JCAMP-DX V2.0
##DATA TYPE= NMR FID
##DATA CLASS= NTUPLES
##ORIGIN= UXNMR, Bruker Analytische Messtechnik GmbH
##OWNER= root
$$ XWIN-NMR		Version 3.5
$$ Tue Sep 24 13:50:06 2019 Russian Standard Time (UT+4h)  she@DPX200
##.OBSERVE FREQUENCY= 200.1315
##.OBSERVE NUCLEUS= ^1H
##.DELAY= (6, 6)
##.ACQUISITION MODE= SIMULTANEOUS
##.ACQUISITION SCHEME= undefined
##.AVERAGES= 8
##.DIGITISER RES= 18
##SPECTROMETER/DATA SYSTEM= spect
##.PULSE SEQUENCE= zg30
##.SOLVENT NAME= CDCl3
##.SHIFT REFERENCE= (INTERNAL, CDCl3, 0, 15.7039)
##AUDIT TRAIL= $$ (NUMBER, WHEN, WHO, WHERE, WHAT)
$$ ##TITLE= Audit trail, XWIN-NMR		Version 3.5
$$ ##JCAMPDX= 5.01
$$ ##ORIGIN= Bruker BioSpin GmbH
$$ ##OWNER= she
$$ F:/spectra/data/she/nmr/H-F/1/audita.txt
$$ ##AUDIT TRAIL=  $$ (NUMBER, WHEN, WHO, WHERE, WHAT)
(   1,<2019-09-24 13:48:55.35 +0400>,<she>,<DPX200>,
      <created by zg, POWCHK disabled, PULCHK disabled
       configuration hash MD5:
       00 E9 B6 7A A2 85 ED C7 34 08 36 98 17 FE 4E 26
       data hash MD5: 16K
       3F 77 EE A8 D4 0A 30 3B C7 69 E4 02 59 7D B1 94>)
$$ ##END=
$$ 
$$ hash MD5
$$ 2B 30 5E 0B 56 4E C1 83 BC 3A E5 4E 7C 89 EC 5F
##$RELAX= 
##$RELAX= 
##$RELAX= 
##$RELAX= 
##$RELAX= 
##$RELAX= 
$$ Bruker specific parameters
$$ --------------------------
##$DU= <F:/spectra>
##$EXPNO= 1
##$NAME= <H-F>
##$PROCNO= 1
##$TYPE= <nmr>
##$USER= <she>
##$AMP= (0..31)
100 100 100 100 100 100 100 100 100 100 100 100 100 100 100 100 100 100 
100 100 100 100 100 100 100 100 100 100 100 100 100 100 
##$AQSEQ= 0
##$AQ_mod= 1
##$AUNM= <au_zg>
##$AUTOPOS= <>
##$BF1= 200.13
##$BF2= 200.13
##$BF3= 200.13
##$BF4= 200.13
##$BF5= 200.13
##$BF6= 200.13
##$BF7= 200.13
##$BF8= 200.13
##$BYTORDA= 1
##$CFDGTYP= 0
##$CFRGTYP= 5
##$CHEMSTR= <none>
##$CNST= (0..31)
1 1 145 1 1 1 1 1 1 1 1 1 1 1 1 1 1 1 1 1 1 1 1 1 1 1 1 1 1 1 1 1 
##$CPDPRG= <>
##$CPDPRG1= <>
##$CPDPRG2= <>
##$CPDPRG3= <>
##$CPDPRG4= <mlev>
##$CPDPRG5= <mlev>
##$CPDPRG6= <mlev>
##$CPDPRG7= <mlev>
##$CPDPRG8= <mlev>
##$CPDPRGB= <>
##$CPDPRGT= <>
##$D= (0..31)
0 1.2 0 0 0 0 0 0 0 0.06 0 0.03 0 0 0 0 0.0002 0 0 0 0 0 0 0 0 0 0 0 0 
0 0 0 
##$DATE= 1569318534
##$DBL= (0..7)
120 120 120 120 120 120 120 120 
##$DBP= (0..7)
150 150 150 150 150 150 150 150 
##$DBP07= 0
##$DBPNAM0= <>
##$DBPNAM1= <>
##$DBPNAM2= <>
##$DBPNAM3= <>
##$DBPNAM4= <>
##$DBPNAM5= <>
##$DBPNAM6= <>
##$DBPNAM7= <>
##$DBPOAL= (0..7)
0.5 0.5 0.5 0.5 0.5 0.5 0.5 0.5 
##$DBPOFFS= (0..7)
0 0 0 0 0 0 0 0 
##$DE= 6
##$DECBNUC= <off>
##$DECIM= 24
##$DECNUC= <off>
##$DECSTAT= 4
##$DIGMOD= 1
##$DIGTYP= 9
##$DL= (0..7)
0 120 120 120 120 120 120 120 
##$DP= (0..7)
150 150 150 150 150 150 150 150 
##$DP07= 0
##$DPNAME0= <>
##$DPNAME1= <>
##$DPNAME2= <>
##$DPNAME3= <>
##$DPNAME4= <>
##$DPNAME5= <>
##$DPNAME6= <>
##$DPNAME7= <>
##$DPOAL= (0..7)
0.5 0.5 0.5 0.5 0.5 0.5 0.5 0.5 
##$DPOFFS= (0..7)
0 0 0 0 0 0 0 0 
##$DQDMODE= 0
##$DR= 18
##$DS= 0
##$DSLIST= <SSSSSSSSSSSSSSS>
$$ [...]
##$SUBNAM2= <"">
##$SUBNAM3= <"">
##$SUBNAM4= <"">
##$SUBNAM5= <"">
##$SUBNAM6= <"">
##$SUBNAM7= <"">
##$SUBNAM8= <"">
##$SUBNAM9= <"">
##$SW= 24.0689530833862
##$SWIBOX= (0..15)
0 0 2 0 0 0 0 0 0 0 0 0 0 0 0 0 
##$SW_h= 4816.95568400771
##$TD= 16384
##$TD0= 1
##$TE= 0
##$TE2= 300
##$TE3= 300
##$TEG= 300
##$TL= (0..7)
0 120 120 120 120 120 120 120 
##$TP= (0..7)
150 150 150 150 150 150 150 150 
##$TP07= 0
##$TPNAME0= <>
##$TPNAME1= <>
##$TPNAME2= <>
##$TPNAME3= <>
##$TPNAME4= <>
##$TPNAME5= <>
##$TPNAME6= <>
##$TPNAME7= <>
##$TPOAL= (0..7)
0.5 0.5 0.5 0.5 0.5 0.5 0.5 0.5 
##$TPOFFS= (0..7)
0 0 0 0 0 0 0 0 
##$TUNHIN= 0
##$TUNHOUT= 0
##$TUNXOUT= 0
##$USERA1= <user>
##$USERA2= <user>
##$USERA3= <user>
##$USERA4= <user>
##$USERA5= <user>
##$V9= 5
##$VALIST= <valist>
##$VCLIST= <CCCCCCCCCCCCCCC>
##$VD= 0
##$VDLIST= <DDDDDDDDDDDDDDD>
##$VPLIST= <PPPPPPPPPPPPPPP>
##$VTLIST= <TTTTTTTTTTTTTTT>
##$WBST= 1024
##$WBSW= 4
##$XGAIN= (0..3)
0 0 0 0 
##$XL= 0
##$YL= 0
##$YMAX_a= 776657
##$YMIN_a= -963429
##$ZGOPTNS= <>
##$ZL1= 120
##$ZL2= 120
##$ZL3= 120
##$ZL4= 120
##$ABSF1= 10
##$ABSF2= 0
##$ABSG= 5
##$ABSL= 3
##$ALPHA= 0
##$AQORDER= 0
##$ASSFAC= 0
##$ASSFACI= 0
##$ASSFACX= 0
##$ASSWID= 0
##$AUNMP= <proc_1d>
##$AZFE= 0.1
##$AZFW= 0.1
##$BCFW= 1
##$BC_mod= 2
##$BYTORDP= 1
##$COROFFS= 0
##$CY= 11.3945322036743
##$DATMOD= 1
##$DC= 2
##$DFILT= <>
##$DTYPP= 0
##$F1P= 20.1720416913024
##$F2P= 0.152960286110954
##$FCOR= 0.5
##$FTSIZE= 0
##$FT_mod= 4
##$GAMMA= 1
##$GB= 0.15
##$INTBC= 1
##$INTSCL= 1
##$ISEN= 128
##$LB= 0.24
##$LEV0= 0
##$LPBIN= 0
##$MAXI= 10000
##$MC2= 0
##$MEAN= 0
##$ME_mod= 0
##$MI= 1.114404
##$NCOEF= 0
##$NC_proc= 0
##$NLEV= 6
##$NOISF1= 3.799351
##$NOISF2= 2.8
##$NSP= 1
##$NTH_PI= 0
##$NZP= 0
##$OFFSET= 15.70392
##$PC= 1
##$PHC0= -9573.623
##$PHC1= 22.00095
##$PH_mod= 1
##$PKNL= yes
##$PPARMOD= 0
##$PSCAL= 0
##$PSIGN= 0
##$REVERSE= no
##$SF= 200.130013532006
##$SI= 16384
##$SIGF1= 3
##$SIGF2= 2
##$SINO= 400
##$SIOLD= 16384
##$SREGLST= <1H.CDCl3>
##$SSB= 0
##$STSI= 0
##$STSR= 0
##$SW_p= 3612.71676300578
##$SYMM= 0
##$S_DEV= 0
##$TDeff= 0
##$TDoff= 0
##$TI= <>
##$TILT= no
##$TM1= 0
##$TM2= 0
##$TOPLEV= 0
##$USERP1= <user>
##$USERP2= <user>
##$USERP3= <user>
##$USERP4= <user>
##$USERP5= <user>
##$WDW= 1
##$XDIM= 8192
##$YMAX_p= 0
##$YMIN_p= 0
$$ End of Bruker specific parameters
$$ ---------------------------------
##NTUPLES= NMR FID
##VAR_NAME=  TIME,          FID/REAL,        FID/IMAG
##SYMBOL=    X,             R,               I
##VAR_TYPE=  INDEPENDENT,   DEPENDENT,       DEPENDENT
##VAR_FORM=  AFFN,          ASDF,            ASDF
##VAR_DIM=   8192,          8192,            8192
##UNITS=     SECONDS,       ARBITRARY UNITS, ARBITRARY UNITS
##FACTOR=    0.0002076,     1,               1
##FIRST=     0,             0,               0
##LAST=      1.7004516,     0,               0
##MIN=       0,             -963429,         0
##MAX=       1.7004516,     776657,          0
$$ Real data points
##PAGE= N=1
##DATA TABLE= (X++(R..R)), XYDATA
$$ [...]
$$ plain form
2325 90 1887 610 -1635 400 2030 -805 -1600 2279 2202 -2030 -1605 1196 699 -487 141 64 -110 -109
2343 -109 -288 225 1456 946 -726 -533 -18 162 634 -301 -1204 136 524 -1453 -698 2289 788 -1795
2361 -1795 -562 856 248 174 540 -812 -392 174 -820 -603 1572 940 -998 -886 267 497 243 -732
2379 -732 -882 581 -367 -1939 110 2134 -213 -1652 315 588 -441 202 373 -858 -623 30 -961
2396 -961 -454 1458 767 -871 -410 405 605 161 -816 -497 754 -706 -2131 180 1631 -857 -1663
2413 -1663 502 213 -452 714 438 -351 237 463 -735 323 1781 361 -1075 -389 477 323 -338
2430 -338 -802 30 549 -1451 -1172 1385 1293 -952 -230 1545 20 -194 1533 550 -1108 261 589 -1375
2448 -1375 -724 1627 508 -1414 -409 1254 1199 -510 -346 1326 1025 -1725 -1174 2059 735 -1843
$$ packed form
2325I0J797j277k245K035J630k835p95L879p7m232M25K801m97j186O28p7j74J
2343a09j79N13J231n10j672J93N15J80M72r35r03J340L88j977P55K987j501k583
2361a795J233J418o08p4L66j352M20N66r94K17K175o32j938J12J153K30k54r75
2379g32j50J463r48j572K049K024k347j439J967K73j029O43J71j231K35O53r91
2396i61N07J912o91j638M61Q15K00m44r77L19J251j460j425K311J451k488q06
2413a663K165k89o65J166k76p89N88K26j198J058J458j420j436O86Q66j54o61
2430c38m64Q32N19k000K79K557r2k245P22J775j525k14J727r83j658J369L28j964
2448a375O51K351j119j922J005J663n5j709J64J672l01k750N51L233j324k578
$$ plain form
2464 -1843 16 1212 -491 -401 1428 21 -1006 943 305 -1415 288 1769 -167 -1502 165 1054
2480 1054 -21 -1347 -44 1359 -294 -2243 121 1914 -622 -1598 889 805 -1291 228 1623 -927
2496 -927 -906 1419 14 -2068 429 1569 -1224 -2049 442 1000 -706 -1141 472 1372 -468 -1820 737
2513 737 1413 -864 -1099 1242 317 -1549 286 636 -1303 -392 922 -943 -1552 1071 806 -1587 -461
2530 -461 1109 244 -567 -270 795 535 -464 -919 361 511 -1164 -376 821 -373 -836 788 203 -1026
2548 -1026 784 1277 -1089 -393 2181 266 -1354 262 1167 -430 -740 -16 477 161 -426 -370 1086
2565 1086 811 -537 -122 1169 -119 -389 522 -220 -726 682 212 -1249 644 1721 -357 -710 1209
2582 1209 993 -581 -123 654 -52 0 -270 -101 350 176 -380 293 720 -214 -24 529 -422 -362 667 -387
$$ packed form
2464a843J859J196j703R0J829j407j027J949o38j720J703J481j936j335J667Q89
2480A054j075j326J303J403j653j949K364J793k536r76K487q4k096J519J395k550
2496i27K1K325j405k082K497J140k793q25K491N58j706m35J613R00j840j352K557
2513G37O76k277k35K341r25j866J835L50j939R11J314j865o09K623k65k393J126
2530d61J570q65q11K97J065k60r99m55J280J50j675P88J197j194m63J624n85j229
2548a026J810M93k366O96K574j915j620J616R05j597l10P24M93l16n87N6J456
2565A086k75j348M15J291j288k70R11p42n06J408m70j461J893J077k078l53J919
2582A209k16j574M58P77p06N2k70J69M51j74n56O73M27r34J90N53r51O0J029j054
$$ plain form
2602 -387 -1152 869 755 -1001 -58 1090 207 -393 683 97 -468 109 -181 -754 -116 395 -374 -548 316
2621 316 394 133 -515 -310 514 584 -1118 -940 1269 102 -1924 377 1208 -809 -1061 839 114 -1093
2639 -1093 -114 109 -584 -353 -12 -230 142 211 65 129 2 -645 310 337 -1116 -477 833 -602 -1066 636
2659 636 493 -734 97 892 -641 -477 988 -134 -1062 455 595 -807 -357 494 552 70 -389 243
2677 243 854 -368 -1431 535 1136 -1328 -1081 1579 641 -1199 347 1295 -373 -414 838 79 -520
2694 -520 501 195 -608 89 261 -151 15 80 247 659 -366 -510 931 505 -1160 -27 1293 -508
2712 -508 -905 1147 507 -1047 350 1239 -539 -560 1041 452 -830 -22 566 -17 -627 -336 474 418 -819
2731 -819 -721 962 486 -1236 61 918 -230 -641 948 430 -598 562 331 -796 75 1008 -533
$$ packed form
2602c87p65K021j14j756R43J148q83o00J076n86n65N77k90n73O38N11p69j74Q64
2621C16P8k61o48K05Q24P0j702J78K209j167k026K301Q31k017k52J900p25j207
2639a093R79K23o93K31L41k18L72O9j46O4j27o47R55K7j453O39J310j435m64J702
2659F36j43j227Q31P95j533J64J465j122r28J517J40j402M50Q51N8m82m59O32
2677B43O11j222j063J966O01k464K47K660r38j840J546R48j668m1J252p59n99
2694e20J021l06q03O97J72m12J66O5J67M12j025j44J441m26j665J133J320j801
2712e08l97K052o40j554J397Q89j778k1J601n89j282Q08N88n83o10K91Q10n6j237
2731h19R8J683m76j722J297Q57j148m11J589n18j028J160k31j127Q71R33j541
$$ plain form
2748 -533 -1051 387 368 -1029 -544 303 406 -286 -636 268 1096 -495 -1161 790 921 -1332 -729 1020
2766 1020 -327 -1151 315 109 -1079 76 506 -597 -385 655 -210 -535 143 323 -92 -63 -401 -35
2784 -35 393 -283 -496 453 -222 -891 477 378 -984 -16 1182 -611 -909 1312 1020 -884 -101 1467
2802 1467 213 -1054 22 648 112 -761 -630 528 505 -595 -292 1133 668 -542 514 580 -394 376
2820 376 597 -796 -412 1140 -80 -1056 553 1201 -586 -410 1049 787 -242 -11 163 195 -101 -389
2838 -389 253 350 -272 -84 485 -124 -459 812 434 -1295 198 1541 -364 -977 1247 1096 -909 -431
2856 -431 668 352 -555 -365 -255 -72 -152 -429 -48 553 -390 -367 284 -249 -173 1039 -76 -1402 528
2875 528 999 -1038 -1038 1226 462 -1393 -404 710 -10 -695 -572 -166 81 -480 -845 265 559 -480 -339
$$ packed form
2748e33n18J438j9j397M85Q47J03o92l50R04Q28j591o66J951J31k253O03J749
2766A020j347q24J466k06j188J155M30j103K12J040q65l25O78J80m15K9l38L66
2784c5M28o76k13R49o75o69J368r9j362R68J198j793k98K221k92j904P83J568
2802A467j254j267J076O26n36q73J31J158k3j100L03J425m65j210J056O6r74P70
2820C76K21j393L84J552j220r76J609O48j787J76J459k62j029K31J74L2k96k88
2838c89O42R7o22J88N69o09l35J271l78j729J493J343j905o13K224j51k005M78
2856d31J099l16r07J90J10J83q0k77L81O01r43K3O51n33P6J212j115j326J930
2875E28M71k037%K264p64j855R89J114p20o85J23M06K47n61l65J110K94j039J41
$$ plain form
2894 -339 589 7 -50 498 -313 -872 455 54 -1538 -422 1194 -167 -998 208 775 -198 43 114 -204
2913 -204 265 -47 -485 13 388 -326 -337 -99 -229 412 555 -730 -232 1426 -6 -1572 309 1303 -594
2932 -594 -1126 376 715 -535 -457 123 589 169 -256 3 1150 571 -700 155 516 -298 -252 553 -205
2951 -205 -475 848 13 -741 666 758 -233 -393 607 400 29 284 -165 86 423 -454 -306 637 639 -478
2971 -478 -29 447 39 334 441 -661 252 736 -450 -897 735 647 -853 -478 602 117 -66 213 -344
2990 -344 115 97 -397 -532 674 -251 -783 101 28 -398 104 271 -560 -49 554 -643 -416 636 311 -717
3010 -717 -262 211 -29 -169 -247 -246 114 115 -869 247 850 -194 -601 409 311 -459 171 204 -549 -194 122
3031 122 -631 -418 497 -8 -611 -30 55 -123 320 -225 -477 429 278 -681 -217 816 -160 -457 421 69
$$ packed form
2894c39R28n82n7N48q11n59J327m01j592J116J616j361q31J206N67r73K41P1l18
2913b04M69l12m38M98L75p14j1K38j30O41J43j285M98J658j432j566J881R94j897
2932e94n32J502L39j250P8N80M66m20m25K59J147n79j271Q55L61q14M6Q05p58
2951b05k70J323q35p54J407R2r91j60J000k07l71K55m49K51L37q77J48R43Kj117
2971d78M49M76m08K95J07j102R13M84j186m47J632q8j500L75J080m85j83K79n57
2990c44M59j8m94j35J206r25n32Q84p3m26N02J67q31N11O03j197K27J052l25j028
3010g17M55M73k40j40p8JL60Jr84J116O03j044m07J010r8p70O30L3p53L55L16
3031A22p53K13R15n05o03N81Q5j78M43n45k52R06j51r59M64J033r76k97Q78l52
$$ plain form
3051 69 -31 392 -228 -462 461 265 -939 -193 703 -133 -566 286 145 38 322 -103 -221 770 131 -788
3071 -788 520 980 -194 -274 631 145 -198 272 -23 147 394 -89 -571 299 644 -334 -173 490 121 -121
3091 -121 459 -204 -247 694 -19 -617 446 560 -247 -259 405 137 -24 94 -359 -78 467 -259 -601 375
3111 375 89 -648 -50 445 -10 87 419 -388 77 756 -201 -539 338 417 -728 -313 228 -75 -127 -84 -219
3132 -219 191 237 -605 -365 806 -24 -747 206 403 -331 129 289 -546 -12 620 -376 -650 345 195 -848
3152 -848 -291 360 188 -387 -157 -33 138 83 -754 -15 750 -157 -595 631 268 -584 248 348 -629 47
3172 47 557 -609 -540 512 58 -646 -104 364 -211 142 99 46 334 278 -374 234 427 -376 -264 542 98
3193 98 -37 393 121 -233 475 567 -492 219 866 -371 -672 435 377 -224 -123 426 232 167 151 100 491
$$ packed form
3051F9j00M23o20k34R23j96j204P46Q96q36m33Q52j41j07K84m25j18R91o39r19
3071g88J308M60j174q0R05m86l43M70k95J70K47m83m82Q70L45r78J61O63l69k42
3091a21N80o63m3R41p13n98J063J14q07j2O64k68j61J18m53K81N45p26l42R76
3111C75k86p37N98M95m55R7L32q07M65O79r57l38Q77P9j145M15N41l03n2M3j35
3132b19M10M6q42K40J171q30p23R53J97p34M60J60q35N34O32r96k74R95j50j043
3152h48N57O51j72n75K30J24J71n5q37P39P65r07m38J226l63q52Q32J00r77O76
3172D7N10j166O9J052m54p04N42M68n75L53m3n3K88n6o52O08J93q03J12Q06m44
3193I8j35M30k72l54P08R2j059P11O47j237l01J107n8o01J01N49j94o5j6n1L91
$$ plain form
3214 491 374 -382 -2 694 -237 -365 388 -222 -338 225 438 -332 201 370 -171 -19 369 -79 -18 367
3234 367 -140 -447 321 200 -373 262 159 -348 -91 120 68 10 375 -375 -374 310 -129 -615 175 384 -513
3255 -513 -164 323 -67 -129 -24 -293 -152 357 -156 -445 247 257 -691 -165 204 -473 -186 150 -170 -294 305
3276 305 -163 -213 153 -192 -451 136 -50 -546 -8 212 -671 -338 613 -163 -397 46 349 -270 -198 149 -56
3297 -56 252 50 -406 158 491 -426 -281 547 -5 -434 174 404 -302 -11 209 -186 281 307 -395 -43 654
3318 654 15 -270 539 198 -135 37 151 29 443 362 -245 124 560 -175 -226 482 -124 -295 385 60 -329
3339 -329 384 591 -268 -82 709 128 -202 139 97 -223 -40 -58 -23 497 88 -580 160 631 -182 -145 490
3360 490 -97 -479 -128 -17 -327 250 171 -535 79 359 -344 108 523 108 -422 168 -168 38 330 -230
$$ packed form
3214D91j17p56L80O96r31j28P53o10j16N63K13p70N33J69n41J52L88m48O1L85
3234C67n07l07P68j21n73O35j03n07K57K11n2n8L65p50JO84m39m86P90K09q97
3255e13L49M87l90o2J05k69J41N09n13k89O92J0r48N26L69o77K87L36l20j24N99
3276C05m68n0L66l45k59N87j86m96N38K20q83L33R51p76k34M43L03o19P2L47k05
3297e6L08k02m56N64L33r17J45Q28n52m29O08K30p06K91K20l95M67K6p02L52O97
3318F54o39k85Q09l41l33J72J14j22M14q1o07L69M36p35n1P08o06j71O80l25l89
3339c29P13K07q59J86P91n81l30L41m2l20J83j8L5N20m09o68P40M71q13L7O35
3360D90n87l82L51J11l10N77p9p06O14K80p03M52M15m15n30N90l36K06K92n60
$$ plain form
3380 -230 -524 427 213 -405 -31 566 -237 -477 157 64 -166 405 19 -513 156 328 -268 -268 279 -311 -578
3401 -578 7 -153 -19 50 -286 -362 98 32 -231 420 299 -386 -295 218 -196 -149 598 -192 -531 103 91 -393
3423 -393 73 344 -263 -220 -41 -21 175 517 -252 -224 321 24 -358 311 442 -258 -152 28 -27 402 210
3444 210 -443 -270 427 -187 -568 554 488 -635 -470 501 269 75 225 88 -43 112 -221 -108 744 47
3464 47 -328 51 209 -108 452 604 -353 -171 480 -19 -340 603 481 -360 -388 231 8 259 318 -320 -57
3485 -57 257 -98 -65 684 205 -346 -244 -150 6 380 209 -367 84 367 -524 -132 810 174 -897 -173 29
3506 29 -110 192 214 -421 -305 12 -366 23 497 32 -447 -446 -273 18 420 -56 -601 290 196 -640 67 808
3528 808 18 -925 -436 64 -163 53 -39 -324 -77 -222 -421 332 802 -68 -436 34 -103 186 492 -105
$$ packed form
3380b30k94R51k14o18L74N97q03k40O34r3k30N71l86n32O69J72n96%N47n90k67
3401e78N85j60J34O9l36p6M60o6k63O51j21o85R1N13m14M7P47p90l39O34j2m84
3423c93M66K71o07M3J79K0J96L42p69K8N45k97l82O69J31p00J06J80n5M29j92
3444B10o53J73O97o14l81J122o6j123J65R71k32j94J50j37j31J55l33J13Q52o97
3464D7l75L79J58l17N60J52r57J82O51m99l21R43j22q41k8O19k23K51N9o38K63
3485e7L14l55L3P49m79n51J02R4J56L74j71n76M51K83q91L92R42o36j071P24K02
3506B9j39L02K2o35J16L17l78L89M74m65m79JJ73K91M02m76n45Q91r4q36P07P41
3528H08p90r43M89N00k27K16r2k85K47j45j99P53M70q70l68M70j37K89L06n97
$$ plain form
3548 -105 -370 41 -94 -681 198 729 -83 -495 -120 -154 -95 449 102 -260 120 -195 -342 394 808 -159 -598
3569 -598 -113 -284 175 366 -80 15 304 -115 -451 610 877 -608 -562 168 -181 -110 198 167 -123 -213 -397
3590 -397 -11 710 480 -68 -260 36 -292 205 569 -40 -5 101 -205 -255 729 706 -385 -302 -175 -236 -1
3611 -1 199 229 -52 44 -279 -74 886 534 -315 -2 -83 -439 -70 334 -295 -258 -23 -497 -275 685 563 -515
3633 -515 -99 -9 -378 -50 405 -106 -149 -166 -658 -236 663 307 -166 -277 -246 -301 124 484 -229 -124 -57 -576
3655 -576 -76 865 290 -481 -316 -258 -299 197 146 -343 171 -178 -611 16 622 52 -489 157 -219 -309 80
3676 80 474 -113 -114 -211 -615 -105 570 273 -214 -39 -204 -230 369 87 -94 409 -80 -779 226 795 72
3697 72 -187 171 -23 34 389 296 -69 100 -159 -460 154 685 171 -354 82 -246 0 251 252 414 213 -567
$$ packed form
3548a05k65M11j35n87Q79N31q12m12L75l4N9N44l47l62L80l15j47P36M14r67m39
3569e98M85j71M59J91m46R5K89m19l36J061K67j485M6P30l49P1L08l1k90r0j84
3590c97L86P21k30n48j92K96l28M97L64o09L5J06l06n0R84k3j091Q3J27o1K35
3611aK00L0k81R6l23K05R60l52q49L13q1l56L69M04o29L7K35m74K22R60j22j078
3633e15M16R0l69L28M55n11m3j7m92M22Q99l56m73j11L1n5M25L60p13J05O7n19
3655e76N00R41n75p71J65N8m1M96n1m89N14l49m33O27O06n70n41O46l76r0L89
3676H0L94n87jr7m04N10O75k97m87J75j65k6N99k82j81N03m89o99J005N69p23
3697G2k59L58j94N7L55r3l65J69k59l01O14N31n14n25M36l28K46K51JJ62k01p80
$$ plain form
3719 -567 -497 506 760 -306 -161 354 -144 -497 229 424 -27 214 -7 -374 298 626 105 -170 145 -52
3739 -52 -79 -11 -106 230 334 -240 -666 284 550 -208 -254 101 -292 -305 207 25 34 246 -423 -511 468 431 -565
3762 -565 -210 119 2 -370 83 244 152 152 -420 -109 684 284 -461 7 -7 -652 -329 107 -161 15 40 -466
3784 -466 -341 661 344 -281 126 302 -161 -306 -88 153 115 3 -537 -162 693 -3 -565 207 193 -710
3804 -710 -273 51 211 -26 -90 -151 -11 312 107 -18 412 147 -566 -48 189 -300 30 148 -308 -147 426
3825 426 237 -114 295 133 -241 -193 -83 97 202 -99 -641 -9 503 -197 49 744 221 -278 201 559
3845 559 244 -60 175 -77 108 172 -232 -75 303 -364 -496 384 133 -187 29 355 -400 -52 253 14
3865 14 141 420 -227 -61 334 -144 -520 225 45 -418 -82 272 -235 -176 499 24 -201 64 73 134 19 7
$$ packed form
3719e67P0J003K54j066J45N15m98l53P26J95m51K41k21l67O72L28n21k75L15j97
3739e2k7O8r5L36J04n74m26R50K66p58m6L55l93j3N12j82RK12o69q8R79l7r96
3762e65L55L29j17l72M53J61r2%n72L11P93m00p45M68j4o45L23M36k68J76K5n06
3784d66J25J002l17o25M07J76m63j45K18K41l8j12n40L75Q55o96n62P72j4r03
3804g10M37L24J60k37o4o1J40L23k05j25M30k65p13N18K37m89L30J18m56J61N73
3825D26j89l51M09j62l74M8J10J80J05l01n42O32N12p00K46O95n23m99M79L58
3845E59l15l04K35k52J85O4m04J57L78o67j32Q80k51l20K16L26p55L48L05k39
3865A4J27K79o47J66L95m78l76P45j80m63L36L54n07N9O75m75k25K65RO1j15j2
$$ plain form
3887 7 -277 426 170 -290 65 347 -250 -493 241 -33 -507 130 116 -321 -40 186 59 108 -37 -283 -86
3908 -86 140 -416 -379 341 -59 -363 150 138 -376 92 213 -44 44 205 -342 -164 337 -185 -420 43 105 -404
3930 -404 101 73 -50 -76 103 -37 184 288 -165 -112 461 234 -372 43 150 -183 -37 -4 -310 -156 353
3951 353 -143 -222 522 68 -316 241 247 -180 -32 388 -197 91 399 15 -157 390 -40 -157 346 151 -202
3972 -202 108 162 -218 227 499 -108 30 568 95 -145 263 123 -387 -47 -41 -214 196 223 -263 87 456
3993 456 -1 -132 274 -59 -290 21 42 -121 126 145 -319 15 269 -127 5 310 -104 -139 17 109 -222
4014 -222 179 218 -332 60 441 -159 -89 586 132 -251 107 -196 -234 145 -114 -382 39 70 -379 -54 232
4035 232 -260 -420 185 -290 -324 30 197 -311 7 -109 -240 -2 224 -304 -168 235 -287 -277 141 61 -593
$$ packed form
3887Gk84P03k56m60L55K82n97k43P34k74m74O37j4m37K81K26j27M9j45k46J97
3908h6K26n56L7P20m00l04N13j2n14M68J21k57Q8J61n47J78N01n22k35M63O2n09
3930d04N05k8j23k6J79j40K21J04m53N3N73k27o06M15J07l33J46L3l06J54N09
3951C53m96p9P44m54l84N57Om27J48M20n85K88L08l84j72N47m30j17N03j95l53
3972b02L10N4l80M45K72o07J38N38m73k40M08j40n10L40Oj73M10K7m86L50L69
3993D56m57j31M06l33k31L11K1j63K47J9m64L34K54l96J32L05m14l5J56R2l31
4014b22M01L9n50L92L81o00P0O75m54l83L58l03l8L79k59k68M21L1m49L25K86
4035B32m92j60O05m75l4L54J67n08L18j16j31K38K26n28J36M03n22J0M18q0o54
$$ plain form
4056 -593 -41 194 -223 115 244 -123 -200 69 43 -103 244 -318 -253 138 -47 -201 403 229 -278 -99 384
4077 384 -44 -265 414 215 -326 -89 -248 -47 239 258 -283 40 341 -177 48 501 -15 -253 257 119
4097 119 -216 404 184 -297 0 214 -297 93 477 -261 -292 502 134 -219 346 274 -219 -80 164 -70 80
4118 80 227 -76 -90 8 -224 -77 472 259 -236 62 261 -380 165 465 -165 -177 101 -208 -114 437 -34 -105
4140 -105 210 19 -249 123 179 -204 -53 34 -256 -112 275 -41 -158 41 -290 -434 297 188 -387 -161 253
4161 253 -406 -419 292 30 -351 -89 -95 -207 173 151 -162 -33 -171 -444 81 418 -147 -395 -117 -358 -332 308
4183 308 270 -251 65 -113 -204 -1 584 119 -438 -270 83 -207 262 147 -379 159 22 -264 177 508 92
4204 92 -66 380 -233 -121 539 -35 -64 25 -101 -521 299 592 -36 -139 223 32 -236 436 295 96 -118
$$ packed form
4056e93N52K35m17L38J29l67p7K69k6j46L47n62O5L91j85j54O04j74n07J79M83
4077C84m28k21O79j99n41K37j59K01K86J9n41L23L01n18K25M53n16k38N10j38
4097A19l35O20k20m81K97K14n11L90L84p38l1P94l68l53N65p2m93J39K44k34J50
4118H0J47l03j4R8k32J47N49k13m95K98J99o41N45L00o30j2K78l09R4N51m71p1
4140a05L15j91k68L72N6l83J51Q7k90J44L87l16j17J99l31j44P31j09n75K26M14
4161B53o59j3P11k62l81K62oj12L80k2l13J29j38k73N25L37n65k48K78k41K6O40
4183C08l8n21L16j78r1K03N85m65n57J68L53k90M69j15n26N38j37k86M41L31m16
4204I2j58M46o13J12O60n74k9Q9j26m20Q20K93o28j03L62j91k68O72j41j99k14
$$ plain form
4225 -118 -16 -282 155 171 -5 35 -249 -509 192 630 -40 -206 492 -127 -617 211 764 -216 -228 -94 -79
4246 -79 -74 250 72 -3 189 -176 -251 399 345 -236 -78 -180 -173 -81 223 -211 -120 257 -406 -382 481 494 -329 -229
4270 -229 84 -484 -258 453 32 -194 -29 -258 -389 162 307 -168 -47 -233 -422 66 129 -462 35 193
4290 193 -655 -563 387 114 -182 94 -74 -487 -83 442 155 19 -25 -378 -377 123 262 8 -177 -267 -102 192
4312 192 -41 -28 151 240 -516 -232 842 399 -215 113 -144 -423 0 235 -86 232 146 -525 -109 484 272
4333 272 -164 -82 -161 13 155 115 333 458 -136 -610 -90 695 -93 -144 530 -93 -282 60 440 118 77 -45
4355 -45 -455 -286 299 163 23 178 -133 -85 313 182 138 314 -109 -727 105 767 27 -11 127 -177 -65
4376 -65 196 52 -26 590 52 -660 188 757 -69 -137 75 131 -323 -91 131 487 343 -457 -329 378 173
$$ packed form
4225a18J02k66M37J6j76M0k84k60P01M38o70j66O98o19m90Q28N53r80j2J34J5
4246g9NL24j78p5J92l65p5O50n4n81J58j02PR2L04m34R1L77o63K4Q63J3q23J00
4270b29L13n68K26P11m21k26J65k29j31N51J45m75J21j86j89M88O3n91M97J58
4290A93q48R2R50k73k96K76j68m13M04N25k87j36m4l53JN00J39k54j85r0J65K94
4312A92k33J3J79Q9p56K84J074m43o14L28k57k79M23K35l21L18q6o71M16N93k12
4333B72m36Q2p9J74J42m0K18J25n94m74N20P85p88n1O74o23j89L42L80l22m1j22
4355d5m10J69N85j36j40J55l11M8L98j31m4J76m23o18Q32O62p40l8J38l04J12
4376f5K61j44p8O16n38p12Q48N69q26o8K12N6m54K32K22L56j44q00J28P07k05
$$ plain form
4397 173 -489 124 315 -398 -575 101 134 -54 150 -318 -535 166 405 -85 200 88 -335 -258 87 -201 -72
4418 -72 295 -382 -543 71 172 -181 -71 225 -222 -358 186 79 309 242 -629 -577 220 219 -411 262 238 -255
4440 -255 -323 253 128 460 224 -301 -224 322 -11 -136 177 -136 -354 -168 370 -205 406 421 -523 -468 403
4461 403 209 -268 79 106 -341 -249 -116 95 515 191 -547 -103 437 -153 -78 513 129 -593 -71 384 266
4482 266 6 -13 -239 -131 338 -10 207 531 -52 -292 423 89 37 581 546 -242 -434 142 282 2 -29
4503 -29 -45 -261 190 -401 -57 715 213 -785 -164 514 -136 -402 142 201 -537 -305 90 191 307 -288 -308
4524 -308 44 128 -375 -150 346 -315 -465 -12 55 -70 219 199 -379 38 231 -133 23 378 -187 -61 -58 -339
4546 -339 -315 321 -149 -712 -85 398 -261 -308 -59 99 -255 -232 100 149 378 -214 -612 489 107 -525 98
$$ packed form
4397A73o62O13J91p13j77O76L3j88K04m68k17P01K39m90K85j12m23P7L45k88J29
4418g2L67o77j61O14J01l53J10K96m47j36N44j07K30o7q71N2P97jo30O73k4m93
4440b55o8N76j25L32k36n25P7N46l33j25L13l13k18J86N38n75O11J5r44N5Q71
4461D03j94m77L47K7m47R2J33K11M20l24p38M44N40n90P5N91l84p22N22M55j18
4482B66k60j9k26J08M69l48K17L24n83k40P15l34n2N44l5p88j92N76J40k80l1
4503b9j6k16M51n91L44P72n02r98O21O78o50k66N44N9p38K32L95J01J16n95k0
4524c08L52Q4n03K25M96o61j50M53O7j25K89k0n78M17J93l64J56L55n65J26Lk81
4546c39K4O36m70n63O27M83o59m7K49J58l54K3L32M9K29n92l98J101l82o32O23
$$ plain form
4567 98 362 -192 -217 -115 10 38 168 -110 -263 297 33 -324 12 283 -315 -128 59 -37 220 420 -214
4588 -214 -120 493 74 -205 263 276 -126 124 261 -125 47 492 -25 -306 155 175 -331 270 513 -160 8
4609 8 -12 129 142 155 -273 -23 392 -126 -141 338 249 -287 -182 237 -165 71 356 -192 -205 275 -10 -58 257
4632 257 161 -254 16 110 -149 263 139 -544 -111 433 -190 -393 110 151 -238 -112 85 60 234 44 -427
4653 -427 53 351 -532 -310 328 28 -405 -147 211 -57 42 -18 -38 232 -22 -177 115 189 -277 -168 407
4674 407 -226 -511 200 289 -364 -231 160 -267 -162 92 -119 -233 72 184 -91 287 78 -249 101 200 -458
4695 -458 55 274 -113 -199 -50 -81 -135 194 -154 -269 242 -66 -301 34 397 -95 -198 214 83 -179 140
4716 140 202 -125 262 10 -222 241 80 -175 -20 393 -107 128 495 82 -214 432 77 -297 -25 76
$$ packed form
4567I8K64n54k5J02J25K8J30k78j53N60k64l57L36K71n98J87J87r6K57K00o34
4588b14R4O13m19k79M68J3m02K50J37l86J72M45n17k81M61K0n06O01K43o73J68
4609Hk0J41J3J3m28K50M15n18j5M79q9n36J05M19m02K36K85n48j3M80k85m8L15
4632B57r6m15K70R4k59M12j24o83M33N44o23k03N03M1l89J26J97k5J74j90m71
4653d27M80K98q83K22O38l00m33K58L58k68R9o0k0K70k54j55K92P4m66J09N75
4674D07o33k85P11Q9o53J33L91m27J05K54k11j14L05J12k75L78k09l27L50R9o58
4695d58N13K19l87q6J49l1n4L29l48j15N11l08k35L35L63m92j03M12j31k62L19
4716A40O2l27L87k52k32M63j61k55J55M13n00K35L67m13k96O46l55l74K72J01
$$ plain form
4736 76 -249 -325 215 -24 -59 192 89 56 333 -17 -63 204 44 -454 154 349 -308 -142 330 3 -171 287
4758 287 118 -137 345 212 -143 -51 139 -232 -75 550 -65 -154 278 48 -322 -219 -210 2 137 -264 -113
4779 -113 370 107 -741 -152 656 -73 -344 524 441 -314 -30 213 -202 -50 -28 -187 173 94 -463 -99 438
4800 438 -264 -218 192 65 -406 -118 268 -239 91 -21 -94 -54 276 -104 -489 154 -171 -360 -61 347 -184
4821 -184 -46 114 39 -87 2 1 -118 111 -114 -67 285 -191 -306 377 423 -180 112 686 73 -359 166 -89
4843 -89 -257 46 75 -121 84 -82 -102 22 334 -90 190 374 -31 106 205 37 -213 331 -124 -479 154
4864 154 585 -422 -278 237 75 -249 154 -16 154 166 199 -165 165 393 -106 -100 -22 -142 36 113 -128 -28
4886 -28 -11 -128 -582 251 207 -265 -24 455 -170 25 500 54 -101 -85 73 -265 59 98 -151 133 -207 -170
$$ packed form
4736G6l25p6N40k39l5K51j03l3K77l50m6K67j60m98O08J95o57J66M72l27j74M58
4758B87j69k55M82j33l55R2J90l71J57O25o15q9M32k30l70J03RK12J35m01J51
4779a13M83k63q48N89Q08p29k71Q68q3p55K84K43m15J52K2j59L60p9n57L64N37
4800D38p02M6M10j27m71K88L86n07L30j12p3M0L30l80l85O43l25j89K99M08n31
4821a84J38J60p5j26Q9jj19K29k25M7L52m76j15O83M6o03K92N74o13m32N25k55
4843h9j68L03K9j96K05j66k0J24L12m24K80J84m05J37R9j68k50N44m55l55O33
4864A54M31j007J44N15j62l24M03j70J70J2L3l64L30K28m99OP8j20J78P7k41J00
4886b8J7j17m54Q33m4m72K41M79o25J95M75m46j55J6J58l38L24L9k49K84l40L7
$$ plain form
4908 -170 -109 148 -215 2 275 -316 -313 344 358 -507 47 224 -276 -152 126 -149 -128 12 -296 -159 281 90
4930 90 -269 14 170 -233 -130 133 -124 184 56 -365 -275 446 -270 -416 556 62 -484 116 542 -45 -109
4951 -109 286 -244 -87 -8 61 -315 14 -95 -232 -14 138 24 414 147 -519 96 724 -56 -432 258 37
4972 37 -447 -76 172 136 305 90 -334 -3 420 -139 -281 290 67 -339 -113 258 121 354 -200 -390 279
4993 279 456 -286 -101 352 -69 -541 -2 280 -109 307 276 -238 83 517 8 -183 183 -110 -217 105
5013 105 7 231 170 -269 -364 252 263 -294 -240 91 -292 -479 129 276 33 249 -100 -405 106 240 -245 -13
5035 -13 143 -267 -330 -158 104 218 141 -294 -400 267 163 -279 28 430 -315 -432 20 -199 132 77 -286
5056 -286 -301 152 194 -369 61 144 -110 -482 34 215 171 179 -416 -369 397 -180 -366 251 350 -419 -176 400 -83
$$ packed form
4908a70O1K57l63K17K73n91LO57J4q65N54J77n00J24K78k75K1J40l08J37M40j91
4930I0l59K83J56m03J03K63k57L08j28m21R0P21p16j46R72m94n46O00M26n87o4
4951a09L95n30J57P9O9l76L29j09j37K18J52j14L90k67o66O15O28p80l76O90k21
4972C7m84L71K48l6J69k15m24L31M23n59j42N71k23m06K26L71j37K33n54j90O69
4993B79J77p42J85M53m21m72N39K82l89M16l1n14L21M34n09j91L66k93j07L22
5013A05r8K24o1m39r5O16J1n57N4L31l83j87O08J47k43K16l49l05N11J34m85K32
5035a3J56m10o3J72K62J14p7m35j06O67j04m42L07M02p45j17M52k19L31n5l63
5056b86j5M53M2n63M30Q3k54l72N16J81m4Qn95M7P66n77j86O17R9p69K43N76m83
$$ plain form
5079 -83 -63 183 -296 -249 259 0 -152 282 272 -279 -97 -2 -37 263 261 -358 -10 220 -15 -101 298 315 -423
5102 -423 -5 548 -138 237 292 -298 -177 427 202 -189 228 67 -227 -389 62 112 380 40 -347 -103 234
5123 234 -244 -108 627 135 -262 -11 -14 -76 179 245 -385 -118 525 -318 -263 377 214 -192 -59 227 528 342
5145 342 -144 -257 82 123 -463 122 458 -232 -571 16 -44 -144 374 195 -179 -61 142 -248 -79 372 -62
5166 -62 -292 -28 81 64 238 -172 -313 67 186 -190 84 253 -335 -284 -22 -1 30 450 -211 -464 157 147
5188 147 -450 -69 232 -138 -345 -123 163 230 179 -221 -180 376 29 -228 159 228 -256 -274 25 -230 231 335
5210 335 -170 -69 424 70 -335 263 541 -242 -395 301 83 28 361 -77 -160 224 -72 -169 64 -18 -271
5231 -271 -180 7 140 267 338 -271 4 599 -7 -423 424 378 -223 -222 -62 15 131 30 -190 125 615 -104
$$ packed form
5079h3K0K46m79M7N08k59j52M34j0n51J82R5l5L00ko19L48K30k35q6L99J7p38
5102d23M18N53o86L75N5n90J21O04k25l91M17j61k94j62M51N0K68l40l87K44L37
5123B34m78J36P35m92l97K51lo2K55O6o30K67O43q43N5O40j63m06J33K86L01j86
5145C42m86j13L39M1n86N85L36o90l39N87o0j00N18j79l74J18K03l90J69M51m34
5166f2k30K64J09j7J74m10j41L80J19l76K74J69n88N1K62K1L1M20o61k53O21j0
5188A47n97L81L01l70k07K22K86O7n1m00M1N56l47k57L87O9m84j8K99k55M61J04
5210C35n05J01M93l54m05N98K78p83j53O96k18n5L33m38q3L84k96r7K33q2k53
5231b71R1J87J33J27P1o09K75N95o06m16Q47m6o01JJ60P7J16j01k20L15M90p19
$$ plain form
5253 -104 -94 340 354 -269 -119 141 79 98 53 -246 130 308 -134 4 345 192 -510 -15 -52 -213 109 174
5275 174 -369 -5 393 -253 -339 324 -43 -335 -140 110 -160 235 71 -321 199 407 -193 23 313 -375
5295 -375 -444 101 -245 -361 59 -203 -387 122 291 -289 -90 340 25 -270 -46 74 -227 87 -71 -308
5315 -308 12 132 -380 -62 355 -379 -185 371 -65 -207 120 119 -345 -78 173 -138 -13 184 -234 -111 247
5336 247 82 -162 212 -58 -403 67 -2 -371 17 237 -227 64 161 54 -16 208 -157 -272 432 136 -362
5357 -362 59 305 -65 8 265 -17 2 95 116 168 332 197 -126 461 64 -172 150 161 -34 124 445 -80
5379 -80 -37 443 -130 -331 222 224 -306 -62 422 -77 -120 9 -145 -36 38 -108 -124 79 -171 -134 195 -6 -458
5402 -458 130 415 -297 80 422 -103 -518 345 109 -304 62 220 -331 15 129 -46 -90 297 -132 -55 17
$$ packed form
5253a04J0M34J4o23J50K60o2J9m5k99L76J78m42J38L41j53p02M95l7j61L22O5
5275A74n43L64L98o46q6O63l67k92J95K50k70L95j64l92N20K08o00K16K90o88
5295c75o9N45l46j16M20k62j84N09J69n80J99M30l15k95K24J20l01L14j58k37
5315c08L20J20n12L18M17p34J94N56m36j42L27jm64K67K51l11J25J97m18J23L58
5336B47j65k44L74k70l45M70o9l69L88K20m64K91R7j07p0K24l65j15P04k96m98
5357c62M21K46l70P3K57k82J9R3K1N2J64j35l23N87l97k36L22J1j95J58L21n25
5379h0M3M80n73k01N53Kn30K44M84m99m3J29j54J09P4j46j6K03k50L7L29k01m52
5402d58N88K85p12L77L42n25m15Q63k36m13L66J58n51L46J14j75m4L87m29P7P2
$$ plain form
5423 17 -88 -270 76 -130 -408 -21 66 -361 -52 182 -370 -7 584 -62 -426 144 -11 -173 -50 326 -366
5444 -366 -204 218 -46 -172 -80 -97 -98 278 -65 -214 82 -46 -356 187 296 -332 -152 474 -154 -269 410
5465 410 49 -180 343 246 -442 -215 165 -262 -165 156 4 -347 114 -111 43 293 -76 14 464 214 -201
5486 -201 206 482 -280 -134 431 38 -325 228 -42 -197 10 372 -133 129 382 -102 -55 135 -124 -78 389
5507 389 -339 -170 268 117 -469 338 124 -161 13 333 -355 -112 378 -74 -231 267 137 -272 156 299
5527 299 -74 -344 233 5 -15 41 -246 -196 263 -260 -244 359 175 -410 5 37 -313 10 383 -153 -21 262
5549 262 -62 -558 177 125 -314 5 78 -226 32 168 -200 -2 291 -257 -353 169 42 -293 -247 29 -299
5570 -299 -46 150 -184 -123 273 -371 -267 332 24 -386 130 53 -310 -41 203 -266 156 12 -396 119 185
$$ packed form
5423A7j05j82L46k06k78L87Q7m27L09K34n52L63N91o46l64N70j55j62J23L76o92
5444c66J62M22k64j26R2j7jL76l43j49K96j28l10N43J09o28J80O26o28j15O79
5465D10l61k29N23r7o88K27L80m27R7L21j52l51M61k25J54K50l69R0M50k50m15
5486b01M07K76p62J46N65l93l63N53k70j55K07L62n05K62K53m84M7J90k59M6M67
5507C89p28J69M38j51n86Q07k14k85J74L20o88K43M90m52j57M98j30m09M28J43
5527B99l73k70N77k28k0N6k87N0M59n23J6O03j84n85M15L2l50L23L73n36J32K83
5549B62l24m96P35n2m39L19P3l04K58J36l68J98K93n48r6N22j27l35M6K76l28
5570b99K53J96l34O1L96o44J04N99l08m10N16p7l63K69K44m69M22j44m08N15O6
$$ plain form
5591 185 49 -77 456 -16 -164 136 138 -165 203 6 -444 -140 413 51 -250 223 152 -72 180 -10 79
5612 79 294 154 -632 85 400 -249 90 483 -33 -237 126 258 105 101 -35 -504 -93 338 -14 -236 233
5633 233 -170 -253 35 -145 -89 572 10 -428 3 538 -35 -31 489 -274 -303 81 -38 -65 442 -52 -455 -83
5655 -83 297 -312 -228 363 -148 -387 74 -61 128 513 -181 -492 142 143 -251 150 467 -411 -338 17 -204 -12
5677 -12 409 -203 -662 113 193 -108 -122 228 -243 -296 -48 111 316 474 -678 -532 3 -230 -379 221 266
5698 266 -382 -422 -37 24 241 255 -279 -518 78 98 -219 420 168 -479 -428 143 122 260 285 -315 -545 342
5720 342 -134 -139 301 475 -166 -241 61 -14 274 154 -508 -499 353 185 -180 403 468 -376 -412 -7 178 425 299
5743 299 -365 -45 224 -129 -99 655 116 -525 -198 20 123 472 393 -487 -247 -13 -110 -187 510 351 -314
$$ packed form
5591A85j36j26N33m72j48L00Kl03L68j97m50L04N53l62l01M73p1k24K52j90Q9
5612G9K15j40p86P17L15o49L39L93n16k04L63J32j53mj36m69M11M31l52k22M69
5633B33m03q3K88j80N6O61n62m38M31N35n73MN20p63k9L84j19k7N07m94m03L72
5655h3L80o09Q4N91n11k39M61j35J89L85o94l11O34Jl94M01L17q78P3L55k21J92
5677a2M21o12m59P75Q0l01j4L50m71n3K48J59K05J58j152J46N35k33j49O00M5
5698B66o48m0L85O1K17J4n34k39N96K0l17O39k52o47N1N71k1J38K5o00k30Q87
5720C42m76nM40J74o41p5L02p5K88j20o62RQ52j68l65N83O5q44l6M05J85K47j26
5743B99o64L20K69l53L0P54n39o41L27K18J03L49p9q80K40K34r7p7O97j59o65
$$ plain form
5764 -314 -382 -98 476 611 127 -617 -105 248 -211 1 735 291 -592 -34 -35 -35 489 102 -369 -102 250 -205
5786 -205 -88 646 230 -718 -365 165 230 529 26 -285 20 52 -355 80 661 -233 -756 -85 -257 8 572
5807 572 42 -466 -130 -101 -236 113 409 139 -528 -204 -310 93 437 -348 -483 54 77 -514 163 595 -117
5828 -117 -447 -210 -198 143 473 24 -445 50 -238 -459 455 773 57 -604 -157 -239 67 466 -15 -318 84
5849 84 -382 -337 401 420 -312 -322 -266 -245 209 720 -118 -387 293 -88 -258 494 633 -220 -345 -280 -1 432
5871 432 311 4 156 98 -421 -322 541 573 -305 -215 -150 -268 362 551 -113 -169 118 -231 -242 789 504 -424
5893 -424 -193 -239 -162 235 284 -262 -171 -94 -548 -188 675 416 -265 -274 -30 -290 465 427 -253 -91 15 -617 -324
5916 -324 576 323 -277 -158 -100 -30 205 351 -179 137 -164 -659 -417 602 267 -369 -433 -85 -139 322 193
$$ packed form
5764c14o8K84N74J35m84p44N12L53m59K12P34m44q83N58j%N24l87m71K67L52m55
5786b05J17P34m16r48L53N30O5K99n03l11L05L2m07M35N81q94n23O71j72K65N64
5807E72n30n08L36K9j35L49K96k70o67L24j06M03L44p85j35N37K3n91O77M32p12
5828a17l30K37J2L41L30m49m69M95k88k21R14L18p16o61M47q2L06L99m81l03M02
5849H4m66M5P38J9p32j0N6K1M54N11q38k69O80l81j70P52J39q53j25O5K79M33
5871D32j21l07J52n8n19R9Q63L2q78R0O5j18O30J89o64n6K87l49j1J031k85r28
5893d24K31m6P7L97M9n46R1P7m54L60Q63k59o81rK44k60P55l8o80J62J06o32K93
5916c24R00k53o00J19N8P0K35J46n30L16l01m95K42J019l35o36o4L48n4M61j29
$$ plain form
5937 193 -238 208 -259 -767 49 768 -141 -385 -225 -319 -401 52 294 -84 -120 -176 -728 75 455 95 -220
5958 -220 27 -239 21 255 214 -98 145 -210 -836 -3 523 80 -410 -50 -184 -212 433 224 -51 216 -217
5979 -217 -621 -56 715 25 -382 120 20 75 220 17 60 264 -422 -580 221 630 -102 -16 308 -430 -271
6000 -271 396 237 74 205 -66 -368 465 351 -416 44 77 -456 -90 346 145 90 260 -258 -343 428 118
6021 118 -128 19 185 -573 -74 530 -121 -101 287 -248 -278 59 245 48 308 85 -363 66 365 14 -74
6042 -74 52 -356 -243 172 30 -79 0 -59 -127 -33 398 -186 283 114 -403 -313 242 78 -455 178 67 -374
6064 -374 -257 137 78 -127 -196 -497 79 37 -303 -55 512 -90 -696 231 149 -49 -120 86 -133 -161 138 -24
6086 -24 129 404 -174 -512 125 203 -238 59 29 -18 23 188 169 284 224 -276 7 462 -18 -217 97 245
$$ packed form
5937A93m31M46m67n08Q16P19r09k44J60r4q2M53K42l78l6n6n52Q03L80l60l15
5958b20K47k66K60K34m1l12K43l55o26Q33N26m43m90L60j34k8O45k09k75K67m33
5979b17m04N65P71o90m07N02j00N5J45k03M3K04o86j58Q01M09p32Q6L24p38J59
6000b71O67j59j63J31k71l02Q33j14p67M60L3n33L66M36k01n5J70n18q5P71l10
6021A18k46J47J66p58M99O04o51K0L88n35l0L37J86j97K60k23m48M29K99l51q8
6042g4J26m08J13M15j42j09P9n9o8R4M31n84M69j69n17R0N55j64n33O33j11m41
6064c74J17L94n9k05o9l01N76m2l40K48N67o02o06R27q2j98p1K06k19k8K99j62
6086b4J53K75n78l38O37P8m41K97l0m7M1J65j9J15o0n00K83M55m80j99L14J48
$$ plain form
6108 245 -403 172 495 -205 14 642 180 -251 149 234 -102 54 115 -123 57 68 -126 254 295 -110 -89 869
6130 869 78 -256 130 125 -262 149 47 -298 129 387 -367 23 437 103 -552 -25 273 -81 155 -111 26
6151 26 191 217 -266 212 577 -374 -430 258 82 -327 -85 255 -265 -55 135 -332 66 434 -191 -144 245
6172 245 -198 -362 12 86 -206 63 100 -113 35 191 -243 -271 113 -271 -186 171 -238 -655 286 178 -468
6193 -468 105 451 -255 -523 25 -167 -37 -52 -109 -189 111 -55 -348 420 326 -229 -39 278 -66 -129 248 -110
6215 -110 -476 343 -172 -530 238 302 -358 71 385 81 14 194 100 -22 194 -35 -90 384 37 -418 240
6236 240 404 -185 38 307 -118 -298 434 170 -21 288 148 -254 58 116 -58 238 201 -188 -175 236 -110
6257 -110 -142 440 325 -140 260 255 61 315 188 -246 253 492 107 -221 424 153 -342 141 -34 -176 172
$$ packed form
6108B45o48N75L23p00K19O28m62m31M00Q5l36J56O1k38J80J1j94L80M1m05K1R58
6130H69p91l34L86nl87M11j02l45M27K58p54L90M14l34o55N27K98l54K36k66J37
6151B6J65K6m83M78L65r51n6O88j76m09K42L40n20K10J90m67L98L68o25M7L89
6172B45m43j64L74P4k92K69L7k13J48J56m34k8L84l84Q5L57m09m17R41j08o46
6193d68N73L46p06k68N48j92J30j5n7q0L00j66k93P68r4n55J90L17l44o3L77l58
6215a10l66Q19n15l58P68O4o60M29L14l04o7J80r4j22K16k29n5M74l47m55O58
6236B40J64n89K23K69m25j80P32k64j91L09j40m02L12N8j74K96l7l89J3M11l46
6257a10l2N82j15m65M00nj94K54j27m34M99K39l85l28O45k71m95M83j75j42L48
$$ plain form
6278 172 42 -65 148 317 -142 -170 123 -35 -157 197 118 -58 133 -46 -310 -117 339 -359 -146 477 -35
6299 -35 -555 152 -21 -325 201 226 -180 18 132 -216 -185 248 -186 -234 136 -155 -334 296 123 -365 80
6320 80 146 -79 91 398 -100 -195 33 -176 -114 232 -4 -288 190 176 -169 -62 456 -26 -52 120 -229 -169
6342 -169 138 -172 -297 260 110 -334 150 441 -136 -118 196 -162 0 158 -140 42 456 103 -257 299
6362 299 331 -286 62 176 -9 -217 331 140 12 315 -31 -27 270 179 18 88 157 -378 -159 390 6 -69
6384 -69 23 81 -182 161 124 -39 220 -113 -285 -60 391 -376 -11 485 102 -284 137 146 -37 62 145 -318 11
6407 11 135 -319 -55 333 7 -368 259 184 28 215 59 -286 -161 -208 -422 -28 397 -308 -477 172 178 -87
6429 -87 183 403 -221 -122 87 -88 -20 135 -271 -247 117 -327 -150 245 83 -413 -192 250 -516 14 457
$$ packed form
6278A72j30j07K13J69m59k8K93j58j22L54p9j76J91j79k64J93M56o98K13O23n12
6299c5n20P07j73l04N26K5m06J98J14l48L1M33m34m8L70k91j79O30j73m88M45
6320H0O6k25J70L07m98r5K28k09O2L46k36k84M78j4l45J07N18m82k6J72l49O0
6342a69L07l10j25N57j50m44M84K91n77J8L14l58J62J58k98J82M14l53l60N56
6362B99L2o17L48J14j85k08N48j91j28L03l46MK97r1j61P0O9n35K19N49l84p5
6384f9R2N8k63L43l7j63K59l33j72K25M51p67L65M96l83l86M21Rj83R9Q3m63L29
6407A1J24m54K64L88l26l75O27p5j56J87j56l45J25m7k14L94M25p05j69O49Ok65
6429h7K70K20o24R9K09j75O8J55m06K4L64m44J77L95j62m96K21M42p66N30M43
$$ plain form
6450 457 -236 -162 -42 -52 -23 263 -152 -370 116 -95 -425 15 423 -296 -442 -68 90 51 105 -74 -215 334
6472 334 -290 -510 400 315 -435 -200 346 -31 -226 413 172 -230 153 49 86 338 233 -189 -189 124 -63
6493 -63 147 509 -184 -83 380 4 -125 368 134 -256 -109 -48 -225 112 386 -336 -278 355 76 -271 420
6514 420 208 -157 -218 102 261 216 79 -61 142 224 -616 -312 695 302 -518 -28 144 -75 126 306 -213
6535 -213 -94 204 -335 -38 588 188 -208 -45 24 -18 314 60 -162 -33 43 -496 66 508 22 -451 -223
6556 -223 -209 -219 166 -11 -283 13 154 -591 -99 628 201 -260 -268 -7 -265 345 -138 -445 -89 -77 -735 -153
6578 -153 531 17 -354 -19 264 133 171 -66 -133 114 3 -652 285 529 -315 -290 -79 -116 -171 204 283 -106
6600 -106 127 -101 -313 94 351 62 -78 114 -119 74 377 -104 -215 172 -173 -588 337 648 -80 -302
$$ packed form
6450D57o93P4J20j0K9K86m15k18M86k11l30M40M08p19j46L74J58l9N4j79j41N49
6472C34o24k20R10q5p50K35N46l77j95O39k41m02L83j04L7K52j05m22%L13j87
6493f3K10L62o93J01M63l76j29M93k34l90J47O1j77L37K74p22N8O33k79l47O91
6514D20k12l65o1L20J59m5j37j40K03Q2q40L04J007l93q20M90J72k19K01J80n19
6535b13J19K98n39K97O26m00l96J63O9m2L32k54k22J29P6n39N62M42m86m73K28
6556b23J4j0L85j77k72K96J41p45M92P27m27m61qK61k58O10m83l07L56J2o58N82
6578a53O84n14l71L35K83j31L8k37o7K47j11o55R37K44q44K5K11l7n5L75P9l89
6600a06K33k28k12M07K57k89j40J92k33J93L03m81j11L87l45m15R25L11p28k22
$$ plain form
6620 -302 136 -107 -6 333 33 -109 194 -286 -482 5 343 -33 14 49 -56 222 360 219 -61 285 -174
6641 -174 -304 330 238 -266 9 117 -244 -22 63 -3 -127 205 -338 -262 360 306 -66 -51 100 -46 94 154
6663 154 -86 9 31 -431 -250 261 155 -413 -41 33 -269 122 269 -247 -333 225 -265 -334 294 139 -481 3
6685 3 -61 -198 160 248 -144 131 6 -410 -149 415 38 -240 168 -93 -369 121 275 -445 91 112 -437 -178
6707 -178 138 108 -386 -79 -45 -316 -60 -12 -89 120 11 -308 -81 367 -312 -268 47 -214 -32 281 179 89
6729 89 204 186 -578 75 469 -59 -183 295 -34 -43 393 201 -140 191 99 -152 86 107 -25 10 22 -109 49
6752 49 275 -151 -400 511 42 -574 152 610 -72 3 302 25 187 41 26 -36 233 -1 -249 232 205 120
6774 120 9 41 -37 170 63 -210 163 428 -247 -652 273 379 -407 -188 459 62 -284 121 -81 -85 69
$$ packed form
6620c02M38k43J01L39l00j42L03m80j96M87L38l76M7L5j05K78J38j41k80L46m59
6641a74j30O34r2n04K75J08l61K22Q5o6j24L32n43P6O22n4l72J5J51j46J40O0
6663A54k40R5K2m62J81N11j06n68L72P4l02L91J47n16q6N58m90o9O28j55o20M84
6685Co4j37L58Q8l92K75j25m16K61N64l77k78M08k61k76M90J54p20N36K1n49K59
6707a78L16l0m94L07L4k71K56M8p7K09j09l19K27M48o79M4L15k61J82L13j02r0
6729H9J15j8p64O53L94n28j24M78l29rM36j92l41L31r2k51K38K1j32L5J2j31J58
6752D9K26m26k49R11m69o16P26M58o82P5K99k77J62j46j5o2K69k34k48M81k7q5
6774A20j11L2p8K07j07k73L73K65o75m05R25J06p86K19O47l97l46M05k02mJ54
$$ plain form
6795 69 -115 -285 207 254 -27 80 -34 -77 84 76 -64 54 279 -342 -265 353 -41 -310 98 150 -377 -97
6817 -97 110 0 -224 -8 -235 -335 48 36 -116 24 -240 -175 91 -213 -325 115 215 -487 -140 622 -25
6838 -25 -398 94 224 -280 -72 115 4 125 124 -163 213 98 5 -39 -27 150 -99 204 -5 -286 183 61
6860 61 -683 -17 476 -28 9 405 219 -392 410 116 -65 60 148 36 140 412 -8 -38 242 6 36 246
6882 246 99 -178 236 80 -72 94 187 -211 -79 285 -305 -226 209 273 -315 69 198 -172 113 154 -99
6903 -99 147 367 -266 -106 191 -338 -260 287 -141 -357 149 179 -129 170 302 -208 -44 367 50 -225 90
6924 90 -1 -224 159 363 -221 86 8 -354 126 161 -118 -268 100 -87 -427 133 36 -285 104 186 -443 -322
6946 -322 89 -225 -16 336 -52 -64 109 175 -152 193 80 -197 -5 94 -306 16 200 -228 -273 316 127
$$ packed form
6795F9j84j70M92M7k81J07j14m3J61qj40J18K25o21P7O18l94k69M08N2n27K80
6817i7K07j10k24K16k27j00L83j2j52J40k64O5K66l04j12M40J00p02L47P62o47
6838b5l73M92J30n04K08J87j11J21jk87L76j15r3m4J2J77k49L03k09k81M69j22
6860F1p44O66M93n04L7L96j86o11Q02k94j81J25Q8j12J04K72m20l0K80k36L0K10
6882B46j47k77M14j56j52J66R3l98J32L64n90P9M35O4n88L84J29l70K85M1k53
6903i9K46K20o33J60K97n29P8N47m28k16N06L0l08K99J32n10J64M11l17k75L15
6924I0r1k23L83K04n84L07p8l62M80L5k79j50L68j87l40N60r7l21L89Q2o29J21
6946c22M11l14K09L52l88j2J73O6l27L45j13k77J92R9m00L22J84m28m5N89j89
$$ plain form
6967 127 -180 143 109 -274 51 236 -229 -95 231 -261 -171 386 117 -230 285 11 139 97 42 -383 154
6988 154 424 -345 -151 369 -100 -320 149 163 -136 138 176 -80 74 279 -383 -61 468 -61 -206 210 64
7009 64 -241 249 -4 -126 172 143 -218 60 148 -117 -113 442 -76 -229 237 161 -64 275 256 -308 144 134 -243
7032 -243 -112 50 -258 -242 127 -125 -197 359 61 -306 126 356 -333 -115 328 -243 -519 19 12 -175 110
7053 110 50 -250 117 44 -42 82 247 -4 -167 -62 -359 -197 498 -115 -350 243 -50 -503 -181 283 -282
7074 -282 -447 11 -89 -168 177 24 -37 59 -19 -387 285 368 -134 -19 -45 -305 17 -25 -334 -101 184 2
7096 2 -333 190 217 -239 -43 190 -192 -166 143 -81 -225 -71 -201 -177 423 405 -178 -106 174 -365 42 180
7118 180 -137 -56 66 -13 -93 429 183 -352 -66 -76 -330 121 350 -225 -153 138 8 -83 163 312 11 -82
$$ packed form
6967A27l07L23l4l83L25J85m65J34L26m92R0N57k69l47N15k74J28m2n5m25N37
6988A54K70p69J94N20m69k20M69J4k99K74L8k56J54K05o62L22N29n29j45M16j46
7009F4l05M90k53j22K98k9l61K78Q8k65MN55n18j53M66p6k25L39j9n64M52j0l77
7032b43J31J62l08J6L69k52p2N56k98l67M32K30o89K18M43n71k76N38pj87K85
7053A10o0l00L67p3q6J24J65k51j63J05k97J62O95o13k35N93k93m53L22M64n65
7074b82j65M58j00p9L45j53o1R6p8l68O72Q3n02J15k6k60L22m2l09K33K85j82
7096Bl35N23K7m56J96K33l82K6L09k24j44J54j30K4O00j8n83P2K80n39M07J38
7118A80l17Q1J22p9q0N22k46n35K86j0k54M51K29n75P2K91j30r1K46J49l01r3
$$ plain form
7140 -82 -77 -242 396 196 -214 137 94 -296 -75 700 298 -245 59 81 -350 33 183 -249 -148 54 -193 16
7162 16 315 87 -109 126 -120 -123 165 225 -184 144 58 -417 -124 479 -160 -300 8 12 -273 192 225 -267 7
7185 7 120 -364 -115 369 36 -347 -135 -267 -182 86 142 -76 207 -71 -385 59 596 -68 -238 149 -332
7206 -332 -227 26 7 -235 197 -188 -512 228 444 -72 -273 -28 -227 -270 102 -41 77 37 -287 -496 308
7227 308 364 -134 -102 100 -370 -73 264 299 -15 199 -124 -565 178 372 6 -217 176 -289 -129 306 279
7248 279 5 177 -330 -373 376 443 -109 151 265 -265 30 298 111 187 283 -285 -411 348 294 -291 230 -39
7270 -39 -358 -121 197 156 -22 285 -170 -8 296 225 -86 -112 149 -244 34 291 46 179 -14 -170 -107 198
7292 198 305 -17 158 -10 -401 -147 144 -115 -82 10 -494 -295 282 291 -57 -49 -40 -395 6 140 136 278 36
$$ packed form
7140h2Nj65O38k00m10L51m3l90K21P75m02n43L04K2m31L83J50m32J01K02k47K09
7162A6K99k28j96K35k46lK88O0m09L28q6m75K93O03o39j40L08Mk85M65L3m92K74
7185GJ13m84K49M84l33l83K12j32Q5K68N6k18K83k78l14M44N37o64j70L87m81
7206c32J05K53j9k42M32l85l24P40K16n16k01K45j99m3L72j43J18m0l24k09Q04
7227C08N6m98L2K02m70K97L37L5l14K14l23m41P43J94l66k23L93m65J60M35k7
7248B79k74J72n07m3P49O7n52K60J14n30K95K68j87P6R6n68j26P59n4n85N21k69
7270c9l19K37L18m1j78L07m55J62L04p1l11k6K61l93K78K57k45J33j93j56O3L05
7292A98J07l22J75j68l91K54K91k59L3R2n04J99N77Rl48QRl55M01J34mJ42k42
$$ plain form
7315 36 -598 -123 314 -90 -318 257 -168 -595 -98 214 -174 249 116 -268 -209 329 281 5 64 -190 -304
7336 -304 -165 -84 -187 102 10 -424 98 373 106 118 402 -343 -332 236 22 -312 339 213 -593 -169 413
7357 413 279 -40 480 -146 -238 56 35 59 32 -286 -206 221 175 -29 94 338 -222 -84 283 12 -47 321
7379 321 9 -640 -39 468 191 185 162 -56 -106 313 130 123 209 -29 -185 67 115 -22 285 161 -70 41 176
7402 176 -140 97 441 -139 -486 176 282 -185 -23 306 -207 -236 196 29 191 273 -148 -4 225 241 38
7423 38 145 30 -217 -36 -56 -162 10 339 -386 -445 79 1 -290 362 309 -121 -118 -62 88 -70 26 -192 -16
7446 -16 171 -202 -138 313 -54 -381 -103 -36 -380 204 365 -350 -235 336 -230 -417 148 36 -386 -124 296
7467 296 -29 -150 22 -7 39 67 -268 -13 135 -116 -167 151 2 -81 344 116 -94 -21 435 -183 -164 356
$$ packed form
7315C6o34M75M37m04k28N75m25m27M97L12l88M23j33l84N9N38m8k76N9k54j14
7336c04J39Q1j03K89r2m34N22K75k67J2K84p45J1N68k14l34O51j26q06M24N82
7357D13j34l19N20o26r2K94k1K4k7l18Q0M27m6k04J23K44n60J38L67k71n9L68
7379C21l12o49O01N07k77ok3k18n0M19j83pQ6k38j56K52M8j37L07j24k31J11J35
7402A76l16K37L44n80l47O62J06m67J62L29n13k9M32j67J62Q2m21J44K29J6k03
7423C8J07j15k47J81k0j06J72L29p25n9N24p8k91O52n3m30LN6J50j58R6k18J76
7446a6J87l73O4M51l67l27K78O7l44N84J61p15J15N71n66j87N65j12m22K62M20
7467B96l25j21J72k9M6K8l35K55J48k51n1L18j49q3M25k28k10P3M56o18J9N20
$$ plain form
7489 356 212 -382 -54 404 -57 -76 324 -5 71 -66 -42 422 176 -173 -91 295 -82 -264 319 266 -149 317
7511 317 211 -213 235 364 -79 -252 342 32 -373 77 388 -41 -10 234 52 240 -98 -188 14 75 -211
7532 -211 -96 102 36 3 313 48 -359 233 168 -257 -433 213 -145 -510 44 435 -104 -32 4 -209 183 -79
7554 -79 -290 97 83 -241 -219 213 -147 -223 -16 -114 -35 391 192 -382 18 396 -174 -541 22 205 -25 -4
7576 -4 163 -28 194 -261 -137 212 50 -498 -44 221 -216 -255 178 -47 47 373 65 -213 141 378 -121
7597 -121 -158 197 -102 -130 129 -48 -191 87 -129 -6 251 91 -132 -84 144 -179 -97 257 -129 -11 424
7618 424 -61 -276 95 167 -218 79 318 -211 -180 -13 0 18 419 86 74 232 -49 -339 13 171 -255 148
7640 148 53 -200 -153 336 209 -97 280 101 -188 13 289 -96 -70 217 -146 40 -56 -196 19 304 64
$$ packed form
7489C56j44n94L28M58m61j9M00l29P6j37K4M64k46l49Q2L86l77j82N83n3m15M66
7511C17j06m24M48J29m43j73N94l10m05M50L11m29L1K44j82J88l38r0K02O1k86
7532b11J15J98o6l3L10k65m07N92o5m25j76O46l58l65N54L91n39P2L6k13L92k62
7554g9k11L87j4l24K2M32l60p6K07r8P9M26j99n74M00L78n70l67N63J83k30K1
7576dJ67j91K22m55J24L49j62n48M54K65m37l9M33k25R4L26l08k78L54K37m99
7597a21l7L55k99k8K59j77j43K78k16J23K57j60k23M8K28l23Q2L54l86J18M35
7618D24m85k15L71P2l85K97K39n29L1J67J3J8M01l33j2J58k81k90L52J58m26M03
7640A48r5k53M7M89j27l06L77j79k89K01K76l85K6K87l63J86r6j40K15K85k40
$$ plain form
7661 64 -242 167 -96 -340 165 114 -314 110 392 -11 -297 272 -96 -247 121 1 -80 -239 -124 -246 17
7682 17 127 -154 -47 207 -348 54 124 33 -290 -7 165 -418 -170 239 -296 -356 233 -87 -288 58 24 -63
7704 -63 -29 -180 4 1 -133 -289 -25 367 -365 -17 171 -151 -90 346 -183 -405 28 256 -228 14 220 -219
7726 -219 -110 78 58 71 115 -48 -27 1 41 -82 120 83 -90 -100 146 -128 133 460 -226 -110 465 85 -220
7749 -220 375 281 -271 -225 260 156 72 189 88 97 289 75 55 340 37 -210 50 123 39 147 190 -247 -189
7772 -189 398 79 -253 364 208 -319 -17 336 -11 -53 106 -78 -104 119 6 -222 186 -78 -71 138 -22
7793 -22 -53 262 33 -472 47 375 -130 -287 368 3 -378 -94 283 -215 -11 106 -278 5 208 36 -120
7814 -120 46 -98 -482 -5 -66 -90 145 8 -263 83 164 -327 -85 227 -337 -327 274 109 -215 188 217 -282
$$ packed form
7661F4l06M09k63k44N05n1m28M24K82m03k86N69l68j51L68j20q1j59J15j22K63
7682A7J10k81J07K54n55M02P0r1l23K83J72n83K48M09n35o0N89l20k01L46l4q7
7704f3L4j51J84lj34j56K64L92p32L48J88l22O1M36n29k22M33K28m84K42K06m39
7726b19J09J88k0J3M4j63K1K8M0j23K02l7j73j0K46k74K61L27o86J16N75l80l05
7749b20N95r4n52M6M85j04q4J17j01RJ92k14k0K85l03k47K60P3q4J08M3m37N8
7772a89N87l19l32O17j56n27L02L53l47m2J59j84k6K23j13k28M08k64PK09j60
7793b2l1L15k29n05N19L28n05j57O55l65l81K84L77m98K04J17l84K83K03j72j56
7814a20J66j44l84M77o1k4K35j37k71L46Q1m91K42L12n64J0O01j65l24M03K9m99
$$ plain form
7836 -282 92 151 -348 -11 227 -293 -111 158 -141 107 88 -54 -309 233 266 -227 50 313 -216 -148 303
7857 303 -10 17 191 -110 -97 211 119 -165 -135 300 11 -52 -47 -20 259 114 -216 -289 306 151 -102 114 188
7880 188 19 -104 76 13 86 210 -165 -347 280 162 -171 150 251 77 -143 112 49 88 426 -88 -299
7901 -299 452 321 2 99 341 -241 10 94 137 269 131 -398 -161 253 145 -158 106 310 -185 -56 36
7922 36 140 129 224 -315 -199 491 96 -111 63 84 -125 -190 -132 -139 186 11 -440 -260 363 -232 -276 153 -4
7945 -4 -295 -75 -19 -37 342 70 -477 -177 237 92 -305 241 101 -168 -98 -137 42 255 -117 -506 -155 208
7967 208 -78 26 257 -55 -144 -299 48 -61 176 11 -508 -46 417 -2 -119 286 160 -164 -106 4 203
7988 203 212 -304 -380 194 381 -273 31 348 -68 -306 -142 111 151 176 -37 -390 278 457 -311 -156 594 87
$$ packed form
7836b82L74N9m99L37K38n20J82K69k99K48j9j42k55N42L3m93K77K63n29O8M51
7857C03l13K7J74l01J3L08r2k84L0M35k89o3NK7K79j45l30p3N95j55k53K16P4
7880A88j69j23J80o3P3J24l75j82O27j18l33L21J01j74k20K55o3L9L38n14k11
7901b99P51j31l19R7K42n82K51Q4M3J32j38n29K37M14j08l03K64K04m95J29R2
7922C6J04j1R5n39J16O90l95k07J74K1k09o5N8pL25j75m51J80O23n95m4M29j57
7945dk91K20N6j8L79k72n47L00M14j45l97N46j40k69P0l9J79K13l72l89L51L63
7967B08k86J04K31l12q9j55L47j09K37j65n19M62M63m19j17M05j26l24N8J10J99
7988B03Rn16p6N74J87o54L04L17m16k38J64K53M0K5k13l53O68J79p68J55P50n07
$$ plain form
8010 87 -225 -32 112 342 257 -223 -75 304 28 -192 340 312 -160 -65 140 119 181 302 -187 -264 313 239 -165
8033 -165 -97 185 210 -300 2 96 303 37 -399 -187 279 85 -104 192 258 -175 -58 -11 -63 217 137 -260
8055 -260 -306 346 128 -484 -39 390 -391 -592 -19 62 117 59 -219 -106 63 -164 -54 245 -4 -168 -24
8076 -24 109 19 306 -32 -559 -381 268 -210 -378 304 354 -415 -272 168 127 -5 -61 -221 2 186 -100 99
8098 99 146 -54 -177 82 -72 182 488 23 -376 33 453 -134 -393 511 286 -344 -175 164 202 -18 62
8119 62 -264 -9 8 -29 103 125 128 -69 31 63 -85 250 -4 -225 200 292 -274 105 652 -4 -345 47 279
8142 279 25 62 108 46 -107 -73 -122 102 153 -178 -116 6 -59 48 268 -48 -111 123 78 -338 57 477 -97
8165 -97 -161 -46 -16 -170 125 205 -201 93 -25 -101 33 34 -111 -57 -66 -181 297 185 -173 -206 181 -22 -426 259
$$ packed form
8010H7l12J93J44K30q5m80J48L79k76k20N32k8m72R5K05k1O2J21m89p7N77p4m04
8033a65O8K82K5n10L02R4K07k66m36K12M66j94j89K96O6m33J17M7n2K80q0l97
8055b60m6O52k18o12M45M29p81k01N73Q1N5n8k78J13J69k27J10K99k49j64J44
8076b4J33r0K87l38n27J78O49m78j68O82N0p69J43M40m1j32n6j60K23J84k86J99
8098I9M7k00j23K59j54K54L06m65l99M09M20n87k59R04k25o30J69L39L8k20Q0
8119F2l26K55J7l7J32K2Lj97J00L2j48L35k54k21M25R2n66L79N47o56l41L92K32
8142B79k54L7M6o2j53L4m9K24N1l31O2J22o5J07K20l16o3K34m5m16L95M20n74
8165i7o4J15L0j54K95Q0m06K94j18p6J34Jj45N4rj15M78j12l58l3L87k03m04O85
$$ plain form
8189 259 156 -341
$$ packed form
8189B59j03m97
8191c41
$$ Imaginary data points
##PAGE= N=2
##DATA TABLE= (X++(I..I)), XYDATA
$$ plain form
0 0 0 0 0 8 -8 0 -3 14 -16 8 -16 24 -32 32 -34 48 -56 64 -73 86 -103 119 -134 154 -176 202 -230 259 -291
29 -291 328 -369 413 -459 514 -572 636 -703 779 -863 957 -1056 1167 -1295 1437 -1593 1768
46 1768 -1973 2209 -2481 2803 -3190 3676 -4285 5079 -6166 7742 -10199 14478 -23367 48916
60 48916 -261475 -963429 221232 776657 -385116 -710297 445643 562075 -481688 -417284
70 -417284 513161 310501 -437913 -150019 390355 11927 -333902 73192 253452 -131937
80 -131937 -165332 118112 13150 -132930 111902 139965 -158804 -64323 206868 -40069 -246516
91 -246516 129192 237473 -238959 -235904 287740 171766 -328334 -67299 383837 -23414
101 -23414 -420558 96242 417558 -163621 -369092 247524 301341 -340203 -244266 397879
$$ packed form
0@%%%Qj6QlJ7l0K4k4M0n6O4o6Q2j04J20j37J59j89K22k53K88l30L78m32M89n50
29b91O19o97P82q72R73j086J208j339J482j642J820k013K223k462K732l030L361
46A768l741M182m690N284n993O866p961R364j1245J3908j7941K4677l7845P2283
60D8916l10391p01954J184661N55425j161773l25181J155940J16432j043763O4404
70d17284R30445k02660p48414K87894N40374l78428l45829M07094J80260l85389
80a31937l3395K83444j04962j46080K44832K8063k98769R4481K71191k46937k06447
91b46516L75708J08281m76432L055N23644j15974n00100K61035M51136m07251
101b3414l97144N16800L21316n81179k05471O16616N3817o41544R5937O42145
$$ plain form
111 397879 179499 -412601 -96858 388936 -4956 -346474 111129 305871 -182624 -254769
121 -254769 203791 159370 -222573 -57531 240180 -26356 -241820 89228 219757 -133636
131 -133636 -163033 186657 103131 -229407 -41076 263374 3189 -246588 45697 200618
141 200618 -108958 -158668 153334 118439 -165394 -71368 149022 16653 -115604 50128
151 50128 99563 -83986 -68132 104668 32448 -104969 19773 103355 -77806 -109598 113462
162 113462 97189 -130236 -49272 155367 -3650 -172248 60294 183812 -96770 -163371
172 -163371 130308 118413 -172113 -76790 203586 40818 -219468 -13369 211264 -20034
182 -20034 -187963 67778 176257 -103187 -163830 121564 138780 -126362 -98371 123109 43413
$$ packed form
111C97879k18380n92100L15743M85794l93892l41518M57603J94742m88495p2145
121b54769M58560m4421l81943J65042K97711k66536k15464L31048J30529l53393
131a33636k9397L49690q3526l32538J88331L04450k60185k49777K92285J54921
141B00618l09576m9710L12002l4895k83833R4026K20390j32369j32257J65732
151E0128M9435j83549J5854J72800p2220j37417J24742Q3582j81161l1792K23060
162A13462j6273k27425Q0964K04639j59017j68598K32542J23518k80582o6601
172a63371K93679j1895k90526R5323K80376j62768k60286K06099K24633k31298
182b0034j67929K55741J08479k79444o0643K85394J7216k65142K7991K21480p9696
$$ plain form
193 43413 -128164 -6550 118063 -15659 -87298 31446 43508 -47353 -4107 59096 -21886
204 -21886 -60312 30960 34916 -51424 -12733 71685 -4554 -86418 13505 82683 -31250 -68447
216 -68447 57675 48610 -91539 -37630 106295 16903 -108899 11009 96910 -52496 -92562
227 -92562 81703 86874 -92662 -72535 90723 43930 -93994 -18334 100039 3860 -100794
238 -100794 2120 87234 -12887 -66672 27205 41589 -47366 -25025 55053 11754 -40417
249 -40417 16625 26709 -42978 -14133 61467 5990 -64164 4436 54338 -23402 -48271 40493
261 40493 50975 -42596 -45589 43684 38769 -37263 -16497 42733 -1252 -48954 10562 42331
273 42331 -20245 -23843 35181 6232 -44296 15507 57083 -18426 -47696 27478 33905 -39724
$$ packed form
193D3413j71577J21614J24613j33722p1639J18744J2062r0861M3246O3203q0982
204b1886l8426R1272L956q6340L8691Q4418p6239q1864R9923O9178j13933l7197
216f8447J26122r065j40149N3909J43925q9392j25802J19908Q5901j49406m0066
227i2562J74265N171j79536K0127J63258m6793j37924P5660J18373r6179j04654
238a00794J02914Q5114j00121n3785R3877J4384q8955K2341Q0078m3299n2171
249d0417N7042J0084o9687K8845P5600n5477p0154O8600M9902p7740k4869Q8764
261D0493J0482r3571k993Q9273m915p6032K0766N9230m3985m7702N9516L1769
273D2331o2576l598N9024k8949n0528N9803M1576p5509k9270P5174O427p3629
$$ plain form
285 -39724 -26549 47095 24119 -46507 -23045 40219 18023 -30944 -3169 32711 -4891 -30380
297 -30380 11011 24030 -12138 -7797 15259 -9850 -18182 23766 21413 -23366 -9572 25506 -3728
310 -3728 -31789 6305 29214 -9460 -29831 3401 20996 -5155 -15447 10839 14966 -14378
322 -14378 -14259 15833 11231 -11543 575 9413 -14248 -11469 16813 5062 -20592 -2001 13105
335 13105 -11403 -17076 11146 15259 -8843 -13679 4189 11367 -1312 -8095 4967 9054 -10040
348 -10040 -14179 5668 7833 -7894 -4635 3402 -3673 -2250 7474 2356 -2614 3830 -1184 -9285
362 -9285 161 5999 -3188 -4703 47 -2305 -1178 3423 1233 1284 3562 -2765 -3116 6474 4415 -4131
378 -4131 909 1866 -6787 -2844 6032 1148 -2210 2276 -258 -1869 3023 1300 -1258 3836 -287
$$ packed form
285c9724J3175P3644k2976p0626K3462O3264k2196m8967K7775L5880l7602k5489
297c0380M1391J3019l6168M341K3056k5109q332M1948k353m4779J3794L5078k9234
310c728k8061L8094K2909l8674k0371L3232J7595k6151j0292K6286M127k9344
322a4378J19L0092m602k2774J2118Q838k3661K779K8282j1751k5654J8591J5106
335A3105k4508n673K8222M113k4102m836J7868P178j2679o783J3062M087j9094
348a0040m139J9847K165j5727L259Q037p075J423R724n118m970O444n014q101
362i285R446N838r187j515M750k352J127M601k190N1K278o327l51R590k059q546
378d131N040R57q653L943Q876m884l358M486k534j611M892j723k558N094m123
$$ plain form
393 -287 -6695 3617 9702 -1542 -2827 6895 1505 -5445 2396 5724 400 -78 -583 -2903 792
408 792 1742 -1782 1301 2724 -2697 1386 7184 -626 -907 8505 602 -10354 2648 10208 -5323
423 -5323 -8195 5193 2802 -7412 -3147 5507 4758 -1173 -3713 2540 6605 -1315 -4230 5249 2415
438 2415 -8327 -955 5423 -5591 -4111 7485 -3015 -11582 6115 10455 -9453 -7343 10738
451 10738 3543 -12664 -3432 11208 3721 -10224 -5032 9210 3515 -12310 -3328 12100 -1983
464 -1983 -14693 3767 9789 -8831 -5007 10127 -3282 -12533 7113 8311 -12322 -5696 12461
477 12461 -591 -15707 655 14474 -1597 -13804 2640 14568 -3766 -15042 7812 15304
489 15304 -12733 -15223 14150 7595 -18720 -1546 17994 -6758 -15915 13276 11832 -15306 -4136
$$ packed form
393b87o408J0312O085j1244j285R722n390o950P841L328n324m78n05k320L695
408G92R50l524L083J423n421M083N798p810k81R412p903j0956J3002P560j5531
423e323k872J3388k391j0214M265Q654p49n931k540O253M065p920k915R479k834
438B415j0742P372O378j1014J480J1596j0500q567J7697M340j9908K110J8081
451A0738p195j6207R232J4640p487j3945N192J4242n695j5825Q982J5428j4083
464a983j2710J8460O022j8620L824J5134j3409r251J9646J198k0633O626J8157
477A2461j3052j5116J6362J3819j6071j2207J6444J1928j8334j1276K2854P492
489A5304k8037k490K9373o555k6315J7174J9540k4752r157K9191j444k7138J1170
$$ plain form
502 -4136 17757 -911 -17727 5633 19222 -6007 -16836 9435 16779 -12431 -14857 18508 14266
515 14266 -21334 -9189 23442 1182 -23235 7779 20331 -14911 -13189 21761 7597 -19814
527 -19814 4371 21554 -10529 -18229 17180 17282 -18353 -11505 22351 7669 -26037 -2883 30271
540 30271 -1981 -30827 9964 29645 -18189 -23219 28215 16755 -32453 -5329 34680 -4167
552 -4167 -29556 15977 23995 -24606 -18293 28728 11431 -29836 -3100 31463 -4951 -32542 12483
565 12483 32925 -20293 -30161 26445 20820 -35980 -11866 39619 -922 -41142 12195 35406
577 35406 -22799 -24933 32114 13502 -38383 -4479 35429 -8586 -34140 16772 25856 -29111
589 -29111 -21481 36059 13534 -41397 -2888 44237 -12572 -46325 27133 42594 -43344 -36336
$$ packed form
502d136K1893j8668j6816K3360J3589k5229j0829K6271P344k9210k426L3365m242
515A4266l5600J2145L2631k2260k4417L1014J2552l5242J722L4950j4164k7411
527a9814K4185J7183l2083p700L5409J02l5635O848L3856j4682l3706K3154L3154
540C0271l2252k8846M0791J9681m7834n030N1434j1460m9208K7124M0009l8847
552d167k5389M5533Q018m8601O313M7021j7297m1267K6736L4563l6414k7591M5025
565A2483K0442n3218r868N6606n625n6800K4114N1485m0541m0220N3337K3211
577C5406n8205k134N7047j8612n1885L3904L9908m4015k5554N0912R084n4967
589b9111P630N7540k2525n4931L8509M7125n6809l3753P3458J5461q5938P008
$$ plain form
601 -36336 51118 18737 -60756 -1871 63767 -15735 -61269 30594 52933 -42383 -40599 51858
613 51858 25332 -61325 -14199 63227 80 -62325 14809 57031 -31454 -49120 47371 39202
625 39202 -55603 -22327 59241 1601 -58589 17486 51149 -33933 -39727 43513 23857 -45810
637 -45810 -2419 48066 -13841 -43709 29233 37076 -39553 -22805 51499 6950 -61471 9971
649 9971 67217 -26619 -62730 47438 54454 -64287 -36695 82024 20352 -87663 1922 85800
661 85800 -24243 -76162 46928 64428 -63634 -48975 74583 30893 -77832 -6615 81385
672 81385 -15396 -79958 36839 73981 -53922 -59535 69294 38841 -81603 -15919 88152
683 88152 -4754 -83501 25626 70891 -43412 -52573 57179 32760 -64833 -15928 61009 -4829
$$ packed form
601c6336Q7454l2381p9493N8885O5638p9502m5534R1863K2339r5316J784R2457
613E1858k6526q6657M7126P7426o3147o2405P7134M2222q8485j7666R6491q169
625C9202r4805L3276Q1568n7640o0190P6075L3663q5082n794Q3240j9656o9667
637d5810M3391N0485o1907k9868P2942P843p6629J6748P4304m4549o8421P1442
649I971N7246r3836l6111J10168P016j18741K7592J18719o1672j08015Q9585Q3878
661H5800j10043n1919J23090J7500j28062J4659J23558m3690j08725P1217Q8000
672H1385r6781o4562J16797L7142j27903n613J28829l0453j20444O5684J04071
683H8152r2906p8747J09127M5265j14303r161J09752k4419r7593M8905P6937o5838
$$ plain form
695 -4829 -54840 22924 43345 -41394 -33094 53203 18640 -58117 2713 60979 -25697 -59264
707 -59264 46350 50477 -64183 -36074 72667 11037 -80781 11942 80298 -34962 -75293
718 -75293 50968 59561 -66809 -41431 79618 21797 -89914 -5015 91159 -14928 -87592
729 -87592 35902 78359 -57979 -66898 74531 50758 -83706 -30166 83866 3482 -81800
740 -81800 18334 72448 -36648 -59620 45973 39495 -52044 -17608 56855 -85 -54775 17029
752 17029 49698 -29440 -36272 43567 21118 -55940 -6069 60684 -10911 -57503 29357 47781
764 47781 -46931 -32803 62395 19035 -66010 171 64815 -19051 -57329 38938 51058 -51487
776 -51487 -40033 60624 27477 -63286 -7803 69054 -8694 -69288 24854 64766 -38373 -52938
$$ packed form
695d829n0011P7764K0421q4739Q300Q6297l4563p6757O0830N8266q6676l3567
707e9264J05614M127j14660K8109J08741o1630r1818R2723O8356j15260m0331
718g5293J26261Q593j26370K5378J21049n7821j11711Q4899R6174j06087p2664
729h7592J23494M2457j36338q919J41429k3773j34464N3540J14032q0384q5282
740h1800J00134N4114j09096k2972J05593o478r1539L4436P4463n6940n4690P1804
752A7029L2669p9138o832P9839k2449p7058M9871O6753p1595m6592Q6860J8424
764D7781r4712J4128R5198m3360q5045O6181O4644q3866l8278R6267J2120j02545
776e1487J1454J00657l3147r0763N5483P6857p7748o0594R4142L9912j03139j4565
$$ plain form
788 -52938 50498 34584 -61917 -16739 67330 1417 -62671 16597 54603 -29304 -39659 44542
800 44542 31003 -49101 -18175 50291 5152 -47830 8947 43603 -23976 -41050 31289 30545
812 30545 -37989 -16187 41431 -928 -42376 16947 39400 -27051 -27811 36109 13171 -42463
824 -42463 1261 45092 -13019 -43557 20503 34936 -30145 -26800 37943 17122 -45380 -11095
836 -11095 44207 -1282 -43465 12725 36580 -28124 -31452 36984 21831 -41111 -7866 41167
848 41167 -7856 -39887 20262 35512 -28248 -29355 30230 17415 -34335 -8090 35762 -803
860 -803 -36833 6160 31793 -13336 -25152 21096 15451 -30045 -8053 32245 -1979 -29504 13464
873 13464 24225 -24467 -17412 32495 11954 -32867 -3335 31259 -5386 -28829 12981 26588
$$ packed form
788e2938J03436j5914r6501M5178Q4069o5913o4088P9268L8006q3907j0355Q4201
800D4542j3539q0104L0926O8466m5139n2982N6777L4656o7579j7074P2339p44
812C0545o8534K1802N7618m2359m1448N9323K2453o6451p60O3920k2938n5634
824d2463M3724M3831n8111l0538O4060J4433o5081L345O4743k0821o2502L4285
836a1095N5302m5489m2183N6190K3855o4704l328O8436j5153o2942L3245M9033
848D1167m9023l2031O0149J5250o3760j107N9585j2815n1750K6245M3852l6565
860h03l6030M2993K5633m5129j1816M6248n645m5496K1992M0298l4224k7525M2968
873A3464J0761m8692P055M9907k0541m4821K9532L4594l6645k3443M1810J3607
$$ plain form
885 26588 -17723 -23899 19305 17761 -20708 -8457 24685 1023 -25909 6788 24471 -12501
897 -12501 -16747 20012 8657 -25430 -250 28407 -4575 -23901 12026 19722 -16002 -13291 21109
910 21109 11114 -21095 -7219 19549 2543 -17378 4917 17433 -9716 -15349 14855 11886 -16645
923 -16645 -3476 19883 -4907 -21150 11262 19758 -14529 -14229 17675 8330 -18454 -2911 20160
936 20160 1311 -18287 138 14829 -3592 -12734 6804 10881 -11021 -9934 11955 5600 -12590
949 -12590 627 12228 -6978 -11572 10669 8864 -11840 -3959 11059 -1668 -11420 3478 9610
962 9610 -5593 -9380 3073 4631 -6024 -4227 6846 2848 -8530 -1417 9388 -727 -8208
975 -8208 5176 5860 -10721 -5836 10486 1374 -11467 767 8374 -4844 -7363 5607 5899 -4818
$$ packed form
885B6588m4311o176M3204j544l8469J2251L3142k3662k6932L2697J7683l6972
897a2501m246L6759j1355l4087K5180K8657l2982j9326L5927P696l5724K711L4400
910B1109r995l2209J3876K6768j7006j9921K2295J2516k7149n633L0204k969k8531
923a6645J3169K3359k4790j6243L2412Q496l4287L00L1904r345k6784J5543K3071
936B0160j8849j9598J8425J4691j8421r142J9538M077k1902J087K1889o355j8190
949a2590J3217J1601j9206m594K2241j805k0704P881J5018j2727r752J4898O132
962I610j5203l787J2453J558j0655J797J1073l998j1378P113J0805j0115p481
975h208J3384O84j6581M885J6322r112j2841J2234P607j3218k519J2970K92j0717
$$ plain form
989 -4818 -4905 2667 2692 -3549 -2505 3991 2287 -4771 -779 6279 195 -3881 3846 2761 -6825 -1843
1005 -1843 6005 -1488 -5731 2598 3104 -3716 -919 4736 1910 -867 -95 792 828 29 -934 1210 997
1022 997 -2603 -238 3669 278 -933 4073 1734 -3549 1029 4701 -1695 -2951 1864 -30 -2798
1037 -2798 -61 680 250 1737 -195 -1903 2726 3720 -1252 -200 3781 730 -1509 948 951 133 419
1054 419 -2269 -2232 1709 510 -3024 -29 2182 -989 -550 2438 286 542 2986 -1203 -3045 3094
1070 3094 2126 -4816 -1922 3603 -1015 -4495 365 2696 -149 -1768 -1065 1435 1420 -2201 -1733 2364
1086 2364 -404 -4104 723 2182 -3278 -883 3640 -2246 -4097 3747 2047 -5685 -1508 4448 -1130
1101 -1130 -4894 577 3233 -791 -3052 -317 2747 461 -3792 -29 3542 -1939 -3761 2754 1060
$$ packed form
989d818q7P572K5o241J044O496j704p058L992P058o084m076P727j085r586M982
1005a843P848p493m243Q329N06o820K797N655k826k777P72Q87L6p99r63K144k13
1022I97l600K365L907l391j211N006k339n283M578L672o396j256M815j894k768
1037b798K737P41m30J487j932j708M629R94m972J052L981l051k239K457Lq18K86
1054D19k688L7L941j199l534K995K211l171M39K988k152K56K444m189j842O139
1070C094r68o942K894N525m618l480M860K331k845j619P03K500j5l621M68M097
1086B364k768l700M827J459n460K395M523n886j851P844j700p732M177N956n578
1101a130l764N471K656m024k261K735L064k286m253L763L571n481j822O515j694
$$ plain form
1116 1060 -4867 783 4234 -4007 -3446 6328 1954 -6630 534 7136 -1284 -5790 1925 4990 -1885
1131 -1885 -5617 750 4864 -1723 -5492 2779 5564 -3314 -2945 6309 1893 -5055 2439 4708 -4938
1146 -4938 -2918 6350 -292 -7763 2077 7000 -3180 -4951 5581 6511 -3120 -3645 5588 5720 -4570
1161 -4570 -4080 6280 3086 -7785 -1242 7596 -2201 -7155 5037 5056 -7223 -950 9033 -855 -7091
1176 -7091 4891 7385 -5157 -4324 6919 3584 -6534 -3025 6052 1388 -7242 -859 7176 -1612
1190 -1612 -7221 4607 6284 -7121 -3117 9691 -1037 -11162 4475 9600 -9032 -8229 11089
1203 11089 5066 -12014 -2001 12474 356 -11547 1047 10029 -3508 -10693 3465 7832 -7120
1216 -7120 -7240 8266 3656 -9641 743 10427 -5266 -9116 8585 5037 -12738 -2449 12156
$$ packed form
1116A060n927N650L451q241N61R774m374q584P164O602q420m506P715L065o875
1131a885l732O367M114o587l769Q271K785q878L69R254m416o948P494K269r646
1146d938K020R268o642p471R840M923j0180j771J0532R30r631n25R233J32j0290
1161d570M90J0360l194j0871O543Q838r797m954J2192J9j2279O273R983r888o236
1176g091J1982K494j2542Q33J1243l335j0118L509R077m664q630O383Q035q788
1190a612n609J1828J677j3405M004J2808j0728j0125J5637N125j8632Q03J9318
1203A1089o023j7080J0013J4475j2118j1903J2594Q982j3537p185J4158M367j4952
1216g120j20J5506m610j3297J0384R684j5693l850J7701l548j7775J0289J4605
$$ plain form
1229 12156 -2966 -12734 5244 10505 -6857 -7615 8455 5533 -9143 -3705 8897 184 -10515
1242 -10515 1413 9085 -6193 -8805 9801 6738 -13106 -2436 15700 -1688 -15624 6891
1254 6891 14442 -10487 -11552 12713 7917 -12631 -4078 12204 1102 -11221 1205 9666 -2954
1267 -2954 -6989 6143 5462 -7565 -740 11596 -1770 -11443 7573 10788 -12833 -8511 16790
1280 16790 4659 -18579 90 19113 -3494 -15355 9004 14503 -10121 -10279 12123 7113 -12620
1293 -12620 -3447 13129 -599 -13220 5252 14121 -7963 -10738 13492 7704 -16660 -2875 17802
1306 17802 -2676 -18222 6618 14065 -10585 -9312 13882 5855 -13049 -98 13099 -2963
1318 -2963 -10500 7244 8262 -12092 -7747 13955 3931 -17811 -606 19250 -5195 -20175 10953
$$ packed form
1229A2156j5122r768J7978N261j7362p58J6070k922j4676N438J2602q713j0699
1242a0515J1928P672j5278k612J8606l063j9844J0670J8136j7388j3936K2515
1254F891P551k4929j065K4265m796k0548Q553J6282j1102j2323J2426Q461j2620
1267b954m035J3132o81j3027O825J2336j3366r673J9016L215k3621M322K5301
1280A6790j2131k3238J8669J9023k2607j1861K4359N499k4624j58K2402n010j9733
1293a2620R173J6576j3728j2621J8472Q869k2084k775K4230n788k4364J3785K0677
1306A7802k0478j5546K4840P447k4650J273K3194q027j8904J2951J3197j6062
1318b963p537J7744J018k0354M345K1702j0024k1742J7205J9856k4445j4980L1128
$$ plain form
1331 10953 19663 -15044 -15994 18223 10102 -20276 -5011 19255 -1524 -18523 3610 13177 -8150
1344 -8150 -9980 10836 6014 -13143 -2600 14628 -1090 -14684 5879 13613 -12437 -13136 15398
1357 15398 8595 -18965 -4697 18317 -2679 -17386 8074 14599 -11392 -9842 13192 4070 -13978
1370 -13978 1616 14076 -6206 -14373 9390 12640 -12752 -9802 16928 6643 -20678 -2996
1382 -2996 22965 -1163 -21984 6697 19194 -12226 -14601 16397 9827 -17386 -4217 15943
1394 15943 -1832 -13782 7916 12509 -10471 -9490 13574 7415 -14124 -2048 17035 -1030 -18247
1407 -18247 5433 18681 -8416 -15057 12685 10475 -15683 -5102 17041 229 -15345 4176
1419 4176 10971 -8881 -6516 13274 4667 -12602 269 14469 -1684 -12258 6867 12795 -10910
$$ packed form
1331A0953Q710l4707r50L4217q121l0378J5265K4266k0779j6999K2133R567k1327
1344h150j830K0816m822j9157J0543J7228j5718j3594K0563P734k6050o99K8534
1357A5398o803k7560J4268K3014k0996j4707K5460O525k5991J550K3034r122j8048
1370a3978J5594J2460k0282q167K3763L250k5392K950K6730j0285k7321J7682
1382b996K5961k4128k0821K8681J2497l1420k375L0998o570k7213J3169K0160
1394A5943j7775j1950K1698M593k2980R81K3064o159k1539J2076J9083j8065j7217
1407a8247K3680J3248k7097o641K7742k210k6158J0581K2143j6812j5574J9521
1419D176O795j9852K365J9790q607j7269J2871J4200j6153j0574J9125N928k3705
$$ plain form
1432 -10910 -13583 11496 9409 -14997 -6748 14998 342 -15360 5480 14916 -7226 -8805 11134
1445 11134 3676 -13055 1521 13642 -5551 -13617 7154 10823 -10285 -8387 13307 6947 -15647
1458 -15647 -6204 15410 2784 -16015 600 13368 -6665 -12715 9144 9207 -10372 -4155 10342
1471 10342 -2697 -10299 6608 8945 -8871 -6672 9588 3321 -10149 -525 11784 -1050 -12947
1484 -12947 583 10325 -4200 -10231 5331 6041 -9629 -4103 10375 1293 -7997 4579 6598
1497 6598 -9066 -3987 11918 1540 -12624 747 10547 -4513 -10523 7039 10744 -7299 -10111
1510 -10111 7317 8182 -7948 -5462 9397 2195 -10853 701 10334 -2329 -5915 7245 2888
1523 2888 -9426 1156 11043 -3166 -9391 5540 6421 -8650 -4818 10395 5131 -8814 -3312
$$ packed form
1432a0910k673K5079k087k4406Q249K1746j4656j5702K0840R436k2142j579J9939
1445A1134p458j6731J4576J2121j9193q066K0771L669k1108J898K1694o360k2594
1458a5647R443K1614j2626j8799J6615J2768k0033o050K1859O3j9579O217J4497
1471A0342j3039p602J6907K337j7816K199J6260o267j3470R624J2309j2834j1897
1484a2947J3530R742j4525o031J5562P10j5670N526J4478r082r290J2576K019
1497F598j5664N079J5905j0378j4164J3371R800j5060o010J7562L705j8043k812
1510a0111J7428Q65j6130K486J4859p202j3048J1554R633j2663l586J3160m357
1523B888j2314J0582R887j4209o225J4931Q81j5071L832J5213n264j3945N502
$$ plain form
1536 -3312 9143 2872 -7116 1259 8316 -3339 -8274 4611 5727 -6348 -1557 7990 -2819 -8940
1550 -8940 6148 9103 -6731 -5190 9016 2923 -9449 -649 10019 589 -8831 -728 6683 -674
1564 -674 -5279 2830 5040 -4264 -4011 4802 1819 -4123 2868 4360 -7287 -4553 8368 2105 -9458
1579 -9458 658 8747 -4833 -9171 5807 8681 -5093 -7030 4519 4414 -5383 -3291 6164 1988
1593 1988 -7399 -1910 5916 -989 -5373 4094 3314 -7945 -2913 8062 -155 -7970 2118 5658
1607 5658 -5681 -5962 5432 4617 -4694 -3269 3165 1653 -2977 -186 3919 56 -4347 256 2614
1622 2614 -1990 -1103 4074 -795 -6453 1641 5819 -3312 -4145 5646 2550 -6664 -1270 6458 1044
1637 1044 -4572 -353 2161 -1037 -2110 1617 2652 -717 -1959 1718 1815 -1210 1322 3933 -2303
$$ packed form
1536c312J2455o271r988Q375P057j1655m935J2885J116j2075M791R547j0809o121
1550h940J5088K955j5834J541J4206o093j2372Q800J0668r430r420Q103P411p357
1564f74m605Q109K210r304K53Q813k983n942O991J492j1647K734J2921o263j1563
1579i458J0116Q089j3580m338J4978K874j3774j937J1549j05r797K092R455m176
1593A988r387N489P826o905m384R467p80j1259N032J0975q217p815J0088L540
1607E658j1339k81J1394q15r311J425O434j512m630K791M105l863m403M603K358
1622B614m604Q87N177m869n658Q094M178r131q33R791l096r214N394P728n414
1637A044n616M219K514l198j073L727J035l369j242L677R7l025K532K611o236
$$ plain form
1652 -2303 -4442 3282 3396 -4628 -1723 5534 -122 -5707 1228 5326 -509 -2365 1212 1450 -652
1667 -652 -502 1106 1826 -405 -1251 683 1031 -248 1787 2459 -2073 -2248 3179 976 -3708 552 3445
1684 3445 -2496 -3792 2136 2347 -1110 -394 905 -121 115 611 491 681 435 -828 -782 206 40 874
1702 874 53 -2569 -896 1985 -825 -2596 1545 1769 -2616 -1533 2231 492 -753 595 -829 -1661
1718 -1661 706 570 -1837 313 1368 -1193 -1566 598 1440 646 -1361 -1829 924 825 -2802 -1610 2790
1735 2790 -316 -4156 -153 2941 -742 -841 2079 230 -1126 806 509 -857 309 241 -1448 -1343
1751 -1343 324 242 112 -590 -811 933 968 -1497 308 2465 -762 -2146 1770 1329 -1688 807 2018
1768 2018 -1590 -1246 2571 655 -1794 939 2018 -1133 -1723 803 1813 220 -1429 -291 2040
$$ packed form
1652b303k139P724J14q024K905P257n656n585O935M098n835j856L577K38k102
1667f52J50J608P20k231q46J934L48j279K035O72m532j75N427k203m684M260K893
1684C445n941j296N928K11l457P16J299j026K36M96j20J90k46j263M6R88j66Q34
1702H74q21k622J673K881k810j771M141K24m385J083L764j739j245J348j424q32
1718a661K367j36k407K150J055k561l73K164Q42p94k007m68K753r9l627J192M400
1735B790l106l840M003L094l683r9K920j849j356J932k97j366J166o8j689J05
1751a343J667q2j30p02k21J744L5k465J805K157l227j384L916m41l017K495J211
1768B018l608L44L817j916k449K733J079l151n90K526J010j593j649J138K331
$$ plain form
1783 2040 117 -2285 1359 3293 -1352 -2001 2584 1487 -1832 1035 1943 -1580 -941 1760 -103 -1411
1799 -1411 1680 1072 -1353 -532 1564 1274 -343 -959 847 1594 -1489 -1691 2279 1475 -3243 -695 2854
1816 2854 -785 -2457 2244 1900 -2637 -380 2644 -654 -1689 1270 946 -1830 -966 798 687 -921
1832 -921 -973 776 821 -1594 -518 2199 -23 -2954 762 2065 -2933 -1536 3156 -683 -4251 1092
1848 1092 3000 -2638 -2286 3072 1442 -2973 -971 2666 800 -2626 -1372 1785 197 -3561 -996
1863 -996 2985 -832 -3512 1305 2062 -2330 -525 2829 -778 -2519 1766 1165 -2886 -146 2324 -1297
1879 -1297 -2221 1350 1583 -1119 -634 1308 910 -1410 -926 1704 825 -2507 -455 2669 -633 -3055
1895 -3055 2358 2881 -2843 -956 3960 254 -3115 1800 3136 -2197 -1604 2442 740 -2106 208
$$ packed form
1783B040j923k402L644J934m645o49M585j097l319K867R08l523O39K701j863j308
1799a411L091o08k425Q21K096k90j617o16J806P47l083k02L970q04m718K548L549
1816B854l639j672M701l44m537K257L024l298j035K959l24k776Q64J764j11j608
1832i21n2J749M5k415J076K717k222k931L716J303m998J397M692l839l568N343
1848A092J908n638L52N358j630m415K002L637j866l426J254L157j588l758K565
1863i96L981l817k680M817P57m392J805L354l607j741M285o01m051K740K470l621
1879a297r24L571K33k702M85J942l98k320M84K630q79l332K052L124l302k422
1895c055N413N23n724J887M916l706l369M915J336n333N93M046j702k846K314
$$ plain form
1910 208 1728 -304 -1099 739 1823 -411 -854 1732 1477 -2305 -720 3384 -64 -3553 1833 3331
1926 3331 -2882 -2130 3883 1048 -3528 517 3480 -1228 -1988 1807 1010 -2007 -530 1572 241 -1493
1942 -1493 160 1599 -435 -1917 1418 2281 -2229 -1775 3405 401 -4351 713 3898 -2470 -3720
1957 -3720 2882 1671 -4028 -528 3491 -726 -3160 1465 2270 -1893 -1838 1919 1468 -2679 -1643 2491
1973 2491 676 -3848 -485 3624 -1438 -4017 2417 2973 -3668 -1253 3885 -711 -3621 1871 2391
1988 2391 -3212 -1688 3080 45 -3319 792 2725 -1522 -3008 1395 2903 -2089 -3030 2816 2308
2003 2308 -4484 -1972 4857 545 -5078 1443 4745 -2728 -3181 4141 2231 -4067 -442 3785 -1034
2018 -1034 -3032 1857 2557 -1905 -2160 2218 1725 -2075 -976 3344 741 -3784 598 3978 -1541 -3278
$$ packed form
1910B08J520k032p95J838J084k234m43K586k55l782J585M104l448l489N386J498
1926C331o213P52O013k835m576M045K963m708p60L795p97l017J477K102j331j734
1942a493J653J439k034j482L335Q63m510M54N180l004m752N064L185o368j250
1957c720O602j211n699L500M019m217k434M625Q05m163N5L757m51m147J036M134
1973B491j815m524L363M109n062k579O434N56o641K415N138m596k910N492N20
1988B391n603J524M768l035l364M111J933m247j486M403J508m992r41N846n08
2003B308o792K512O829m312n623O521L302p473m53P322j910o298L625M227m819
2018a034j998M889P00m462k55M378m93l800J099M320k603m525M382L380n519j737
$$ plain form
2034 -3278 3072 2366 -3717 -144 4469 -940 -3592 2669 2614 -3208 -1161 4328 584 -3894 129 3638
2050 3638 -710 -3461 1331 3806 -1859 -3768 3041 3815 -3534 -2233 4712 984 -4813 1029 4495
2065 4495 -2065 -3231 2673 1378 -3415 -62 3344 -656 -2984 795 2133 -1148 -1669 1905 1868 -2459
2081 -2459 -1973 2500 983 -3176 -337 2684 -1864 -3073 2637 1720 -3143 -131 3127 -1425 -3007
2096 -3007 2935 2537 -2958 -1851 2409 384 -3279 -714 2790 -190 -3688 -608 3115 -206 -3040
2111 -3040 1200 2277 -2781 -1723 2810 241 -2960 987 1920 -2709 -1123 3458 469 -3294 360
2126 360 2453 -1516 -2482 1551 2435 -1900 -3024 1345 2358 -1482 -1561 2389 1031 -3145 -353 2970
2142 2970 -645 -1883 2015 1152 -2808 563 3649 -302 -1956 1666 1273 -2076 -900 2130 866
$$ packed form
2034c278O350p06o083L573M613n409k652O261n5n822K047N489l744m478M023L509
2050C638m348k751M792K475n665j909O809P74p349J301O945l728n797N842L466
2065D495o560j166N904j295m793L353L406m000k328L779J338l281n21L574l7m327
2081b459M86M473j517m159K839L021m548j209N710r17m863L012L258m552j582
2096c007N942l98n495J107M260k025l663K565L504k980l498L080L723l321k834
2111c040M240J077n058J058M533k569l201L947R33m629J586M581k989l763L654
2126C60K093l969r66M033Q84m335j124M369J013l840p9L950j358m176K792L323
2142B970l615j238L898q63l960L371L086l951j654L622l93l349J176L030j264
$$ plain form
2157 866 -1790 -1483 977 866 -734 202 1869 9 -1178 1175 1562 -952 597 2484 -1322 -2162
2173 -2162 2597 2230 -2393 -728 2833 -192 -2986 549 2614 -457 -2176 -376 1111 57 -613
2188 -613 1110 1584 -873 -921 1574 250 -1488 1313 1499 -2904 -1699 3355 1106 -3261 281 3174
2204 3174 -1581 -3170 1564 2853 -1077 -2268 221 940 -588 -1184 973 1300 -1353 -1461 1072 135
2220 135 -949 1023 450 -2763 -692 2493 -258 -2419 1224 1509 -2295 -1562 1700 1198 -1298 -1165
2236 -1165 -362 4 -85 6 527 311 -397 -250 -25 -304 594 1675 -1382 -3082 1344 2354 -2293 -1683
2254 -1683 3064 670 -3792 -571 3240 771 -1942 -13 1109 -384 -1056 418 1241 -422 -1326 149
2270 149 876 -625 638 2198 -910 -2601 1685 2567 -1910 -800 2828 465 -3160 -217 2916 878
$$ packed form
2157H66k656L07K460j11j600R36J667j860j187K353L87k514J549J887l806q40
2173b162M759l67m623J665L561l025k794L535K065l071j719J800J487j054o70
2188f13J723M74k457m8K495j324j738K801J86m403J205N054k249m367L542K893
2204C174m755j589M734J289l930j191K489P19j528n96K157L27k653j08K533r37
2220A35j084J972n73l213K071L185k751k161L643K85l804P33L262n02k496J33
2236a165Q03L66q9R1N21k16p08J47K25k79Q98J081l057j700M426J010m647O10
2254a683M747k394m462L221L811k469k713J929J122j493o72J474Q23j663r04J475
2270A49P27j501J263J560l108j691M286Q82m477J110L628k363l625K943L133k038
$$ plain form
2286 878 -1117 -399 405 320 -177 -346 1121 986 -739 -851 361 764 1127 596 -1404 -412 1943 243
2304 243 -1752 1412 2561 -1716 -2310 1597 1761 -931 -322 375 -508 -475 260 386 522 299 -592 -651 -250
2323 -250 562 1501 414 -1863 -181 1905 -541 -1777 1583 1782 -2464 -2121 1327 1143 -768 -365 256
2340 256 -340 -167 -237 253 940 246 -1534 -1208 -51 143 353 -620 -1166 -9 868 -918 -600 2198 640
2359 640 -2343 -789 1239 10 -505 31 -836 -751 361 -350 -425 1105 685 -1439 -1259 663 486 -26
2377 -26 -904 -680 360 104 -1112 471 2205 -177 -2145 323 1002 -498 93 481 -794 -414 762
2394 762 -67 -80 1426 788 -1047 -451 684 640 136 -828 -738 614 -211 -1330 931 2067 -417 -1397
2412 -1397 1019 1526 41 638 851 -315 100 598 -151 51 1318 133 -1553 -329 557 354 -489
$$ packed form
2286H78j995P18Q04q5m97j69J467j35j725j12J212M03L63n31k000R92K355j700
2304B43j995L164J149m277n94L907J64k692O09O97q83L3P35J26J36k23q91n9M01
2323b50Q12R39j087k277J682K086k446j236L360J99m246L43L448j84j911M03O21
2340B56n96J73p0M90O87o94j780L26J157J94K10r73n46J157Q77j786L18K798j558
2359F40k983J554K028j229n15N36q67Q5J112p11p5J530m20k124J80J922j77n12
2377b6q78K24J040k56j216J583J734k382j968K468O79j500N91L88j275L80J176
2394G62q29j3J506o38j835N96J135m4n04r64R0J352q25j119K261J136k484r80
2412a397K416N07j485N97K13j166M15M98p49K02J267j185j686J224Q86k03q43
$$ plain form
2429 -489 -483 107 807 -613 -748 1777 1769 -955 -486 1587 129 -859 947 320 -1719 -272 954 -981
2447 -981 -560 1438 521 -1298 -545 1190 931 -604 -983 500 471 -1606 -1471 1854 903 -1838 -389
2464 -389 1800 -270 -871 1208 275 -1299 144 576 -1591 -204 1484 -441 -1928 -118 1308 -205
2480 -205 -1258 -104 856 -319 -1783 85 1867 -349 -1750 832 1118 -1259 -251 1537 -598 -1490
2496 -1490 966 144 -1905 134 1599 -905 -1807 570 1432 -560 -960 567 1352 -330 -1622 723
2512 723 1895 -894 -1440 1038 829 -1411 -262 1082 -628 -592 963 -124 -930 1444 1325 -1103 -338
2529 -338 1638 527 -841 -122 615 394 -619 -797 545 843 -614 -322 1146 298 -389 745 875
2546 875 -550 622 1345 -786 -707 1762 543 -1722 57 1317 -261 -1147 387 833 151 -448 -48
$$ packed form
2429d89ON90P00j420j35K525qk724M69K073j458r88J806o27k039J447J226j935
2447i81M21J998r17j819P53J735k59j535l79J483k9k077J35L325r51k741J449
2464c89K189k070o01K079r33j574J443M32k167J387J688j925j487J810J426j513
2480b05j053J154R60j175j464J868J782k216j401K582K86k377J008J788k135q92
2496a490K456q22k049K039J465k504r02K377Q62j992m00J527P85j682j292K345
2512G23J172k789n46K478k09k240J149J344j710L6J555j087q06K374j19k428P65
2529c38J976j111j368P19P37k21j013j78J342K98j457K92J468q48o87J134J30
2546H75j425J172P23k131P9K469j219k265J779J260j578q86J534M46o82n99M00
$$ plain form
2563 -48 1092 631 -610 -209 844 -146 -892 291 136 -663 347 522 -1008 258 1583 -393 -1157
2580 -1157 836 685 -1133 -442 495 -138 -584 -327 -359 471 62 -496 188 600 -384 -344 272 -224 -778 497
2600 497 -94 -1048 168 883 -905 -563 972 -16 -1094 196 163 -781 -80 139 -622 73 403 -288 -359
2619 -359 205 243 -140 -199 -471 317 410 -904 -705 1098 303 -1629 191 1458 -528 -1083 758 456 -907
2638 -907 87 417 -217 -96 351 110 84 402 -99 39 -79 -489 89 412 -789 -376 1034 354 -788
2657 -788 699 1284 -768 -16 869 -216 -515 886 123 -1088 335 893 -322 -232 1016 710 -315
2674 -315 -361 234 741 -349 -1347 243 1379 -692 -915 1681 1253 -1201 73 1312 -410 -771 470
2691 470 147 -752 188 293 -640 47 471 289 93 79 250 235 -134 -512 296 304 -1013 -499 958 -112
$$ packed form
2563d8J140m61j241M01J053r90p46J183j55p99J010J75j530J266J325j976p64
2580a157J993j51j818O91R37o33m46K57l2Q30m09n58O84M12r84M0O16m96n54J275
2600D97n91r54J216P15j788L42J535r88j078J290l3r44P01K19p61O95L30o91p1
2619c59N64L8l83n9k72P88R3j314J99J803p95j932J820J267j986n55J841l02j363
2638i07R94L30o34J21M47k41k6L18n01J38j18m10N78L23j201M13J410o80j142
2657g88J487N85k052P52Q85j085k99J401p63j211J423N58j215R0J248l06j025
2674c15m6N95N07j090r98J590J136k071k23K596m28k454J274J239j722l61J241
2691D70l23q99R40J05r33O87M24j82j96j4J71j5l69l78Q08Qj317N14J457j070
$$ plain form
2711 -112 -1250 711 676 -1045 41 1120 -543 -969 815 343 -1171 -227 602 -26 -805 -473 334 111
2729 111 -720 -783 738 436 -1249 -168 1307 -285 -1071 651 556 -924 21 520 -807 -199 865 -585
2747 -585 -1035 643 523 -901 -397 514 332 -234 -754 106 872 -294 -1112 561 902 -1274 -710 1205
2765 1205 115 -1216 520 707 -564 69 1054 -375 -124 973 236 -574 213 437 -168 -178 -141 20
2783 20 283 -169 -509 512 130 -616 437 679 -591 106 1439 -40 -1011 1174 1448 -1156 -515 1294
2801 1294 -104 -1443 -88 1047 155 -481 -389 601 892 -209 -256 1006 692 -903 196 721 -419
2818 -419 -114 465 -625 -239 1127 273 -1026 662 1175 -595 -786 636 373 -543 -319 45 -25 -39 -321
2837 -321 -30 562 -294 -374 305 244 -526 469 494 -1077 -277 1289 -152 -1651 694 867 -1287 -935 707
$$ packed form
2711a12j138J961l5j721J086J079j663m26J784m72j514R44Q29o28p79L32Q07k23
2729A11q31o3J521l02j685J081J475j592p86J722r5j480R45M99j327O08J064j450
2747e85m50J678j20j424N04R11j82n66n20Q60P66j166q18J673L41k176N64J915
2765A205j090j331J736J87j271O33R85j429K51J097p37q10P87K24o05j0L7J61
2783B0K63m52l40J021l82p46J053K42j270O97J333j479r71K185K74k604O41J809
2801A294j398j339J355J135q92o36R2R90K91j101m7J262l14j595J099N25j140
2818d19L05N79j090L86J366q54j299J688N13j770j91J422k63r16K24L64p0j4k82
2837c21K91N92q56q0O79o1p70R95K5j571Q00J566j441j499K345J73k154L52J642
$$ plain form
2856 707 74 -933 -603 -44 -111 -101 -403 145 669 -67 -276 228 178 -369 430 -210 -1216 205 1270 -819
2876 -819 -1153 1026 603 -1479 -591 1031 46 -696 -453 158 168 -36 -417 416 1055 -267 -510 517 229
2895 229 -218 292 -431 -1016 579 632 -823 -316 1217 316 -1156 450 886 -44 -36 144 -95 19 -41 -421
2915 -421 -126 307 33 -287 489 502 398 501 -611 -519 1087 138 -1454 138 1340 -582 -1380 697
2933 697 1104 -299 -388 486 563 379 -392 217 807 204 -904 -167 596 -387 -456 472 -248 -476 579 271
2953 271 -573 436 986 -533 -387 535 156 -366 -267 -248 -211 196 -129 -681 533 423 -590 -370 345 -146
2973 -146 -51 -26 -542 -297 522 -532 -651 590 514 -988 -438 784 209 -416 28 -116 -139 74 -442 -355
2993 -355 448 -39 -762 -97 342 -368 65 228 -378 -139 889 -280 -672 672 297 -930 -417 434 -10
$$ packed form
2856G07o33j007L30N59o7J0l02N48N24p36k09N04n0n47P99o40j006J421J065k089
2876h19l34K179m23k082Q88J622r85p42K43O11J0k04l81Q33O39j322k43J027k88
2895B29m47N10p23n85J595N3j455N07J533r01j472J606M36r30QJ80k39J14o0l80
2915d21K95M33k74l20P76J3j04J03j112R2J606r49j592J592J202j922p98K077
2933F97M07j403q9Q74P7j84p71O09N90o03j108P37P63r83o9R28p20k28J055l08
2953B71q44J009N50j519J46R22l79n22R9J9L7M07l25n52J214j10j013K20P15m91
2973a46R5K5n16K45Q19j054j19J241p6j502N50J222n75o25M44j44k3K13n16Q7
2993c55Q03m87p23O65M39p10M33J63o06K39J028j169l92J344l75j227N13Q51m44
$$ plain form
3012 -10 -262 -44 20 173 204 -423 4 1005 -114 -605 283 292 -712 -51 130 -310 -242 223 -164 -205 634
3033 634 295 -451 82 393 23 278 5 -358 444 770 -471 52 944 50 -625 243 349 -71 331 75
3053 75 -439 135 321 -643 -315 946 109 -618 279 575 -61 45 52 -88 601 317 -625 291 944 -330
3073 -330 -726 534 191 -456 -96 157 -217 349 76 -640 367 617 -302 -444 438 -11 -229 48 -87
3092 -87 -330 421 219 -588 368 765 -505 -556 380 112 -363 -337 -354 -320 317 -274 -723 491 536 -366 -226
3113 -226 511 -66 -170 306 -74 -140 497 -61 -776 136 465 -792 -461 633 78 -277 -98 -51 84 399
3133 399 -341 -300 557 202 -801 164 532 -247 4 238 -293 -237 681 -63 -467 533 433 -715 -451 672
3153 672 -100 -398 -233 212 367 101 -331 -11 758 -88 -449 749 579 -496 208 261 -405 1 470 -282
$$ packed form
3012a0k52K18O4J53L1o27M27J001j119m91Q88Rj004O61J81m40O8M65l87m1Q39
3033F34l39p46N33L11l70K55k73l63Q02L26j241N23Q92q94o75Q68J06m20M02k56
3053G5n14N74J86r64L28J261q37p27Q97K96o36J06Pj40O89k84r42R16O53j274
3073c30l96J260l43o47L60K53l74N66k73p16J007K50r19j42Q82m49k18K77j35
3092h7k43P51k02q07R56L97j270n1R36k68m75K6j7L4O37n91m49J214M5r02J40
3113b26P37n77j04M76l80o6O37n58p15R12L29j257L31J094n55l55J79M7J35L15
3133C99p40M1Q57l55j003R65L68p79K51K34n31N6R18p44m04J000j00j148K64J123
3153F72p72k98J65M45J55k66m32L20P69q46l61J198j70j075P04N3o66M06M69p52
$$ plain form
3173 -282 -432 573 336 -528 54 751 -26 101 147 91 103 221 -292 162 315 -189 -281 464 458 -335 274 140
3195 140 -278 22 424 -535 -331 479 -324 -704 417 603 -454 -24 344 28 78 389 -76 336 178 -497
3215 -497 -130 447 -215 -577 140 -37 -476 78 303 -293 -64 316 -281 -535 362 -157 -399 -113 -269 -584
3235 -584 136 353 -630 -5 443 -269 -237 287 12 -322 44 -217 -425 353 73 -464 92 325 -533 -238
3255 -238 569 14 -87 154 -127 -281 207 -60 -391 259 299 -681 48 500 -241 -322 199 -64 -184 358 284
3276 284 -213 269 160 -414 239 126 -390 -113 446 -259 -243 655 229 -428 418 574 -285 -64 243 146 28
3297 28 127 -413 279 609 -201 -327 736 256 -424 89 489 -242 -55 250 5 233 312 -53 -174 702 -11
3318 -11 -484 244 116 -126 3 233 -185 -70 227 -109 -123 510 -277 -377 135 116 -455 70 344 -278 100
$$ packed form
3173b82j50J005k37q64N82O97p77J27M6n6J2J18n13M54J53n04r2P45op93O09j34
3195A40m18L00M02r59K04Q10q03l80J121J86j057M30L68l16N0L11m65M12j58o75
3215d97L67N77o62l62P17j77m39N54K25n96K29L80n97k54Q97n19k42K86j56l15
3235e84P20K17r83O25M48p12L2N24k75l34L66k61k08P78k80n37N56K33q58K95
3255b38Q07n55j01K41k81j54M88k67l31O50M0r80P29M52p41q1N21k63j20N42p4
3276B84m97M82j09n74O53j13n16K77N59p05J6Q98m26o57Q46J56q59K21L07r7j18
3297B8R9n40O92L30q10j26J063m80o80N13M00p31J87L05k45K28P9l65j21Q76p13
3318a1m73P28j28k42J29K30m18J15K97l36j4O33p87j00N12j9n71N25K74o22L78
$$ plain form
3339 100 466 -211 -345 506 -32 -586 -71 203 -307 -315 -44 -284 201 58 -501 276 569 -424 -405 315 72
3360 72 -653 -214 82 -371 139 -85 -452 142 347 -231 -427 214 -38 -627 -263 161 -256 56 -75 -514
3380 -514 241 252 -480 -362 448 -200 -519 154 216 -93 190 107 -438 102 380 -367 -139 321 -290 -414 231
3401 231 304 27 242 -135 -254 279 337 -217 168 345 -538 -321 408 -26 -201 414 120 -427 277 582 -92
3422 -92 68 485 -121 -208 205 163 321 304 -152 -286 174 482 -398 304 524 -146 -193 245 94 101 319 -325
3444 -325 -213 513 -92 -449 579 649 -478 -437 506 342 -31 -44 -165 -290 106 21 -78 456 122 -464 32
3465 32 198 -38 286 270 -470 -281 409 -5 -512 284 299 -559 -485 263 38 18 247 -284 -387 150 -94 -167
3487 -167 501 85 -773 -627 161 344 366 110 -431 -119 144 -335 -160 506 -42 -981 -352 412 -15 -152
$$ packed form
3339A00L66o77j34Q51n38n54N15K74n10qK71k40M85j43n59P77K93r93J9P20k43
3360G2p25M39K96m53N10k24l67N94K05n78j96O41k52n89L64M24m17L12j31m39
3380e14P55J1p32J18Q10o48l19O73O2l09K83q3n45N40K78p47K28M60o11j24O45
3401B31P3k77K15l77j19N33N8n54L85J77q83K17P29m34j75O15k94n47P04L05o74
3422i2J60M17o06q7M13m2J58j7m56j34M60L08q80P02K20o70m7M38j51PK18o44
3444c25J12P26o05l57J028P0j127M1R43j64l73j3j21j25L96q5r9N34l34n86M96
3465C2J66k36L24j6p40J89O90m14n07P96J5q58P4P48k25k0K29n31j03N37k44p3
3487a67O68m16q58J46P88J83K2k56n41L12K63m79J75O66n48r39O29P64m27j37
$$ plain form
3507 -152 210 -432 -347 -20 -1 64 393 -48 -482 -134 479 170 334 48 -278 24 353 -438 -66 760 -249
3528 -249 -966 -116 373 89 229 115 -271 19 200 -18 513 795 -180 -747 11 142 207 537 114 -529
3548 -529 105 263 -370 223 771 -277 -760 -114 443 61 468 181 -217 -3 48 -3 445 463 -361 -690 -124
3569 -124 91 444 441 -65 -355 64 25 -485 601 869 -593 -708 84 324 -158 318 150 89 -125 -174 -41
3590 -41 582 560 -578 -454 190 -115 -94 444 -237 -579 -1 -83 -261 522 514 -567 -914 -116 193 121 255 -71
3612 -71 -161 109 -58 -69 626 395 -569 -608 1 -67 -92 483 -270 -423 -87 -192 -238 812 500 -598 -346 181
3634 181 -57 15 267 -294 -395 -38 -265 -82 587 342 -590 -263 23 -121 204 378 -121 -269 54 -380
3654 -380 13 842 352 -487 -620 90 -62 320 693 -158 -280 24 -276 198 1117 314 -595 -82 150 -157
$$ packed form
3507a52L62o42Q5L27J9O5L29m41m34L48O13l09J64k86l26L02L29p91L72Q26j009
3528b49p17Q50M89k84J40j14l86K90J81k18N31K82r75n67P58J31O5L30m23o43
3548e29O34J58o33N93N48j048m83O46N57l82M07k87l98K14N1n1M48J8q24l29N66
3569a24K15L53ln06k90M19l9n10J086K68j462j15P92K40m82M76j68o1k14m9J33
3590d1O23k2j138J24O44l05K1N38o81l42N78q2j78P83qj081l47P98L09p2J34l26
3612g1r0K70j67j1O95k31r64l9O09o8k5N75p53j53L36j05m6J050l12j098K52N27
3634A81k38P2K52n61j01L57k27J83O69k45r32L27K86j44L25J74m99j48L23m34
3654c80L93Q29m90q39j33P10j52L82L73q51j22L04l00M74R19q03r09N13K32l07
$$ plain form
3674 -157 240 429 26 -154 74 -214 109 666 435 -384 -69 57 153 498 275 -100 -163 74 -760 279
3694 279 943 200 -636 -39 145 -301 204 419 -167 -79 -119 -504 88 667 207 -605 92 373 236 157 130
3715 130 320 175 -584 -657 502 598 -471 -444 284 -5 -419 348 414 -148 -133 211 -430 97 521 -241 -547
3736 -547 -493 -161 76 217 -28 -72 217 -280 -664 382 566 -577 -478 152 -192 -362 124 32 -147 -116 -398
3757 -398 -475 318 513 -490 -335 294 -38 -360 141 89 117 158 -399 -224 475 382 -558 -255 248 -290 -116
3778 -116 440 219 109 281 -18 -54 909 495 -238 -122 248 -176 -483 144 195 136 -139 -396 -24 608 96
3799 96 -549 171 473 -656 -121 629 373 -239 104 247 140 171 362 36 210 -38 -453 71 499 -109
3819 -109 -246 350 17 -163 695 240 -358 38 128 -240 -114 24 -34 133 -102 -301 136 748 128 -232 601
$$ packed form
3674a57L97J89m03j80K28k88L23N57k31q19L15J26R6L45k23l75o3K37q34J039
3694B79O64p43q36N97J84m46N05K15n86Q8m0l85N92N79m60q12O97K81j37p9k7
3715A30J90j45p59p3J159R6j069K7P28k89m14P67O6n62J5L44o41N27M24p62l06
3736e47N4L32K37J41k45m4K89m97l84J046J84j143R9O30l44j70M86r2j79L1k82
3757c98p7P93J95j003J55O29l32l22N01n2K8M1n57J75O99r3r40L03N03n38J74
3778a16N56k21j10J72k99l6R63m14p33J16L70m24l07O27N1n9k75k57L72O32n12
3799I6o45P20L02j129N35P50k56o12L43J43j07L1J91l26J74k48m15N24M28o08
3819a09j37N96l33j80Q58m55n98L96R0l68J26J38n8J67k35j99M37O12o20l60Q33
$$ plain form
3840 601 191 -547 3 489 -191 -434 -220 -63 -37 26 -341 -2 171 -169 -518 217 406 -218 -54 400 -169
3861 -169 -171 236 -46 -179 -48 -140 -336 -83 -63 -470 60 367 -490 -135 399 -103 -301 183 110 -249 -89 112
3883 112 9 4 -46 -273 -18 87 -336 139 229 -17 -458 385 273 -352 95 156 -248 -264 173 -111 -23 -55 -307
3906 -307 -41 110 -13 -102 351 42 -272 -139 227 -62 167 466 -166 -119 304 -184 -62 263 110 -222 204
3927 204 300 -143 100 234 -7 137 162 33 50 212 -5 -178 170 173 -186 264 388 -262 61 223 -28 -127
3949 -127 352 -178 -197 377 226 -236 189 134 -444 58 295 -335 65 242 -111 -309 172 257 -139 78 110
3970 110 -208 -18 172 -313 99 436 -209 -301 167 155 -352 118 65 -572 -121 194 -158 92 224 -149 -114
3991 -114 409 -137 -123 279 170 -498 119 133 -390 2 75 -296 -165 222 -58 -200 219 47 -287 222 14
$$ packed form
3840F01m10p38N50M86o80k43K14J57K6O3l67L39J73l40l49P35J89o24J64M54n69
3861a69kM07k82j33J31r2j96K53K0m07N30L07q57L55N34n02j98M84p3l59J60K01
3883A12j03nn0k27K55J05m23M75R0k46m41Q43j12o25M47O1m04j6M37k84Q8l2k52
3906c07K66J51j23q9M53l09l14J33L66k89K29K99o32M7M23m88J22L25j53l32M26
3927B04R6m43K43J34k41J44K5j29J7J62k17j73L48Ll59M50J24o50L23J62k51r9
3949a27M79n30j9N74j51m62M25n5n78N02K37o30M00J77l53j98M81Q5l96K17L2
3970A10l18J90J90m85M12L37o45r2M68j2n07M70n3o37M51L15l52K50J32l73L5
3991a14N23n46J4M02j09o68O17J4n23L92P3l71J31L87k80j42M19j72l34N09k08
$$ plain form
4012 14 -175 73 73 -295 -39 261 -200 -122 216 60 -346 -13 -39 -300 -94 291 -322 -72 189 -59 101 305
4034 305 -130 -433 280 68 -255 95 77 -189 37 184 -29 -43 273 -272 -272 215 -126 -219 378 288 -302 219
4056 219 390 38 58 578 46 -378 30 83 152 37 102 -170 253 193 -282 186 487 -417 -295 329 59 -349
4078 -349 253 33 -344 31 246 13 271 120 -160 -50 175 -135 -53 443 -73 -558 -75 177 -138 32
4098 32 151 -252 -76 213 -54 0 382 48 -298 226 95 -297 136 213 -365 -337 -136 7 -124 -8 -50 -279
4120 -279 44 -148 -186 306 245 -355 -10 468 -273 73 211 -252 -370 -132 53 -225 182 -18 -313 -171 -33
4141 -33 -214 160 235 -295 -492 84 -73 -98 114 19 -283 59 -129 -405 290 306 -469 -481 266 -104 -473 518
4163 518 349 -288 -33 356 22 130 102 -324 -66 92 -44 127 664 -149 -276 112 -117 -134 380 516 -242
$$ packed form
4012A4j89K48%l68K56L00m61P8L38j56m06L33k6k61K06L85o13K50K61k48J60K04
4034C05m35l03P13k12l23L50j8k66K26J47k13j4L16n45%M87l41r3N97r0n90N21
4056B19J71l52K0N20n32m24M08N3O9j15O5k72M23o0m75M68L01r04J22O24k70m08
4078c49O02k20l77L75K15k33K58j51k80J10K25l10Q2M96n16m85M83K52l15J70
4098C2J19m03J76K89k67N4L82l34l46N24j31l92M33P7n78K8K01J43j31J16m2k29
4120b79L23j92l8M92o1o00L45M78p41L46J38m63j18K38J85k78M07k00k95J42J38
4141c3j81L74P5n30j97N76j57k5K12r5l02L42j88k76O95J6p75j2P47l70l69R91
4163E18j69o37K55L89l34J08k8m26K58J58j36J71N37q13j27L88k29j7N14J36p58
$$ plain form
4184 -242 -47 321 -173 -75 496 110 -424 -95 1 -205 164 179 -12 7 246 -182 93 458 -74 -312 161
4205 161 -186 -229 300 123 -377 -99 -87 -129 206 730 -59 -194 297 -45 -12 347 424 -263 -199 63 -217 6
4227 6 132 -62 -209 -105 -446 95 654 -80 -282 36 118 -570 73 560 -155 -425 -209 -5 -109 307 -118
4248 -118 -456 -132 -314 -326 272 235 -230 -355 -131 -279 130 369 46 -302 166 -195 -381 705 380 -600
4268 -600 -322 35 -453 -317 355 28 -285 -259 -47 -261 281 283 -215 -180 -194 -56 108 361 -243 -2 175 -293
4290 -293 -328 769 472 -417 12 273 -302 146 441 -210 -204 50 -300 -230 577 338 -190 -231 -19 162 141 195
4312 195 -24 157 126 -534 -82 794 295 -364 22 231 -210 304 406 77 144 143 -256 -186 642 406 -289 -328
4334 -328 -16 -71 170 49 148 121 -35 -468 311 882 6 -316 87 7 -358 98 384 -127 27 -123 -552
$$ packed form
4184b42J95L68m94R8N71l86n34L29R6k06L69J5j91J9K39m28K75L65n32k38M73
4205A61l47m3N29j77n00K78J2m2L35N24p89j35M91l42L3L59P7o87O4K62k80K23
4227FJ26j94j47J04l41N41N59p34k02L18Q2o88O43M87p15k70K16K04j04M16m25
4248a18l38L24j82j2N98l7m65j25K24j48M09K39l23l48M68l61j86J086l25r80
4268f00K78L57m88J36O72l27l13K6K12k14N42Km98L5j4J38J64K53o04K41J77m68
4290b93l5J097k97q89M29K61n75M48K95o51OK54l50P0Q07k39n28m1K12J81k1N4
4312A95k19J81l1o60M52Q76m99o59L86K09m41N14J02l29O7jl99P0Q28k36o95l9
4334c28L12n5K41j21R9k7j56m33P79N71q76l22M03q0l65M56K86n11J54j50m29
$$ plain form
4355 -552 -140 523 138 -263 17 -222 -174 184 215 -93 -81 -231 -716 222 578 -27 -408 104 -288 -172 166
4376 166 43 -133 188 -141 -824 318 588 -144 -759 -8 55 -342 -95 367 222 59 -389 -368 537 467 -569
4397 -569 -79 402 -500 -536 256 382 -184 -60 -175 -184 258 205 5 -75 -122 -360 57 118 56 -213 77 -265 -268
4420 -268 455 561 -264 -308 -26 -186 -32 169 99 19 74 -491 -354 522 414 -364 82 425 -152 -125 221 142
4442 142 11 26 -334 -205 474 178 -290 97 170 -349 -120 356 214 194 51 -503 -285 356 194 -346 43
4463 43 296 -280 -113 129 206 123 -253 -739 -116 660 -52 -235 290 101 -510 -159 572 272 -79 26 -349
4484 -349 -109 6 59 41 233 -249 -225 293 419 -178 60 253 -442 -386 299 134 -373 -35 47 -82 28 -130
4506 -130 -92 512 38 -698 -17 675 -85 -402 251 159 -547 -128 -62 -23 149 -215 -520 -29 182 -314 -255 288
$$ packed form
4355e52M12O63l85m01K80k39M8L58L1l08J2j50m85R38L56o05l81N12l92J16L38
4376A66j23j76L21l29o83J142K70p32o15P51O3l97K47M62j45j63m48K1R05p0j036
4397e69M90M81r02l6P92J26n66J24j15rM42n3k00q0m7k38M17O1o2k69K90l42l
4420b68P23J06q25m4K82j60J54K01p0q0N5n65J37Q76j08p78M46L43n77K7L46p9
4442A42j31J5l60J29O79k96m68L87P3n19K29M76j42k0j43n54K18O41j62n40L89
4463D3K53n76J67K42P7q3l76m86O23P76p12j83N25j89o11L51P31l00l51J05l75
4484c49K40J15N3j8J92m82K4N18J26n97K38J93o95N6O85j65n07L38Q2j29J10j58
4506a30L8O04m74p36O81O92p60l17O53r2p06M19O6L9J72l64l05M91K11m96N9N43
$$ plain form
4528 288 -155 -450 321 270 41 201 103 -439 -77 207 -202 -56 344 -322 -402 174 118 -191 328 -59 -585
4549 -585 36 622 -139 -225 274 58 -285 -10 52 310 385 -206 -448 324 437 -408 62 378 -155 -261 223
4570 223 508 41 255 -178 -318 238 48 -138 162 320 -81 -252 482 256 161 372 -123 -306 194 199 -321
4591 -321 112 245 -247 -173 173 -2 38 445 -213 -273 191 181 -411 19 318 -56 -262 24 212 63 50 -471
4613 -471 -194 479 -98 -365 265 253 -339 -244 263 -210 -15 160 -246 -77 233 129 -114 25 -132 -324 78
4634 78 218 -390 66 1 -446 -137 389 -169 -326 100 88 -39 -231 102 -188 126 -302 -514 6 254 -354
4655 -354 -388 343 39 -564 -10 169 -89 -60 -116 63 -212 115 -270 65 216 -150 -376 417 77 -399 16
4676 16 301 -436 -110 392 -154 125 166 62 -87 131 108 17 339 231 -228 212 302 -118 -56 431 33 -159
$$ packed form
4528B88m43k95P71n1k29J60r8n42L62K84m09J46M00o66q0N76n6l09N19l87n26
4549e85O21N86p61q6M99k16l43K75O2K58P5n91k42P72J13q45M70L16n33j06M84
4570B23K85m67K14m33j40N56j90j86L00J58m01j71P34k26r5K11m95j83N00Nn20
4591c21M33J33m92P4L46j75M0M07o58o0M64j0n92M30K99l74k06K86J88j49j3n21
4613d71K77O73n77k67O30j2n92R5N07m73J95J75m06J69L10j04k43J39j57j92M02
4634G8J40o08M56o5m47L09N26n58j57M26j2j27j92L33k90L14m28k12N20K48o08
4655c54l4P31l04o03N54J79k58K9n6J79k75L27l85L35J51l66k26P93l40m76M15
4676A6K85p37L26N02n46K79M1j04j49K18k3r1L22j08m59M40R0m20O2M87l98j92
$$ plain form
4698 -159 196 283 21 138 -136 -285 279 174 -321 -140 454 -117 -88 330 182 -155 138 233 -297 117 122 -268
4720 -268 190 193 -222 38 428 -169 26 490 -197 -301 387 177 -516 -59 311 -39 -156 295 137 -53 256
4741 256 12 -107 -66 -223 -243 72 9 -359 14 161 -271 -189 215 21 -287 169 60 -359 -38 -67 -305 -25
4763 -25 129 -153 -146 346 83 -426 29 177 -481 -73 -115 -99 -130 -188 -22 338 227 -437 -22 508 -143 -712
4785 -712 347 172 -522 -313 289 -11 -207 -178 -76 74 41 -80 69 459 -35 -260 175 179 -396 -34 268
4806 268 -174 40 113 -119 -142 151 -117 -428 287 155 -312 217 363 -149 -224 226 -61 -60 -41 -22 -41 114 59
4829 59 -114 284 178 -196 380 390 -352 -121 681 12 -447 -32 257 -333 112 -41 -63 -35 324 -45 181
$$ packed form
4698a59L55Q7k62J17k74j49N64j05m95J81N94n71K9M18j48l37K93R5n30M14Nl90
4720b68M58Lm15K60L90n97J95M64o87j04O88k10o93M57L70l50j17M51j58j90L09
4741B56k44j19M1j57k0L15o3l68L73J47m32Q2M04j94l08M56j09m19L21k9k38K80
4763b5J54k82PM92k63n09M55J48o58M08m2J6l1n8J66L60j11o64M15N30o51n69
4785g12J059j75o94K09O02l00j96K9J02J50l3j21J49L90m94k25M35Mn75L62L02
4806B68m42K14P3k32k3K93k68l11P15j32m67N29J46n12p5M50k87JJ9J9j9J55n5
4829E9j73L98j06l74N76J0p42K31Q02o69m59M15K89n90M45j53k2K8L59l69K26
$$ [...]
8191b62
##END NTUPLES=NMR FID
##END=
