##TITLE=1H_CA-8651-2
 CDCl3, 8 sc, 
 24.9.2019
##JCAMPDX= 6.0         $$ Bruker NMR JCAMP-DX V2.0
##DATA TYPE= NMR FID
##DATA CLASS= NTUPLES
##ORIGIN= UXNMR, Bruker Analytische Messtechnik GmbH
##OWNER= root
$$ XWIN-NMR		Version 3.5
$$ Tue Sep 24 15:48:40 2019 Russian Standard Time (UT+4h)  she@DPX200
##.OBSERVE FREQUENCY= 200.1315
##.OBSERVE NUCLEUS= ^1H
##.DELAY= (6, 6)
##.ACQUISITION MODE= SIMULTANEOUS
##.ACQUISITION SCHEME= undefined
##.AVERAGES= 8
##.DIGITISER RES= 18
##SPECTROMETER/DATA SYSTEM= spect
##.PULSE SEQUENCE= zg30
##.SOLVENT NAME= CDCl3
##.SHIFT REFERENCE= (INTERNAL, CDCl3, 0, 15.7039)
##AUDIT TRAIL= $$ (NUMBER, WHEN, WHO, WHERE, WHAT)
$$ ##TITLE= Audit trail, XWIN-NMR		Version 3.5
$$ ##JCAMPDX= 5.01
$$ ##ORIGIN= Bruker BioSpin GmbH
$$ ##OWNER= she
$$ F:/spectra/data/she/nmr/H-F/1/audita.txt
$$ ##AUDIT TRAIL=  $$ (NUMBER, WHEN, WHO, WHERE, WHAT)
(   1,<2019-09-24 15:47:31.15 +0400>,<she>,<DPX200>,
      <created by zg, POWCHK disabled, PULCHK disabled
       configuration hash MD5:
       00 E9 B6 7A A2 85 ED C7 34 08 36 98 17 FE 4E 26
       data hash MD5: 16K
       F0 77 8B 44 DE F2 B6 7A F3 2B EB 90 84 82 24 45>)
$$ ##END=
$$ 
$$ hash MD5
$$ 00 EC 2E 16 AD EC B3 4D D6 49 4B EF 84 74 86 99
##$RELAX= 
##$RELAX= 
##$RELAX= 
##$RELAX= 
##$RELAX= 
##$RELAX= 
$$ Bruker specific parameters
$$ --------------------------
##$DU= <F:/spectra>
##$EXPNO= 1
##$NAME= <H-F>
##$PROCNO= 1
##$TYPE= <nmr>
##$USER= <she>
##$AMP= (0..31)
100 100 100 100 100 100 100 100 100 100 100 100 100 100 100 100 100 100 
100 100 100 100 100 100 100 100 100 100 100 100 100 100 
##$AQSEQ= 0
##$AQ_mod= 1
##$AUNM= <au_zg>
##$AUTOPOS= <>
##$BF1= 200.13
##$BF2= 200.13
##$BF3= 200.13
##$BF4= 200.13
##$BF5= 200.13
##$BF6= 200.13
##$BF7= 200.13
##$BF8= 200.13
##$BYTORDA= 1
##$CFDGTYP= 0
##$CFRGTYP= 5
##$CHEMSTR= <none>
##$CNST= (0..31)
1 1 145 1 1 1 1 1 1 1 1 1 1 1 1 1 1 1 1 1 1 1 1 1 1 1 1 1 1 1 1 1 
##$CPDPRG= <>
##$CPDPRG1= <>
##$CPDPRG2= <>
##$CPDPRG3= <>
##$CPDPRG4= <mlev>
##$CPDPRG5= <mlev>
##$CPDPRG6= <mlev>
##$CPDPRG7= <mlev>
##$CPDPRG8= <mlev>
##$CPDPRGB= <>
##$CPDPRGT= <>
##$D= (0..31)
0 1.2 0 0 0 0 0 0 0 0.06 0 0.03 0 0 0 0 0.0002 0 0 0 0 0 0 0 0 0 0 0 0 
0 0 0 
##$DATE= 1569325650
##$DBL= (0..7)
120 120 120 120 120 120 120 120 
##$DBP= (0..7)
150 150 150 150 150 150 150 150 
##$DBP07= 0
##$DBPNAM0= <>
##$DBPNAM1= <>
##$DBPNAM2= <>
##$DBPNAM3= <>
##$DBPNAM4= <>
##$DBPNAM5= <>
##$DBPNAM6= <>
##$DBPNAM7= <>
##$DBPOAL= (0..7)
0.5 0.5 0.5 0.5 0.5 0.5 0.5 0.5 
##$DBPOFFS= (0..7)
0 0 0 0 0 0 0 0 
##$DE= 6
##$DECBNUC= <off>
##$DECIM= 24
##$DECNUC= <off>
##$DECSTAT= 4
##$DIGMOD= 1
##$DIGTYP= 9
##$DL= (0..7)
0 120 120 120 120 120 120 120 
##$DP= (0..7)
150 150 150 150 150 150 150 150 
##$DP07= 0
##$DPNAME0= <>
##$DPNAME1= <>
##$DPNAME2= <>
##$DPNAME3= <>
##$DPNAME4= <>
##$DPNAME5= <>
##$DPNAME6= <>
##$DPNAME7= <>
##$DPOAL= (0..7)
0.5 0.5 0.5 0.5 0.5 0.5 0.5 0.5 
##$DPOFFS= (0..7)
0 0 0 0 0 0 0 0 
##$DQDMODE= 0
##$DR= 18
##$DS= 0
##$DSLIST= <SSSSSSSSSSSSSSS>
$$ [...]
##$SUBNAM2= <"">
##$SUBNAM3= <"">
##$SUBNAM4= <"">
##$SUBNAM5= <"">
##$SUBNAM6= <"">
##$SUBNAM7= <"">
##$SUBNAM8= <"">
##$SUBNAM9= <"">
##$SW= 24.0689530833862
##$SWIBOX= (0..15)
0 0 2 0 0 0 0 0 0 0 0 0 0 0 0 0 
##$SW_h= 4816.95568400771
##$TD= 16384
##$TD0= 1
##$TE= 0
##$TE2= 300
##$TE3= 300
##$TEG= 300
##$TL= (0..7)
0 120 120 120 120 120 120 120 
##$TP= (0..7)
150 150 150 150 150 150 150 150 
##$TP07= 0
##$TPNAME0= <>
##$TPNAME1= <>
##$TPNAME2= <>
##$TPNAME3= <>
##$TPNAME4= <>
##$TPNAME5= <>
##$TPNAME6= <>
##$TPNAME7= <>
##$TPOAL= (0..7)
0.5 0.5 0.5 0.5 0.5 0.5 0.5 0.5 
##$TPOFFS= (0..7)
0 0 0 0 0 0 0 0 
##$TUNHIN= 0
##$TUNHOUT= 0
##$TUNXOUT= 0
##$USERA1= <user>
##$USERA2= <user>
##$USERA3= <user>
##$USERA4= <user>
##$USERA5= <user>
##$V9= 5
##$VALIST= <valist>
##$VCLIST= <CCCCCCCCCCCCCCC>
##$VD= 0
##$VDLIST= <DDDDDDDDDDDDDDD>
##$VPLIST= <PPPPPPPPPPPPPPP>
##$VTLIST= <TTTTTTTTTTTTTTT>
##$WBST= 1024
##$WBSW= 4
##$XGAIN= (0..3)
0 0 0 0 
##$XL= 0
##$YL= 0
##$YMAX_a= 570341
##$YMIN_a= -737618
##$ZGOPTNS= <>
##$ZL1= 120
##$ZL2= 120
##$ZL3= 120
##$ZL4= 120
##$ABSF1= 10
##$ABSF2= 0
##$ABSG= 5
##$ABSL= 3
##$ALPHA= 0
##$AQORDER= 0
##$ASSFAC= 0
##$ASSFACI= 0
##$ASSFACX= 0
##$ASSWID= 0
##$AUNMP= <proc_1d>
##$AZFE= 0.1
##$AZFW= 0.1
##$BCFW= 1
##$BC_mod= 2
##$BYTORDP= 1
##$COROFFS= 0
##$CY= 11.3945322036743
##$DATMOD= 1
##$DC= 2
##$DFILT= <>
##$DTYPP= 0
##$F1P= 20.1720416913024
##$F2P= 0.152960286110954
##$FCOR= 0.5
##$FTSIZE= 0
##$FT_mod= 4
##$GAMMA= 1
##$GB= 0.15
##$INTBC= 1
##$INTSCL= 1
##$ISEN= 128
##$LB= 0.24
##$LEV0= 0
##$LPBIN= 0
##$MAXI= 10000
##$MC2= 0
##$MEAN= 0
##$ME_mod= 0
##$MI= 1.114404
##$NCOEF= 0
##$NC_proc= 0
##$NLEV= 6
##$NOISF1= 3.799351
##$NOISF2= 2.8
##$NSP= 1
##$NTH_PI= 0
##$NZP= 0
##$OFFSET= 15.70392
##$PC= 1
##$PHC0= -9578.33
##$PHC1= 25.40095
##$PH_mod= 1
##$PKNL= yes
##$PPARMOD= 0
##$PSCAL= 0
##$PSIGN= 0
##$REVERSE= no
##$SF= 200.130013532006
##$SI= 16384
##$SIGF1= 3
##$SIGF2= 2
##$SINO= 400
##$SIOLD= 16384
##$SREGLST= <1H.CDCl3>
##$SSB= 0
##$STSI= 0
##$STSR= 0
##$SW_p= 3612.71676300578
##$SYMM= 0
##$S_DEV= 0
##$TDeff= 0
##$TDoff= 0
##$TI= <>
##$TILT= no
##$TM1= 0
##$TM2= 0
##$TOPLEV= 0
##$USERP1= <user>
##$USERP2= <user>
##$USERP3= <user>
##$USERP4= <user>
##$USERP5= <user>
##$WDW= 1
##$XDIM= 8192
##$YMAX_p= 0
##$YMIN_p= 0
$$ End of Bruker specific parameters
$$ ---------------------------------
##NTUPLES= NMR FID
##VAR_NAME=  TIME,          FID/REAL,        FID/IMAG
##SYMBOL=    X,             R,               I
##VAR_TYPE=  INDEPENDENT,   DEPENDENT,       DEPENDENT
##VAR_FORM=  AFFN,          ASDF,            ASDF
##VAR_DIM=   8192,          8192,            8192
##UNITS=     SECONDS,       ARBITRARY UNITS, ARBITRARY UNITS
##FACTOR=    0.0002076,     1,               1
##FIRST=     0,             0,               0
##LAST=      1.7004516,     0,               0
##MIN=       0,             -737618,         0
##MAX=       1.7004516,     570341,          0
$$ Real data points
##PAGE= N=1
##DATA TABLE= (X++(R..R)), XYDATA
$$ plain form
0 0 0 0 0 -8 8 -11 8 -16 24 -32 40 -48 64 -80 96 -113 137 -169 194 -228 268 -315 364 -420 484 -555 634
27 634 -719 815 -920 1039 -1168 1309 -1464 1634 -1823 2031 -2251 2498 -2772 3071 -3398 3760
43 3760 -4165 4616 -5119 5683 -6330 7071 -7928 8933 -10140 11618 -13469 15868 -19119
56 -19119 23804 -31155 44396 -75607 292088 -79024 -687510 327272 541104 -362879 -522954
67 -522954 386906 335345 -413162 -269942 403201 142423 -347737 -45713 329665 -12195
77 -12195 -215859 94381 165721 -123197 -69134 115527 -32036 -114961 112867 75327 -153109
88 -153109 9246 214219 -71689 -210037 152344 191446 -233700 -166607 271245 99562
98 99562 -317552 -39887 329378 -36255 -335206 106108 316728 -179366 -288721 239022
$$ packed form
0@%%%qJ6j9J9k4M0n6P2q8J12j44J76k09K50l06L63m22M96n83O79p84R04j039J189
27F34j353J534j735J959k207K477k773L098l457L854m282M749n270N843o469P158
43C760p925Q781r735J0802j2013J3401j4999J6861j9073K1758k5087K9337l4987
56a9119M2923n4959P5551j20003L67695l71112o08486J014782K13832r03983j60075
67e22954R09860n1561p48507J43220O73143k60778m90160L02024L75378l41860
77a2195k03664L10240P1340k88918N4063J84661j47563q2925K27828l7540k28436
88a53109J62355K04973k85908j38348L62381L9102m25146O7093M37852j71683
98I9562m17114K77665L69265l65633k98951M41314K10620m96094j09355N27743
$$ plain form
108 239022 237893 -288796 -170760 326242 102623 -326438 -15984 313079 -60268 -272716
118 -272716 126878 213601 -181051 -153714 200334 69569 -226121 -15964 207829 -57017
128 -57017 -193691 112880 164456 -161932 -130497 191646 78617 -212660 -19516 227323
138 227323 -22832 -203052 77527 169819 -123137 -135244 134667 71461 -152495 -32414
148 -32414 131772 -19086 -110636 56051 82827 -72922 -30182 108930 5862 -109571 36942
159 36942 107123 -84116 -106329 111416 72816 -152796 -44697 172006 -2 -177692 57932
170 57932 187572 -86443 -152285 138041 131752 -159503 -93136 174653 49677 -189200 -19932
181 -19932 182301 -21081 -181719 47529 167856 -69009 -135194 105074 119012 -109043
$$ packed form
108B39022j129n26689J18036M97002k23619m29061L10454L29063l73347k12448
118b72716L99594Q6723l94652K7337L54048j30765k95690K10157K23793k64846
128e7017j36674L06571N1576l26388L1435L22143j13029k91277J93144K46839
138B27323k50155j80220K80579R2292k92956j2107K69911o3206k23956J20081
148c2414J64186j50858r1550J66687K6776j55749M2740J39112j03068j15433J46513
159C6942P0181j91239k2213K17745l8600k25612J08099K16703j72008j77690K35624
170E7932J29640k74015o5842K90326o289k91255O6367K67789j24976k38877J69268
181a9932K02233k03382j60638K29248J20327k36865o6185K40268J3938k28055
$$ plain form
191 -109043 -73691 120953 36084 -117038 -2926 96481 -28109 -70240 48243 39839 -53491
202 -53491 -2964 58111 -20210 -45412 48162 36179 -67374 -26522 74855 4877 -84650 17887
214 17887 91642 -38921 -86336 67290 78699 -89564 -60078 106094 32804 -116349 -5414
225 -5414 111539 -28121 -106377 47356 86636 -67309 -70004 76361 49262 -84612 -36094
236 -36094 81092 16385 -79719 2523 75364 -21134 -68222 32341 44091 -56495 -35029
247 -35029 53353 4318 -55427 18525 48634 -34360 -30904 51638 19046 -55194 -5407 51525
259 51525 -13432 -58051 10854 42342 -25154 -38446 34847 35961 -35056 -18251 47874 9586
271 9586 -49046 3502 40177 -27628 -41318 29354 17032 -43950 -2090 52933 -939 -37768
$$ packed form
191a09043L5352J94644q4869j53122J14112R9407j24590m2131J18483q404r3330
202e3491N0527O1075p8321k5202R3574j1983j03553M0852J01377o9978q9527J02537
214A7887P3755j30563m7415J53626J1409j68263K9486J66172p3290j49153J10935
225e414J16953j39660p8256J53733L9280j53945k695J46365k7099j33874M8518
236c6094J17186o4707r6104Q2242P2841r6498m7088J00563J1750j00586K1466
247c5029Q8382m9035n9745P3952L0109q2994L456Q2542l2592p4240M9787N6932
259E1525o4957m4619O8905L1488o7496j3292P3293J114p1017J6805O6125l8288
271I586n8632N2548L6675o7805j3690P0672j2322o0982M1860N5023n3872l6829
$$ plain form
283 -37768 23541 42648 -22440 -34781 22383 25464 -27286 -24627 25062 17142 -28448 -11743 29844
296 29844 5614 -25129 4901 19397 -13964 -10979 16287 -4969 -20095 17930 24865 -11645
308 -11645 -2703 31988 13389 -16896 -443 15466 -5144 -19310 -1555 10687 -6943 -18666
320 -18666 2494 15086 -6893 -11913 13802 11730 -9074 5626 18239 -6546 -9367 20030 11886
333 11886 -15983 -1185 17209 -3197 -18303 -3284 4495 -6784 -13843 -4826 8777 4992 -9641
346 -9641 -1782 16570 7237 -8323 -477 5263 -3487 -4583 -4756 -10421 -2058 6447 -4739 -5567 11959
361 11959 7746 -6596 2092 8884 -4063 -8308 -2362 -3346 -4799 -5168 -9606 -4306 4977 -1800 -6382
376 -6382 5513 6950 -1188 2559 4521 -3176 -295 3688 -5370 -5268 3398 -2164 -6683 1282 -142
$$ packed form
283c7768O1309J9107o5088j2341N7164L081n2750K659M9689p920m5590J6705M1587
296B9844k4230l0743L0030J4496l3361K985K7266k1256j5126L8025O935l6510
308a1645Q942L4691j8599l0285J6453J5909k0610j4166J7755J2242j7630j1723
320a8666K1160J2592k1979n020K5715k072k0804J4700J2613k4785k821K9397q144
333A1886k7869J4798J8394k0406j5106J5019P779j1279p059R017J3603l785j4633
346i641P859J8352r333j5560P846N740q750j096j73n665Q363Q505j1186q28J7526
361A1959m213j4342Q688O792j2947m245N946r84j453l69m438N300R283o777m582
376f382J1895J437q138L747J962p697K881L983r058J02Q666n562m519P965j424
$$ plain form
391 -142 -6517 -1083 -1256 -7480 1219 5344 -7709 -5227 10937 5059 -7307 96 8246 4622 976
406 976 -988 394 5657 -419 -9457 -1160 3522 -8845 -6809 8491 2884 -5569 5639 9678 1180
421 1180 5174 9211 -180 437 8036 155 -8338 -3555 -1238 -4075 -3371 -2640 736 5957 2113 865
437 865 11133 8215 -4607 4004 13833 -2238 -8226 6208 1470 -11509 803 8021 -7596 -7831
451 -7831 9324 6799 -7717 -5014 6099 5996 -3490 -5103 6975 8443 -7169 -4502 13183 2960
465 2960 -15009 1666 14015 -7025 -10156 9885 3468 -11181 4242 11328 -7745 -7621 10094
478 10094 4236 -13101 -7881 5828 -271 -13647 -5359 11635 1885 -14631 3827 21252 -4720
491 -4720 -17449 13790 15628 -19860 -11609 18024 -2680 -24469 4107 16215 -15201 -16841 14419
$$ packed form
391a42o375N434j73o224Q699M125j3053K482J6164n878j2366P403Q150l624l646
406I76j964J382N263o076r038Q297M682j2367K036J5300n607q453J1208M039q498
421A180L994M037r391O17P599p881q493M783K317k837P04P31L376N221l844j248
437H65J0268k918j2822Q611R829j6071n988J4434m738j2979J2312P218j5617k35
451g831J7155k525j4516K703J1113j03r486j613J2078J468j5612K667J7685j0223
465B960j7969J6675J2349k1040l131K0041o417j4649J5423P086j9073J24J7715
478A0094n858j7337N220J3709o099j3376Q288J6994r750j6516J8458J7425k5972
491d720j2729L1239J838l5488Q251K9633k0704k1789K8576J2108l1416j640L1260
$$ plain form
504 14419 9139 -19529 -10034 16616 4184 -20435 -2488 22269 -1560 -23261 10315 26952
516 26952 -12761 -19034 23227 14375 -27447 -7648 22302 -10969 -26971 12773 15356 -23184 -10477
529 -10477 25835 4630 -24630 3467 27097 -5057 -21369 15660 24213 -19858 -20532 27671 14993
542 14993 -35081 -7153 38840 -3652 -37638 17029 32484 -29050 -23669 37937 13809 -39204
554 -39204 384 41642 -7937 -35747 18487 31621 -25765 -24984 35107 21955 -38606 -10070
566 -10070 48645 5042 -46250 10910 46718 -22533 -38337 35173 24829 -46026 -11776 48857
578 48857 -3549 -44949 20893 41707 -27382 -25857 40488 17129 -45030 -5295 46056 -10804
590 -10804 -51139 20107 45542 -36250 -39017 51063 28590 -61031 -10114 70470 -8548 -72153
$$ packed form
504A4419n280k8668R495K6650j2432k4619J7947K4757k3829k1701L3576J6637
516B6952l9713o273M2261q852m1822J9799K9950l3271j6002L9744K583l8540J2707
529a0477L6312k1205k9260K8097K3630l2154j6312L7029Q553m4071o74M8203j2678
542A4993n0074K7928M5993m2492l3986N4667J5455o1534N381O1606k4128n3013
554c9204L9588M1258m9579k7810N4234J3134n7386P81O0091j3152o0561K8536
566a0070N8715m3603n1292N7160L5808o9251j5804P3510j0344p0855L4250O0633
578D8857n2406m1400O5842K0814o9089J525O6345k3359o2159L9735N1351n6860
590a0804m0335P1246K5435q1792k767R0080k2473q9621N0917Q0584p9018o3605
$$ plain form
602 -72153 26825 63457 -48369 -55112 57383 33941 -68841 -16189 72311 -1596 -70215 19162
614 19162 65400 -36176 -60379 46044 44925 -60870 -33447 65831 11627 -72082 7451 69024
626 69024 -27472 -57756 47598 44287 -57937 -24393 60772 -665 -63165 15899 50925 -36338
638 -36338 -41831 46238 25691 -55428 -9913 59767 -6904 -58219 27531 55528 -45859 -47015
650 -47015 60564 28550 -77307 -12237 80688 -12300 -78412 36987 69545 -56285 -50659
661 -50659 74971 32478 -82107 -7491 87025 -12956 -83247 33881 75384 -53113 -63076
672 -63076 71482 49402 -83000 -27790 94702 8237 -95326 16572 91223 -38281 -77749
683 -77749 57475 58820 -69107 -34359 77577 15414 -70659 10468 67701 -21758 -48786 38841
$$ packed form
602g2153R8978L6632j11826o743J12495k3442j02782N2652Q8500p3907o8619Q9377
614A9162M6238j01576k4203J06423j119j05795K7423R9278n4204q3709P9533O1573
626F9024r6496l0284J05354l311j02224L3544Q5165o1437o2500P9064L5026q7263
638c6338n493Q8069k0547q1119M5515O9680o6671n1315Q5750K7997j01387j156
650d7015J07579l2014j05857O5070R2925r2988o6112J15399L2558j25830N626
661e0659J25630m2493j14585P4616R4516r9981p0291J17128M1503j28497r963
672f3076J34558k2080j32402N5210J22492q6465j03563J11898P4651j29504l9468
683g7749J35224J345j27927L4748J11936o2163q6073Q1127N7233q9459k7028Q7627
$$ plain form
695 38841 35453 -46869 -17700 51292 -3205 -56278 17392 48176 -38645 -39775 54673 25113
707 25113 -64172 -681 74660 -18276 -69778 44162 63768 -60482 -46608 75449 28611
718 28611 -82979 -8245 84330 -13433 -84168 30916 76892 -49555 -69333 61668 52555
729 52555 -76777 -37059 82075 13845 -85158 9751 82421 -28926 -68080 49737 54159
740 54159 -58806 -31782 64603 10338 -64835 5433 52880 -28847 -50522 34344 30504 -50012
752 -50012 -20722 52384 3683 -53172 16032 52574 -30904 -41918 48940 29106 -61172 -12292
764 -12292 65041 -10254 -66398 28132 56522 -46503 -45198 58242 28534 -67631 -14621 67214
776 67214 -4865 -69973 16124 61657 -32838 -53594 47788 44884 -54714 -23530 69774 12405
$$ packed form
695C8841l388q2322K9169O8992n4497n3073P3670L0784q6821j130R4448k9560
707B5113q9285O3491P5341r2936n1502J13940J9606j24250J3874J22057m6838
718B8611j11590P4734R2575r7763p0735J15084M5976j26447j9778J31001r113
729E2555j29332L9718J19134o8230r9003R4909P2670j11347l9154J17817M422
740E4159j12965K7024R6385n4265p5173P0268M7447q1727k1675Q4866l840q0516
752e0012K9290P3106m8701n6855O9204L6542q3478j1014R0858j9834r0278M8880
764a2292P7333p5295n6144R4530K8390j03025J305J03440k9708r6165N3010Q1835
776F7214p2079o5108Q6097M5533r4495k0756J01382k904r9598L1184R3304n7369
$$ plain form
788 12405 -66883 11352 66553 -28529 -57355 41341 39677 -55735 -27881 56600 7058 -59724
800 -59724 5333 54691 -16694 -45288 29957 40471 -32337 -23095 44802 16138 -42601 3190
812 3190 46585 -14885 -39632 28546 28441 -41182 -16268 45548 -1452 -48240 16109 45086 -27382
825 -27382 -36004 37543 28034 -40348 -15095 44513 6367 -41526 7470 42588 -15071 -35272
837 -35272 28495 30818 -35103 -19427 40812 4396 -46053 7624 41179 -24559 -37895 33444
849 33444 27556 -40197 -16407 42590 6175 -40949 3769 36954 -13081 -33634 18256 26467
861 26467 -24880 -20372 28971 12251 -30646 -1099 31182 -10644 -29142 20194 20125 -32420 -15078
874 -15078 33407 1595 -37104 4567 31588 -13602 -27005 18687 21207 -20604 -14230 22749
$$ packed form
788A2405p9288P8235N5201r5082k8826R8696j664r5412K7854Q4481m9542o6782
800e9724O5057M9358p1385k8594P5245J0514p2808R242O7897k8664n8739M5791
812C190M3395o1470k4747O8178j05o9623K4914O1816m7000m6788O4349K8977p2468
825b7382q622P3547r509o8382K5253N9608l8146m7893M8996L5118n7659k0201
837c5272O3767K323o5921J5676O0239l6416n0449N3677L3555o5738j3336P1339
849C3444n888o7753K3790N8997l6415m7124M4718L3185n0035k0553N1890Q211
861B6467n1347M508M9343j6720m2897K9547L2281m1826j8498M9336o9n2545J7342
874a5078M8485l1812l8699M1671K7021m5190j3403M5692K520m1811O374L6979
$$ plain form
886 22749 8209 -23821 -3448 21921 -5032 -22113 11266 16939 -19417 -11307 25586 3372
898 3372 -28425 5685 28121 -13980 -25101 18270 16697 -24146 -12386 22846 5486 -22298
910 -22298 -314 21397 -1187 -17167 5973 15467 -8322 -10834 12128 5644 -15551 1339 18694
923 18694 -6528 -15770 15654 15504 -17305 -8022 20488 2264 -20239 2370 17089 -6531 -14174
936 -14174 8461 12657 -6174 -6142 10000 7847 -7070 -1257 10776 -1029 -11141 5953 10891
949 10891 -10514 -8493 14214 4517 -15199 657 14664 -5383 -11996 8237 9770 -7455 -4676
962 -4676 8793 5919 -3132 -904 4524 1188 -4271 -1530 1204 -5406 -6387 2828 1583 -7804 338
977 338 9911 -1690 -6190 9014 7507 -8518 -2732 9192 -1008 -9001 764 4061 -3425 -2472
$$ packed form
886B2749j4540l2030K0373K5369k6953j7081L3379N673l6356Q110L6893k2214
898C372l1797L4110K2436m2101j1121M3371j573m0843J1760L5232j7360k7784
910b2298K1984K1711k2584j5980K3140R494k3789k512K2962o484k1195J6890J7355
923A8694k5222r242L1424j50l2809R283K8510j8224k2503K2609J4719k3620p643
936a4174K2635M196j8831L2J6142k153j4917N813J2033j1805j0112J7094M938
949A0891k1405K021K2707r697j9716J5856J4007k0047o613K0233J533j7225K779
962d676J3469k874r051K228N428l336n459K741K734o610r81R215j245r387Q142
977C38R573j1601m500J5204j507j6025N786J1924j0200p993R765L297p486R53
$$ plain form
991 -2472 2668 667 -3071 -1275 895 -2155 -7370 -4346 2913 -1574 -7714 2157 8733 -1952 -3864
1006 -3864 7992 5376 -5651 -1653 3335 -2557 -4737 -1917 -3418 -1754 2354 -1550 -3201 4137
1020 4137 4724 -2558 -2683 1083 -207 -3344 -4486 -2158 1458 -1128 -4911 3083 8107 -491 -2193
1035 -2193 7771 5727 -3027 908 3806 -2750 -2066 2501 -3055 -5632 520 802 -3801 -2275 570
1050 570 280 997 1558 1140 4089 4158 1412 3684 5033 600 189 1594 -2292 -2442 1652 -4319 -8355
1067 -8355 2996 6163 -6201 -4279 9296 6335 -3924 122 6846 2497 -2887 -1370 2679 2435
1081 2435 -3370 -3518 4000 3585 -3657 -1057 4282 687 -602 2546 -2039 -3518 4771 2365 -7064
1096 -7064 -564 8227 -724 -6355 3177 5633 -3458 -4898 1353 2367 -2640 -5347 -780 3284 -1449
$$ packed form
991b472N140k001l738J796K170l050n215L024P259m487o140R871O576j0685j912
1006c864J1856k616j1027L998M988n892k180K820j501J664M108l904j651P338
1020D137N87p282j25L766j290l137j142K328L616k586l783P994N024q598j702
1035b193R964k044q754L935K898o556O84M567n556k577O152K82m603J526K845
1050E70k90P17N61m18K949O9k746K272J349m433m11J405l886j50M094n971m036
1067h355J1351L167j2364J922J3575k961j0259M046O724m349n384J517M049k44
1081B435n805j48P518m15p242K600N339l595j289L148m585j479Q289k406r429
1096g064O500Q791q951n631R532K456r091j440O251J014n007k707M567M064m733
$$ plain form
1111 -1449 -3794 3002 2640 -3580 1815 6587 -4246 -6383 6748 3039 -11132 -4289 7034 -2691
1125 -2691 -10625 196 6268 -2292 -5745 2921 7506 306 -5554 2005 6321 -3522 -7580 1550 539
1140 539 -8054 -1698 4143 -5379 -3651 9635 3789 -7092 3696 11690 -2627 -8468 4221 5700
1154 5700 -8080 -9667 2354 3510 -6713 -7320 4780 5416 -5025 -1436 8446 1071 -4399 7416
1168 7416 6788 -7836 -758 13253 -1539 -12966 5394 10476 -11045 -11523 9654 5450 -13561
1181 -13561 -5536 12950 5612 -10251 -406 15139 3380 -9676 4200 11325 -7130 -8353 10654
1194 10654 3149 -14377 2296 15789 -6442 -11269 14575 10415 -16565 -5099 17667 -889
1206 -889 -20252 1160 16671 -5451 -14585 10063 15379 -8846 -7574 16797 6934 -18695 -1862
$$ packed form
1111a449k345O796l62o220N395M772j0833k137J3131l709j4171O843J1323r725
1125b691p934J0821O072q560l453Q666M585p200n860P559M316r843m058R130j011
1140E39q593O356N841r522J728J3286n846j0881J0788P994j4317n841J2689J479
1154E700j3780j587J2021J156j0223o07J2100O36j0441L589R882p375n470J1815
1168G416o28j4624P078J4011j4792j1427J8360N082k1521m78K1177m204j9011
1181a3561Q025J8486p338j5863R845J5545j1759j3056J3876P125j8455j223J9007
1194A0654p505j7526J6673J3493k2231m827K5844m160k6980J1466K2766j8556
1206h89j9363K1412J5511k2122r134K4648N316k4225J272K4371r863k5629J6833
$$ plain form
1219 -1862 18815 -7825 -22575 10974 16683 -18131 -11178 24571 8176 -22474 1553 23542
1231 23542 -6383 -22445 6540 13873 -13910 -13948 11915 7316 -13077 -763 17025 -1371 -13427
1244 -13427 9749 12430 -16645 -10309 18844 309 -26404 3893 23997 -13214 -22916 19009
1256 19009 18700 -22933 -13094 23711 6183 -24334 -1605 21694 -4031 -19673 9064 16794 -13575
1269 -13575 -13758 16240 6061 -22268 -2666 20562 -7697 -20688 15577 17703 -19630 -8884
1281 -8884 26014 4120 -24835 3825 21462 -11918 -19375 14654 12252 -19220 -7080 23155
1293 23155 3419 -22862 4244 24897 -9999 -24247 15725 19945 -24302 -15992 29512 10455
1305 10455 -29493 1282 33735 -4085 -25111 13616 20945 -17731 -15681 16747 4776 -21089
$$ packed form
1219a862K0677k6640j4750L3549N709l4814O953L5749j6395l0650K4027K1989
1231B3542k9925j6062K8985P333k7783l8K5863m599k0393J2314J7788j8396j2056
1244a3427K3176K681k9075O336K9153j8535k6713L0297K0104l7211r702M1925
1256A9009l09m1633R839L6805j7528l0517K2729K3299k5725j5642K8737P730l0369
1269a3575j83K9998j0179k8329J9602K3228k8259j2991L6265K126l7333J0746
1281h884L4898k1894k8955K8660J7637l3380p457L4029k402l1472J2140L0235
1293B3155j9736k6281K7106K0653l4896j4248L9972M220m4247Q310M5504j9057
1305A0455l9948L0775L2453l7820k1026L8727P329l8676K050L2428j1971k5865
$$ plain form
1317 -21089 -1910 18058 -4082 -14757 12225 16078 -12607 -6607 22500 4776 -23695 3349
1329 3349 25543 -12136 -26706 16331 19729 -24320 -14256 27276 7410 -25932 3325 27792
1341 27792 -6161 -21242 13783 19150 -16691 -14835 18014 7123 -23194 -4346 22013 -4244
1353 -4244 -23498 10145 21233 -15257 -14513 21762 8938 -22589 281 21816 -8751 -19779
1365 -19779 13583 12708 -19292 -8030 19671 460 -21359 4329 19357 -11569 -19642 15579
1377 15579 16313 -21677 -13513 25826 8245 -28637 -1539 28801 -6749 -27515 12746 21050 -19969
1390 -19969 -15470 22286 7634 -22666 -151 22171 -4867 -18371 10141 14283 -14755 -12314
1402 -12314 15876 5975 -20546 -2945 20164 -3818 -20677 9454 17692 -15466 -12152 20946
$$ packed form
1317b1089J9179J9968k2140j0675K6982L853k8685O000K9107j7724k8471K7044
1329C349K2194l7679j4570M3037L398m4049J0064M1532j9866l3342K9257K4467
1341B7792l3953j5081L5025N367l5841J856L2849j0891l0317J8848K6359k6257
1353d244j9254L3643J1088l6490P44L6275j2824l1527K2870K1535l0567j1028
1365a9779L3362q75l2000J1262K7701j9211k1819K5688J5028l0926q073L5221
1377A5579P34l7990Q164L9339j7581l6882K7098L0340l5550k0766M0261Q304m1019
1390a9969M499L7756j4652l0300K2515K2322k7038j3504K8512M142k9038K441
1402a2314K8190r901k6521J7601K3109k3982j6859L0131Q238l3158L314L3098
$$ plain form
1414 20946 7049 -20873 2976 24005 -5730 -16749 14461 14512 -16967 -10213 15940 483 -23005
1427 -23005 -2627 17171 -6893 -19719 10412 20397 -9452 -10037 21889 13598 -16622 -756 21576
1440 21576 -4448 -20831 8184 13225 -16597 -10550 17200 3519 -17128 3761 17850 -6322
1452 -6322 -14413 10566 12509 -13032 -10185 14790 6456 -15750 -503 19525 -1844 -15930 10591
1465 10591 16345 -13861 -11431 17239 4924 -19551 572 17724 -6789 -15410 10900 11681 -14670
1478 -14670 -9713 13276 3386 -16710 -3420 13906 -1310 -13210 6595 15556 -6370 -8263 14154
1491 14154 7528 -14951 -2345 13593 -6856 -16468 7269 8620 -15213 -7475 15234 1750 -15843
1504 -15843 1855 14604 -4771 -13263 6896 11003 -9070 -9028 12116 8004 -12722 -3164 15156
$$ packed form
1414B0946j3897k7922K3849K1029k9735j1019L1210N1l1479O754K6153j5457k3488
1427b3005K0378J9798k4064j2826L0131R985k9849n85L1926q291l0220J5866K2332
1440B1576k6024j6383K9015N041k9822O047K7750j3681k0647K0889J4089k4172
1452f322q091K4979J943k5541K847K4975q334k2206J5247K0028k1369j4086K6521
1465A0591N754l0206K430K8670j2315k4475K0123J7152k4513q621K6310P81k6351
1478a4670M957K2989r890k0096J3290J7326j5216j1900J9805Q961k1926j893K2417
1491A4154o626k2479J2606J5938k0449r612K3737J351k3833P738K2709j3484j7593
1504a5843J7698J2749j9375q492K0159M107k0073M2K1144m112k0726R558J8320
$$ plain form
1517 15156 -446 -16057 3222 10724 -11700 -11417 10701 3290 -14276 755 14243 -2781 -9470
1530 -9470 8605 9613 -7465 -5521 8052 2219 -10950 -2757 8375 -2278 -10378 4086 10346
1543 10346 -6150 -6757 11633 6125 -11320 447 13857 -4175 -12434 7554 9477 -10476 -6674
1556 -6674 11062 3785 -9800 153 10606 -562 -8091 3358 8938 -3257 -6954 5709 5760 -7261
1570 -7261 -3381 8301 -432 -8855 5121 8742 -7192 -4704 11098 3192 -9862 1656 10472
1583 10472 -3740 -7792 5924 6190 -7096 -5262 7135 4179 -7707 -3184 8334 1630 -8973
1596 -8973 554 8541 -4025 -7956 6657 5686 -8364 -2286 9332 -368 -7203 4023 5864 -5294
1610 -5294 -3012 5760 648 -6109 -402 4467 -1524 -4929 952 3224 -3664 -4609 3944 2906 -6695
$$ packed form
1517A5156j5602j5611J9279P502k2424K83K2118p411j7566J5031J3488j7024o689
1530i470J8075J008j7078J944J3573n833j3169Q193J1132j0653q100J4464O260
1543A0346j6496o07J8390n508j7445J1767J3410j8032q259J9988J923j9953L802
1556f674J7736p277j3585R953J0453j1168p529J1449N580j2195l697J2663N1j3021
1570g261L880J1682q733q423J3976L621j5934K488J5802p906j3054J1518Q816
1583A0472j4212m052J3716K66j3286J834J2397k956j1886M523J1518o704j0603
1596h973R527P987j2566l931J4613r71j4050O078J1618r700o835J1226J841j1158
1610e294K282Q772n112o757N707M869n991l405N881K272o888r45Q553j038r601
$$ plain form
1625 -6695 -1817 7782 -264 -8294 3022 6556 -6110 -5508 6057 1049 -7812 18 5810 -2563
1639 -2563 -4670 3515 4030 -2523 -2265 2849 1499 -4381 -3090 2425 -1366 -6688 -198 4952 -3144
1654 -3144 -4483 5885 4122 -5262 538 7409 -1359 -5797 3425 4263 -4523 -2762 4068 2038 -2188
1669 -2188 -319 2775 891 -2441 -1427 1837 -1369 -4883 88 2825 -2261 -2212 4149 2270 -900
1684 -900 4199 4664 -1990 306 5304 -471 -4585 1259 2165 -3505 -2647 2023 947 -1848 -1266 1940
1700 1940 2534 -1257 -1966 3250 3132 -2261 -323 4248 503 -2270 2892 2813 -2627 -567 2627 -701
1716 -701 -1872 1299 -80 -1678 1258 1304 -1309 -709 828 106 -595 -1569 -1313 639 -189 -2025 1278
1733 1278 2776 -1380 -292 5105 1436 -3631 1336 3121 -3328 -3840 789 -839 -4110 -2027 245
$$ packed form
1625f695M878R599q046q030J1316L534j2666O02J1565n008q861P830N792q373
1639b563k107Q185N15o553K58N114j350n880J291N515l791n322O490N150q096
1654c144j339J0368j763r384N800O871q768m438R222Q38q786J761O830k030m226
1669b188J869L094j884l332J014L264l206l514M971K737n086M9O361j879l170
1684i00N099M65o654K296M998n775m114N844R06n670Q58M670j076k795N82L206
1700A940N94l791p09N216j18n393J938M571l745k773N162p9n440K060L194l328
1716g01j171L171j379j598K936M6k613O00J537p22p01r74K56J952q28j836L303
1733A278J498m156J088N397l669n067M967J785o449n12M629j628l271K083K272
$$ plain form
1748 245 95 -1072 -1326 940 2783 -295 -1665 1902 1780 -2069 -536 1603 -1549 -1060 1744 -940
1764 -940 -2656 1643 641 -3845 -839 2068 -2401 -3590 772 1458 -1810 -1976 732 2540 407 -2241
1780 -2241 921 4220 -516 -3187 2256 2681 -3679 -1939 3115 -910 -3809 917 1691 -1815 30
1795 30 1821 -454 -15 1932 525 -711 670 834 -130 -475 -124 212 -38 -1188 888 2778 -700
1812 -700 -1867 4264 3520 -3579 -331 5477 -444 -4911 2243 3488 -3769 -2798 3703 1627 -2596 -51
1828 -51 2763 1502 -298 119 1655 403 -1085 571 1113 -2315 -1512 2689 -423 -3835 2639 4321
1844 4321 -3838 -1606 6966 1713 -6064 1140 6154 -1809 -5625 1576 2581 -3479 -3705 1339 1662
1859 1662 -2625 -2230 3121 2478 -2581 -439 4089 -524 -3333 2123 1770 -4287 -808 3987 -2126 -4487
$$ packed form
1748B45j50j167k54K266J843l078j370L567j22l849J533K139l152M89K804k684
1764i40j716M299j002m486L006K907m469j189M362O86l268j66K708J808k133k648
1780b241L162L299m736k671N443M25o360J740N054m025k899M726P74l506J845
1795C0J791k275M39J947j407j236J381J64r64l45L51L36k50j150K076J890l478
1812g00j167O131p44p099L248N808n921m467P154J245p257R71O501k076m223K545
1828e1K814j261j800M17J536j252j488J656N42l428Q03M201l112l412O474J682
1844D321q159K232Q572n253p777P204N014p963l816P201J005o060k26N044L23
1859A662m287L95N351o43n059K142M528m613k809N456l53o057L479M795o113k361
$$ plain form
1875 -4487 3104 2360 -4565 -1074 3880 -1488 -4246 1451 2046 -3884 -3484 2369 1818 -3983 -2402 4645
1891 4645 2312 -4968 -50 6731 -931 -6641 2995 5409 -5917 -5056 4707 862 -6296 -70 3791
1906 3791 -2290 -2527 3244 1110 -2868 671 3610 -764 -2711 2137 2970 -3345 -3319 4370 3390 -6222
1922 -6222 -1986 8269 1147 -8325 1575 8378 -3448 -6150 5635 3896 -6615 -1699 6536 -236
1936 -236 -5380 2153 5231 -1517 -2706 3724 3431 -3389 -1553 4998 1107 -5787 362 5974 -2489
1951 -2489 -5513 4395 4279 -5886 -1063 7721 -497 -5964 4157 5920 -4477 -3069 5929 1360
1965 1360 -6250 -29 5494 -1798 -6439 2029 6232 -2879 -5704 4570 5757 -5249 -3230 6782
1979 6782 1262 -6601 1351 5872 -4607 -4652 5415 1248 -6707 852 6007 -3320 -5282 4781 3539
$$ packed form
1875d487P591p44o925L491M954n368k758N697N95n930M00N853n51n801J581P047
1891D645k333p280M918O781p662n710R636K414j1326Q61R763l845p158O226L861
1906C791o081k37N771k134l978L539K939m374j947M848Q33o315K6P689r80r612
1922f222M236J0255p122r472R900O803j1826k702J1785j739j0511M916Q235o772
1936b36n144P533L078o748j189O430k93o820J836O551l891o894O149N612q463
1951b489l024R908j16j0165M823Q784q218n467J0121J763j0397J408Q998m569
1965A360p610O221N523p292m641Q468M203r111k825J0274J187j1006K019J0012
1979F782n520p863P952M521j0479m5J0067m167p955P559N155r327j962J0063j242
$$ plain form
1994 3539 -6068 -3507 5509 1746 -7199 -1801 6744 -149 -7364 2019 7588 -3953 -6100 6416
2008 6416 4350 -7986 -2277 7247 -2127 -7758 3211 4825 -5872 -3899 5869 1677 -6473 -543
2022 -543 5787 -482 -5811 963 4972 -2657 -5059 3481 3680 -5192 -1777 6679 -87 -6119 3293
2037 3293 5429 -5694 -3416 7160 648 -8395 1108 7290 -3437 -7173 4233 6133 -4315 -4328
2051 -4328 5996 4592 -5372 -2188 7369 1471 -7107 775 7084 -2950 -6325 4775 4102 -6212
2065 -6212 -963 7324 -772 -5437 4195 5424 -3904 -2631 4959 1914 -4129 -312 3689 -1148 -3872
2080 -3872 1442 3432 -3029 -2842 4650 2432 -4901 937 7139 -1492 -5431 6091 6386 -6750 -3772
2095 -3772 8050 1422 -8927 -1052 6466 -2267 -6765 1854 4893 -2816 -4582 3670 4296 -3469 -2575
$$ packed form
1994C539r607K561R016l763q945N398Q545o893p215R383N569j1541k147J2516
2008F416k066j2336N709R524r374n631J0969J614j0697J973R768m192q150N930
2022e43O330o269n329O774M009p629k402Q540J99q872L415Q456o766o032R412
2037C293K136j1123K278J0576o512r043R503O182j0727l736J1406J900j0448j3
2051d328J0324j404r964L184R557n898q578P882O309j0034l375J1100o73j0314
2065f212N249Q287q096m665R632J229r328J273P590l045o043L817M001m837k724
2080c872N314J990o461J87P492k218p333N838O202q631l939J1522K95j3136K978
2095c772J1822o628j0349P875P518q733m498Q619L039p709j766Q252O26p765Q94
$$ plain form
2110 -2575 4704 1566 -4770 982 4765 -2849 -3795 5074 1976 -6219 -113 5548 -2716 -6036 2558
2125 2558 2885 -5209 -2583 3928 537 -4604 -188 4075 -441 -4149 1416 3792 -3090 -3898 4196
2140 4196 2761 -5512 -905 7411 51 -6253 2620 5627 -4186 -5388 2726 848 -5788 -2769 2001
2155 2001 -1069 -2898 555 2672 313 45 2699 2228 -917 442 3221 -963 -3898 2256 3703
2170 3703 -4055 -3306 4814 1518 -5772 -397 4622 -2428 -4788 2430 3092 -2740 -1699 3734 2439
2185 2439 -1186 527 3763 1156 -2152 1063 3358 -2355 -4160 2790 3155 -4737 -2433 5429 1175
2200 1175 -4798 1239 4878 -1665 -3015 2660 2028 -2229 -840 1871 544 -660 944 1843 -191
2215 -191 -680 1626 1715 -2675 -1641 3287 662 -4065 703 4298 -2329 -3458 3351 2115 -4201 -1439
$$ packed form
2110b575P279l138o336N752L783p614r46Q869l098q195O106N661q264l320Q594
2125B558L27q094K626O511l391n141M416M263m516l708N565K376o882q08Q094
2140D196j435q273M607Q316p360o304Q873L007r813j202Q114j878o636L019M770
2155B001l070j829L453K117k359k68K654m71l145J359K779m184k935O154J447
2170C703p758P49Q120l296p290N375N019p050k360P218O62n832J041N433j295
2185B439l625J713L236k607l308L215K295n713j805O950L65p892K304P862m254
2200A175n973O037L639o543j350N675o32m257J389K711j327j204J604Q99k034
2215a91m89K306Q9m390J034M928k625m727M768L595o627j129O809j236o316K762
$$ plain form
2231 -1439 3120 -496 -2900 876 1840 -1141 -56 2373 835 -1512 -45 2299 -599 -3765 -465
2246 -465 2524 -2613 -4688 2080 2722 -4125 -2078 4742 922 -4089 851 3405 -1899 -2370 1611 92
2262 92 -2383 -160 1728 -846 -2186 799 2080 -1333 -2745 1648 2451 -2728 -2563 3392 1095 -4656
2278 -4656 -614 3941 -1209 -3722 1988 2252 -2015 -678 1552 -719 -1182 1186 409 -1394 57 1454
2294 1454 -147 -1368 315 1915 418 -1747 1162 3269 -1212 -2704 2564 1887 -3765 -1394 3464
2309 3464 -261 -3091 1632 2323 -2222 -617 3447 1174 -1873 553 2757 453 -1649 118 2400
2324 2400 162 -2332 866 2766 -1320 -3032 2175 2181 -2429 -904 2456 281 -850 1517 757 -389
2340 -389 1269 1302 -977 -355 711 -839 -1541 -635 76 -123 -476 66 1884 1584 -1080 -68 2524 350
$$ packed form
2231a439M559l616k404L776R64k981J085K429j538k347J467K344k898l166L300
2246d65K989n137k075O768O42o847K047O820l820n011M940K554n304m71L981j519
2262I2k475K223J888k574j340K985J281l413j412M393Q03n179J65N955k297n751
2278d656M042M555n150k513N710K64m267J337K230k271m63K368p77j803J451J397
2294A454j601j221J683J600j497k165K909K107m481j492N268o77n652K371M858
2309C464l725k830M723O91m545J605M064k273l047K426K204k304k102J767K282
2324B400k238k494L198J900m086j712N207Om610J525L360k175j131K367p60j146
2340c89J658L3k279O22J066j550p02R06P11j99l53N42J818l00k664J012K592k174
$$ plain form
2358 350 -2429 475 1412 -2277 -1417 1693 -314 -1967 984 1658 -991 -887 466 -397 -1432 -1327 -810
2375 -810 52 -986 -1237 1380 2060 -1103 -545 2643 270 -2375 143 592 -2522 -1527 974 -1037 -1529
2392 -1529 1506 1754 -685 -214 1215 23 -1819 -2202 -885 -695 -2878 -2377 1510 1127 -2233 671
2408 671 4463 872 -1275 2709 2423 -1660 -506 1817 -1052 -2248 550 235 -2128 -1108 -105 -760
2424 -760 -1584 -697 794 468 -983 618 3474 1665 -615 2479 3441 -712 -381 2189 -890 -3180
2440 -3180 427 643 -3164 -1142 2838 240 -1856 1529 3028 -28 -906 1394 2027 -1124 -2093 649
2456 649 1944 -1502 -1977 2328 1908 -1511 519 3059 -843 -1405 2161 595 -2680 387 1869 -1923
2472 -1923 -1421 2197 599 -2413 -21 2125 35 -1921 -601 1766 501 -1671 192 2365 69
$$ packed form
2358C50k779K904R37l689Q60L110k007j653K951O74k649J04J353q63j035J05N17
2375h10Q62j038k51K617O80l163N58L188k373k645K518M49l114R95K501k011m92
2392a529L035K48k439M71J429j192j842l83J317J90k183N01L887l83l360K904
2408F71L792l591k147L984k86m083J154K323k869j196K798l15k363J020J003o55
2424g60q24Q87J491l26j451J601K856j809k280L094R62m153L31K570l079k290
2440c180L607K16l807K022L980k598k096L385J499l056q78K300O33l151r69K742
2456F49J295l446m75M305m20l419K030K540l902n62L566j566l275L067J482l792
2472a923N02L618j598l012K392K146k090j956J320K367j265k172J863K173k296
$$ plain form
2487 69 -1339 2096 1569 -2273 -686 2097 -1996 -3316 1023 451 -3517 -970 2162 -805 -2111 1360
2503 1360 2079 -149 -376 1118 1378 -66 -1144 -161 587 -1520 -2056 236 -515 -2143 -394 609 -1171
2520 -1171 18 1986 -234 -1019 2210 1449 -2202 -402 1799 -1036 -2549 2 -358 -1555 -772 179
2536 179 -128 -159 399 899 1084 -253 41 1712 498 -1236 864 1381 -1813 -1300 1873 -539 -3246
2553 -3246 181 1619 -1157 -842 1838 780 -169 1083 1210 366 504 365 204 238 -285 -570 575 26
2571 26 -138 1703 1037 -1060 1106 2675 -973 -1801 1489 729 -2357 -415 1501 -723 -828 1245 1315
2588 1315 98 593 778 589 508 -552 -469 124 -458 -421 858 444 -576 1507 1612 -1293 -76 1546
2606 1546 -1221 -2421 845 175 -3003 -559 2163 -362 -1142 1843 1935 -655 -379 1019 321 -1541
$$ packed form
2487F9j408L435n27l842J587K783m093j320M339n72l968K547L132k967j306L471
2503A360P19k228k27J494K60j444j078R83P48k107n36K292p51j628J749J003j780
2520a171J189J968k220p85L229p61l651J800K201k835j513K551l60j197P83R51
2536A79l07l1N58N00J85j337K94J671j214j734K100N17l194N13L173k412k707
2553c246L427J438k776L15K680j058r49J252J27q44J38j39j61L4n23k85J145n49
2571B6j64J841o66k097K166J569l648q28L290p60l086J942J916k224j05K073P0
2588A315j217M95J85j89q1j060Q3N93n82L7J279m14j020K083J05k905J217J622
2606A546k767j200L266o70l178K444K722k525p80K985R2k590K76J398o98j862
$$ plain form
2622 -1541 -1874 485 779 -2245 -1406 2008 676 -2588 349 2873 -1500 -2257 1861 557 -2885 -388
2638 -388 1916 -559 -977 1283 855 -805 -404 94 -511 -1457 -1111 -134 -461 -1659 -173 1889 -342
2655 -342 -864 2252 1548 -2239 46 2747 -1850 -3302 1794 1512 -2929 -767 3168 532 -2272 631
2671 631 2120 -807 -2394 320 1631 -1013 -2249 1411 2698 -701 -724 3286 1788 -2223 586 2688
2687 2688 -1967 -2756 1414 223 -2562 246 1968 -558 -180 2507 1239 -751 817 1818 118
2702 118 -1490 45 1145 -924 -2129 1143 2519 -1739 -1871 3475 2155 -3530 -444 4103 -534
2717 -534 -3251 1829 2684 -2378 -1708 1957 670 -2125 -683 1280 534 -1083 -5 1316 -47 -1024
2733 -1024 1032 1849 -1402 -730 2318 64 -2837 349 1628 -2711 -1795 2494 -158 -3331 501 2347
$$ packed form
2622a541l33K359K94l024Q39L414j332l264K937K524m373p57M118j304l442K497
2638c88K304k475m18K260m28j660M01M98o05r46L46R77l27j198J486K062k231
2655c42n22L116p04l787K285K701m597j452N096k82m441K162L935k636k804K903
2671F31J489k927j587K714J311k644j236L660J287l399k3M010j498m011K809K102
2687B688m655p89M170j191k785K808J722k526L78K687j268j990J568J001j700
2702A18j608J535J100k069j205L272J376m258j32N346j320n685L086M547m637
2717e34k717N080Q55n062O70L665j287k795J442J963p46j617J078J321j363r77
2733a024K056Q17l251O72L048k254k901L186J279m339R16M289k652l173L832J846
$$ plain form
2749 2347 -1651 -1800 1888 1572 -1199 -1005 1658 938 -2054 -1617 1834 739 -3278 -1196 2337 -1020
2765 -1020 -3566 1091 2177 -1926 -977 2539 556 -1885 908 1368 -1125 -533 471 -1030 -1371 23
2781 23 -72 -1576 -1234 711 1271 -809 -1482 2157 2259 -2007 -934 3703 1047 -3075 865 3588 -1954
2798 -1954 -3203 1322 800 -3124 -1518 1186 -250 -1391 401 1815 800 -95 1349 2430 140
2813 140 -1152 1251 1155 -2103 -885 1910 -480 -1994 1896 2044 -1604 -146 2460 47 -1676 1062
2829 1062 738 -1783 -733 1339 -107 -1466 306 1923 952 -988 396 2560 243 -1968 1429
2844 1429 2714 -1947 -1692 3058 1055 -3032 -92 2238 -1189 -2467 882 186 -2113 -569 1034
2859 1034 203 -822 853 1649 994 -350 458 1604 -375 -1710 993 726 -2534 -1419 1608 -574
$$ packed form
2749B347l998j49L688l16k771J94K663p20k992M37L451j095m017K082L533l357
2765a020k546M657J086m103R49L516j983k441K793M60k493N92J004j501l41J394
2781B3r5j504L42J945N60k080o73L639J02m266J073M637k656m122L940K723n542
2798a954j249M525n22l924J606K704j436j141J792J414j015q95J444J081k290
2813A40j292K403r6l258J218K795k390j514L890J48l648J458K606k413j723K738
2829A062l24k521J050K072j446j359J772J617r71j940J384K164k317k211L397
2844A429J285m661K55M750k003m087K940K330l427j278L349o96k299J544J603
2859A034q31j025J675P96o55j344Q08J146j979j335K703k67l260J115L027k182
$$ plain form
2875 -574 -2663 513 871 -2164 -698 1407 -788 -1727 904 1011 -1025 -192 1327 991 -255 -60 869
2892 869 611 -1529 -1515 495 -665 -2691 -544 1354 -1045 -1294 1808 1115 -853 531 1452 -1165 -1046
2909 -1046 735 -667 -1732 -107 233 -736 35 785 904 774 202 937 1354 -674 -1577 629 324 -2405
2927 -2405 -1252 1945 -475 -1839 1542 2157 -995 -330 2024 1017 -539 31 829 662 -487 -1308
2943 -1308 251 979 -849 -1171 1396 1045 -1132 135 1720 81 -193 725 81 16 1030 -263 -1099
2960 -1099 893 730 -1212 -209 1184 -83 -316 744 574 260 -76 -541 331 1069 -803 -1157 988
2977 988 427 -1180 427 1276 -676 -316 1668 359 -1290 275 788 -908 -665 -65 -160 -469 -478 -78
2995 -78 657 -51 -1175 272 1704 -568 -1262 1096 558 -1510 -293 459 -990 -690 654 -439 -940
$$ packed form
2875e74k089L176L58l035J466K105k195r39K631J07k036Q33J519l36j246J95R29
2892H69k58k140J4K010j160k026K147J898k399k49L102o93j968J384R21k617J19
2909a046J781j402j065J625L40r69P71P50J19j30n72P35M17k028r03K206l05k729
2927b405J153L197k420j364L381O15l152O65K354j007j556N70P98j67j149q21
2943a308J559P28j828l22K567l51k177J267J585j639k74R18o44o5J014j293q36
2960a099J992j63j942J003J393j267k33J060j70l14l36m65Q72P38j872l54K145
2977I88n61j607J607Q49j952L60J984j309j649J565N13j696K43O00r5l09rM00
2995g8P35p08j124J447J432k272o94K358n38k068J217P52j449L00J344j093n01
$$ plain form
3012 -940 571 559 -617 205 661 -77 -188 -360 -268 163 -463 -1867 -169 780 -1340 -1197 863 343 -820
3031 -820 684 711 -730 543 958 -1128 -616 1130 27 -1401 677 1467 -368 -789 586 1039 106
3048 106 -1259 -724 1118 -123 -2478 -401 1782 -562 -1581 1142 1557 -242 520 1068 111 570 895
3065 895 -530 -335 1139 102 -1244 190 634 -316 -535 -262 88 733 -191 -920 805 1027 -855 191
3083 191 1819 129 -1020 1221 1126 -873 247 1060 -407 -315 1296 208 -692 119 292 65 -234 -815
3101 -815 -539 592 -440 -1442 266 938 -645 190 1655 522 -16 1025 342 -264 877 -86 -1640
3118 -1640 -170 553 -1399 -1670 178 168 -625 -775 -546 285 439 -678 -384 1489 115 -1803 -29
3135 -29 1493 -850 -1272 798 271 -791 61 -63 -673 291 -219 -1137 -392 284 -905 -905 70 20 -550 123
$$ packed form
3012i40J511j2j176Q22M56p38j11j72R2M31o26j404J698R49k120J43K060n20j163
3031h20J504K7j441J273M15k086N12J746j103j428K078P90j835m21J375M53r33
3048A06j365N35J842j241k355K077K183k344j019K723M15j799P62N48r57M59L25
3065H95j425J95J474j037j346J434M44r50k19K73L50O45r24p29J725K22j882J046
3083A91J628j690j149K241r5j999J120Q13j467R2J611j088r00Q11J73k27k99n81
3101h15K76J131j032j002J708O72j583Q35J465j133n38J041o83o06J141r63j554
3118a640J470P23j952k71J848j0p93j50K29Q31J54j117K94J873j374j918J774
3135b9J522k343m22K070n27j062Q52j24o10R64n10r18P45O76j189%R75n0n70O73
$$ plain form
3155 123 -111 118 855 45 -391 1196 698 -1014 -58 1140 -1028 -1332 646 -222 -1643 230 679 -673
3173 -673 -320 815 295 182 469 -195 412 852 -288 -228 838 92 -856 794 709 -568 -30 536 -21
3192 -21 -6 413 -758 -327 899 -161 -765 858 531 -684 344 1226 -167 -90 976 403 -9 400
3210 400 204 -79 305 -90 -686 567 136 -646 438 1066 -529 -288 1305 279 -412 100 -22 -376
3228 -376 511 55 -1096 615 798 -1200 -439 1311 75 -1070 537 994 -347 -497 -127 6 470
3245 470 -391 -1001 251 724 -820 -377 500 -100 -763 382 -124 -755 374 68 -1067 -76 838 -882
3263 -882 -977 604 200 -745 139 487 -138 256 480 -412 245 144 -372 -211 -313 -988 -139 319 -1270 -867
3283 -867 1456 77 -1944 519 1943 -766 -1368 1190 1031 -813 -768 298 724 155 -735 -162 1131
$$ packed form
3155A23k34K29P37q10m36J587m98j712R56J198k168l04J978q68j421J873M49j352
3173f73L53J135n20j13K87o64O07M40j140O0J066p46r48J650q5j277N38N66n57
3192b1J5M19j171M31J226j060o04J623l27j215J028Q82j393P7J066n73m12M09
3210D00j96k83L84l95n96J253m31p82J084O28j595K41J593j026o91N12j22l54
3228c76Q87m56j151J711J83j998P61J750j236j145J607M57j341j50L70J33M64
3245D70q61o10J252M73j544M43Q77o00o63J145n06o31J129l06j135R91R14j720
3263h82r5J581m04r45Q84L48o25L94K24q92O57j01n16J61j02o75Q49M58j589M03
3283h67K323j379k021K463J424k709o02K558j59j844M5J066M26n69q90N73J293
$$ plain form
3300 1131 382 -1250 160 913 -676 -748 432 -88 -142 234 -180 -37 1444 457 -1218 938 1609 -548
3318 -548 -1018 1098 264 -1044 175 784 -184 -348 174 488 420 -560 -323 919 335 -1175 474 1619
3336 1619 -886 -682 1794 934 -1562 65 1470 -211 -1154 -150 220 115 -255 -320 505 925 -118
3353 -118 -281 1108 766 -734 -128 273 -172 87 -150 -1077 88 1340 -755 -1127 1361 995 -1679 -426
3371 -426 997 -630 -1312 -23 343 -211 -467 -290 330 584 -540 -339 939 -232 -917 538 596 -1215
3389 -1215 -203 1115 -845 -949 703 203 -1153 -300 379 -1085 -894 156 -149 -272 252 313 227 478
3407 478 -11 452 366 -744 -572 807 -383 -1731 207 928 -1170 -1156 1424 473 -1137 353 913 -160
3425 -160 -110 438 128 373 436 -91 124 613 130 -215 145 -97 73 225 -752 -447 1113 290 -1310 658
$$ packed form
3300A131p49j632J410P53j589p2J180n20n4L76m14J43J481r87j675K156O71k157
3318e48m70K116q34j308J219O09r68j64N22L14o8r80K37J242n84j510J649J145
3336A619k505K04K476q60k496J627J405j681r43J004L70j05l70o5Q25M20j043
3353a18j63J389l42j500O06M01m45K59k37r27J165J252k095l72K488l66k674J253
3371d26J423j627o82J289L66n54k56J77O20K54j124K01J278j171o85J455N8j811
3389a215J012J318j960j04J652n00j356Q53O79j464J91J050l05j23N24O1q6K51
3407D78m89M63q6j110J72J379j190j348J938P21k098J4K580r51j610J490N60j073
3425a60N0N48l10K45O3n27K15M89m83l45L60k42J70J52r77L05J560q23j600J968
$$ plain form
3445 658 1867 -457 -766 1835 957 -1260 25 1337 -301 -902 232 214 -111 -284 200 682 51 -304
3463 -304 816 1215 -557 -351 1385 338 -1608 75 1085 -1096 -909 914 121 -1147 283 664
3479 664 -237 587 548 -410 -47 635 -2 -482 -268 -7 214 -30 -805 74 1044 -441 -836 1054 581 -1480
3499 -1480 -123 1133 -801 -1089 848 239 -847 168 155 -814 -544 -3 -556 -695 -435 129 577 240
3517 240 -106 922 1143 -365 -175 1352 -159 -2014 -191 188 -1817 -1682 36 -470 -849 170 535
3534 535 5 793 803 253 521 423 -303 4 226 -269 -71 180 -375 -60 513 -641 -591 636 22 -1324
3554 -1324 -67 742 -251 -101 1007 449 -296 931 888 96 -3 42 -226 298 -251 -700 154 517 -493
3573 -493 400 1319 -2 -571 1074 421 -794 -155 317 -595 -204 871 16 126 791 660 259 535 175
$$ packed form
3445F58J209k324l09K601q78k217J285J312j638o01J134j8l25j73M84M82o31l55
3463c04J120L99j772K06J736j047j946J683J010k181J87J823p93j268J430L81
3479F64r01Q24l9r58L63O82o37m80K14K61K21k44p75Q79R70j485l95J890m73k061
3499a480J357J256j934k88J937o09j086J015j3r69K70N41n53j39K60N64M48l37
3517B40l46J028K21j508J90J527j511j855J823L79k005J35J718n06l79J019L65
3534E35n30P88J0n50K68r8p26L07K22m95J98K51n55L15N73j154N0J227o14j346
3554a324J257Q09r93J50J108n58p45J227m3p92r9M5k68N24n49m49Q54L63j010
3573d93Q93R19j321n69J645o53j215O39M72r12L91J075q55J10O65j31m01K76l60
$$ plain form
3592 175 -37 888 150 -865 334 384 -759 -110 841 -282 -674 455 -152 -949 -318 62 -684 17 479
3611 479 -3 612 895 360 248 671 -296 -417 26 -752 -1042 -313 -150 -1134 77 687 -153 109 787 -138
3631 -138 -441 480 -250 -1008 100 341 -1044 -450 582 -183 -375 41 -254 174 58 -594 -341 435 -287
3650 -287 -879 441 444 -639 15 585 -253 -391 473 -8 -728 154 19 -772 177 227 -267 -180 250 -76 225
3671 225 406 -448 29 949 -229 -750 586 727 -787 -127 666 303 -150 401 22 97 482 -314 -276 684
3691 684 185 -597 352 667 -348 51 465 -8 103 285 -534 -281 1002 56 -1015 353 1006 -155
3709 -155 -238 953 438 100 515 379 368 223 -502 -162 393 -404 -956 44 198 -739 240 769 -212 -327
3729 -327 1152 561 -631 -24 132 -537 -164 -29 -391 43 304 -168 33 643 19 -364 314 131 -648
$$ packed form
3592A75k12R25p38j015J199N0j143O49R51j123l92J129o07p97O31L80p46P01M62
3611D79m82O15K83n35j12M23r67j21M43p78k90P29J63r84J211O10q40K62O78r25
3631a38l03R21p30p58J108K41j385N94J032p65j92M16k95M28j16o52K53P76p22
3650b87n92J320Lj083O54N70q38j38Q64m81p20Q82j35p91R49N0m94Q7M30l26L01
3671B25J81q54M77R20j178n21J336J41j514O60P93l63m53N51l79P5L85p96L8R60
3691F84m99p82R49L15j015L99M14m73J11J82q19K53J283r46j071J368O53j161
3709a55q3J191n15l38M15j36j1j45p25L40N55p97n52J000J54r37R79N29r81j15
3729c27J479n91j192O07J56o69L73J35l62M34K61m72K01O10o24l83O78j83p79
$$ plain form
3748 -648 -257 -82 -42 90 -273 -669 631 1034 -1010 -726 1041 -60 -1776 -160 1080 -511 -749 804
3766 804 898 123 -1 37 381 -106 -1208 -905 -1 -1034 -1464 -113 -116 -909 -20 870 -9 164 1151 191
3786 191 -243 676 249 -830 -270 226 -127 -12 117 -387 -196 190 -714 -702 17 -216 -601 100 350 -24
3806 -24 857 841 277 1082 840 -21 -118 606 -411 -1349 -13 235 -600 -87 663 428 457 461 239 398 397 -553
3828 -553 -806 356 -123 -597 404 435 -50 964 753 92 751 1379 -170 -403 490 182 -736 -224 176
3847 176 -267 46 -204 -299 321 217 -910 -275 832 -58 -723 637 1345 276 517 869 263 598 293
3866 293 -785 11 140 -1195 -1245 110 -217 -1120 141 584 151 199 470 -215 29 564 -238 -414 171
3885 171 -387 -661 14 -312 -877 -48 203 -547 -122 467 -260 -400 545 98 -181 285 -128 -232 421 -518
$$ packed form
3748f48L91J75M0J32l63l96J300M03k044K84J767j101j716J616J240j591k38J553
3766H04R4p75j24L8L44m87j102L03R04j033m30J351lp93Q89Q90q79J73R87r60
3786A91m34R19m27j079N60M96l53J15J29n04J91L86r04J2P19k33l85P01K50l74
3806b4Q81j6n64Q05k42q61r7P24j017r38J336K48q35N13P50k35K9Mk22J59jr50
3828e53k53J162m79m74J001L1m85J014k11o61O59O28j549k33Q93l08r18N12M00
3847A76m43L13k50r5O20j04j127O35J107q90o65J360P08j069K41L52o06L35l05
3866B93j078P96J29j335n0J355l27r03J261M43m33M8K71o85K44N35q02j76N85
3885A71n58k74O75l26n65Q29K51p50M25N89p27j40R45m47k79M66m13j04O53r39
$$ plain form
3905 -518 -1059 227 443 -1071 -926 914 304 -883 39 877 239 -49 -175 30 600 -13 -1012 236
3923 236 688 -599 -897 558 194 -404 131 291 -221 494 431 -464 -89 821 -546 -178 864 221 -661
3942 -661 479 532 -329 -47 201 -152 272 523 6 342 573 -263 76 489 -187 -460 787 403 -911
3961 -911 -11 828 -103 -310 416 268 -343 -21 -39 78 492 -134 -304 788 661 -413 24 380 -211 -140
3981 -140 -70 -396 -292 175 -469 -549 961 327 -628 406 1166 -351 -549 430 192 -936 -465 -13 -169
4000 -169 -365 -251 125 364 -132 -629 515 467 -1009 -737 578 -307 -963 387 492 -474 59 697 -148
4019 -148 -442 36 -562 -442 -156 -582 -757 99 -168 -195 453 282 28 403 312 -538 -77 140 -732 -642 524
4040 524 95 -477 352 527 -499 63 475 -723 -239 391 -280 -661 159 258 -13 343 524 223 570 247
$$ packed form
3905e18n41J286K16j514J45J840o10j187R22Q38o38k88j26K05N70o13r99J248
3923B36M52j287k98J455l64n98N35J60n12P15o3q95L75R10j367L68J042o43q82
3942f61J140N3q61K82K48l53M24K51n17L36K31q36L39M13o76k73J247l84j314
3961i11R00Q39r31k07P26j48o11L22j8J17M14o26j70J092j27j074M37L56n91P1
3981a40P0l26J04M67o44q0J510o34r55J034P60j517j98R79k38j128M71M52j56
4000a69j96J14L76K39m96m97J144m8j476K72J315q85o56J350J05r66N33O38q45
4019a48k94M78n98J20K86m26j75Q56k67k7O48j71k54L75r1q50M61K17q72R0J166
4040E24m29n72Q29J75j026N62M12j198M84O30o71l81Q20R9k71L56J81l01L47l23
$$ plain form
4060 247 -274 334 255 -554 -356 365 -411 -227 650 372 -119 681 675 -481 35 828 -130 -488 222 256 -404
4081 -404 -214 154 684 714 204 11 940 610 -832 100 877 -428 -838 531 114 -480 51 72 -302 303
4101 303 68 -347 341 883 21 -145 561 324 -10 212 -48 -139 226 -254 -526 43 90 -800 -332 407 -388
4122 -388 -161 489 176 -409 638 344 -535 -154 740 -245 -441 38 -290 -129 54 -403 -350 349 -286 -783
4142 -783 244 434 -571 -376 200 -63 -14 360 33 11 607 -399 -862 475 190 -922 -275 552 -277
4161 -277 -404 22 81 -116 290 54 57 571 -41 -321 449 -88 -603 -85 196 -640 -390 549 90 -506 441
4182 441 556 -179 -23 473 14 111 199 -518 -181 207 -519 -407 593 331 -405 290 757 176 97 350 -290
4203 -290 224 310 -680 -485 622 -64 -853 194 610 -345 245 573 215 430 546 -17 200 601 67 -548
$$ packed form
4060B47n21O08p9q09J98P21p76J84Q77k78m91Q00oj156N16P93r58l58P10L4o60
4081d04J90L68N30L0n10j93R29l30j442R32P77j305m10J369m17n94N31K1l74O05
4101C03k35m15O88N42q62j66P06k37l34K22k60r1L65m80k72N69M7q90M68P39p95
4122c88K27O50l13n85J047k94q79L81Q94r85j96M79l28J61J83m57N3O99o35m97
4142g83J027J90j005J95N76k63M9L74l27k2N96j006m63J337k85j112O47Q27q29
4161b77j27M26N9j97M06k36LN14o12k80P70n37n15N18K81q36K50R39m59n96R47
4182D41J15p35J56M96m59R7Q8p17L37L88p26J12J000k62p36O95M67n81p9K53o40
4203b90N14Q6r90J95J107o86p89J047M16r55N90L28l58K15J16n63K17M01n34o15
$$ plain form
4223 -548 79 316 -367 -172 -78 -292 -47 24 -602 58 533 -323 -385 953 389 -380 339 374 -237 83 383
4244 383 -529 -218 308 -114 -452 27 29 -305 58 -305 -472 326 -214 -844 -130 555 -544 -198 724 398
4264 398 -313 217 77 -321 293 31 -976 -30 395 -593 -600 309 -146 -284 4 -167 -78 -45 -600 -444 247
4285 247 1 -729 64 585 -478 -297 690 294 -146 275 149 -503 160 453 -771 -421 455 -7 -614
4304 -614 172 213 89 324 109 -212 587 194 -598 270 672 -70 -147 335 -133 -113 458 -493 -215 408 291
4325 291 -706 3 880 -225 -308 631 306 -96 226 260 127 314 -272 -603 416 240 -615 -19 772 -123
4345 -123 81 654 -209 -241 521 -3 -655 227 331 -561 68 534 -115 -230 461 149 -119 524 -74 -406
4365 -406 123 -74 -427 22 -100 -384 41 177 -413 -102 447 -233 -403 760 216 -704 -262 217 -709 -448
$$ packed form
4223e48O27K37o83J95R4k14K45P1o26O60M75q56o2J338n64p69P19L5o11L20L00
4244C83r12L11N26m22l38M79Kl34L63l63j67P98n40o30P14O85j099L46R22l26
4264C98p11N30j40l98O14k62j007R46M25r88pR09m55j38K88j71Q9L3n55J56O91
4285B47k46p30P93N21j063J81R87l96m40M21j26o52O63K93j224L50Q76m62o07
4304f14P86M1j24K35k15l21P99l93p92Q68M02p42p7M82m68K0N71r51K78O23j17
4325B91r97P09Q77j105q3R39l25m02L22L4j33J87n86l31J019j76q55N96P91q95
4345a23K04N73q63l2P62n24o52Q82J04q92O29M66o49j15O91l12k68O43n98l32
4365d06N29j97l53M49j22k84M25J36n90L11N49o80j70J163n44r20M42M79r26K61
$$ plain form
4385 -448 28 -217 52 17 -423 -102 580 -189 -427 340 32 -624 -56 396 -385 -416 306 -276 -365 246 -118
4406 -118 -187 512 151 -413 369 392 -552 -249 223 -191 -542 288 65 -146 223 8 -51 240 99 -406 38
4427 38 248 -721 -375 271 -454 -521 234 143 -165 412 504 -240 193 499 -234 -84 360 -112 -95 326 -281 -140
4449 -140 400 -261 -542 353 350 -246 -111 593 -46 -314 251 37 194 528 83 -228 733 354 -468 181 594
4470 594 -259 -287 415 -127 -385 428 124 -429 222 303 -225 -11 228 -216 362 248 67 303 693 -199 -359
4491 -359 860 310 -863 -173 469 -239 -710 -38 -162 -125 -17 -571 -98 625 -128 -870 511 457 -758
4510 -758 -189 758 354 -302 -21 -20 -1 406 -326 -350 341 -84 -767 -115 14 -918 -605 88 -482 -475 349 170
4532 170 -252 471 585 -202 138 240 13 324 -86 -707 42 220 -730 -588 557 139 -916 -85 545
$$ packed form
4385d48M76k45K69l5m40L21O82p69k38P67l08o56N68M52p81l1P22n82q9O11l64
4406a18o9O99l61n64P82K3r44L03M72m14l51Q30k23k11L69k15n9K91j41n05M44
4427C8K10r69L46O46p25o7P55r1l08N77R2p44M33L06p33J50M44m72J7M21o07J41
4449a40N40o61k81Q95ln96J35P04o39k68N65k14J57L34m45l11R61l79q22O49M13
4470E94q53k8P02n42k58Q13l04n53O51Q1n28K14K39m44N78j14j81K36L90q92j60
4491c59J219n50j173O90O42p08m71O72j24L7J08n54M73P23p53p42J381n4j215
4510g58N69R47m04o56K81JJ9M07p32k4O91m25o83O52J29r32L13O93n70PQ24j79
4532A70m22P23J14p87L40J02k27L11m10o21P49J78r50J42J145m18j055Q31O30
$$ plain form
4551 545 -212 -220 58 -66 4 112 -267 44 594 29 -492 464 480 -231 -274 226 -218 27 -111 -251 -96 516
4573 516 -182 -493 426 183 -593 124 493 -215 -152 577 -38 25 470 102 38 432 290 -94 174 38 -318
4594 -318 21 57 -514 106 392 -198 -358 404 285 -261 258 143 -106 189 279 -395 95 593 -403 -489 563
4615 563 235 -570 -89 188 -326 -294 -112 -188 178 -103 -565 179 518 -246 -399 571 -63 -343 75 89 -536
4636 -536 -191 164 -250 -198 370 -195 -280 259 137 -2 359 136 -206 29 254 -567 -163 371 -466 -479 249
4657 249 -108 -624 284 261 -285 127 200 -234 37 379 -218 -97 276 -227 -173 103 244 -252 424 258 -129
4678 -129 -54 -129 -167 -111 49 -412 50 352 -23 -162 386 334 -219 85 424 -38 -218 477 -214 -201 297 -45
4700 -45 -115 468 254 -134 384 229 -265 175 230 -170 -51 290 -211 -95 526 153 -262 238 76 -385 -138
$$ packed form
4551E45p57qK78j24P0J08l79L11N50n65n21R56J6p11m3N00m44K45j38j40J55O12
4573E16o98l11R19k43p76P17L69p08O3P29o15O3M45l68o4L94j42l84K68j36l56
4594c18L39L6n71O20K86n90j60P62j19n46N19j15k49K95R0o74M90M98r96q6J052
4615E63l28q05M81K77n14L2J82p6L66k81m62P44L39p64j53R70o34k80M18J4o25
4636e36L45L55m14N2N68n65q5N39j22j39L61k23l42K35K25q21M04N34q37j3P28
4657B49l57n16R08k3n46M12P3m34K71L42n97J21L73n03N4K76J41m96O76j66l87
4678a29P5p5l8N6J60m61M62L02l75j39N48n2n53L04L39m62j80O95o91J3M98l42
4700d5p0N83k14l88N18j55m94M40N5m00J19L41n01J16O21l73m15N00j62m61K47
$$ plain form
4721 -138 355 -194 -208 337 74 -74 381 232 -231 32 154 -243 37 -51 -618 24 400 -309 -119 592 154
4742 154 -74 150 112 -383 -26 -221 -542 -228 135 -314 -164 673 133 -189 215 361 -242 100 -110 -451
4762 -451 1 17 -586 127 420 -49 -345 427 -68 -476 -351 -81 -362 -119 -228 -586 131 542 -220 -50
4782 -50 694 154 -255 241 21 -306 -257 -160 -254 -352 -255 -485 190 368 -468 -369 411 347 -473 165 547 -257 -14
4805 -14 353 -105 6 192 -111 -226 37 -227 -401 259 -16 -299 242 457 59 20 476 169 -5 211 -127
4826 -127 -233 105 -263 -542 349 332 -425 220 654 289 -70 695 259 -218 157 69 -131 73 -117 -352 35
4847 35 335 -316 -74 438 93 -306 527 218 43 269 80 -261 229 197 -517 137 155 -494 -371 -19 49
4868 49 -353 220 153 -68 -158 165 -43 201 19 -380 218 356 -392 -242 375 -98 -506 66 -71 -550 -31
$$ packed form
4721a38M93n49j4N45k63j48M55j49m63K63J22l97K80q8n67O42L76p09J90P11m38
4742A54k28K24l8m95L57j95l21L14L63m49J50Q37n40l22M04J46o03L42k10l41
4762d51M52J6o03P13K93m69k96P72m95m08J25K70k81K43j09l58P17M11p62J70
4782e0P44n40m09M96k20l27M9R7r4r8R7k30O75J78q36R9P80o4q20O38L82q04K43
4805a4L67m58J11J86l03j15K63k64j74O60k75k83N41K15l98l9M56l07j74K16l38
4826a27j06L38l68k79Q91j7p57O45M34l65l59P65m36m77L75q8k00K04j90k35L87
4847C5L00o51K42N12l45l99Q33l09j75K26j89l41M90l2p14O54J8o49J23L52O8
4868D9m02N73o7k21r0L23k08K44j82l99N98J38p48J50O17m73m08N72j37m79N19
$$ plain form
4889 -31 27 -129 -121 293 141 12 526 95 -216 134 -143 -513 -212 -275 -380 -323 -145 -255 -260 375 -53 -87 462
4912 462 227 -47 481 116 -602 67 247 -156 -373 150 265 -171 48 -160 -233 135 -103 -433 68 324
4932 324 -59 177 449 52 -62 155 -18 -252 128 -18 -384 97 329 -211 144 753 216 -185 514 311
4952 311 -168 -270 -172 -301 140 -382 -455 153 148 -80 570 650 -17 -27 546 113 -504 278 269 -302 -109 295 -148
4975 -148 83 275 -21 -159 -188 -234 -349 304 -104 -546 41 298 28 366 430 -30 459 341 -350 -404 174
4996 174 -307 -737 27 200 -389 -67 462 -121 -214 139 -17 -270 -71 -265 -321 167 -119 -345 88 266 -163
5017 -163 133 297 -402 -388 124 -410 -552 67 -58 -279 81 70 -62 154 45 -279 -155 9 -203 -416 61
5038 61 93 -211 15 40 43 140 93 -201 41 302 -411 -386 172 -159 -536 70 160 -102 98 197 7 145 236 -194
$$ packed form
4889c1N8j56QM14j52j29N14m31l11L50k77l70L01o3j05N7J78j10nO35m28l4N49
4912D62k35k74N28l65p18O69J80m03k17N23J15m36K19k08p3L68k38l30N01K56
4932C24l83K36K72l97j14K17j73k34L80j46l66M81K32n40L55O09n37m01O99k03
4952C11m79j02R8j29M41n22p3O08nk28O50Q0o67j0N73m33o17P82rn71J93M04m43
4975a48K31J92k96j38k9m6j15O53m08m42N87K57k70L38O4m60M89j18o91n4N78
4996A74m81m30P64J73n89L22N29n83r3L53j56k53J99j94n6M88k86k26M33J78m29
5017a63K96J64o99J4N12n34j42O19j25k21L60j1j32K16j09l24J24J64k12k13M77
5038F1L2l04K26K5LR7m7k94K42K61p13K5N58l31l77O06R0k62K00R9j90J38R1m30
$$ plain form
5062 -194 -177 127 96 -108 291 -13 -262 396 170 -312 203 264 -243 -190 277 34 -249 68 231 87 280
5083 280 83 -131 546 309 -328 4 565 -73 -87 209 -15 -164 69 251 -44 198 4 -152 64 378
5103 378 10 -226 377 136 -79 5 -16 -323 92 117 -194 119 117 -196 -136 315 65 -92 58 156 32 237
5125 237 -52 -44 81 174 -195 -185 108 -171 -135 100 -32 -299 230 191 -126 213 422 -47 105 449 -98 -143
5147 -143 -122 -386 -489 -106 -465 -707 -171 272 -260 -213 414 82 138 350 -67 191 287 -247 -386 215 161 -489
5169 -489 95 522 -124 -224 131 -69 -207 44 -223 -127 239 -12 -321 262 303 -35 -11 364 -204 -70 52
5190 52 -328 -44 312 11 -301 333 443 7 142 570 -201 -391 380 -170 -327 -14 -26 73 164 111 141 373
5212 373 171 107 396 300 -39 -7 665 -51 -287 -18 357 -176 -65 37 -170 142 57 -324 -244 355 180 -153
$$ packed form
5062a94J7L04l1k04L99l04k49O58k26m82N15O1n07N3M67k43k83L17J63j44J93
5083B80j97k14O77k37o37L32N61o38j4K96k24j49K33J82k95K42j94j56K16L14
5103C78l68k36O03k41k15Q4k1l07M15K5l11L13kl13O0M51k50j57J50R8j24K05
5125B37k89QJ25R3l69J0K93k79L6K35j32k67N29l9l17L39K09m69J52L44n47m5
5147a43K1k64j03L83l59k42N36M43n32M7O27l32N6K12m17K58R6n34j39O01n4o50
5169d89N84M27o46j00L55k00j38K51k67R6L66k51l09N83M1l38K4L75n68J34J22
5190E2l80K84L56l01l12O34J10m36J35M28p71j90P71n50j57L13j2R9R1n3L0K32
5212C73k02o4K89r6l39L2O72p16k36K69L75n33J11J02k07L12q5l81Q0N99j75l33
$$ plain form
5234 -153 239 367 167 398 471 169 4 160 -227 -265 -81 -501 -573 184 -284 -246 404 -34 -317 219 318 -312
5256 -312 -322 315 126 -550 23 98 -29 -11 -122 137 224 -150 -242 113 46 -442 -303 273 -231 -144 113 -191
5278 -191 -114 129 292 -524 -121 310 -247 -334 301 139 -56 238 239 130 -49 -119 -98 169 -366 -379 24 19 -412
5301 -412 -241 236 -52 -232 317 277 -205 209 396 -170 56 131 -241 -61 168 -90 -25 419 101 -169 287
5322 287 351 -62 -239 231 173 -103 84 -232 236 153 -150 -78 396 169 -468 179 410 -233 -336 90 243
5343 243 -223 -28 -77 96 284 -36 4 233 92 111 119 173 -294 -118 136 -278 -42 350 150 -407 276 352
5365 352 -119 19 7 70 29 82 88 -328 112 -152 -396 -25 33 -143 18 -67 -44 25 -6 -327 -97 279 -114 -537
5389 -537 371 24 -366 70 170 -205 52 -7 -263 -223 153 -123 -131 179 -18 -166 -86 162 -57 137 -187 -166
$$ packed form
5234a53L92J28k00K31P3l02j65J56l87l8J84m20p2P57m68L8O50m38k83N36R9o30
5256c12j0O37j89o76N73P5j27J8j11K59Q7l74r2L55o7m88J39N76n04Q7K57l04
5278a91P7K43J63q16M03M31n57q7O35j62j95K94Jj09j79p0K1K67n35j3M03nm31
5301d12J71M77k88j80N49m0m82M14J87n66K26P5l72J80K29k58O5M44l18k70M56
5322B87O4m13j77M70n8k76J87l16M68q3l03P2M74k27o37O47K31o43j03M26J53
5343B43m66J95m9J73J88l20M0K29j41J9QN4m67J76K54m14K36L92k00n57O83P6
5365C52m71J38j2O3m1N3Om16M40k64k44L71N8j76J61q5K3O9l1l21K30L76l93m23
5389e37R08l47l90M36J00l75K57n9k56M0L76k76qL10j97j48Q0K48k19J94l24K1
$$ plain form
5411 -166 -110 224 -248 -152 463 171 -181 179 330 -176 -244 0 -104 -154 68 -167 -164 217 -93 -97 159 308 -69
5434 -69 217 4 -90 150 38 -216 87 249 -102 -45 276 153 -11 295 163 -165 -131 248 -297 -329 212 162
5456 162 -181 167 215 220 203 164 166 309 58 -229 -17 476 -196 -245 255 -105 -21 83 -112 -14 11 222 65 15
5480 15 360 -76 6 283 0 28 278 -107 -26 300 -50 -120 -140 13 3 -145 120 -28 -73 241 10 -270 142
5503 142 219 -305 -176 221 -70 -33 6 -31 -59 136 -165 50 138 -119 -332 101 30 -480 63 285 -295 -188
5525 -188 337 -173 -204 307 4 -45 261 -101 -309 50 196 -265 -82 34 -129 -105 223 -61 -105 101 -51
5546 -51 -189 182 -63 -305 186 187 -237 -18 311 27 -360 -5 356 -92 -46 162 -55 43 -30 -145 97 208
5568 208 -89 13 344 4 -120 223 222 116 108 257 -152 230 105 -226 101 221 -47 -324 206 167 -43 186
$$ packed form
5411a66N6L34m72R6O15k92l52L60J51n06o8K44j04n0K22k35LL81l10mK56J49l77
5434f9K86k13r4K40j12k54L03J62l51N7L21j23j64L06j32l28L4L79n45l2N41n0
5456A62l43L48M8Nj7l9KJ43k51k87K12M93o72m9N00l60Q4J04j95R8K5K11j57n0
5480A5L45m36Q2K77k83K8K50l85Q1L26l50p0k0J53j0j48K65j48m5L14k31k80M12
5503A42P7n24J29L97k91L7L9l7k8J95l01K15Q8k57k13M33p1n10N43K22n80J07
5525a88N25n10l1N11l03m9L06l62k08L59J46m61J83J16j63K4L28k84m4K06j52
5546e1j38L71k45k42M91Jm24K19L29k84l87L55L61m48M6K08k17R8p3j15K42J11
5568B08k97J02L31l40j24L43jj06qJ49m09L82j25l31L27J20k68k77N30l9k10K29
$$ plain form
5590 186 278 -168 128 157 -49 -32 295 -85 -8 211 16 -143 131 148 -66 167 49 -177 -208 73 -163 -164 125
5613 125 -21 -223 116 210 -173 103 93 -64 -121 77 -157 -134 226 -168 -127 -116 -146 -266 -46 230 -433 -35
5635 -35 295 -105 -350 304 222 -258 -42 26 -108 5 -200 -124 135 38 -408 -144 143 -106 -260 133 110 -206
5657 -206 -12 -27 -144 -148 -16 -296 64 228 -206 -94 262 101 88 174 86 -192 145 -146 -331 -256 -22 40 -96
5680 -96 117 -37 -96 110 -5 -172 371 234 -329 92 148 -172 96 -24 -23 -147 81 111 -305 262 -163 -74
5702 -74 156 -7 -44 241 303 -106 -74 320 35 -62 363 126 -60 18 313 -71 111 34 -34 -105 87 -401 -50
5725 -50 225 -177 -26 177 310 -252 -16 212 -187 163 145 -227 -8 102 -57 -267 45 -12 -176 -21 320
5746 320 -118 -274 73 -111 -57 175 -233 -56 130 -8 -286 113 174 -267 72 250 -88 -162 210 -159 -264
$$ packed form
5590A86R2m46K96K9k06J7L27l80P7K19j95j59K74J7k14K33j18k26l1K81k36jK89
5613A25j46k02L39R4l83K76j0j57n7J98k34K3L60l94M1J1l0j20K20K76o63L98
5635c5L30m00k45O54q2m80K16O8j34J13k05P6K59r7m46K64K87k49j54L93k3l16
5657b06J94j5j17mJ32k80L60J64m34J12L56j61j3Q6q8k78L37k91j85P5K34O2j36
5680i6K13j54n9K06j15j67N43j37n63M21N6l20K68j20Jj24K28L0m16N67m25Q9
5702g4K30j63l7K85O2m09L2L94k85r7M25k37j86P8K95l84J82p7o8p1J92m88L51
5725e0K75m02J51K03J33n62K36K28l99L50j8l72K19J10j59k10L12n7j64J55L41
5746C20m38j56L47j84N4K32m08J77J86j38k78L99O1m41L39J78l38p4L72l69j05
$$ plain form
5767 -264 152 19 -91 -5 -12 -31 55 -262 -369 109 225 103 23 257 -5 -90 -73 -78 -447 96 36 -169 185 202
5791 202 -197 8 210 29 -158 88 -24 -188 -100 122 -131 -36 95 -316 -117 -15 6 20 210 0 -125
5812 -125 -9 -6 -150 247 195 -308 75 204 -227 -351 89 160 -203 2 180 19 -169 -7 -35 195 -24 -324
5834 -324 97 355 -236 -117 570 171 -213 148 322 -129 -71 104 -89 -221 85 -58 -46 284 -153 -148 278
5855 278 219 -193 120 95 -73 -33 129 -254 -21 100 -21 224 225 20 -86 239 36 -401 -161 140 -181 -344
5877 -344 1 -133 -210 -130 -92 -65 17 10 -15 31 98 -146 -59 306 14 -19 34 -141 -179 83 -111 -544 -5 90 -495
5902 -495 -230 -71 -341 -280 275 83 -92 -7 264 -36 55 -44 -401 13 -142 -329 248 191 -359 -40 303 87
5924 87 -396 206 73 -219 -256 160 -187 -44 87 -3 45 58 -103 12 224 103 -162 217 285 22 -94 168
$$ packed form
5767b64M16j33j10Q6pj9Q6l17j07M78J16j22q0K34k62q5J7nl69N43o0k05L54J7
5791B02l99K05K02j81j87K46j12j64Q8K22k53R5J31m11J99J02K1J4J90k10j25
5812a25J16Lj44L97n2n03L83J29m31j24M40P1l63K05J78j61j88J62k8K30k19l00
5834c24M21K58n91J19O87l99l84L61J74m51N8J75j93j32L06j43J2L30m37NM26
5855B78n9m12L13k5j68M0J62l83K33J21j21K45Jk05j06L25k03m37K40L01l21j63
5877c44L45j34p7Q0L8K7Q2pk5M6O7k44Q7L65k92l3N3j75l8K62j94m33N39R5n85
5902d95K65J59k70O1N55j92j75Q5K71l00R1r9l57M14j55j87N77n7n50L19L43k16
5924H7m83O02j33k92l7M16l47J43J31r0M8J3j61J15K12j21k65L79O8k63j16K62
$$ plain form
5946 168 17 71 222 7 77 115 -84 -300 -128 134 -212 -86 326 -30 24 241 140 15 76 137 -52 133
5968 133 43 -82 30 15 -220 29 -4 35 -49 202 -16 84 284 233 -314 139 170 -90 20 5 102 -112 253
5991 253 3 -240 58 68 -220 -184 -149 148 153 197 -54 137 239 4 -159 127 -124 -239 116 -35 -316 -205
6013 -205 355 -53 -82 66 68 -151 102 46 -124 29 24 -209 53 58 -101 22 93 -216 -21 329 -47 67 264
6036 264 26 -51 -58 129 -233 -22 114 -406 -276 103 -40 -397 236 72 -37 -26 207 -145 -31 -159 -59
6057 -59 -15 41 -259 -149 248 -4 -52 13 -10 -283 180 87 -129 47 180 5 -187 -14 51 -21 -100 47 79 -98
6081 -98 106 13 -3 126 -18 123 7 -210 -128 234 -44 -160 90 144 -148 -29 -67 -68 61 141 48 124 87 -113
6105 -113 -76 -98 38 -115 -48 138 -77 69 341 35 11 245 -167 82 210 -140 -222 52 63 -326 -7 174
$$ packed form
5946A68j51N4J51k15P0L8j99k16J72K62l46J26M12l56N4K17j01j25O1O1j89J85
5968A33r0j25J12j5k35K49l3L9q4K51k18J00K00n1n47M53L1k60J10j5R7k14L65
5991B53k50k43K98J0k88L6L5K97NM4k51J91J02k35j63K86k51j15L55j51k81J11
6013b05N60m08k9J48Kk19K53n6j70J53nk33K62Nj59J23P1l09J95L50l76J14J97
6036B64k38p7pJ87l62K11J36n20J30L79j43l57O33j64j09J1K33l52J14j28J00
6057e9M4N6l00J10L97k52m8O5k3k73M63r3k16J76J33j75j92J73O5p2p9J47L2j77
6081i8K04r3j6J29j44J41j16k17Q2L62k78j16K50N4k92J19l8jJ29Q0r3P6l7k00
6105a13L7k2J36j53O7J86k15J46K72l06k4K34m12K49J28l50q2K74J1l89L19J81
$$ plain form
6127 174 -62 -188 77 185 -238 122 213 29 74 -30 -75 14 200 -79 139 283 10 -228 127 -121 -31 -130
6149 -130 -30 -192 -145 161 -49 118 295 134 -187 218 208 -203 -53 -1 -311 -201 -208 -122 189 -28 -65 113
6171 113 104 -36 -154 223 -250 -116 -46 257 -281 -30 262 79 115 41 -112 -57 174 -8 -78 35 17 -58 231
6194 231 -132 -63 86 144 -128 -53 -13 -171 -303 238 -262 -217 267 98 92 15 282 106 125 198 -27 -106 -218 33
6218 33 55 154 -250 -180 46 123 -87 -11 127 -110 -20 260 87 119 246 68 -38 66 42 -47 13 111 -139 -74
6242 -74 142 172 -234 69 114 135 184 88 -29 77 251 -207 -164 236 10 -304 -46 46 -238 -168 185 -76 206
6265 206 116 -102 157 -3 -75 91 264 -48 -73 90 -138 -138 -50 -120 -232 -38 116 -53 27 -58 -78 -42 -146 105
6289 105 2 125 197 -307 -203 247 -102 -238 42 -79 -164 -58 -335 -102 94 4 0 93 -136 -171 120 215 -100
$$ packed form
6127A74k36j26K65J08m23L60R1j84M5j04m5Q9J86k79K18J44k73k38L55k48R0r9
6149a30J00j62M7L06k10J67J77j61l21M05j0m11J50N2l10J10pQ6L11k17l7J78
6171A13rj40j18L77m73J34P0L03n38K51K92j83L6p4j53N5K31j82p0J13j8p5K89
6194B31l63O9J49N8k72P5M0j58j32N41n00M5M84j69op7K67j76J9P3k25p9j12K51
6218C3K2R9m04P0K26P7k10P6J38k37R0K80j73L2J27j78j06J04k4q9O0R8k50O5
6242g4K16L0m06L03M5K1M9r6j17J06J74m58M3M00k26l14K58R2k84P0L53k61K82
6265B06r0k18K59j60p2J66J73l12k5J63k28%Q8p0j12J94J54j69Q0q5k0L6j04K51
6289A05j03J23P2n04J04M50l49j36K80j21q5J06k77K33J96r0mR3k29l5K91R5l15
$$ plain form
6312 -100 -303 39 -37 -44 -137 -136 -77 165 222 -67 185 299 37 -2 199 -155 -79 -10 -193 -262 -98 80 -247 106
6336 106 299 -12 76 84 174 108 17 31 -62 -19 48 41 62 242 90 -11 -31 -210 -25 45 -129 -160 140 -120 -181 81
6362 81 269 89 -67 159 196 -78 -32 -46 -116 -120 -107 51 -23 214 -219 282 360 -6 -5 92 -229 -358 30 -141
6386 -141 -194 -23 33 -172 37 -15 42 225 -27 -177 73 56 -85 -353 -9 8 -34 -19 94 110 102 63 -8 -51 33
6411 33 -200 -189 43 164 -63 134 149 31 181 -44 -182 14 88 -201 -248 163 48 -68 89 98 63 -35 15
6434 15 42 216 -140 -219 8 190 136 -375 -167 89 -154 -38 154 -167 -46 -125 7 64 -148 -6 -37 156
6456 156 111 -100 289 187 -168 42 268 -60 -178 120 103 -60 1 56 7 150 -137 -104 70 84 -77 79
6478 79 -27 150 111 -66 9 123 3 -68 182 206 -114 -172 54 24 -174 -247 221 -74 -153 24 107 -80 -49 102
$$ packed form
6312a00k03L42p6pr3JN9K42N7k89K52J14k62l9K01l54P6O9j83o9J64J78l27L53
6336A06J93l11Q8QR0o6r1J4r3M3O7pK1J80j52j01k0j79J85P0j74l1L00k60o1K62
6362H1J88j80j56K26L7k74M6j4p0mJ3J58p4K37m33N01P8l66JR7l21j29L88j71
6386a41n3J71N6k05K09n2N7J83k52j50K50j7j41k68L44J7m2J5J13J6ql9p1m3Q4
6411C3k33J1K32J21k27J97J5j18J50k25j38J96P4k89m7M11j15j16J57Rl5r8N0
6434A5K7J74l56p9K27J82n4n11K08K56k43J16J92l21J21p9J32N7k12J42l1J93
6456A56m5k11L89j02l55K10K26l28j18K98j7j63O1N5m9J43k87L3J74J4j61J56
6478G9j06J77l9j77P5J14j20p1K50K4l20n8K26l0j98p3M68k95p9J77Q3j87L1J51
$$ plain form
6502 102 161 20 97 -97 -39 42 -254 -8 43 -122 -69 -20 -5 32 48 -15 -105 -73 134 18 -92 -84 -193 -524 85
6527 85 -121 -370 29 -51 -133 -83 -24 88 201 -114 165 -91 42 -3 -92 384 5 -144 54 70 41 25 -78
6550 -78 -43 -40 33 -28 -82 79 -135 -123 -8 92 144 -53 10 -64 -213 -16 -305 -57 261 129 -23 124 110 -256
6574 -256 86 109 -109 -119 46 -51 -283 25 83 -103 123 113 141 141 51 53 80 282 10 183 218 -50 26 -35 167
6599 167 92 54 87 -82 -39 164 -457 37 203 26 -50 105 311 24 220 70 67 -60 46 15 -171 -124 -53
6622 -53 -147 44 -137 -41 6 89 -168 128 201 -90 23 53 31 -141 240 133 -24 78 63 -6 133 -88 -49 -190
6646 -190 116 -3 -104 57 -37 -89 87 102 -59 269 -94 -234 -98 4 -241 -149 172 39 -97 198 54
6667 54 -10 77 22 -82 -149 58 -25 -169 36 -46 -198 9 37 170 24 -162 -109 197 -5 -87 -35 259 -28 -102
$$ packed form
6502A02N9j41P7j94N8Q1k96K46N1j65N3M9J5L7J6o3r0L2K07j16j10Qj09l31O09
6527H5k06k49L99q0q2N0N9J12J13l15K79k56J33m5q9M76l79j49J98J6k9j6j03
6550g8L5LP3o1n4J61k14J2J15J00N2j97O3p4j49J97k89K48L18j32j52J47j4l66
6574b56L42K3k18j0J65r7k32L08N8j86K26j0K8%r0KK7K02k72J73L5k68P6o1K02
6599A67p5l8L3j69M3K03o21M94J66j77p6J55K06k87J96j50lj27J06l1j86M7P1
6622e3r4J91j81R6M7Q3k57K96P3k91J13L0k2j72L81j07j57J02j5o9J39k21L9j41
6646a90L06j19j01J61r4n2J76J5j61L28l63j40J36J02k45R2L21j33j36K95j44
6667E4o4Q7n5j04o7K07q3j44K05q2j52K07K8J33j46j86N3L06k02q2N2K94k87p4
$$ plain form
6691 -102 46 -144 -119 125 3 -241 237 135 -90 -37 91 16 -127 -82 79 147 176 -127 -40 44 59 -111 122
6714 122 -19 -203 -56 247 64 -26 236 -177 -20 46 -45 -148 -192 171 134 -143 125 -52 5 -120 -232 146
6736 146 139 -89 -77 157 -110 -202 17 69 -89 63 262 -38 -103 85 -15 -235 104 301 -18 -247 -27 -50
6758 -50 -66 -7 19 -10 64 -311 17 118 11 -75 91 -3 -152 46 148 109 -305 174 65 -86 122 -63 -60 -44
6782 -44 93 -186 46 -2 -72 41 -107 -127 -15 127 -99 -272 65 66 -90 124 58 -85 -38 193 -171 -121 111
6805 111 66 -27 -22 301 32 70 -73 53 -54 114 -61 130 216 -192 55 113 -35 -40 103 64 -295 41 74 -191
6829 -191 -214 65 -91 -68 124 181 -89 -20 170 -52 -52 107 23 59 -76 -236 310 100 -146 -179 347 -27 -136
6852 -136 -127 -86 -81 -40 202 -20 51 232 116 -37 90 -113 -112 103 158 -66 10 225 72 57 28 -50 -46 68 -183
$$ packed form
6691a02J48j90K5K44j22k44M78j02k25N3J28p5j43M5J61O8K9l03Q7Q4J5j70K33
6714A22j41j84J47L03j83r0K62m13J57O6r1j03m4L63l7k77K68j77N7j25j12L78
6736A46pk28J2K34k67r2K19N2j58J52J99l00o5J88j00k20L39J97l19k29K20k3
6758e0j6N9K6k9P4l75L28J01j07q6J66r4j49J98J02l9m14M79j09j51K08j85LJ6
6782d4J37k79K32m8p0J13j48k0J12J42k26j73L37Jj56K14o6j43M7K31l64N0K32
6805A11m5r3NL23k69L8j43J26j07J68j75J91Q6m08K47N8j48nJ43l9l59L36L3k65
6829a91k3K79j56K3J92N7k70O9J90k22%J59q4L6j35j60N46k10k46l3N26l74j09
6852a36RM1NM1K42k22P1J81j16j53J27k03JK15N5k24P6K15j53j5k9p8MJ14k51
$$ plain form
6877 -183 75 114 32 -66 78 166 5 -93 19 205 115 196 -37 -6 14 95 -92 21 -57 -266 104 -37 -5 -39
6901 -39 79 -22 -142 -42 -143 -36 -6 116 -98 120 69 -72 -145 -59 -21 24 89 -2 0 31 -23 70 -37 152 -183
6926 -183 113 98 -71 35 70 182 -115 -32 -91 -167 8 222 19 -18 111 -268 -113 -15 -81 -160 110 0 12
6949 12 76 77 122 -55 -9 -127 84 354 -145 -170 203 95 95 -46 65 -19 29 83 -75 -70 106 -73 62 261 45
6974 45 -34 151 148 70 67 14 -122 -80 -129 -41 -83 45 147 -171 -18 -18 -15 -8 16 -61 102 56 40 178 79 -25 -72 368
7002 368 53 -83 -64 36 -146 -1 46 -4 59 88 70 147 -184 -126 -211 66 -11 -23 54 49 -190 60 -131 -101 -26
7027 -26 -19 16 34 110 -159 -63 162 -13 -91 168 217 -39 117 140 -96 -46 131 75 8 -42 -162 -135 -71 -38 113 -21
7053 -21 2 -122 -18 18 -167 -126 0 21 -126 212 66 -127 -14 95 -45 -58 81 118 84 94 168 86 -204 -116
$$ packed form
6877a83K58L9q2r8J44Q8j61r8J12J86r0Q1k33L1K0Q1j87J13p8k09L70j41L2l4
6901c9J18j01j20J00j01J07L0J22k14K18n1j41p3Q6L8M5O5r1KL1n4R3j07J89l35
6926a83K96j5j69J06L5J12k97Q3n9p6J75K14k03l7J29l79J55R8o6p9K70j10J2
6949A2O4JM5j77M6j18K11K70m99k5L73j08%j41J11q4M8N4j58NJ76j79J35J99k16
6974D5p9J85lp8ln3j36M2m9Q8m2J28J02l18J53%LPK4p7J63m6j6J38r9j04m7M40
7002C68l15j36J9J00j82J45M7n0O3K9j8P7l31N8q5K77p7j2P7nk39K50j91L0P5
7027b6PL5J8P6k69R6K25j75p8K59M9k56J56K3k36N0J77n6o7n0j20K7O4L3J51j34
7053b1K3j24J04L6j85M1J26K1j47L38j46j93J13J09j40j3J39L7l4J0P4q2k90Q8
$$ plain form
7077 -116 -25 242 -126 -116 11 84 -117 -147 0 -93 -105 119 -96 38 194 31 -19 228 124 -82 98 -27
7099 -27 72 -52 30 -55 -61 -44 95 -33 -36 36 -177 -131 47 -2 -249 104 -98 -127 154 86 -123 189 39 14 -28
7124 -28 80 -83 -109 54 -124 138 250 -50 144 76 35 -79 -190 89 -71 -70 -10 -173 -109 59 -199 -90 72
7147 72 253 -71 97 265 -24 -74 93 47 -38 58 -207 -24 -112 -114 -171 147 -25 -167 -168 -4 -89 -155 59 57 -137
7172 -137 162 17 -195 88 -51 -43 -59 -13 -145 51 -21 5 83 79 44 -6 199 -35 -77 67 -103 7 59 -88
7196 -88 -206 -129 75 -79 -6 -63 -63 -184 38 -17 -138 -13 140 124 -191 25 15 -92 110 65 -102 287 89
7219 89 -12 44 -15 -55 75 81 117 111 104 -178 -89 451 153 101 -50 -146 -136 33 -1 66 63 -26 68 79 92 -30 -14 126
7247 126 15 176 12 201 -194 -87 16 111 85 59 -154 -61 185 56 -242 44 56 41 93 -20 -4 110 60
$$ packed form
7077a16R1K67l68J0J27P3k01l0J47r3j2K24k15J34J56j63n0K47j04k06J80j25
7099b7R9j24Q2q5oJ7J39j28lP2k13M6J78m9k47L53k02k9K81o8k09L12j50k5m2
7124b8J08j63k6J63j78K62J12l00J94o8m1j14j11K79j60JO0j63O4J68k58J09J62
7147G2J81l24J68J68k89n0J67m6q5R6k65J83q8kn7L18j72j42jJ64q5o6K14kj94
7172a37K99j45k12K83j39Qj6M6j32J96p2K6P8ml5n0K05k34m2J44j70J10N2j47
7196h8j18P7K04j54P3n7%j21K22n5j21J25J53j6l15K16j0j07K02m5j67L89j98
7219H9j01N6n9m0J30OL6opk82Q9N40k98n2j51r6J0J69l4O7lq9R4J1J3j22J6J40
7247A26j11J61j64J89l95J07J03R5k6k6k13R3K46j29k98K86J2j5N2j13J6J14n0
$$ plain form
7270 60 -12 -29 -43 42 -179 -10 -135 -151 -120 -16 -184 -12 109 35 95 173 -6 89 -77 14 -88 -68 -34 -19 -7
7295 -7 61 226 -129 17 60 -73 -81 -50 -89 13 -23 -252 53 -45 -41 -122 124 130 79 131 85 -83 -163 65 -30 -27 -156
7322 -156 102 -22 -3 152 95 152 -12 28 -104 -141 -170 108 85 -22 61 176 120 -109 157 57 29 -45 76 -104
7346 -104 -55 -38 -68 -26 5 16 -226 123 -288 -27 155 -88 -82 116 31 -123 -48 6 40 150 74 -59 61 241
7370 241 -170 -172 -110 96 -77 -197 130 -94 144 89 70 -64 19 -58 -111 89 51 21 -11 116 -59 -23 166 -111
7394 -111 -135 131 -69 -113 62 -26 9 66 73 11 -3 219 120 140 -140 186 -38 27 -104 -120 204 -84 -102 -31 66
7419 66 -118 97 196 126 -7 59 162 -85 -31 79 75 -71 72 -53 -4 -46 238 5 20 -225 26 37 4 30
7443 30 209 -29 -15 28 81 62 17 76 -59 -171 197 22 60 -11 105 -76 47 68 -91 -71 -6 100 -12 -49
$$ packed form
7270F0p2j7j4Q5k21J69j25j6L1J04j68J72J21p4O0P8j79R5j66R1j02K0L4J5J2
7295gO8J65l55J46M3j33qL1l9J02l6k29L05r8Mq1K46On1N2m6j68q0K28r5Lj29
7322a56K58j24J9J55n7N7j64M0j32l7k9K78k3j07Q3J15n6k29K66j00k8p4J21j80
7346a04M9J7l0M2L1J1k42L49m11K61J82k43OJ98q5j54P5N4L4J10p6j33J20J80
7370B41m11kO2K06j73j20L27k24K38n5j9j34Q3p7n3K00l8l0l2J27j75L6J89k77
7394a11k4K66k00m4J75q8L5N7Po2j4K22r9K0k80L26k24O5j31j6L24k88j8P1R7
7419F6j84K15R9p0j33O6J03k47N4J10mj46J43j25M9m2K84k33J5k45K51J1l3K6
7443C0J79k38J4M3N3j9m5N9j35j12L68j75L8p1J16j81J23K1j59K0O5J06j12l7
$$ plain form
7467 -49 -54 119 53 88 -10 126 -29 -353 -71 284 20 56 -107 27 -17 -21 39 -231 0 70 72 -65 12 -77 237
7492 237 160 208 258 84 -22 45 6 -85 -36 78 -106 -88 -220 217 -236 -16 0 200 -168 13 -107 -107 -51 165
7516 165 40 50 45 -80 126 24 191 89 -28 -48 -90 -188 77 57 -47 -52 56 17 116 86 -134 100 18 -108
7540 -108 -144 -81 -41 -45 98 -245 45 -194 -105 136 27 -44 -37 78 148 29 92 272 110 -106 33 -73 27 100
7564 100 -135 8 -38 153 84 -109 106 28 -108 61 116 -66 28 -83 -310 -94 -72 -70 209 106 -148 113 30
7587 30 159 -100 34 12 107 37 68 -107 -145 137 -35 54 87 -8 -20 99 -50 73 111 -62 47 -72 -33 4
7611 4 71 3 -11 45 13 -102 29 -109 -24 43 -78 151 2 -49 -49 -92 -16 174 -8 -39 141 -144 -100 193 -32
7636 -32 -131 -81 192 -33 3 187 -46 -84 50 63 -86 156 -109 -108 26 -159 3 116 -49 57 1 -162 -47
$$ packed form
7467d9nJ73o6L5r8J36j55l24K82L55k64L6j63J34m4mO0k70K31P0Kj37P7q9L14
7492B37p7M8N0j74j06O7l9r1M9J14j84J8j32M37m53K20J6K00l68J81j20%N6K16
7516A65j25J0nj25K06j02J67j02j17k0m2r8K65k0j04nJ08l9R9l0k20K34q2j26
7540a08l6O3M0mJ43l43K90k39Q9K41j09p1PJ15P0j19O3J80j62k16J39j06J00P3
7564A00k35J43m6J91o9j93K15p8j36J69N5j82R4j11k27K16K2KK79j03k54K61q3
7587C0J29k59J34k2R5p0L1j75l8K82j72Q9L3r5j2J19j49J23L8j73J09j19L9L7
7611DO7o8j4N6l2j15J31j38Q5O7j21K29j49n1%m3P6J90j82l1J80k85M4K93k25
7636c2r9N0K73k25L6J84k33l8J34J3j49K42k65JJ34j85J62J13j65J06n6j63J15
$$ plain form
7659 -47 70 -44 -103 36 167 -7 -139 95 -90 -50 -17 -1 -58 34 -93 -25 134 15 -10 -2 -53 -22 -169 62
7683 62 -30 -37 17 -10 92 -20 -10 -174 -111 153 -63 -227 39 47 -29 138 -84 146 -70 -40 -13 -43 48 55 -48 61
7709 61 150 37 8 154 -106 131 -54 44 6 62 108 -24 -56 1 208 129 -55 -55 118 -94 39 -155 -100 139
7733 139 -54 28 49 -15 -32 -21 62 -27 85 -59 -123 163 -21 -24 -142 109 13 -76 244 214 -63 75 82 84 93 -15
7759 -15 -3 -41 -58 7 137 147 -81 107 -37 -74 -14 12 32 -33 17 -75 15 -155 59 34 -17 158 204 101 133 -42
7785 -42 -25 -72 -80 -14 22 40 15 181 42 -41 -86 -65 -101 -119 -12 -3 -47 55 -51 -153 146 -174 238 22 82 103
7811 103 -141 -112 -171 10 204 20 -155 210 89 -102 -142 193 46 -151 -4 -63 -75 43 -109 158 56 73
7833 73 77 121 -17 36 -115 -30 -128 -92 167 47 -37 45 192 2 -155 -134 -8 137 -24 186 -103 -28 145 24
$$ packed form
7659d7J17j14n9J39J31j74j32K34j85M0L3J6n7R2j27O8J59j19k5Qn1L1j47K31
7683F2r2pN4k7J02j12J0j64O3K64k16j64K66Qp6J67k22K30k16L0K7l0R1Pj03J09
7709F1Q9j13k9J46k60K37j85R8l8N6M6j32l2N7K07p9j84%J73k12J33j94N5K39
7733A39j93Q2K1o4j7J1Q3q9J12j44o4K86j84lj18K51r6q9L20l0k77J38PKRj08
7759a5J2l8j7O5J30J0k28J88j44l7O0K6K0o5N0r2R0j70K14k5n1J75M6j03L2j75
7785d2J7m7qO6L6J8k5J66j39q3m5K1l6j8J07Rm4J02j06j02K99l20M12k16O0K1
7811A03k44K9n9J81J94j84j75L65j21j91m0L35j47j97J47n9j2J18j52K67j02J7
7833G3MM4j38N3j51Q5r8L6K59j20q4Q2J47j90j57K1J26J45j61K10k89P5J73j21
$$ plain form
7857 24 20 268 90 1 215 10 186 -27 2 39 -90 -235 -164 30 34 1 121 -2 70 -17 123 23 -119 125
7881 125 18 61 76 -123 -43 -40 111 -159 -113 44 -277 142 267 -119 -63 41 -126 -64 -143 -31 109 -70 55
7904 55 -46 44 140 -48 50 -125 -85 72 -110 2 -10 -150 -27 49 10 -51 -4 -37 66 67 -99 -95 245 7 100
7929 100 -20 -26 0 -59 -38 155 -45 -49 41 -46 21 -49 -108 -32 77 -5 -212 -7 138 35 28 -88 93 59 36 -45
7955 -45 88 -10 145 -129 -75 25 2 -184 4 94 -20 131 -165 1 -72 -24 59 105 45 68 -87 -64 -18 -10 -30
7980 -30 11 -34 -38 30 -210 -46 63 -2 84 -73 160 -216 35 161 195 -87 -37 -80 101 -53 180 57 -166 95
8004 95 24 -2 -2 -10 -136 43 -55 165 95 -97 1 115 -69 55 78 263 123 -25 51 61 134 82 159 108 -48 27
8030 27 46 217 -27 -90 -61 105 142 -124 -89 105 116 35 -108 -264 -2 11 -71 -46 135 -14 -105 5 -94 118
$$ packed form
7857B4mK48j78q9K14k05J76k13K9L7j29j45P1J94Ml3J20j23P2q7J40j00j42K44
7881A25j07M3J5j99Q0LJ51k70M6J57l21M19J25l86N6J04j67O2p9J12J40j79J25
7904E5j01R0R6j88R8j75M0J57j82J12j2j40J23P6l9o1M7l3J03Jj66ML40k38R3
7929A00j20oK6n9K1J93k00mR0q7O7p0n9P6J09q2k07K05J45j03pj16J81l4k3q1
7955d5J33r8J55k74N4J00k3j86J88R0j14J51k96J66p3M8Q3M6o0K3j55K3M6Qk0
7980c0M1m5mO8k40J64J09o5Q6j57K33l76K51J26L4k82N0m3J81j54K33j23k23K61
8004I5p1k6%qj26J79r8K20p0j92R8J14j84J24K3J85j40j48P6J0P3n2P7n1j56P5
8030B7J9J71k44o3K9J66L7k66L5J94J1q1j43j56K62J3q2K5J81j49r1J10r9K12
$$ plain form
8054 118 -104 33 77 -88 -15 2 44 63 -168 -37 114 94 96 1 -145 59 -24 -58 -29 -219 11 -94 73 145
8078 145 -42 -346 2 -15 -36 156 -106 26 4 -43 -63 -118 -17 -28 29 36 -116 -44 -55 87 150 -40 -61 -8 21
8103 21 237 -132 -277 0 -36 -59 -63 214 -36 75 27 26 140 -24 -87 85 -101 -74 -11 -181 -17 -72 37 186
8127 186 73 -113 17 -153 76 5 -39 -50 -1 -26 56 -111 96 20 -12 78 18 -123 -21 -119 -53 163 -132 36
8151 36 -50 5 -49 -72 -32 -161 -51 231 237 23 53 -21 -45 -88 -80 -24 158 -43 87 -33 2 24 -153 -9 27 -113
8177 -113 155 -113 -6 -107 94 -51 36 -27 -19 -35 74 -54 -85 91
$$ packed form
8054A18k22J37M4j65P3J7M2J9k31J31J51k0Kr5j46K04q3l4K9j90K30j05J67P2
8078A45j87l04L48j7k1J92k62J32k2m7k0n5J01j1N7Pj52P2j1J42O3j90k1N3K9
8103B1K16l69j45K77l6k3mK77k50J11m8jJ14j64o3J72j86K7O3j70J64n5J09J49
8127A86j13j86J30j70K29p1m4j1M9k5Q2j67K07p6l2R0o0j41J02r8O6K16k95J68
8151C6q6N5n4k3M0j29J10K82Ok14L0p4k4m3QN6J82k01J30j20L5K2j77J44L6j40
8177a13K68k68J07j01K01j45Q7o3Qj6J09j28l1J76
8191I1
$$ Imaginary data points
##PAGE= N=2
##DATA TABLE= (X++(I..I)), XYDATA
$$ plain form
0 0 0 0 0 8 -8 0 0 8 -13 8 -13 19 -24 24 -32 40 -48 56 -64 75 -91 104 -117 134 -154 177 -200 226 -255 288
30 288 -321 361 -402 449 -502 557 -616 682 -760 842 -930 1026 -1139 1264 -1400 1553 -1732
47 -1732 1940 -2177 2456 -2795 3213 -3738 4420 -5347 6685 -8758 12337 -19694 40590 -212410
61 -212410 -737618 204146 570341 -365987 -563748 370240 419234 -398544 -300348 422110
71 422110 212122 -365959 -85187 349639 16702 -273217 50283 186149 -121198 -124883
81 -124883 115668 15681 -119317 77600 101153 -132485 -35626 183904 -46345 -223240 103730
92 103730 196323 -201854 -186635 251091 133405 -297181 -70422 325508 1983 -334946
102 -334946 70901 327947 -143000 -303891 211553 266126 -265107 -205091 310419 137085
$$ packed form
0@%%%Qj6Q%Qk1K1k1L2m3M8n6P2q8J04j20J39j66J95k21K51k88L31l77M26m81N43
30B88o09O82p63Q51r51J059j173J298j442J602j772J956k165K403k664K953l285
47a732L672m117M633n251O008o951Q158r767J2032j5443K1095l2031O0284k53000
61b12410n25208R41764L66195r36328j97761R33988M8994q17778R8196P22458
71D22110k09988n78081K80772M34826l32937k89919L23500J35866l07347l685
81a24883K40551r9987j34998J96917K3553k33638R6859K19530k30249j76895L26970
92A03730R2593l98177J5219M37726j17686m30586K26759L95930l23525l36929
102c34946M05847K57046m70947j60891N15444N4573n31233O0016N15510j73334
$$ plain form
112 137085 -331147 -62170 319604 -26762 -298912 91425 240432 -160683 -188568 189780
122 189780 109446 -216486 -41713 220429 -18914 -199006 88984 182727 -136543 -146743
132 -146743 180882 109051 -199999 -45966 224663 -1353 -219102 48730 185530 -104670
142 -104670 -155560 130307 104325 -143699 -47944 149030 11569 -116391 45037 103848 -60338
153 -60338 -53291 93285 17382 -113174 12137 106512 -63033 -109297 98213 92599 -130312
164 -130312 -56260 168541 28127 -171653 33084 187320 -71454 -171762 111112 139785
174 139785 -154259 -117147 164600 68364 -185242 -35992 186184 107 -180690 37831
184 37831 179330 -55734 -150310 88631 127662 -109915 -99565 112861 51105 -123506 -20954
$$ packed form
112A37085m68232K68977L81774l46366k72150L90337J49007m01115k7885L78348
122A89780q0334l25932J74773K62142k39343j80092K87990R3743l19270j0200
132a46743L27625p1831l09050J54033K70629k26016k17749K67832J36800k90200
142a04670n0890K85867k5982k48024R5755J96974j37461j27960J61428N8811j64186
153f0338P047J46576p5903j30556J25311R4375j69545m6264K07510n614k22911
164a30312P4052K24801j40414j99780K04737J54236k58774j00308K82874K8673
174A39785k94044L7112K81747r6236k53606J49250K22176j86077j80797K18521
184C7831J41499k35064r4576K38941L9031k37577J0350K12426o1756j74611J02552
$$ plain form
195 -20954 107274 -14218 -84570 39649 55591 -51881 -21055 56721 -10163 -54207 32913
206 32913 38726 -60882 -33567 70475 15760 -79934 6363 88712 -28622 -91031 51765 81883
218 81883 -81094 -72534 96884 45156 -114153 -20988 113395 -12983 -110868 37940 96871
229 96871 -58582 -78720 72136 58898 -81749 -43167 83102 26318 -80886 -7463 76801
240 76801 -13956 -74293 25493 55945 -45065 -39086 58020 22555 -52471 10555 55376 -25336
252 -25336 -39166 44105 24208 -55466 -13266 52561 -5517 -55421 13529 52955 -14394 -36593
264 -36593 33877 40790 -32975 -26527 41480 13469 -50559 -5072 44091 -16076 -40658 31170
276 31170 33342 -32647 -4020 54284 4242 -43498 13284 39318 -25156 -40876 20897 28846
$$ packed form
195b0954J28228j21492p0352J24219J5942j07472L0826P7776o6884m4044Q7120
206C2913N813r9608K7315J04042n4715r5694Q6297Q2349j17334o2409J42796L0118
218H1883j62977Q560J69418n1728j59309R3165J34383j26378r7885J48808N8931
229I6871j55453k0138J50856j3238j40647L8582J26269n6784j07204P3423Q4264
240G6801r0757o0337R9786L0452j01010N979R7106l5465p5026O3026M4821q0712
252b5336j3830Q3271j9897p9674M2200O5827n8078m9904O8950L9426o7349k2199
264c6593P0470O913p3765O448O8007k8011o4028M5487M9163o0167k4582P1828
276C1170K172o5989K8627N8304n0042m7740N6782K6034o4474j5720O1773P949
$$ plain form
288 28846 -25221 -24801 26969 22198 -25438 -13244 30751 10073 -26934 291 23332 -8965 -14524
301 -14524 17252 5508 -15126 16060 27112 -12368 -12378 21991 5633 -28527 -11583 10890 -7496
314 -7496 -21493 -966 12878 -3147 -14209 5858 18733 -2547 -11341 12575 14008 -10572 -2852
327 -2852 13637 -7206 -15798 11857 7992 -21719 -10189 12442 -5935 -22484 -3573 8274 -3511
340 -3511 -8699 2236 12990 7078 -7161 -2234 13663 4153 -14344 -6421 3919 -4778 -7915 -2360
354 -2360 -4124 1246 10259 702 -4192 9937 7300 -9900 -4109 5612 -6303 -11927 -1560 43
368 43 -2949 -1269 -1986 1930 9994 4211 -2832 6640 9243 -2038 -1531 2846 -4176 -3692 2607 -3617
384 -3617 -5461 4238 1494 -5518 2132 3856 -3646 296 4252 -1798 3287 9324 -1713 -2491 12484
$$ packed form
288B8846n4067M20N1770m771m7636J2194M3995k0678l7007K7225K3041l2297n559
301a4524L1776j1744k0634L1186J1052l9480j0L4369j6358l4160J6944K2473j8386
314g496j3997K0527J3844j6025j1062K0067J2875k1280q794K3916J433k4580P720
327b852J6489k0843q592K7655l865k9711J1530K2631j8377j6549J8911J1847j1785
340c511n188J0935J0754n912j4239M927J5897r510j8497P923J0340q697l137N555
354b360j764N370R013r557m894J4129k637j7200N791R721j1915n624J0367J603
368D3k992J680p17L916Q064n783p043R472K603j1281N07M377p022M84O299o224
384c617j844R699k744p012P650J724p502L942L956o050N085O037j1037p78J4975
$$ plain form
399 12484 7848 -7238 -671 9838 3309 -2950 -2537 -1226 2483 -1038 -8366 -1103 7387 -2590 -3236
414 -3236 12030 8429 -4117 4906 10715 -539 -1230 4195 -3695 -6350 2132 -2814 -11184 -3868 2414
429 2414 -291 420 3207 4748 7613 4019 -111 6050 4650 -8295 -3689 7694 -5426 -14294 1441
444 1441 2818 -11011 -1721 9304 -4706 -8059 9307 7367 -8704 -5762 6854 5477 -4585
457 -4585 -5563 4641 6082 -7558 -7847 8737 2543 -16049 -1957 13747 -5441 -13591 7678 6030
471 6030 -11716 -583 10001 -7709 -11440 7079 3496 -14061 -7874 7929 2748 -9314 -1648
484 -1648 13686 5372 -11576 1776 18708 -4335 -20747 7499 15247 -18949 -16062 17255 3238
497 3238 -22439 3301 20658 -9552 -15770 15696 13881 -15950 -8184 19452 8928 -16429 -1490
$$ packed form
399A2484m636j5086O567J0509o529o259M13J311L709l521p328P263Q490r977o46
414c236J5266l601j2546R023N809j1254o91N425p890k655Q482m946q370P316O282
429B414k705P11K787J541K865l594m130O161j400j2945M606J1383j3120q868J5735
444A441J377j3829R290J1025j4010l353J7366j940j6071K942J2616j377j0062
457d585r78J0204J441j3640k89J6584o194j8592J4092J5704j9188q150K1269j648
471F030j7746J1133J0584j7710l731J8519l583j7557O187J5803n181j2062P666
484a648J5334q314j6948J3352J6932k3043j6412K8246P748l4196K887L3317j4017
497C238k5677K5740J7357l0210o218L1466j815k9831P766K7636j0524k5357J4939
$$ plain form
510 -1490 23471 2772 -21152 7120 26552 -10958 -23460 17523 15910 -27457 -12827 23997
522 23997 -2345 -24647 13352 23309 -15969 -10386 27461 9814 -23041 1408 27391 -2918
534 -2918 -23385 10594 22833 -18156 -23043 23453 17902 -31753 -11402 37956 2360 -38719 10644
547 10644 36009 -22802 -27685 34694 19588 -38345 -6099 41323 -3936 -39082 13457 34223
559 34223 -21933 -27773 31223 23930 -36563 -16119 43713 7508 -48894 1328 45841 -18125
571 -18125 -44608 27880 31120 -41671 -18703 48622 4571 -47055 13093 44027 -24940 -35086
583 -35086 32584 19573 -45257 -13316 43832 -4092 -49967 15116 48739 -27707 -42305 43871
595 43871 34375 -56793 -20526 65413 -233 -73780 16453 67468 -38926 -60678 53144 45087
$$ packed form
510a490K4961k0699k3924K8272J9432l7510j2502M0983j613m3367J4630L6824
522B3997k6342k2302L7999R957l9278N583L7847j7647l2855K4449K5983l0309
534b918k0467L3979J2239m0989m887M6496n551m9655K0351M9358l5596m1079M9363
547A0644K5365n8811m883O2379j5106n7933L2246M7422m5259l5146N2539K0766
559C4223n6156n840N8996p293o0493K0444N9832l6205n6402N0222M4513o3966
571a8125k6483P2488L240p2791K2968O7325m4051n1626O0148L0934o8967j0146
583c5086O7670j3011o4830L1941N7148m7924m5875O5083L3623p6446j4598Q6176
595D3871r496r1168L6267Q5939o5646p3547R0233N1015j06394k1752J13822q057
$$ plain form
607 45087 -63526 -24641 71737 7399 -71993 9876 67538 -28696 -63923 40780 52798 -53456
619 -53456 -39178 64518 23837 -68518 -1074 72575 -16639 -63485 38664 51813 -53967
630 -53967 -35620 59251 11294 -62953 8952 58295 -25594 -45502 43254 35376 -49620 -16505
642 -16505 59303 2822 -58381 17752 57571 -36955 -52092 53697 38758 -68882 -19869 81529
654 81529 1908 -78856 26412 76318 -45816 -59639 67525 42654 -78889 -19596 85744
665 85744 -2870 -86217 23617 80148 -43601 -69040 63364 57411 -77281 -38897 89650
676 89650 18280 -96035 3890 94281 -27768 -85207 48792 69327 -63600 -46305 75231
687 75231 25403 -74831 -2035 69402 -17884 -60231 28971 40033 -45585 -28990 47222 5429
$$ packed form
607D5087j08613L8885R6378o4338p9392Q1869N7662r6234l5227J04703J2018j06254
619e3456J4278J03696m0681r2355O7444P3649q9214m6846J02149J3149j05780
630e3967J8347R4871m7957p4247P1905M9343q3889j9908Q8756p878q4996L3115
642a6505P5808n6481o1203P6133L9819r4526j5137J05789j4939j07640M9013J01398
654H1529p9621q0764J05268M9906j22134j3823J27164k4871j21543N9293J05340
665H5744q8614q3347J09834N6531j23749k5439J32404n953j34692L8384J28547
676H9650p1370j14315R9925R0391j22049n7439J33999K0535j32927J7295J21536
687G5231m9828j00234P2796P1437q7286m2347Q9202J1062q5618J6595P6212m1793
$$ plain form
699 5429 -55588 9482 52603 -27946 -43763 48106 34120 -59475 -12869 70204 -9231 -73735
711 -73735 30553 66225 -54418 -57612 66834 36220 -81781 -20308 82583 -4402 -86313
722 -86313 21004 79831 -41773 -74706 55132 60865 -69959 -45329 80262 26281 -83571
733 -83571 -1404 85183 -19492 -76235 39364 60743 -56530 -45076 60598 18762 -67729
744 -67729 -4171 57817 -18875 -52592 32264 41810 -40796 -23901 53840 14556 -51138 7773
756 7773 54723 -22750 -47587 40513 35869 -55990 -21339 63701 1272 -66357 19765 62486
768 62486 -37246 -50912 53465 37353 -63208 -21058 68569 5583 -67946 12383 68065 -22191
780 -22191 -55415 43180 52059 -49565 -33269 63545 18160 -69641 -1692 65995 -21949 -64226
$$ packed form
699E429o1017O5070M3121q0549j5817R1869j3986r3595M6606Q3073p9435o4504
711g3735J04288L5672j20643l194J24446l0614j18001O1473J02891q6985q1911
722h6313J07317N8827j21604l2933J29838N733j30824K4630J25591n3981j09852
733h3571Q2167Q6587j04675n6743J15599K1379j17273J1454J05674m1836q6491
744f7729O3558O1988p6692l3717Q4856R546q2606J6895P7741l9284o5694N8911
756G773M6950p7473k4837Q8100m644r1859L4651Q5040o2429o7629Q6122M2721
768F2486r9732j3666J04377j6112j00561M2150Q9627o2986p3529Q0329N5682r0256
780b2191l3224R8595Q879j01624J6296R6814m5385q7801O7949O7687q7944m2277
$$ plain form
792 -64226 33693 48041 -49788 -33831 57408 18320 -57165 1179 59806 -8931 -48323 25628
804 25628 44713 -30071 -31035 39198 19486 -44650 -7486 43855 -10888 -45495 20134 33488
816 33488 -36583 -23617 43651 7599 -47327 9474 47725 -21649 -40454 33398 32535 -39318
828 -39318 -21444 42728 10672 -43634 218 41672 -12132 -40524 20471 31654 -33686 -27506
840 -27506 36540 10325 -45725 311 43159 -16786 -40248 29486 32998 -37533 -22356 41725
852 41725 10672 -42631 -1639 38485 -9334 -36139 15252 30147 -21691 -23854 26904 16480
864 16480 -30436 -7390 30345 -5842 -31814 14526 24023 -27355 -18312 33074 8576 -35275
876 -35275 2202 35502 -8243 -28358 17234 24715 -19386 -17372 21836 11206 -23456 -5842
$$ packed form
792f4226R7919J4348r7829J5957R1239l9088p5485N8344N8627o8737l9392P3951
804B5628J9085p4784r64P0233j9712o4136L7164N1341n4743l4607O5629J3354
816C3488p0071J2966O7268l6052n4926N6801L8251o9374j8805P3852q63p1853
828c9318J7874O4172l2056n4306M3852M1454n3804k8392O0995J1183o5340O180
840b7506O4046k6215n6050M6036M2848n9945k3462O9734L512p0531J5177O4081
852D1725l1053n3303M0992M0124m7819k6805N1391J4895n1838k163N0758j0424
864A6480m6916K3046L7735l6187k5972M6340R497n1378R043N1386k4498m3851
876c5275L7477L3300m3745k0115M5592P481m4101K014L9208j0630l4662J7614
$$ plain form
888 -5842 23255 -718 -21563 8871 20366 -14619 -13652 23542 7951 -26734 1623 28918 -9906
901 -9906 -26694 16840 21502 -20685 -13413 24781 9843 -21418 -1309 23146 626 -18246 4340
914 4340 16877 -6664 -12773 10547 8946 -13471 -1551 18174 -2999 -16846 11538 16198 -16931
927 -16931 -12233 19031 4888 -20941 200 19074 -4331 -15226 8506 14272 -6520 -8794 8182
940 8182 6844 -8915 -5220 8076 -730 -11937 2704 10351 -8994 -10333 12040 6130 -15481
953 -15481 -2342 14966 -3328 -13718 7281 11041 -8102 -7222 7996 4855 -6724 -4695 1954
966 1954 -1250 -6123 -3250 974 -3003 -4540 4244 4849 -4304 354 10212 -47 -7826 5115 6368
981 6368 -10165 -6528 7492 -544 -10591 -11 6002 -2572 -3693 2501 474 -3691 -2019 869
$$ packed form
888e842K9097k3973k0845L0434J1495l4985R67L7194j5591l4685K8357K7295l8824
901i906j6788M3534M662m2187P272L8194j4938l1261K0109K4455k2520j8872K2586
914D340J2537k3541o109K3320j601k2417J1920J9725k1173j3847K8384M660l3129
927a6931M698L1264j4143k5829K1141J8874k3405j0895K3732N766k0792k274J6976
940H182j338j5759L695J3296q806j1207J4641P647j9345j339K2373n910k1611
953a5481J3139J7308j8294j0390K0999L760j9143Q80J5218l141j1579K029O649
966A954l204m873K873M224l977j537Q784O05r153M658R858j0259p779J2941J253
981F368j6533L637J4020q036j0047J0580O013q574j121O194k027m165J672K888
$$ plain form
995 869 -1397 -4717 -1127 5834 2720 -3611 3611 10062 -590 -5625 5407 4099 -7825 -4557 3314
1010 3314 -1897 -5339 -90 839 704 4320 1297 -1432 4211 4819 -3175 -3757 1422 695 -2202 -1538
1026 -1538 1563 4570 2924 -574 4497 9037 377 -3787 4989 4376 -6274 -3510 2267 -3183 -4429
1041 -4429 1697 -1292 -4440 1924 3783 -1374 159 4286 3115 2402 2992 1688 2775 2841 -764 -240
1057 -240 1319 -2680 -4412 -1409 -3151 -3803 637 -1745 -5273 4333 8652 -3245 -4079 9250 6485
1072 6485 -6447 -3007 4826 -165 -5871 -2723 1606 683 -3878 -3400 3378 3724 -3954 -2832 3735
1087 3735 486 -3351 302 -1279 -3874 2731 2473 -6619 -2056 7436 -379 -8001 1114 4977 -4625
1102 -4625 -6226 1453 2733 -2521 -4376 519 4492 182 -3170 2501 3618 -3566 -868 4515 -4092
$$ packed form
995H69k266l320L590O961l114o331P222O451j0652n035J1032j308j1924L268P871
1010C314n211l442N249R29j35L616l023k729N643O08p994n82N179p27k897O64
1026a538L101L007j646l498N071M540q660m164Q776o13j0650K764N777n450j246
1041d429O126k989l148O364J859n157J533M127j171p13N90j304J087O6l605N24
1057b40J559l999j732L003j742o52M440k382l528R606M319j1897q34J3329k765
1072F485j2932L440P833m991n706L148M329r23m561M78O778L46p678J122O567
1087C735l249l837L653j581k595O605k58r092M563R492p815p622R115L863r602
1102d625j601P679J280n254j855M895L973m310l352N671J117p184K698N383q607
$$ plain form
1117 -4092 -7776 4398 3507 -10219 -4658 8792 512 -8206 2271 9459 -111 -4447 3698 7096
1131 7096 -874 -6694 132 4916 -3989 -8365 1735 3875 -4525 -217 7316 -139 -1965 9306
1145 9306 5629 -7590 537 9626 -4116 -11462 1814 5562 -7645 -8250 4937 7030 -3508 -3955
1159 -3955 7801 8644 -2670 -1500 8603 2906 -5574 3809 6169 -7978 -4387 10177 -1316 -14491
1173 -14491 2557 10961 -8963 -10929 10997 9036 -10366 -3882 15201 7546 -10084 -1673 13619
1186 13619 2427 -12604 -555 9654 -6694 -10964 8279 5483 -13174 -562 15959 -3994
1198 -3994 -14003 10376 10420 -16860 -9002 16494 1045 -19876 1053 19044 -2876 -14611 8449
1211 8449 15806 -9335 -12200 11734 5950 -19649 -6421 17431 -4148 -21778 9186 20280 -14263
$$ packed form
1117d092l684J2174q91j3726N561J3450q280q718J0477P188r570m336Q145L398
1131G096p970n820O826M784q905m376J0100K140q400M308P533p455j826J1271
1145I306l677j3219Q127R089j3742p346J3276L748j3207o05J3187K093j0538m47
1159c955J1756Q43j1314J170J0103n697q480R383K360j4147L591J4564j1493j3175
1173a4491J7048Q404j9924j966K1926j961j9402O484J9083p655j7630Q411J5292
1186A3619j1192j5031J2049J0209j6348m270J9243k796j8657J2612J6521j9953
1198c994j0009K4379M4k7280P858K5496j5449k0921K0929J7991k1920j1735K3060
1211H449P357k5141k865K3934n784k5599J3228K3852k1579j7630L0964J1094l4543
$$ plain form
1224 -14263 -13425 22086 9689 -24399 -4206 21800 -5747 -24746 5442 17292 -10583 -13660
1236 -13660 13753 11977 -11259 -3044 15566 -293 -15931 4433 11660 -14743 -12818 17127 4802
1249 4802 -23012 2134 26224 -8009 -23145 17066 21583 -21046 -15705 23748 9861 -23882
1261 -23882 -3444 23412 -1074 -20462 6662 18368 -11629 -15664 15031 10336 -19262 -3987
1273 -3987 22415 -1154 -19438 13343 21057 -16708 -12670 23643 6552 -26058 -572 23130
1285 23130 -8190 -20474 14042 16719 -16344 -8760 22320 5981 -22516 712 24070 -7210
1297 -7210 -24935 12988 22795 -19440 -17061 28556 14863 -28649 -3791 32415 -2952 -30481
1309 -30481 7639 21596 -17299 -19566 16548 9668 -18924 -2362 20876 136 -15147 9568
$$ packed form
1224a4263Q38L5511j2397l4088K0193K6006k7547j8999L0188J1850k7875l077
1236a3660K7413j776k3236Q215J8610j5859j5638K0364P227k6403J925K9945j2325
1249D802k7814K5146K4090l4233j5136M0211M517m2629N341L9453j3887l3743
1261b3882K0438K6856k4486j9388K7124J1706k9997m035L0695m695k9598J5275
1273c987K6402k3569j8284L2781P714l7765M038L6313j7091l2610K5486K3702
1285B3130l1320j2284L4516K677l3063P584L1080j6339k8497K3228K3358l1280
1297g210j7725L7923R807m2235K379M5617j3693m3512K4858L6206l5367k7529
1309c0481L8120J3957l8895k267L6114o880k8592J6562K3238k0740j5283K4715
$$ plain form
1321 9568 16528 -11931 -11623 16896 4947 -24750 -2425 23433 -9089 -27291 13850 23334 -20424
1334 -20424 -16615 26688 11564 -26324 -1580 27265 -5199 -25402 9076 18614 -16707 -18481
1346 -18481 15925 9718 -21524 -6286 22711 429 -22786 7663 23100 -12723 -18010 18573
1358 18573 11420 -23118 -5180 21525 -5652 -21807 10553 15735 -17333 -10832 19627 3881
1370 3881 -20877 1831 20509 -7726 -19565 13679 18646 -18286 -14916 24152 11334 -27505
1382 -27505 -5137 29099 -2498 -28355 9941 24839 -16341 -17736 22042 12133 -22067 -3036
1394 -3036 22965 -2493 -20220 7453 16357 -12933 -13380 15531 9345 -17900 -3862 21285 642
1407 642 -19611 7879 20592 -11430 -14043 19589 11021 -20394 -1387 23276 -4360 -21003 9454
$$ packed form
1321I568O960k8459L08K8519j1949k9697K2325K5858l2522j8202M1141R484m3758
1334b0424L809M3303j5124l7888K4744K8845l2464k0203L4478R538l5321j774
1346a8481L4406o207l1242J5238K8997k2282k3215L0449J5437l5823n287L6583
1358A8573p153l4538J7938K6705k7177j6155L2360N182l3068O501L0459j5746
1370C881k4758K2708J8678k8235j1839L3244M967l6932L370L9068j2818l8839
1382b7505K2368L4236l1597k5857L8296J4898m1180j395L9778r909l4200J9031
1394c036K6001k5458j7727K7673Q904k9290m47K8911o186k7245J4038K5147k0643
1407F42k0253K7490J2713l2022k613L3632q568l1415J9007K4663k7636j6643L0457
$$ plain form
1420 9454 14429 -17442 -13953 15209 4220 -20051 -777 21707 122 -15649 11633 23310
1432 23310 -7214 -13576 16648 12502 -20212 -9027 17231 -4101 -23650 4623 16059 -12900
1444 -12900 -11830 17520 7497 -16378 813 17731 -5209 -16297 8084 13150 -12111 -11268 14109
1457 14109 8714 -15177 -3372 17841 -754 -18228 5663 15375 -13629 -15519 14465 7220 -19528
1470 -19528 -2802 18310 -4440 -17358 8363 12780 -13648 -11443 13496 6026 -14794 -2717
1482 -2717 16326 2369 -12625 4883 15107 -6394 -12236 9505 6508 -16605 -7077 12656 -3773
1495 -3773 -16398 6483 12396 -11480 -7437 16153 5257 -14988 699 15900 -3066 -13574
1507 -13574 6130 12399 -7590 -9652 11119 8931 -12387 -6132 13429 684 -16727 1066 12841
$$ packed form
1420I454M975l1871L489K9162j0989k4271J9274K2484k1585j5771K7282J1677
1432B3310l0524o362L0224m146l2714J1185K6258k1332j9549K8273J1436k8959
1444a2900J070K9350j0023k3875J7191J6918k2940j1088K4381N066k5261Q43K5377
1457A4109n395k3891J1805K1213j8595j7474K3891R712k9004j890K9984p245k6748
1470a9528J6726K1112k2750j2918K5721M417k6428K205K4939p470k0820J2077
1482b717J9043j3957j4994J7508J0224k1501n842K1741k997k3113R528J9733j6429
1495c773j2625K2881N913k3876M043K3590j0896k0245J5687J5201j8966j0508
1507a3574J9704O269j9989k062K0771k188k1318O255J9561j2745j7411J7793J1775
$$ plain form
1520 12841 -7602 -11005 11912 8427 -11189 427 16176 -655 -11036 6192 9816 -8290
1532 -8290 -8122 7201 3189 -9824 -2317 10050 974 -8578 4422 11955 -4038 -7609 9571 6973
1546 6973 -11464 -3015 12576 -2909 -13661 5956 11115 -9106 -7813 11514 5853 -10075 -1442
1559 -1442 10459 -218 -9183 2174 8358 -3814 -8407 4068 6413 -6587 -4993 7922 1634
1572 1634 -8396 3119 9250 -6158 -6795 9273 3886 -11114 -1135 9978 -3510 -10103 4487
1585 4487 6451 -7126 -6386 6776 4373 -7661 -4006 7716 2134 -8947 -963 8635 -2584 -8623
1599 -8623 5243 6950 -7751 -4252 8730 789 -8449 1970 5984 -5519 -5085 5047 906 -6760
1613 -6760 -941 4767 -1227 -5052 741 3759 -2443 -4355 3693 3795 -5033 -2188 7537 729 -8270
$$ packed form
1520A2841k0443l403K2917l485j9616J1616J5749j6831j0381J7228L624j8106
1532h290J68J5323m012j3013P507J2367r076r552J3000P533j5993l571J7180k598
1546F973j8437Q449J5591j5485j0752J9617N159k0221J293J9327n661j5928Q633
1559a442J1901j0677q965J1357O184j2172m593J2475K345j3000J594J2915o288
1572A634j0030J1515O131j5408o37J6068n387j5000R979J1113j3488o593J4590
1585D487J964j3577P40J3162k403j2034L655J1722n582j1081P984R598j1219o039
1599h623J3866J707j4701L499J2982p941r238J0419M014j1503M34J0132m141p666
1613f760N819N708n994l825N793L018o202j912Q048J02q828K845R725o808q999
$$ plain form
1628 -8270 1603 7376 -4689 -6165 6131 3210 -6886 4 7529 -462 -4886 3244 4528 -2767
1642 -2767 -3286 2258 1040 -4331 -2733 3268 1157 -4202 1258 6871 25 -3512 5786 5483 -4850
1657 -4850 -1322 6606 -934 -6866 2689 4989 -4052 -3254 4518 2828 -3014 -1086 2311 346 -2842
$$ packed form
1628h270R873N773j2065j476J2296k921j0096O890P525p991m424Q130J284p295
1642b767n19N544j218n371J598O001k111n359N460N613o846l537R298l03j0333
1657d850L528P928p540n932R555K300r041P98P772j690n842J928L397j965l188
$$ [...]
8191H2
##END NTUPLES=NMR FID
##END=
