##TITLE=1H_CA-8651-1
 CDCl3, 8 sc, 
 24.9.2019
##JCAMPDX= 6.0         $$ Bruker NMR JCAMP-DX V2.0
##DATA TYPE= NMR FID
##DATA CLASS= NTUPLES
##ORIGIN= UXNMR, Bruker Analytische Messtechnik GmbH
##OWNER= root
$$ XWIN-NMR		Version 3.5
$$ Tue Sep 24 15:54:23 2019 Russian Standard Time (UT+4h)  she@DPX200
##.OBSERVE FREQUENCY= 200.1315
##.OBSERVE NUCLEUS= ^1H
##.DELAY= (6, 6)
##.ACQUISITION MODE= SIMULTANEOUS
##.ACQUISITION SCHEME= undefined
##.AVERAGES= 8
##.DIGITISER RES= 18
##SPECTROMETER/DATA SYSTEM= spect
##.PULSE SEQUENCE= zg30
##.SOLVENT NAME= CDCl3
##.SHIFT REFERENCE= (INTERNAL, CDCl3, 0, 15.7039)
##AUDIT TRAIL= $$ (NUMBER, WHEN, WHO, WHERE, WHAT)
$$ ##TITLE= Audit trail, XWIN-NMR		Version 3.5
$$ ##JCAMPDX= 5.01
$$ ##ORIGIN= Bruker BioSpin GmbH
$$ ##OWNER= she
$$ F:/spectra/data/she/nmr/H-F/1/audita.txt
$$ ##AUDIT TRAIL=  $$ (NUMBER, WHEN, WHO, WHERE, WHAT)
(   1,<2019-09-24 15:53:00.45 +0400>,<she>,<DPX200>,
      <created by zg, POWCHK disabled, PULCHK disabled
       configuration hash MD5:
       00 E9 B6 7A A2 85 ED C7 34 08 36 98 17 FE 4E 26
       data hash MD5: 16K
       CF 61 74 25 31 65 FE B8 6D 58 63 EA 2B 6B E7 8A>)
$$ ##END=
$$ 
$$ hash MD5
$$ E4 10 76 52 EA BE 3A E5 D0 3A DE 77 85 C6 A3 C5
##$RELAX= 
##$RELAX= 
##$RELAX= 
##$RELAX= 
##$RELAX= 
##$RELAX= 
$$ Bruker specific parameters
$$ --------------------------
##$DU= <F:/spectra>
##$EXPNO= 1
##$NAME= <H-F>
##$PROCNO= 1
##$TYPE= <nmr>
##$USER= <she>
##$AMP= (0..31)
100 100 100 100 100 100 100 100 100 100 100 100 100 100 100 100 100 100 
100 100 100 100 100 100 100 100 100 100 100 100 100 100 
##$AQSEQ= 0
##$AQ_mod= 1
##$AUNM= <au_zg>
##$AUTOPOS= <>
##$BF1= 200.13
##$BF2= 200.13
##$BF3= 200.13
##$BF4= 200.13
##$BF5= 200.13
##$BF6= 200.13
##$BF7= 200.13
##$BF8= 200.13
##$BYTORDA= 1
##$CFDGTYP= 0
##$CFRGTYP= 5
##$CHEMSTR= <none>
##$CNST= (0..31)
1 1 145 1 1 1 1 1 1 1 1 1 1 1 1 1 1 1 1 1 1 1 1 1 1 1 1 1 1 1 1 1 
##$CPDPRG= <>
##$CPDPRG1= <>
##$CPDPRG2= <>
##$CPDPRG3= <>
##$CPDPRG4= <mlev>
##$CPDPRG5= <mlev>
##$CPDPRG6= <mlev>
##$CPDPRG7= <mlev>
##$CPDPRG8= <mlev>
##$CPDPRGB= <>
##$CPDPRGT= <>
##$D= (0..31)
0 1.2 0 0 0 0 0 0 0 0.06 0 0.03 0 0 0 0 0.0002 0 0 0 0 0 0 0 0 0 0 0 0 
0 0 0 
##$DATE= 1569325979
##$DBL= (0..7)
120 120 120 120 120 120 120 120 
##$DBP= (0..7)
150 150 150 150 150 150 150 150 
##$DBP07= 0
##$DBPNAM0= <>
##$DBPNAM1= <>
##$DBPNAM2= <>
##$DBPNAM3= <>
##$DBPNAM4= <>
##$DBPNAM5= <>
##$DBPNAM6= <>
##$DBPNAM7= <>
##$DBPOAL= (0..7)
0.5 0.5 0.5 0.5 0.5 0.5 0.5 0.5 
##$DBPOFFS= (0..7)
0 0 0 0 0 0 0 0 
##$DE= 6
##$DECBNUC= <off>
##$DECIM= 24
##$DECNUC= <off>
##$DECSTAT= 4
##$DIGMOD= 1
##$DIGTYP= 9
##$DL= (0..7)
0 120 120 120 120 120 120 120 
##$DP= (0..7)
150 150 150 150 150 150 150 150 
##$DP07= 0
##$DPNAME0= <>
##$DPNAME1= <>
##$DPNAME2= <>
##$DPNAME3= <>
##$DPNAME4= <>
##$DPNAME5= <>
##$DPNAME6= <>
##$DPNAME7= <>
##$DPOAL= (0..7)
0.5 0.5 0.5 0.5 0.5 0.5 0.5 0.5 
##$DPOFFS= (0..7)
0 0 0 0 0 0 0 0 
##$DQDMODE= 0
##$DR= 18
##$DS= 0
##$DSLIST= <SSSSSSSSSSSSSSS>
$$ [...]
##$SUBNAM2= <"">
##$SUBNAM3= <"">
##$SUBNAM4= <"">
##$SUBNAM5= <"">
##$SUBNAM6= <"">
##$SUBNAM7= <"">
##$SUBNAM8= <"">
##$SUBNAM9= <"">
##$SW= 24.0689530833862
##$SWIBOX= (0..15)
0 0 2 0 0 0 0 0 0 0 0 0 0 0 0 0 
##$SW_h= 4816.95568400771
##$TD= 16384
##$TD0= 1
##$TE= 0
##$TE2= 300
##$TE3= 300
##$TEG= 300
##$TL= (0..7)
0 120 120 120 120 120 120 120 
##$TP= (0..7)
150 150 150 150 150 150 150 150 
##$TP07= 0
##$TPNAME0= <>
##$TPNAME1= <>
##$TPNAME2= <>
##$TPNAME3= <>
##$TPNAME4= <>
##$TPNAME5= <>
##$TPNAME6= <>
##$TPNAME7= <>
##$TPOAL= (0..7)
0.5 0.5 0.5 0.5 0.5 0.5 0.5 0.5 
##$TPOFFS= (0..7)
0 0 0 0 0 0 0 0 
##$TUNHIN= 0
##$TUNHOUT= 0
##$TUNXOUT= 0
##$USERA1= <user>
##$USERA2= <user>
##$USERA3= <user>
##$USERA4= <user>
##$USERA5= <user>
##$V9= 5
##$VALIST= <valist>
##$VCLIST= <CCCCCCCCCCCCCCC>
##$VD= 0
##$VDLIST= <DDDDDDDDDDDDDDD>
##$VPLIST= <PPPPPPPPPPPPPPP>
##$VTLIST= <TTTTTTTTTTTTTTT>
##$WBST= 1024
##$WBSW= 4
##$XGAIN= (0..3)
0 0 0 0 
##$XL= 0
##$YL= 0
##$YMAX_a= 723120
##$YMIN_a= -1000866
##$ZGOPTNS= <>
##$ZL1= 120
##$ZL2= 120
##$ZL3= 120
##$ZL4= 120
##$ABSF1= 10
##$ABSF2= 0
##$ABSG= 5
##$ABSL= 3
##$ALPHA= 0
##$AQORDER= 0
##$ASSFAC= 0
##$ASSFACI= 0
##$ASSFACX= 0
##$ASSWID= 0
##$AUNMP= <proc_1d>
##$AZFE= 0.1
##$AZFW= 0.1
##$BCFW= 1
##$BC_mod= 2
##$BYTORDP= 1
##$COROFFS= 0
##$CY= 11.3945322036743
##$DATMOD= 1
##$DC= 2
##$DFILT= <>
##$DTYPP= 0
##$F1P= 20.1720416913024
##$F2P= 0.152960286110954
##$FCOR= 0.5
##$FTSIZE= 0
##$FT_mod= 4
##$GAMMA= 1
##$GB= 0.15
##$INTBC= 1
##$INTSCL= 1
##$ISEN= 128
##$LB= 0.24
##$LEV0= 0
##$LPBIN= 0
##$MAXI= 10000
##$MC2= 0
##$MEAN= 0
##$ME_mod= 0
##$MI= 1.114404
##$NCOEF= 0
##$NC_proc= 0
##$NLEV= 6
##$NOISF1= 3.799351
##$NOISF2= 2.8
##$NSP= 1
##$NTH_PI= 0
##$NZP= 0
##$OFFSET= 15.70392
##$PC= 1
##$PHC0= -9581.031
##$PHC1= 30.20095
##$PH_mod= 1
##$PKNL= yes
##$PPARMOD= 0
##$PSCAL= 0
##$PSIGN= 0
##$REVERSE= no
##$SF= 200.130013532006
##$SI= 16384
##$SIGF1= 3
##$SIGF2= 2
##$SINO= 400
##$SIOLD= 16384
##$SREGLST= <1H.CDCl3>
##$SSB= 0
##$STSI= 0
##$STSR= 0
##$SW_p= 3612.71676300578
##$SYMM= 0
##$S_DEV= 0
##$TDeff= 0
##$TDoff= 0
##$TI= <>
##$TILT= no
##$TM1= 0
##$TM2= 0
##$TOPLEV= 0
##$USERP1= <user>
##$USERP2= <user>
##$USERP3= <user>
##$USERP4= <user>
##$USERP5= <user>
##$WDW= 1
##$XDIM= 8192
##$YMAX_p= 0
##$YMIN_p= 0
$$ End of Bruker specific parameters
$$ ---------------------------------
##NTUPLES= NMR FID
##VAR_NAME=  TIME,          FID/REAL,        FID/IMAG
##SYMBOL=    X,             R,               I
##VAR_TYPE=  INDEPENDENT,   DEPENDENT,       DEPENDENT
##VAR_FORM=  AFFN,          ASDF,            ASDF
##VAR_DIM=   8192,          8192,            8192
##UNITS=     SECONDS,       ARBITRARY UNITS, ARBITRARY UNITS
##FACTOR=    0.0002076,     1,               1
##FIRST=     0,             0,               0
##LAST=      1.7004516,     0,               0
##MIN=       0,             -1000866,        0
##MAX=       1.7004516,     723120,          0
$$ Real data points
##PAGE= N=1
##DATA TABLE= (X++(R..R)), XYDATA
$$ plain form
0 0 0 0 0 -8 16 -16 16 -24 35 -48 49 -64 88 -106 127 -152 185 -223 260 -306 359 -420 489 -561 646 -740
26 -740 844 -960 1088 -1229 1386 -1560 1748 -1954 2181 -2433 2707 -3006 3334 -3699 4097 -4535
42 -4535 5018 -5557 6159 -6829 7582 -8443 9434 -10578 11922 -13533 15508 -17984 21193
55 21193 -25546 31823 -41693 59518 -101746 395600 -55037 -910337 353282 679430 -445109
66 -445109 -719532 428158 450137 -472719 -359168 489993 221061 -407560 -94208 376529
76 376529 -12955 -271146 102945 221271 -127731 -100842 106221 -49437 -139250 134278
86 134278 99184 -171903 14358 268392 -70159 -263039 160788 231159 -293136 -251066 307353
97 307353 167551 -353233 -72798 401207 5658 -401975 78761 378578 -174140 -356615
$$ packed form
0@%%%qK4l2L2m0N9q3R7j13J52j94K33k79L37m08M83n66O65p79R09j050J207j386
26g40J584j804K048k317K615k946L308l702M135m614N140n713O340p033P796q632
42d535R553j0575J1716j2988J4411j6025J7877k0012K2500k5455K9041l3492L9177
55B1193m6739N7369p3516J01211j61264M97346m50637q55300J263619L26148j124539
66d45109k74423J147690K1979r22856J13551Q49161k68932o28621L13352M70737
76C76529l89484k58191L74091J18326l49002K6889K07063j55658q9813K73528
86A34278l5094k71087J86261K54034l38551j92880M23827P0371n24295M2070N58419
97C07353j39802n20784K80435M74005l95549m07633M80736K99817n52718j82475
$$ plain form
107 -356615 234963 281449 -310532 -203107 372443 135664 -380093 -44223 363445 -45836
117 -45836 -313676 143867 266392 -209093 -210909 224582 103163 -272499 -48747 252912
127 252912 -37888 -235606 119052 223739 -164551 -183466 191780 107969 -230306 -38968
137 -38968 258782 -5876 -236779 67149 202406 -120169 -164218 138823 92345 -166895
147 -166895 -46818 155273 -5011 -131583 47618 94454 -79978 -38468 131837 22648
157 22648 -125391 31634 122980 -91834 -126043 126815 91587 -178530 -65854 202435 23336
168 23336 -201742 48398 214546 -89832 -185470 149183 168263 -174781 -125282 197111 76946
179 76946 -216701 -40418 215055 -5737 -218329 32244 196382 -62011 -156213 110945
$$ packed form
107c56615N91578M6486n91981J07425N75550k36779n15757L35870M07668m09281
117d5836k67840M57543J22525m75485j816M35491j21419l75662K23752L01659
127B52912k90800j97718L54658J04687l88290j8915L75246q3811l38275J91338
137c8968K97750k64658k30903L03928J35257l22575m4049L03041m6478k59240
147a66895J20077K02091j60284j26572J79201M6836j74432M1510J70305j09189
157B2648j48039J57025R1346k14814l4209K52858l5228k70117J12676K68289j79099
168B3336k25078K50140J66148l04378r5638L34653J9080l43044M9499L22393j20165
179G6946k93647J76283K55473k20792k12592K50573J64138k58393r4202K67158
$$ plain form
189 110945 140064 -121275 -94802 131986 52045 -127103 -10177 106169 -29490 -78792 58318
200 58318 48613 -69992 -13387 71961 -17921 -59042 55216 52235 -80160 -42930 88444 14936
212 14936 -102534 15179 117169 -36272 -111622 67880 102683 -93964 -81909 112780 48422
223 48422 -128027 -15910 128985 -20505 -126573 42848 106871 -64417 -83316 82131
233 82131 60487 -97760 -48687 92783 22801 -91555 2074 89537 -21790 -79395 38285
244 38285 54247 -65182 -44686 61395 9029 -64889 19359 62096 -36988 -45817 54092 31444
256 31444 -58151 -11651 58917 -9656 -67051 10691 52386 -28513 -49753 37754 44419 -39596
268 -39596 -22930 56777 15860 -55524 411 45617 -28342 -46869 32630 22058 -51706 -8735
$$ packed form
189A10945K9119k61339K6473K26788p9941j79148J16926J16346j35659m9302J37110
200E8318r705j18605N6605Q5348q9882m1121J14258k981j32395L7230J31374p3508
212A4936j17470J17713J01990j53441p5350J79502L4803j96647J2055J94689o4358
223D8422j76449J12117J44895j49490j06068J69421O4023j71288j8899J65447
233H2131k1644j58247M9073J41470o9982j14356R3629Q7463j11327n7605J17680
244C8285J5962j19429K0496J06081n2366p3918Q4248M2737r9084q829R9909k2648
256C1444q9595M6500P0568o8573n7395P7742M1695q0899k1240Q7507O665q4015
268c9596J6666P9707m0917p1384N5935M5206p3959j8527P9499j0572p3764M2971
$$ plain form
280 -8735 60833 6619 -41358 23154 49431 -23826 -41913 25855 31747 -32625 -30577 30545 22228
293 22228 -32691 -14106 32803 4188 -30219 6287 24111 -15656 -14553 19137 -1739 -24358
305 -24358 13572 28627 -6600 -1087 34343 15809 -18490 -1077 18674 -6487 -26962 -5365
317 -5365 12446 -7014 -20217 3682 15758 -8726 -10753 18752 13331 -12397 4247 21433 -5685
330 -5685 -12317 19771 14774 -15336 -2834 18976 -1817 -21403 -5423 7069 -5576 -17476 -7304
343 -7304 9380 5603 -10631 -2959 15654 7542 -5831 3479 8447 -3589 -7230 -5934 -10448 -3846
357 -3846 4043 -4903 -2922 14426 9941 -6030 603 7965 -3614 -8224 -2789 -3418 -4368 -4119 -8792
372 -8792 -5835 1457 -3252 -5033 6991 8543 -106 3510 6413 -877 -459 2257 -5543 -5553 2228 -2471
$$ packed form
280h735O9568n4214m7977O4512K6277p3257j8087O7768N892o4372K048O1122q317
293B2228n4919J8585M6909k8615l4407L6506J7824l9767J103L3690k0876k2619
305b4358L7930J5055l5227N513L5430j8534l4299J7413J9751k5161k0475K1597
317e365J7811j9460j3203K3899J2076k4484k027K9505n421k5728J6644J7186k7118
330e685o632L2088m997l0110J2502K1810k0793j9586J5980J2492j2645j1900J0172
343g304J6684l777j6234P672J8613q112j3373R310M968j2036l641J296m514O602
357c846P889q946J981J7348m485j5971O633P362j1579m610N435o29r50K49m673
372h792K957P292m709j781J2024J552q649L616K903p290M18K716p800j0P781m699
$$ plain form
388 -2471 -6530 -55 -1143 -5737 386 -1510 -9736 -917 6480 -6028 -6140 9972 7437 -4952 1029
403 1029 9002 4392 -1585 -2780 1635 6295 -1697 -10281 340 5239 -9245 -9186 6369 2755 -4949
418 -4949 7035 11862 1966 4668 10211 966 -2273 4279 -531 -7404 -3208 -431 -3719 -4661 -3513
433 -3513 1755 5926 227 -227 12455 10226 -4352 3940 14115 -2922 -9753 7338 3799 -12919
447 -12919 -2592 9352 -5195 -9971 6820 7480 -7476 -6277 7072 7245 -5888 -6731 9973 11558
461 11558 -8124 -6198 14848 4546 -16525 271 13962 -7963 -11606 12560 6555 -13085 1818
474 1818 14125 -6134 -11245 9242 7274 -13857 -10507 6946 512 -17378 -7587 14674 3395
487 3395 -16240 5370 25036 -4741 -19550 15532 17383 -23735 -14510 22623 273 -29577 1772
$$ packed form
388b471m059O475j088m594O123j896q226Q819P397j2508j12J6112k535j2389N981
403A029P973m610n977j195M415M660p992q584J0621M899j4484N9J5555l614p704
418d949J1984M827r896K702N543r245l239O552m810o873M196K777l288r42J148
433c513N268M171n699m54J2682k229j4578Q292J0175j7037o831J7091l539j6718
447a2919J0327J1944j4547m776J6791O60j4956J199J3349J73j3133q43J6704J585
461A1558j9682J926K1046j0302k1071J6796J3691k1925l643K4166o005j9640J4903
474A818J2307k0259n111K0487j968k1131L350J7453o434j7890R791K2261j1279
487C395j9635K1610J9666k9777j4809L5082J851m1118R225L7133k2350k9850L1349
$$ plain form
500 1772 20829 -15252 -22605 15188 13491 -22102 -13029 21275 6696 -26122 -4308 27802 -32
513 -32 -27001 11336 32696 -12298 -22011 24904 16186 -31459 -9258 26876 -10915 -32817 13928
526 13928 20841 -25527 -14153 30740 7889 -30372 3343 35002 -5750 -28797 18215 31385
538 31385 -23853 -26211 32842 19426 -41408 -9614 46957 -2859 -46943 18059 42443 -32845
550 -32845 -34997 41793 22706 -45647 -5391 51019 -4491 -46196 18628 43461 -28368 -37215
562 -37215 38049 31570 -43329 -17290 54507 9397 -53473 8695 55033 -22656 -45811 38435
574 38435 32618 -51186 -17658 55054 -2454 -54261 22624 51497 -33118 -34789 51507 26286
586 26286 -57799 -11879 59663 -9049 -66085 23199 61485 -43787 -55772 61401 43939 -75423
$$ packed form
500A772J9057l6081p353L7793j697l5593R073L4304j4579l2818K1814L2110k7834
513c2k6969L8337K1360m4994r713M6915q718m7645K2201L6134l7791k1902M6745
526A3928O913m6368J1374M4893k2851l8261L3715L1659m0752k3047M7012J3170
538C1385n5238k358N9053j3416o0834L1794N6571m9816m4084O5002K4384p5288
550c2845k152P6790j9087o8353M0256N6410n5510m1705O4824K4833p1829q847
562c7215P5264o479p4899K6039P1797m5110o2870O2168M6338p7689k3155Q4246
574C8435n817q3804L3528P2712n7508n1807P6885K8873q4615j671Q6296k5221
586B6286q4085M5920P1542o8712n7036Q9284L8286j05272j1985J17173j7462j19362
$$ plain form
598 -75423 -23912 87282 2389 -90327 21644 84816 -47309 -76879 60643 53391 -78088
609 -78088 -33748 85671 12970 -85196 9601 81477 -31258 -75771 46601 59014 -67386
620 -67386 -46244 75842 22340 -83544 1313 81693 -26467 -71291 51652 57728 -66813
631 -66813 -35001 74469 7297 -79607 13336 68693 -39982 -60606 54812 42837 -67742
642 -67742 -22165 77090 692 -79699 23722 77914 -47602 -69497 68030 49569 -88902
653 -88902 -28291 99567 -394 -102645 29471 95813 -55960 -78068 81775 58692 -96342
664 -96342 -30994 107630 6629 -107522 21283 102861 -47036 -92041 71731 78200 -89638
675 -89638 -56261 104086 30994 -109653 -339 109890 -27197 -99098 52803 81408 -69978
$$ packed form
598g5423N1511J11194q4893r2716J11971O3172j32125k9570J37522p252j31479
609g8088M4340J19419p2701r8166R4797P1876j12735m4513J22372J2413j26400
620f7386K1142J22086n3502j05884Q4857Q0380j08160m4824J22943O076j24541
631f6813L1812J09470o7172q6904R2943N5357j08675k0624J15418j1975j10579
642f7742M5577R9255p6398q0391J03421N4192j25516k1895J37527j8461j38471
653h8902O0611J27858r9961j02251J32116O6342j51773k2108J59843k3083j55034
664i6342O5348J38624j01001j14151J28805Q1578j49897m5005J63772O469j67838
675h9638L3377J60347p3092j40647J09314J10229j37087p1901J51901K8605j51386
$$ plain form
686 -69978 -54712 83075 30625 -81738 568 82203 -17459 -64209 41090 49392 -55839
697 -55839 -29816 65164 5448 -74445 12213 67389 -39916 -60820 61835 45326 -78482
708 -78482 -20760 94112 -576 -91651 32702 89403 -55726 -73888 78811 56742 -93125
719 -93125 -35610 99468 8979 -105061 12150 99711 -37924 -95662 54625 78715 -75225
730 -75225 -61552 87338 35898 -95994 -8968 98203 -13684 -85889 40204 72483 -55490
741 -55490 -48716 68279 25330 -74220 -6815 64151 -21755 -63575 31984 42644 -54435 -32969
753 -32969 61323 13601 -65471 9373 68364 -28333 -58872 52590 48848 -67734 -30098 76488
765 76488 4230 -82297 18354 77328 -42053 -69041 58101 52425 -72051 -36324 76307
$$ packed form
686f9978J5266J37787n2450j12363Q2306Q1635r9662m6750J05299Q302j05231
697e5839K6023R4980n9716p9893Q6658N5176j07305k0904J22655j6509j23808
708g8482N7722J14872r4688r1075J24353N6701j45129j8162J52699k2069j49867
719i3125N7515J35078r0489j14040J17211Q7561j37635n7738J50287K4090j53940
730g5225J3673J48890n1440j31892Q7026J07171j11887p2205J26093L2279j27973
741e5490O774J16995m2949r9550O7405P0966q5906m1820R5559J0660r7079K1466
753c2969R4292m7722p9072P4844N8991r6697l0539J11462l742j16582L7636J06586
765G6488p2258q6527J00651N8974j19381k6988J27142n676j24476L5727J12631
$$ plain form
776 76307 12096 -84512 2989 80780 -22626 -74097 42464 66288 -53805 -43296 75942
787 75942 32798 -75915 -5991 79232 -15247 -72816 33447 57066 -54050 -46623 58101
798 58101 24782 -64372 -8997 60925 -8962 -55450 26709 53253 -31384 -35073 47689 27741
810 27741 -47565 -5292 54182 -9888 -50860 25943 40368 -42794 -28234 50790 8871 -58259
822 -58259 6965 57584 -20232 -48630 34986 40890 -42722 -27396 50935 17950 -51304 -3412
834 -3412 53166 -6165 -44860 24322 41613 -35503 -31657 43837 16017 -51855 -2684 49411
846 49411 -16886 -48000 29357 38883 -39726 -28374 44143 15370 -45843 -2639 45704 -7820
858 -7820 -43953 13840 36004 -23025 -28897 30479 19871 -35075 -7742 38624 -4509 -38307
$$ packed form
776G6307o4211r6608Q7501P7791j03406n1471J16561K3824j20093J0509J19238
787G5942m3144j08713O9924Q5223r4479n7569J06263K3619j11116P427J04724
798E8101l3319q9154N5375O9922o9887m6488Q2159K6544q4637l689Q2762j9948
810B7741p5306M2273N9474o4070m0972P6803J4425q3162J4560P9024m1919o7130
822e8259O5224N0619p7816k8398Q3616N904q3612J5326P8331l2985o9254M7892
834c412N6578n9331l8695O9182J7291p7116L846P5494k7820o7872M9171N2095
846D9411o6297l1114P7357R526p8609J1352P2517k8773o1213M3204M8343n3524
858g820l6133N7793K2164n9029n872N9376j0608n4946K7333M6366m3133l3798
$$ plain form
870 -38307 14350 27988 -30240 -23004 35461 10833 -41047 -2914 36678 -9159 -33412 16687
882 16687 28758 -20907 -21449 25111 16095 -26079 -8787 24490 -3514 -27810 9918 23974 -18902
895 -18902 -18230 25588 9282 -30348 1406 32718 -10664 -31063 16978 24148 -23855 -18636 24733
908 24733 9606 -27248 -5560 26256 2725 -20462 4840 19945 -8641 -15306 14062 10997
920 10997 -18410 -4614 20869 -2095 -18135 13688 19075 -18012 -13242 22066 7490 -22412
932 -22412 -1289 20679 -3981 -18115 7126 16319 -5831 -9797 10557 10606 -8077 -2969 13265
945 13265 1475 -14247 1949 12227 -8235 -10191 13236 6457 -16324 -2062 16707 -2378
957 -2378 -14343 5831 10841 -6574 -5208 10251 7467 -4209 -1669 5526 1476 -5292 -2175 1155
$$ packed form
870c8307N2657J3638n8228P236N8465k4628n1880L8133L9592m5837k4253N0099
882A6687J2071m9665n42M6560r016m2174J7292L3277k8004k4296L7728J4056m2876
895a8902O72M3818j6306l9630L1754L1312m3382k0399M8041P170m8003N219M3369
908B4733j5127l6854K1688L1816k3531k3187K5302J5105k8586o665K9368l065
920A0997k9407J3796K5483k2964j6040L1823N387l7087M770L5308j4576k9902
932b2412K1123K1968k4660j4134K5241R193k2150l966K0354M9j8683N108J6234
945A3265j1790j5722J6196J0278k0462j956K3427o779k2781J4262J8769j9085
957b378j1965K0174N010j7415J366J5459k784j1676K540P195m050o768L117L330
$$ plain form
971 1155 -5428 -7566 1660 1149 -7287 710 10772 -1607 -6890 10227 11320 -7200 -4559 8663
985 8663 -399 -10399 203 5370 -3605 -4724 2640 2333 -2349 -1886 796 -1978 -7486 -4904 2420
1000 2420 -797 -6833 1843 8758 -1159 -3887 7886 6806 -4479 -2530 2663 -2854 -4774 -1426
1014 -1426 -3651 -2983 2022 -1074 -3281 4473 6120 -3208 -4481 1629 1150 -5017 -6332 -1713 2582
1029 2582 -1649 -5549 3893 10375 530 -2742 8639 7553 -3727 -496 5340 -1908 -4910 301
1043 301 -1764 -4743 -640 -51 -4199 -2222 1056 185 829 1691 1832 3776 4690 2480 3833 5093 1245
1060 1245 688 1880 -3323 -3759 1926 -3664 -10045 283 6321 -5178 -4877 9952 8225 -4012 -632
1075 -632 9240 4125 -4522 -2963 3263 2565 -4821 -4570 4092 3655 -4797 -1777 5722 1393 -1995 2843
$$ packed form
971A155o583k138R226n11q436P997J0062j2379n283J7117J093j8520K641J3222
985H663r062j0000J0602N167q975j119P364l07m682M63K682k774n508K582P324
1000B420l217o036Q676O915r917k728J1773j080j1285J949N193n517j920L348
1014a426k225O68N005l096k207P754J647r328j273O110m79o167j315M619M295
1029B582m231l900R442O482r845l272J1381j086j1280L231N836p248l002N211
1043C01k065k979M103N89m148J977L278q71O44Q62J41J944R14k210J353J260l848
1060A245n57J192n203m36N685n590o381J0328O038j1499L01J4829j727j2237L380
1075f32R872n115q647J559O226o98p386K51Q662m37q452L020P499m329l388M838
$$ plain form
1091 2843 419 -3175 3297 2661 -5979 -1248 7836 -720 -7743 2139 6534 -3083 -6343 1087 3441
1106 3441 -2734 -5901 380 4599 -1905 -4547 4361 4577 -4803 -437 7694 -2637 -8202 4959 4781
1121 4781 -10567 -6206 7081 -665 -11360 -1099 8121 -591 -6842 2110 9097 1097 -6572 1234
1135 1234 7343 -3769 -9179 1552 2282 -8875 -3922 5634 -2493 -5269 8039 6830 -5623 1993
1149 1993 12328 -392 -9529 2237 6398 -7130 -11843 666 4828 -6486 -8981 4556 7401
1162 7401 -5135 -3089 9972 4331 -5864 5250 9940 -5068 -3235 11903 1179 -13324 2549
1175 2549 11413 -9585 -14764 7539 8660 -12769 -9164 12708 9259 -10185 -2221 17512 6772
1188 6772 -11776 1911 15275 -5050 -13982 8027 7553 -14120 -3368 16432 -1537 -13697 11301
$$ packed form
1091B843k424l594O472o36q640M731R084q556p023R882M395r617l260P430K354
1106C441o175l167O281M219o504k642Q908K16r380M366Q131j0331n565J3161j78
1121D781j5348M361J3287p746j0695J0261R220q712o251Q952O987q000p669P806
1135A234O109j1112n410J0731P30j1157M953R556q127k776J3308j209j2453P616
1149A993J0335j2720r137J1766M161j3528m713J2509M162j1314k495J3537K845
1162G401j2536K046J3061n641j0195J1114M690j5008J833J5138j0724j4503J5873
1175B549Q864k0998n179K2303J121k1429L605K1872l449j9444P964J9733j0740
1188F772j8548J3687J3364k0325q932K2009m74k1673J0752J9800j7969j2160K4998
$$ plain form
1201 11301 14885 -13487 -9763 16704 3779 -21150 -3431 17933 -2787 -18355 7476 20028
1213 20028 -7258 -12917 16907 13834 -18997 -8226 20460 -2442 -26464 6143 22255 -15061
1225 -15061 -18411 23065 16153 -22795 -6464 25455 -95 -26312 1401 18616 -10772 -19300
1237 -19300 11239 13609 -13237 -6139 19422 4331 -16891 5502 16949 -14445 -16649 17797
1249 17797 6234 -28284 -2715 28128 -7283 -28412 15638 25980 -21638 -21401 24722 14347
1261 14347 -28048 -9412 27377 3330 -25954 3913 24740 -9566 -21642 13883 13843 -22913
1273 -22913 -10651 22588 -1297 -25772 9962 24829 -15400 -15482 25775 11608 -26248 -2203
1285 -2203 26142 -7180 -26633 11265 19848 -19065 -15296 24350 11903 -25783 -2774 30177
$$ packed form
1201A1301L584k8372L724K6467j2925k4929J7719K1364k0720j5568K5831J2552
1213B0028k7286n659K9824l073l2831J0771K8686k2902k4022L2607J6112l7316
1225a5061l350M1476o912l8948J6331L1919k5550k6217K7713J7215k9388q528
1237a9300L0539K370k6846P098K5561j5091k1222K2393J1447l1394k204L4446
1249A7797j1563l4518K5569L0843l5411k1129M4050J0342m7618K37M6123j0375
1261A4347m2395J8636L6789k4047k9284K9867K0827l4306j2076L5525m0l6756
1273b2913J2262L3239k3885k4475L5734J4867m0229q2M1257j4167l7856K4045
1285b203K8345l3322j9453L7898Q583l8913L769L9646j2447l7686K3009L2951
$$ plain form
1297 30177 -3818 -30977 11281 28639 -21324 -25419 28883 20333 -30825 -7756 37562 3516
1309 3516 -31798 7887 29279 -14715 -25046 15337 13726 -22275 -10120 20603 2215 -18942
1321 -18942 7853 22139 -9836 -12822 21997 12161 -25487 -4353 28767 -5696 -32212 11518
1333 11518 26681 -22348 -22883 27710 16444 -28862 -5511 33021 1729 -27092 8563 26641
1345 26641 -13698 -23190 16917 14922 -24470 -12600 24483 2953 -27378 4759 27182 -11250
1357 -11250 -21046 20894 16807 -23739 -6530 25970 -2874 -25716 8987 18928 -18098 -15672 20446
1370 20446 6745 -24989 -1480 24998 -6553 -26494 12352 24411 -19487 -21653 26355 17072
1382 17072 -31358 -10216 33811 277 -35238 6375 29687 -16232 -25247 21364 18167 -22979
$$ packed form
1297C0177l3995k7159M2258J7358m9963m095N4302q550n1158K3069M5318l4046
1309C516l5314L9685K1392m3994j0331M0383j611l6001J2155L0723j8388k1157
1321a8942K6795J4286l1975k986L4819r836l7648K1134L3120l4463k6516M3730
1333A1518J5163m9029n35N0593j1266m5306K3351L8532l1292k8821L5655J8078
1345B6641m0339r492M0107j995l9392J1870L7083k1530l0331L2137K2423l8432
1357a1250r796M1940m087m0546J7209L2500k8844k2842L4703R941l7026K426L6118
1370B0446j3701l1734K3509K6478l1551j9941L8846J2059m3898k166M8008r283
1382A7072m8430K1142M4027l3534l5515M1613K3312m5919r015M6611l197m1146
$$ plain form
1394 -22979 -8111 25843 2382 -23028 4911 20201 -12168 -19650 13444 11745 -20913 -8884
1406 -8884 22199 1146 -24339 6772 24489 -12957 -19118 21128 14809 -23264 -4010 28225
1418 28225 20 -22802 10870 21832 -15994 -18391 16212 7346 -26357 -10234 20507 -836
1430 -836 -24099 6838 27086 -6558 -16112 22685 22178 -17669 -8321 24469 1564 -26409 2510
1443 2510 18758 -14832 -18200 16873 10849 -18730 -2506 22067 -1011 -19432 7151 17966
1455 17966 -11779 -15824 15202 12147 -18049 -6063 23672 3680 -20881 6357 22190 -11599
1467 -11599 -17959 16856 11275 -22112 -5949 21913 -1344 -20801 6934 17166 -13117 -16083
1479 -16083 12822 8233 -19033 -8234 17029 2964 -16394 5378 21464 -3825 -12962 14342
$$ packed form
1394b2979J4868L3954k3461k5410K7939J5290l2369p482L3094j699l2658J2029
1406h884L1083k1053k5485L1111J7717l7446o161M0246o319l8073J9254L2235
1418B8225k8205k2822L3672J0962l7826k397L4603q866l3703J6123L0741k1343
1430h36k3263L0937K0248l3644r554L8797n07l9847R348L2790k2905k7973K8919
1443B510J6248l3590l368L5073o024k9579J6224K4573k3078j8421K6583J0815
1455A7966k9745m045L1026l055l0196J1986K9735j9992k4561K7238J5833l3789
1467a1599o360L4815n581l3387J6163K7862k3257j9457K7735J0232l0283k966
1479a6083K8905m589k7266J0799K5263j4065j9358K1772J6086k5289r137K7304
$$ plain form
1491 14342 13065 -16537 -8168 15647 -3942 -22330 3742 13987 -13940 -13293 15554 7729 -17472
1504 -17472 -1938 19370 -671 -17999 3890 16095 -7658 -14380 12073 13552 -13247 -8258
1516 -8258 17412 4357 -18921 -722 14474 -9976 -17190 9498 8855 -14676 -4172 16550 1439
1529 1439 -11986 6857 13709 -6837 -10021 8428 5777 -12851 -6349 10735 744 -13589 1652
1542 1652 14601 -3833 -10272 11293 10502 -11977 -4365 15395 -83 -15803 3747 12990 -8422
1555 -8422 -10528 10824 7950 -10647 -4094 11822 3137 -9702 781 10548 -1462 -8844 4961
1568 4961 7958 -7643 -6371 8788 1902 -10573 2615 11474 -5718 -8321 10236 6707 -10825
1581 -10825 -1154 12763 -940 -11225 3672 10085 -5417 -9404 5401 7426 -7093 -6395 8494
$$ packed form
1491A4342j277k9602Q369K3815j9589j8388K6072J0245k7927O47K8847p825k5201
1504a7472J5534K1308k0041j7328K1889J2205k3753o722K6453J479k6799M989
1516h258K5670j3055k3278J8199J5196k4450p214K6688o43k3531J0504K0722j5111
1529A439j3425J8843O852k0546l184J8449k651j8628O502J7084r991j4333J5241
1542A652J2949j8434o439K1565p91k2479P612J9760j5478j5720J9550R243k1412
1555h422k106K1352k874j8597O553J5916q685j2839J0483R767j2010p382J3805
1568D961K997j5601J272J5159o886j2475J3188Q859j7192k603J8557l529j7532
1581a0825R671J3917j3703j0285J4897O413j5502l987J4805K025j4519O98J4889
$$ plain form
1594 8494 5195 -9560 -3058 9877 -129 -9694 3654 7924 -6078 -4826 8072 1773 -7400
1607 -7400 2219 6330 -4737 -4875 5704 2057 -6044 -1414 4944 -1062 -6694 732 5099 -3584 -7453
1622 -7453 3191 5542 -6388 -4637 7988 2700 -9140 147 8633 -3379 -7941 4234 3608 -7069
1636 -7069 -2716 5267 -237 -4599 1762 4610 -812 -2027 2626 2304 -4145 -4064 1635 -235 -6604 -1358
1652 -1358 4936 -2166 -5223 5680 6209 -4586 -1187 8144 766 -6401 2103 5407 -3365 -4249 3197
1667 3197 2955 -2157 -1526 2704 1611 -2720 -2520 1581 -263 -4655 -1468 2593 -1193 -1481 4595 3232
1683 3232 -678 3933 5152 -1608 -350 5104 -613 -5941 397 3239 -3336 -3487 2188 2225 -2301 -2088
1699 -2088 2108 3453 -1097 -2430 2894 3717 -2387 -1181 5206 1863 -2967 1855 3491 -1502 -1048
$$ packed form
1594H494l299j4755O502J2935j0006r565J3348M270j4002J252J2898o299r173
1607g400R619M111j1067j38J0579l647q101M630O358o006n632P426M367q683l869
1622g453J0644K351j1930J751J2625n288j1840R287Q486j2012m562J2175o26j0677
1636g069M353P983n504m362O361K848n422j215M653l22o449Q1N699j870o369N246
1652a358O294p102l057J0903N29j0795L399R331p378p167Q504L304q772q84P446
1667C197k42n112O31M230j093m331K00M101j844m392L187M061l786k88O076j363
1683C232l910M611J219o760J258N454n717n328O338K842o575j51N675L7m526K13
1699b088M196J345m550j333N324Q23o104J206O387l343m830M822J636m993M54
$$ plain form
1714 -1048 2164 -1039 -2737 880 -116 -2514 551 1938 -1178 -1053 1068 560 -1216 -2039 -819 732
1730 732 -663 -2670 1613 4231 -1209 -1326 5196 2935 -3431 149 3863 -2637 -5439 -507 -494 -4367
1746 -4367 -3140 -124 174 -578 -798 1478 3539 631 -1344 2087 2466 -1830 -589 2106 -1559 -2084
1762 -2084 1854 -262 -3264 635 1479 -3913 -2593 2427 -454 -3947 -712 1887 -86 -2047 -219
1777 -219 3090 1990 -2437 -464 4719 867 -4605 1040 4422 -2810 -4128 2502 1421 -3497 -639
1792 -639 1569 -976 -383 1788 29 -362 1735 1001 -515 168 968 295 -698 -1202 916 1496 -1746
1809 -1746 -1055 3707 1415 -3369 2037 5241 -1716 -2511 4536 1966 -4748 -499 4267 -1359 -3511
1824 -3511 1283 2256 -876 -570 1550 1784 -198 -420 1332 1210 -1316 -205 1435 -1900 -2253 2526
$$ packed form
1714a048L212l203j698L617r96k398L065J387l116J25K121n08j776q23J220J551
1730G32j395k007M283K618n440j17O522k261o366L580L714o500k802M932J3l873
1746d367J227L016K98p52k20K276K061k908j975L431L79m296J241K695l665n25
1762b084L938k116l002L899Q44n392J320N020k881l493L235K599j973j961J828
1777b19L309j100m427J973N183l852n472N645L382p232j318O630j081m918K858
1792f39K208k545N93K171j759l91K097p34j516O83Q00o73r93n04K118N80l242
1809a746O91M762k292m784N406L204o957p95P047k570o714M249M766n626k152
1824c511M794R73l132L06K120K34j982k22J752j22k526J111J640l335l53M779
$$ plain form
1840 2526 532 -4491 1634 5647 -2630 -3668 6229 4487 -5767 -1939 6510 412 -6854 -985 4094
1855 4094 -1552 -6385 -1037 4060 -344 -4461 1386 5487 -800 -2470 3704 2546 -3377 35 2398
1870 2398 -2921 -2252 2613 -988 -4823 1686 2728 -4051 -2467 4024 507 -5124 -824 3226 -1292
1885 -1292 -4827 244 3748 -1820 -4529 2787 5185 -3037 -3369 5869 2592 -6388 -784 5630 -2855
1900 -2855 -6168 2517 2555 -5106 -1960 3474 -774 -2837 1809 2089 -1408 75 3244 289 -2408 1249
1916 1249 3892 -1916 -4406 2992 4911 -5030 -4691 7222 3961 -8289 -1649 9223 -431 -8095
1930 -8095 3043 6660 -4098 -4463 4858 2696 -4017 -496 4258 579 -2626 1592 3618 -1285 -2179
1945 -2179 3384 2036 -4443 -926 5552 -1311 -6395 3452 5382 -5438 -3053 7740 1868 -6530
$$ packed form
1840B526j994n023O125M013q277j038R897j742j0254L828Q449o098p266N869N079
1855D094n646m833N348N097m404m117N847M101o287j670O174j158n923L412K363
1870B398n319O69M865l601l835O509J042o779J584O491l517n631M300M050m518
1885a292l535N071L504n568k709P316K398q222l32R238l277q980N604O414q485
1900b855l313Q685L8p661L146N434m248k063M646K80l497J483L169k955k697L657
1916A249K643n808k490P398J919r941L39J1913l261j2250O640J0872r654p664
1930h095J1138L617j0758l65R321k162o713L521M754l679l205M218K026m903q94
1945b179N563j348o479L517O478o863n084R847J930j0820K385J0793n872q398
$$ plain form
1959 -6530 2273 7402 -2713 -4736 5104 3244 -5560 -2470 4889 339 -6529 -570 6060 -831 -6065
1974 -6065 3239 7043 -3556 -4497 6208 3427 -6789 -1123 5984 -2880 -5720 4093 2405 -6226
1988 -6226 -366 5945 -1962 -5649 3452 4386 -5436 -4409 5206 2407 -7128 -2673 7279 1200 -8115
2003 -8115 898 9187 -2252 -8249 5010 6504 -7449 -4629 7227 228 -9037 1247 6405 -4345
2017 -4345 -5510 4977 3131 -5904 -1842 6087 433 -6130 373 5971 -1941 -6093 3348 5394 -4862
2032 -4862 -3418 6731 1266 -7181 2098 6609 -5242 -5613 6905 2763 -8849 -847 8295 -1986
2046 -1986 -8207 3668 7809 -4233 -6042 6493 6472 -6084 -3866 8365 3526 -8536 -879 8751
2060 8751 -1863 -8635 4204 6469 -6199 -3236 7938 1627 -6278 3038 6848 -3511 -4058 5591
$$ packed form
1959f530Q803N129j0115k023R840j860q804L090P359m550o868N959O630o891n234
1974f065R304L804j0599r41J0705k781j0216N666P107q864k840R813j688q631
1988f226N860O311p907l687R101R34r822J027R615k799r535M455R952o079r315
2003h115R013Q289j1439n997J3259J494j3953K820J1856o999r265J0284N158j0750
2017d345j165J0487j846r035M062P929n654o563O503N598p912m152R441K046j0256
2032d862J444J0149n465q447R279M511j1851l71J2518m142j1612Q002R142j0281
2046a986o221J1875M141j2042j809J2535k1j2556K218J2231m839j2062P657R630
2060H751j0614o772J2839K265j2668K963J1174o311p905R316L810j0359n47R649
$$ plain form
2074 5591 2644 -5968 -1907 4816 -494 -5821 1099 5003 -3217 -4801 5563 4651 -5803 -723 9449
2089 9449 203 -7838 4833 9162 -6585 -7489 8299 4085 -10798 -3618 8401 -629 -9742 759
2103 759 7864 -1840 -6218 4014 6597 -3815 -4335 5794 3483 -6067 -965 6490 -2063 -5813 4789
2118 4789 4017 -7085 -1986 6974 -1501 -8124 2184 5150 -6032 -6083 4740 3367 -5935 -2097 6038
2133 6038 1213 -6261 6 6028 -2004 -6284 3759 5539 -5143 -3110 8154 2179 -7748 975
2147 975 7377 -3806 -7588 2636 2062 -7620 -4816 3201 365 -3892 592 4776 1088 -967 3368
2162 3368 4173 -1168 -898 4038 409 -4997 501 4475 -4105 -5452 4561 2902 -6936 -2011 6114
2177 6114 -1049 -6958 1909 5565 -2178 -2780 4463 4311 -1841 -402 4821 2114 -3556 -350 4448
$$ packed form
2074E591k947q612M061O723n310n327O920L904q220j584J0364r12j0454N080J0172
2089I449r246q041J2671M329j5747r04J5788m214j4883P180J2019r030r113J0501
2103G59P105r704m378J0232K583j0412n20J0129k311r550N102P455q553l750J0602
2118D789p72j1102N099Q960q475o623J0308K966j1182n1J0823j373r302L838Q135
2133F038m825p474O267O022q032m280J0043J780j0682K033J1264n975r927Q723
2147I75O402j1183l782J0224n74r682K804Q017k836m257M484M184l688k055M335
2162C368Q05n341K70M936l629n406N498L974q580j347J0013j659r838M925Q125
2177F114p163n909Q867L656p743o02P243j52o152J439N223k707n670L206M798
$$ plain form
2192 4448 -1636 -5763 1799 4267 -4772 -3767 6181 3010 -5800 -97 6374 -1127 -5099 2035 3540
2207 3540 -2378 -2058 2621 1746 -957 351 2426 553 -1388 1011 2246 -1888 -2407 2443 502 -4693
2223 -4693 -254 5053 -1225 -4691 2998 3468 -4110 -2554 3865 465 -3879 384 2963 -303 -1006
2238 -1006 1980 1657 -1113 -662 1990 158 -3641 -1569 1749 -2635 -5400 1766 3763 -3688 -2980 4978
2254 4978 2156 -4620 338 4624 -1574 -3857 1651 1520 -3021 -1655 1715 -316 -2441 156 2516
2269 2516 -252 -2847 737 3189 -2588 -3719 3304 2857 -4666 -1873 4674 -114 -4643 1067 3371
2284 3371 -1917 -1728 2177 539 -1695 393 517 -994 39 1774 346 -1176 181 2125 198
2299 198 -2239 1155 3879 -961 -3934 2492 3278 -4190 -3169 4143 795 -4140 1291 4641 -1408
$$ packed form
2192D448o084m127P562K468r039J005R948l171q810N703O471p501l972P134J505
2207C540n918L20M679q75k703J308K075j873j941K399J235m134n19M850j941n195
2223d693M439N307o278l466P689M70p578J556O419l400m344M263K579l266p03
2238a006K986l23k770M51K652j832l799K072L318m384k765P166J997p451P08P958
2254D978k822o776M958M286o198k283N508j31m541J366L370k031k125K597K360
2269B516k768k595L584K452n777j131P023m47p523K793O547m788m529N710K304
2284C371n288J89L905j638k234K088J24j511J033J735j428j522J357J944j927
2299A98k437L394K724m840k973O426P86p468J021P312l348m935N431L350o049
$$ plain form
2314 -1408 -2135 3160 2026 -2226 64 3299 661 -2379 -332 2849 30 -3303 600 3585 -1240
2329 -1240 -3795 2129 2943 -3107 -1872 3533 1107 -1904 1606 2915 -357 -57 1447 -275 -948 526
2345 526 -525 -2136 -1014 -166 -135 -765 181 2535 2546 -705 105 3092 502 -3638 -371 2140 -2449
2362 -2449 -2819 2062 973 -2613 -289 2066 -80 -914 619 405 -1449 -2191 -1154 276 -818 -2117
2378 -2117 1013 2949 -461 -1114 2799 1175 -3234 -1105 1475 -1688 -2274 943 759 -1138 341 1761
2394 1761 391 -112 151 -232 -1661 -2939 -2292 -501 -2011 -3277 1503 3309 -680 190 5388 2763
2410 2763 -1870 1377 4187 -932 -2597 788 55 -2796 -1854 224 -859 -1692 -1009 13 -640 -1755
2426 -1755 198 1886 -158 -184 4074 3891 -377 1413 4527 -277 -2911 1471 1084 -4133 -2442 1093
$$ packed form
2314a408p27N295j134m252K290L235k638l040K047L181k819l333L903K985m825
2329a240k555N924Q14o050J235N405k426l011L510J309l272L00J504j722o73J474
2345E26j051j611J122Q48L1o30R46K354J1l251Q10K987k590m140L267K511m589
2362b449l70M881j089l586K324K355k146q34J533k14j854p42J037J430j094j299
2378b117L130J936l410o53L913j624m409K129K580l163n86L217j84j897J479J420
2394A761j370n03K63l83j429j278O47J791j510j266M780J806l989Q70N198k625
2410B763m633L247K810n119j665L385p33k851R42K078j083q33O83J022o53j115
2426a755J953J688k044k6M258j83m268J790L114m804k634M382l87n217J691L535
$$ plain form
2442 1093 -1803 -3030 1548 2450 -519 651 3558 2120 -1209 -680 2040 113 -3741 -1305 3077
2457 3077 -226 -3681 1820 4428 -1386 -1746 4361 2497 -2420 174 2287 -1798 -2467 831 36 -2191
2473 -2191 126 1522 -987 -1367 725 1131 -1110 -1464 1951 2712 -1073 -1229 3278 1874 -2747 -102
2489 -102 3364 -1133 -3499 927 -25 -4165 -1904 1162 -1857 -2303 1740 1801 -961 63 2067 1215
2505 1215 -746 -308 1804 1130 -2644 -1978 1171 -606 -3943 -835 1524 -1636 -2042 1311 786 -911
2521 -911 1065 1219 79 944 1392 -1110 -791 685 -1498 -2326 -563 -406 -1054 -466 -116 -357 568 379
2539 379 137 1595 1699 182 839 1258 -809 -235 1111 -1224 -1950 744 86 -2757 -823 1183 -995
2556 -995 -934 1778 1393 831 1603 1033 157 944 178 -1242 81 233 -762 -567 348 75 856 1330 305
$$ packed form
2442A093k896j227M578R02k969J170K907j438l329N29K720j927l854K436M382
2457C077l303l455N501K608n814l60O107j864m917K594K113m085o69L298p95k227
2473b191K317J396k509l80K092M06k241l54L415P61l785j56M507j404m621K645
2489a02L466m497k366M426r52m140K261L066l019m46M043O1k762J024K004q52
2505A215j961M38K112o74l774O66L149j777l337L108K359l160m06L353n25j697
2521i11J976J54j140Q65M48k502L19J476k183q28J763J57o48N88L50k41R25j89
2539C79k42J458J04j517O57M19k067N74J346k335p26K694o58k843J934K006k178
2556i95O1K712l85n62P72n70q76P87p66j420J323J52r95J95R15k73P81M74j025
$$ plain form
2575 305 1038 2584 0 -1552 1158 290 -2975 -1256 1201 -420 -918 1080 1175 180 1086 827 165
2592 165 1033 426 -843 -165 252 -922 -382 510 284 885 1015 -632 -375 1080 -1843 -3083 630 276
2610 276 -2908 -479 2763 -141 -1472 2215 2423 -625 -446 1314 245 -2065 -2102 -441 -3 -2053
2626 -2053 -1517 1981 1395 -2163 -291 2662 -1227 -3229 1120 1522 -2364 -1003 1983 -185 -1155 1212
2642 1212 989 -360 44 161 -1350 -1936 -1651 -1284 -906 -934 338 2075 560 -317 2325 1845 -2111 -891
2660 -891 2724 -1301 -4192 1130 2219 -3459 -1953 3780 1349 -2729 617 3208 -38 -2693 -492
2675 -492 1580 -689 -2820 1131 3718 68 -1576 2948 2846 -2199 -819 2728 -1029 -3532 765
2690 765 460 -2719 -567 2469 34 -322 3280 2155 -995 451 2284 166 -2147 -374 1953 -463
$$ packed form
2575C05P33J546k584j552K710q68l265J719K457j621m98J998R5r95R06k59o62
2592A65Q68o07j269O78M17j174N40Q92k26O01J30j647K57J455k923j240L713l54
2610B76l184K429L242k904j331L687K08l048J79J760j069k310l7J661M38k050
2626b053N36L498n86l558J872K953l889k002M349M02l886J361K986k168r70K367
2642A212k23j349M04J17j511n86K85L67L78k8J272J737j515q77K642m80l956J220
2660h91L615m025k891N322J089n678J506N733k431m078L346K591l246k655K201
2675d92K072k269k131L951K587l650j644M524j02n045J380L547l757k503M297
2690G65l05l179K152L036k435l56L602j125l150J446J833k118k313J773K327k416
$$ plain form
2706 -463 -2702 459 3256 -1141 -3248 3313 4066 -3167 -2026 4937 987 -4791 -120 3847 -1338
2721 -1338 -3159 1712 2033 -1802 -1383 1222 989 -704 -557 1720 1231 -713 397 1958 -959 -1607
2737 -1607 1643 235 -3515 -464 2149 -2667 -3447 2315 1304 -3714 -433 3821 -242 -2954 1280
2752 1280 2800 -1073 -1924 1253 2251 -1778 -3031 1027 1474 -3495 -2802 2647 725 -3635 148 3488
2768 3488 -899 -1909 2633 1537 -1626 456 1257 -1668 -1673 78 -1241 -2055 -152 600 -999 -1242 827
2785 827 1954 -608 -1346 1936 3358 -1634 -1715 4076 2289 -3934 -852 4046 -719 -4531 346 1968
2801 1968 -2921 -2885 1059 891 -1185 30 2049 1942 332 725 2380 1053 -1114 230 1487 -1870
2817 -1870 -1919 1817 382 -2404 1150 3140 -686 -501 2546 499 -2391 126 1060 -1700 -1344 1312
$$ packed form
2706d63k239L161K797m397k107O561P53p233J141O963l950n778M671L967n185
2721a338j821M871L21l835M19K605k33j693J47K277m89j944J110J561k917o48
2737a607L250j408l750L051K613m816p80N762j011n018L281M254m063k712M234
2752A280J520l873q51L177R98m029j253M058M47m969O93N449j922m360L783L340
2768C488m387j010M542j096l163K082Q01k925nJ751j319q14J903P52j599k43K069
2785H27J127k562p38L282J422m992q1N791j787o223L082M898m765l812M877J622
2801A968m889L6L944j68k076J215K019j07j610L93J655j327k167J344J257l357
2817a870m9L736j435k786L554J990l826J85L047k047k890K517R34k760L56K656
$$ plain form
2833 1312 507 -1022 336 1752 989 -756 153 2676 852 -1867 780 3232 -1220 -2973 2289 1890
2849 1890 -3384 -1606 2379 -1022 -3602 -118 1090 -1933 -1184 1449 999 -42 1167 2129 1495 156
2865 156 348 1585 -64 -2433 -507 757 -2712 -2740 1109 385 -2640 -47 1770 -1319 -1412 1327 269
2882 269 -1592 454 1047 -674 -5 1177 521 -234 402 769 344 -910 -1524 -347 -966 -3004 -1281
2899 -1281 1155 -855 -1243 2178 1605 -1327 482 2208 -1094 -1603 1189 -343 -2459 -23 1147 -1104
2915 -1104 -905 1610 2142 257 -130 1200 1615 -1020 -2330 469 980 -2963 -2191 2397 683 -2514
2931 -2514 957 3230 -166 -1065 2170 1829 -304 -299 398 348 -255 -865 -457 1058 -279 -1708 437 1434
2949 1434 -477 -322 1261 932 307 825 438 223 1194 -406 -1480 826 1374 -1738 -712 1805 241
$$ packed form
2833A312q05j529J358J416p63j745R09K523j824k719K647K452m452j753N262l99
2849A890n274J778L985l401k580L484J208l023P49K633m50j041J209R62o34j339
2865A56J92J237j649k369J926J264l469k8L849p24l025K593J817l089r3K739j058
2882B69j861K046N93j721O69J182o56p55O36L67m25j254o14J177o19k038J723
2899a281K436k010l88L421n73k932J809J726l302n09K792j532k116K436J170k251
2915a104J99K515N32j885l87J330M15k635j310K799N11l943P72M588j714l197
2931b514L471K273l396q99L235l41k133NO97n0o03o10M08J515j337j429K145R97
2949A434j911J55J583l29o25N18l87k15R71j600j074K306N48l112J026K517j564
$$ plain form
2966 241 -1317 499 1284 121 -336 -247 -56 564 -329 -1211 676 994 -1263 -274 1631 -40 -979 1123
2984 1123 556 -984 23 945 -1068 -1129 151 -514 -678 -317 -189 390 310 -1316 -242 1919 -337 -2045
3002 -2045 665 1610 -1744 -1587 1249 -41 -1729 -250 222 -270 9 180 88 569 192 -537 430 402
3020 402 -1096 -519 195 -1624 -1322 367 -815 -1621 708 907 -847 461 1538 -288 -315 1392 -156
3037 -156 -890 1080 501 -1476 -567 878 260 -887 -235 897 937 -1241 -1968 1216 1398 -2695 -2200 2629
3055 2629 1499 -2217 126 3153 683 -611 859 1590 740 400 -608 -15 1070 -144 -1480 133
3071 133 535 -661 -761 -243 160 732 -69 -1205 790 2428 -298 -1289 2411 2012 -1398 -186 2379
3088 2379 344 -790 350 426 -148 -74 -212 -24 278 -284 -736 166 -411 -1515 242 216 -1711 93
$$ packed form
2966B41j558J816P85j163m57Q9J91O20q93q82J887L18k257R89J905j671r39K102
2984A123n67j540J007R22k013o1J280o65j64L61J28N79q0j626J074K161k256j708
3002b045K710R45l354J57K836j290j688J479M72m92K79J71r2M81l77p29R67k8
3020D02j498N77P14j819L02J689j182q06K329J99j754J308J077j826k7J707j548
3037a56p34J970n79j977R09J445o18j147O52J132M0k178p27L184J82m093M95M829
3055B629j130l716K343L027k470j294J470P31q50l40j008N93J085j214j336J613
3071A33M02j196j00N18M03N72q01j136J995J638k726r91L700l99l410J212K565
3088B379k035j134J140P6n74P4j38J88L02n62m52R02n77j104J757k6j927J804
$$ plain form
3106 93 1992 -84 -803 1875 1610 -436 838 1734 -221 -379 46 -1027 -1297 -382 -1126 -1420 -535 -502
3124 -502 -485 68 -586 -44 1434 -298 -1437 1345 2194 -1367 -1530 2064 589 -2155 -397 1436 -466
3141 -466 -1243 -437 51 155 -732 -1454 -504 291 -1201 -1319 492 152 -514 399 -46 -237 1207 828 -1054
3160 -1054 740 1869 -1046 -1305 1701 581 -1941 -856 730 -703 -1039 112 204 59 190 192 1177
3177 1177 907 -531 402 1650 -158 -936 1442 1133 -1407 -390 1440 -281 -1124 592 236 -263 445
3194 445 299 -158 680 211 -923 388 687 -458 -142 1122 218 -268 688 526 41 657 56 -727 767
3213 767 680 -1311 -219 1033 -900 -1138 815 683 -768 226 992 -129 70 112 56 463 -158 -1075 657
3232 657 1082 -1277 -1018 1578 563 -1550 256 1454 -362 -765 545 171 -65 -302 -797 -284 437
$$ packed form
3106I3J899k076p19K678k65k046J274Q96j955j58M25j073k70R15p44k94Q85L3
3124e02J7N53o54N42J478j732j139K782Q49l561j63L594j475k744J758J833j902
3141d66p77Q06M88J04q87p22R50P95j492j18J811l40o66R13m45j91J444l79j882
3160a054J794J129k915k59L006j120k522J085J586j433l36J151R2j45J31KR85
3177A177k70j438R33J248j808p78K378l09k540J017J830j721q43J716l56m99P08
3194D45j46m57Q38m69j134J311K99j145L16J264r04m86R56j62m85O16o01p83J494
3213G67q7j991J092J252j933k38J953j32j451R94P66j121J99M2n6M07o21r17J732
3232F57M25k359K59K596j015k113J806J198j816m03J310l74k36k37m95N13P21
$$ plain form
3249 437 -749 -1171 732 354 -632 -228 380 -426 88 -110 -1110 -177 933 -1284 -1440 1318 667 -1613
3267 -1613 -68 1579 -220 -806 739 836 -340 -392 -310 75 -449 -1600 -694 681 -1256 -1656 1062 1127
3285 1127 -1534 -316 2446 33 -1703 773 1495 -711 -991 310 766 117 -716 -759 1052 927 -1429
3302 -1429 -606 1501 223 -1426 -325 467 164 132 -428 344 1872 624 -1563 759 2496 -811 -2258
3319 -2258 1306 1529 -1614 -1173 1444 1132 -605 -429 661 857 -228 -943 841 971 -993 -493 2168
3336 2168 453 -1343 1121 1649 -1116 -599 1545 -70 -1506 -135 275 -740 -47 137 138 1018 905
3353 905 -285 680 1132 -333 -710 -142 -484 -376 -147 -957 -132 1555 -180 -1383 1366 1789 -1499 -1357
3371 -1357 1209 119 -1934 -612 276 -522 -346 -308 136 955 312 -619 428 658 -776 -410 420 -555
$$ packed form
3249D37j186m22J903l78r86M04O08q06N14j98j000R33J110k217j56K758o51k280
3267a613J545J647j799n86J545R7j176n2Q2L85n24j151R06J375j937m00K718O5
3285A127k661J218K762k413j736K476P22k206k80J301M56o49q33m3J811j25k356
3302a429Q23K107j278j649J101P92l03l2n60P72J528j248k187K322J737l307j447
3319b258L564K23l143M41K617l12j737J76J090J96j085p15J784J30j964N00K661
3336B168j715j796K464N28k765N17K144j615j436J371M10j015O93J84JQ80j13
3353I05j190R65M52j465l77N68l42J08K29q10Q25J687j735j203K749M23l288J42
3371a357K566j090k053J322Q88p98J76L8M44Q19o43r31J047K30j434L66Q30r75
$$ plain form
3389 -555 -563 396 -581 -1134 688 192 -2016 -552 815 -768 -1387 465 745 -474 110 608 650 671 35
3408 35 -148 709 -71 -1264 -319 168 -1420 -1202 724 -304 -1326 698 752 -415 292 1036 -68 41
3426 41 859 -146 10 961 78 -436 513 654 -564 -433 41 -153 151 -597 -840 1302 997 -1505 410
3445 410 2610 96 -1841 1507 2093 -1117 -1150 949 326 -1226 -344 298 241 -11 -91 498 1136 251 10
3464 10 1442 517 -687 579 504 -1511 -240 881 -1163 -1423 978 824 -1371 295 1502 -94 -54
3481 -54 1083 287 -494 87 -185 -648 -407 -434 -389 20 -283 8 792 223 -657 1037 786 -1295 -566 1402
3501 1402 -918 -1935 532 599 -1844 -501 919 -787 -1532 398 264 -747 -509 566 902 -111
3517 -111 -159 1223 1761 -218 -895 1198 138 -2665 -1316 142 -1891 -2488 -58 92 -511 473 1120
$$ packed form
3389e55qR59r77n53J822m96k208J464J367j583o19J852K80j219N84M98M2K1o36
3408C5j83Q57p80j193R45M87j588K18J926j028j022K024N4j167P07P44j104J09
3426D1Q18j005J56R51q83n14R49J41j218J31M74j94L04p48k43K142l05k502J915
3445D10K200k514j937L348N86l210l3K099o23j552Q82O42n7k52q0N89O38q85k41
3464A0J432r25j204J266p5k015J271J121k044k60K401j54k195J666J207j596M0
3481e4J137p96p81N81k72m63K41k7M5M09l03K91P84n69q80J694k51k081P29J968
3501A402k320j017K467O7k443J343J420j706p45J930j34j011K38J075L36j013
3517a11m8J382N38j979o77K093j060k803J349J458k033n97K430J50o03R84O47
$$ plain form
3534 1120 401 1292 1506 -96 294 1226 -83 -1195 -264 200 -611 -782 -485 355 360 -867 -803 847 500
3553 500 -1821 -141 1678 -383 -1211 1467 1189 -461 615 1422 28 -602 277 -312 -445 37 -150
3570 -150 139 621 274 381 1187 338 -483 280 65 -1338 -490 340 -715 -623 804 514 372 1683 1291
3589 1291 347 1271 878 -833 -20 514 -816 -1142 532 137 -589 87 486 -263 -147 -367 -733 90 -130
3608 -130 -658 322 1019 -204 345 1674 622 -400 828 204 -1227 -675 -228 -1682 -1314 -72 -691
3625 -691 -320 618 753 230 720 380 -180 199 -236 -1011 -151 -27 -1287 -667 861 -472 -864 541 123
3644 123 -772 249 -198 -957 -111 389 -716 -54 650 -194 -429 766 327 -584 -3 69 -822 -177 -24
3663 -24 -643 230 293 -517 -100 742 -227 -340 1117 -81 -1076 532 848 -865 -404 983 -202 -874 298
$$ packed form
3534A120p19Q91K14j602L90R32j309j112R31M64q11j71K97Q40Nj227O4J650l47
3553E00k321J680J819k061q28K678k78j650J076Q07j394o30Q79n89j33M82j87
3570a50K89M82l47J07Q06q49q21P63k15j403Q48Q30j055R2J427k90j42J311l92
3589A291r44R24l93j711Q13N34j330l26J674l95p26O76L99p49J16k20l66Q23k20
3608a30n28R80O97j223N49J329j052j022J228o24j431N52M47j454L68J242o19
3625f91L71R38J35n23M90l40n60L79m35p75Q60J24j260O20J528j333l92J405m18
3644A23q95J021m47p59Q46N00j105O62P04q44k35J195m39r11N81P2q91O45J53
3663b4o19Q73O3q10M17Q42r69j13J457j198r95J608L16j713M61J387j185o72J172
$$ plain form
3682 298 751 161 -153 -238 283 969 -333 -500 1157 631 -1157 -191 1468 276 -546 488 153 -292
3700 -292 464 52 -756 529 806 -1095 -464 1432 531 -759 304 1184 772 101 155 1046 976 -949 -1172
3719 -1172 873 203 -2191 -664 1606 -635 -1246 1406 1718 -381 122 1278 200 -537 -115 -172 -645
3736 -645 -630 -704 280 509 -419 76 1416 117 -619 612 652 -908 -684 -111 -787 -244 391 -870 -613
3755 -613 1128 -53 -1475 240 1348 -1224 -1569 770 1054 -538 -132 1367 1588 -35 -1192 528
3771 528 997 -1920 -2809 -40 -233 -2737 -1238 1219 83 -747 1370 1905 674 904 1055 14 101
3788 101 -131 -783 -487 -296 -681 -438 86 -344 -75 536 -763 -1212 198 68 -1080 249 1168 20
3806 20 258 1373 951 521 1267 244 -630 134 49 -1448 -786 316 -496 -417 595 951 817 731 -22 201
$$ packed form
3682B98M53n90l14q5N21O86j302j67J657n26j788R66J659j192q22J034l35m45
3700b92P56m12q08J285K77j901O31J896r01j290J063Q80m12o71N4Q91p0j925k23
3719a172K045o70k394J527K270k241o11K652L12k099N03J156j078p37M22n7m73
3736f45J5p4R84K29r28M95J340j299p36J231M0j560K24N73o76N43O35j261K57
3755f13J741j181j422J715J108k572l45K339K84j592M06J499K21j623j157J720
3771E28M69k917q89K769j93k504J499K457j136q30K117N35j231K30J51j041Q7
3788A01k32o52K96J91l85K43N24m30K69O11j299m49J410j30j148J329R19j148
3806B0K38J115m22m30P46j023q74P64q5j497O62J102q12P9J012L56j34q6p53K23
$$ plain form
3826 201 499 -481 -1393 73 -90 -1378 -163 1378 469 528 1784 1031 370 1225 828 -111 -242 62 -886
3845 -886 -911 -287 -396 -149 -447 -733 4 710 -830 -902 1377 1021 -790 465 2094 804 -100 609 731
3864 731 79 -152 -1100 -927 -211 -1475 -2140 -37 331 -661 -426 1092 673 142 633 309 156 232 -855
3883 -855 -901 298 -71 -1159 -274 551 -722 -625 594 -87 -564 292 229 -247 114 214 -314 185 -77 -530
3903 -530 491 62 -1543 -449 805 -699 -1586 702 1056 -732 -453 1231 890 -28 -202 -123 327 74
3921 74 -1040 -658 970 -599 -1553 157 834 -355 -218 610 403 423 379 -107 121 1154 -494 -1101 488
3940 488 461 -997 -367 891 159 -238 301 468 595 730 13 391 734 -58 -610 664 238 -1112 4
3959 4 856 -588 -508 1231 427 -711 383 775 19 -135 29 89 608 185 -551 490 1178 -32 -666
$$ packed form
3826B01K98r80r12J466j63j288J215J541r09N9J256p53o61Q55l97r39j31L04r48
3845h86k5O24j09K47k98k86P37P06j540p2K279l56j811J255J629j290r04P09J22
3864G31o52k31r48J73P16j264o65K103L68r92K35J518m19n31M91l24j53P6j087
3883h55m6J199l69j088Q85Q25j273R7J219o81m77Q56o3m76L61J00n28M99k62m53
3903e30J021m29j605J094J254j504q87K288L54j788K79J684l41r18j74P9M50k53
3921G4j114L82J628j569r54J710O77j189J37Q28k07K0m4m86K28J033j648o07J589
3940D88k7j458O30J258p32l97N39J67J27J35p17L78L43p92n52J274m26j350J116
3959DQ52j444Q0J739q04j138J094L92p56j54J64O0N19m23p36J041O88j210o34
$$ plain form
3978 -666 647 382 -650 -685 -502 -499 128 -503 -718 970 1354 -746 -35 2072 476 -1554 -93 997
3996 997 -923 -1407 -196 349 -417 -526 -291 873 459 -515 -35 1092 -803 -1520 459 356 -1173 -147
4014 -147 1262 103 -177 599 288 -661 -271 -563 -835 -117 -470 -1017 203 421 -305 -5 872 413 2
4033 2 239 -73 -249 -73 -567 -1157 381 56 -988 305 1373 -309 -552 739 -156 -829 42 -86 -811
4052 -811 101 258 -184 586 1109 282 280 604 -51 -137 196 -734 -642 494 24 -826 793 1082 -579 278
4072 278 1293 -115 -400 888 45 -850 -47 204 -420 71 570 375 724 732 -125 708 863 -678 -649 802
4092 802 -325 -1231 106 418 -442 -166 302 -381 275 546 -380 173 1164 253 -706 681 1093 -342 -248
4111 -248 447 42 -214 -446 -848 -92 -80 -1214 -579 700 218 -849 723 853 -277 328 1049 -386
$$ packed form
3978f66J313k65j032l5J83LO27o31k15J688L84k100P11K107j596k030J461J090
3996I97j920m84J211N45p66j09K35J164m14r74M80J127j895p17J979j03j529J026
4014a47J409j159k80P76l11r49L90k92k72P18l53n47J220K18p26L00Q77m59m11
4033BK37l12j76J76m94n90J538l25j044J293J068j682k43J291q95o73Q71j28p25
4052h11R12J57m42P70N23q27kL24o55q6L33r30R2J136m70q50J619K89j661Q57
4072B78J015j408k85J288q43q95Q03K51o24M91M99j95L49Qq57Q33J55j541K9J451
4092H02j127r06J337L12q60K76M68o83O56K71r26N53R91r11r59J387M12j435R4
4111b48O95m05k56k32m02P56J2j134O35J279m82j067J572J30j130O05P21j435
$$ plain form
4129 -386 -381 518 -397 -847 203 56 -921 -247 31 -420 -139 -2 -396 -27 497 -231 -264 274 -84 -434 271
4150 271 -303 -582 587 -78 -1398 -142 856 -1094 -1076 967 437 -1173 -145 1157 15 -515 -151
4167 -151 120 480 -219 -624 236 637 -849 -480 688 -364 -919 417 432 -664 355 871 -159 130
4185 130 1057 135 -595 529 79 -585 -53 122 -503 53 800 34 345 800 267 294 403 -507 -106 324
4205 324 -822 -1059 557 2 -1325 -174 1267 -41 -387 1389 1016 -18 486 672 218 454 286
4222 286 -331 -121 -58 -358 -214 -281 -679 -179 189 -822 -246 1382 365 -846 1021 1577 -511 -373 1192
4241 1192 234 -768 -91 -66 -522 -255 -62 -534 -103 -140 -350 -218 -170 -537 24 50 -1163 -147 978 -513
4261 -513 -1023 1192 969 -826 70 1241 -216 -660 380 -24 -895 -54 -43 -864 -211 125 -449 -250 123
$$ packed form
4129c86NQ99r15m50J050j47r77O74K78m51K81J37l94L69N24p28l3N38l58l50P05
4150B71n74k79J169o65j320J256R98j950J8K043n30j610J028J302j142n30L64
4167a51K71L60o99m05Q60M01j486L69J168j052n55J336J5j096J019N16j030K89
4185A30R27r22p30J124m50o64N32J75o25N56P47p66L11M55n33K7J09r10M01M30
4205C24j146k37J616n55j327J151J441j308l46J776l73j034N04J86m54K36j68
4222B86o17K10O3l00J44o7l98N00L68j011N76J628j017j211J867N56k088J38J565
4241A192r58j002O77K5m56K67J93m72M31l7k10J32M8l67N61K6j213J016J125j491
4261e13n10K215k23j795Q96J171j457m44J040m04q71Q41J1q21O53L36n74J99L73
$$ plain form
4280 123 -237 256 -307 -681 215 542 -1156 -522 1212 276 -1080 831 1095 -562 -168 710 -282 -980
4298 -980 285 46 -862 -91 218 -678 -524 -136 357 451 -227 85 986 508 -1043 115 1581 -233 -1026
4317 -1026 1041 761 -1017 -160 680 -505 -411 639 -339 -222 625 443 -532 292 952 475 29 -26 427
4336 427 652 -515 -604 1015 747 -1376 -490 1541 186 -1033 749 902 -653 -315 800 132 -514
4353 -514 314 121 -496 61 221 -70 196 -95 -43 621 -35 -634 392 353 -973 -481 635 -358 -488 466
4373 466 -25 -777 492 449 -753 -18 878 -501 -965 135 169 -691 -597 3 169 -59 -517 -264 726 -38
4393 -38 -1170 560 1004 -920 -880 732 -160 -1168 -216 311 -677 -191 68 -39 60 417 -378 -57 515
4412 515 -235 -577 496 23 -503 186 186 -494 17 493 -79 217 558 -472 -121 913 -83 -1011 219
$$ packed form
4280A23l60M93n63l74Q96L27j698O34J734r36j356J911K64j657L94Q78r92o98
4298i80J265k39r08P71L09q96J54L88M93R4o78L12R01m78j551J158J466j814p93
4317a026K067k80j778Q57Q40j185R4J050r78J17Q47j82r75Q24O60m77m46n5M53
4336D27K25j167q9J619k68k123Q86K031j355j219J782J53j555L38J115o68o46
4353e14Q28j93o17N57J60k91K66k91N2O64o56n99J026l9j326M92J116r93j30R54
4373D66m91p52J269m3j202P35Q96j379m64J100L4q60R4O00J66k28m58K53R90p64
4393c8j132J730M44j924M0J612q92j008R52N27r88M86K59j07R9L57p95L21N72
4412E15p50l42J073m73n26O89%o80N11M76n72K96L41j030L51J034r96r28J230
$$ plain form
4431 219 183 -799 -277 773 257 -145 475 351 349 511 55 110 576 -143 -640 316 -33 -1033 -251 450 -724
4452 -724 -192 744 270 -48 654 605 -151 449 586 164 295 360 -189 353 626 -719 -543 950 37 -806
4472 -806 339 494 -598 -125 125 -99 -5 188 -147 43 289 9 -173 518 194 -131 670 373 -500 366
4492 366 693 -509 -603 470 -128 -1236 -428 -152 -636 -178 -390 -312 563 196 -770 122 1364 -53 -605
4511 -605 793 730 -518 -18 268 127 21 -524 -665 278 108 -1189 -713 554 -807 -1353 59 278
4529 278 -328 174 690 -9 553 1027 448 23 251 -109 -457 89 -639 -397 270 -482 -934 450 584 -647
4549 -647 -471 680 18 -666 303 264 255 27 -295 -167 865 717 -508 396 980 -448 -753 416 259
4568 259 -393 -251 3 -75 381 -44 -682 300 470 -829 -534 756 194 -432 424 735 356 563 608 29
$$ packed form
4431B19l6r82N22J050n16m02O20j24kJ62m56N5M66p19m97R56l49j000P82P01j174
4452g24N32R36m74l18P02m9p56O00J37m22J31O5n49N42K73j345J76J493r13q43
4472h06J145J55j092M73K50k24R4J93l35J90K46k80j82O91l24l25Q01k97q73Q66
4492C66L27j202r4J073n98j108Q08K76m84M58k12P8Q75l67r66Q92J242j417n52
4511f05J398o3j248N00K86j41j06n45j41R43j70j297M76J267j361n46J412K19
4529B78o06N02N16o99N62M74n79m25K28l60l48N46p28K42O67p52m52J384J34j231
4549f47J76J151o62o84R69l9rk28l22J28J032j48j225R04N84j428l05J169j57
4568B59o52J42K54p8M56m25o38R82J70j299K95J290n62o26Q56L11l79K07M5n79
$$ plain form
4588 29 379 402 -473 57 335 -564 -582 324 -212 -409 460 459 -503 271 688 -123 96 578 87 -43 431 -146
4610 -146 -63 646 -277 -899 314 587 -634 -219 649 8 -696 -131 -44 196 -202 -538 -100 632 -137 -651
4630 -651 528 427 -818 -386 694 -285 -766 292 176 -482 -50 523 -320 90 296 -133 280 112 -100
4649 -100 155 98 -834 -602 213 -295 -934 72 250 -542 65 547 -154 242 451 -55 -214 284 -246 -789
4669 -789 438 348 -591 -162 795 -184 -422 195 -86 -24 -96 -324 64 454 -209 -545 743 438 -570 130
4689 130 783 -77 -225 479 -62 -510 219 -3 -478 336 508 -184 50 683 -62 -333 441 6 -366 97
4709 97 -131 182 532 -80 -90 901 472 -638 21 672 -684 -894 584 193 -451 315 596 142 245 552
4729 552 -192 86 147 -547 -442 -62 -262 -539 468 309 142 624 493 -93 438 43 -928 -422 187 -877
$$ packed form
4588B9L50K3q75N30K78q99j8R06n36j97Q69jr62P74M17q11K19M82m91j30M74n77
4610a46Q3P09r23o22J213K73j221M15Q68o41p04N65Q7K40l98l36M38P32p69n14
4630f51J179j01j245M32J080r79m81J058j16o58M32N73q43M10K06m29M13j68k12
4649a00K55n7r32K32Q15n08o39J006J78p92O07M82p01L96K09n06j59M98n30n43
4669g89J227r0r39M29R57r79k38O17k81O2p2k28L88L90o63l36J288l05j008P00
4689A30O53q60j48P04n41m48P29k22m75Q14J72o92K34O33p45k71P74m35l72M63
4709I7k28L13L50o12j0R91m29j110O59O51j356k10J478l91o44P66K81m54J03L07
4729E52p44K78O1o94J05L80k00k77J007j59j67M82j31n86N31l95r71N06O09j064
$$ plain form
4749 -877 -976 515 -119 -815 236 819 -19 77 421 168 -74 -324 -321 -42 -42 -619 -394 655 37 -609 -12
4770 -12 240 -763 -506 -180 -579 -93 276 -504 -219 1377 469 -551 663 1206 -293 -835 225 29
4788 29 -709 -875 -458 -71 -386 -769 160 997 -106 -734 523 886 -680 -238 674 -26 -304 353 292 -135
4808 -135 224 101 -469 66 287 -824 -196 422 -89 -88 601 553 177 295 137 142 333 -291 -542 464 173
4829 173 -962 -79 1120 -144 -513 1201 1209 -412 368 807 -113 -584 -307 -243 -261 -391 -496 -149 401 -375
4849 -375 248 875 142 -29 629 672 -276 427 429 -611 -299 461 -473 -801 303 42 -682 -163 574 -103
4869 -103 -35 432 309 -23 84 -172 199 168 -781 -230 341 -354 -1086 226 332 -1022 -337 739 -113 -676
4889 -676 564 567 -353 270 635 9 -49 463 -283 -433 -328 -389 -567 -445 -802 -156 160 -832 -53 899 355
$$ packed form
4749h77r9J491o34o96J051N83q38R6L44k53k42k50LK79%n77K25J049o18o46N97
4770a2K52j003K57L26l99M86L69p80K85J596r08j020J214N43j499n42J060j96
4788B9p38j66M17L87l15l83R29Q37j103o28J257L63j566M42R12p00k78O57o1m27
4808a35L59j23n70N35K21j111O28O18n11JO89m8l76J18j58NJ91o24k51J006k91
4829A73j135Q83J199j264l69J714Qj621P80M39r20m71K77O4j8j30j05L47N50p76
4849c75O23O27p33j71O58M3r48P03Kj040L12P60r34l28J104k61p24N19P37o77
4869a03O8M67j23l32J07k56L71l1r49N51N71o95p32J312J06j354O85J076q52n63
4889f76J240Lr20O23L65o26n8N12p46j50J05o1j78J22l57O46L16r92P79R52n44
$$ plain form
4910 355 -544 684 963 -488 -336 786 -172 -781 245 363 -274 -157 331 -210 -219 -155 -167 61 -95 -398
4930 -398 46 434 -265 -201 782 -44 -218 513 241 -578 44 334 -558 -265 911 317 -121 892 1068 116
4950 116 -147 464 -31 -665 -770 -407 -60 -405 -529 445 1053 40 146 1616 1066 -409 395 953 -591
4969 -591 -771 331 -221 -618 129 337 -124 -18 164 62 346 -220 -362 -16 77 -371 195 714 -30 185
4989 185 1115 103 -452 237 -70 -1219 -417 399 -754 -492 615 256 -315 251 458 107 -103 -83 55
5008 55 -17 -239 -607 283 71 -552 -11 764 -18 -394 650 60 -852 -302 264 -736 -395 274 -174 -261
5028 -261 499 420 109 268 -47 -376 204 -1 -805 -233 150 -236 50 356 65 -51 316 -30 -257 142
5048 142 -250 -655 30 478 -816 -356 586 151 -50 123 467 188 144 -93 -85 475 -52 -813 486 524 -427
$$ packed form
4910C55q99J228K79j451J52J122r58o09J026J18o37J17M88n41rO4j2K28j56l03
4930c98M44L88o99O4R83q26j74P31k72q19O22K90q92K93J176n94m38J013J76r52
4950A16k63O11m95o34j05L63L47l45j24R74O08j013J06J470n50j475Q04N58j544
4969e91j80J102n52l97P47K08m61J06J82j02K84n66j42L46R3m48N66N19p44K15
4989A85R30j012n55O89l07j149Q02Q16j153K62J107l59n71N66K07l51k10K0J38
5008E5p2k22l68Q90k12o23N41P75p82l76J044n90r12N50N66j000L41O69m48q7
5028b61P60p9l11J59l15l29N80k05q04N72L83l86K86L06k91j16L67l46k27L99
5048A42l92m05O85M48j294M60R42m35k01J73L44k79m4k37QN60n27p61J299L8r51
$$ plain form
5069 -427 -324 753 99 -433 513 391 -417 -83 162 -22 -31 93 29 443 387 -144 282 676 -231 -659 652
5090 652 230 -689 -34 596 -235 -293 280 77 104 298 38 266 647 167 -428 84 414 -248 -197 176 -180
5111 -180 -93 172 -470 14 965 -46 -480 417 664 -528 -333 398 35 -266 -178 -40 -104 119 -439 -381 426
5132 426 90 -609 -101 120 -72 43 253 100 546 725 -131 47 589 -244 -849 -217 -330 -1345 -788 -219
5152 -219 -545 -537 439 413 193 546 526 342 261 71 -332 -92 -258 -726 40 382 -524 -337 842 449 -866
5173 -866 38 315 -507 -254 -198 -257 214 364 -212 144 626 170 -185 86 340 -104 -29 -281 -129 556 209
5194 209 -502 496 1082 -45 -425 552 293 -886 -638 -22 -427 -560 -38 229 547 693 442 808 746 86
5214 86 208 570 -103 -745 206 140 -1030 -321 400 -287 -461 177 149 -12 93 -115 -123 665 286 -357 427
$$ packed form
5069d27J03J077o54n32R46j22q08L34K45j84rJ24o4M14n6n31M26L94r07m28J311
5090F52m22r19O55O30q31n8N73k03K7J94k60K28L81m80n95N12L30o62N1L73l56
5111a80Q7K65o42M84R51j011m34Q97K47j192J95P31l63l01Q8J38o4K23n58N8Q07
5132D26l36o99N08K21j92J15K10j53M46J79q56J78N42q33o05O32j13j015N57N69
5152b19l26QR76k6k20L53k0j84q1j90m03K40j66m68P66L42r06J87J179l93j315
5173h66R04K77q22K53N6n9M71J50n76L56M82m56l55K71K54m44P5k52J52O85l47
5194B09p11R98N86j127l80R77k59j179K48O16m05j33N22K67L18J46k51L66o2o60
5214H6J22L62o73o42R51o6j170P09P21o87j74O38k8j61J05k08qP88l79o43P84
$$ plain form
5235 427 1186 134 -32 568 378 -131 -504 -518 -509 -232 -872 -542 571 256 -569 556 1023 48 -507 461
5255 461 122 -626 -79 89 -288 -66 67 -57 211 296 -131 181 326 -184 -238 165 -313 -729 -92 39 -649
5276 -649 -159 282 -305 126 472 -500 -518 425 -38 -820 258 739 -199 -230 587 440 -110 -412 -352 27 -203
5297 -203 -747 -339 355 -449 -639 368 673 -116 114 742 237 -70 93 -61 -293 144 -2 -587 40 149
5317 149 -102 106 68 34 -67 253 -250 -159 347 269 -201 158 142 50 317 -92 -377 423 501 -654 -406 805
5339 805 73 -595 328 816 -239 -24 95 307 198 -46 -212 279 235 -356 -264 214 -127 -535 59 -26 -381
5360 -381 148 252 -477 36 552 91 -232 402 275 -427 -65 319 -424 -42 5 -140 70 332 -170 -110 288
5381 288 -49 -372 -2 -261 -228 154 -4 -506 242 456 -216 -51 498 -198 -422 -62 -33 -330 -185 76 -376
$$ packed form
5235D27P59j052j66O00j90n09l73j4RK77o40L30J113l15q25J125M67r75n55R68
5255D61l39p48N47J68l77K22J33j24K68Q5m27L12J45n10n4M03m78m16O37J31o88
5276f49M90M41n87M31L46r72j8R43m63p82J078M81r38l1Q17j47n50l02O0L79k30
5297b03n44M08O94q04j90J007L05p89K30O28n05l07J63j54k32M37j46n85O27J09
5317A49k51K08l8l4j01L20n03R1N06p8m70L59j6r2K67m09k85Q00P8j155K48J211
5339H05p32o68R23M88j055K15J19K12j09k44j66M91m4n91R2M78l41m08N94q5l55
5360c81N29J04p29N13N16m61l23O34j27p02L62L84p43L82M7j45K10K62n02O0L98
5381B88l37l23L70k59L3L82j58n02P48K14o72J65N49o96k24L60K9k97J45K61m52
$$ plain form
5402 -376 -47 337 25 -147 418 136 -108 -20 -186 -319 -112 -387 -433 464 240 -375 75 504 -44 -495 151
5423 151 -242 -451 -54 -139 -266 103 381 -150 -6 447 286 82 200 93 -75 -198 -356 -291 266 -52 -424
5444 -424 385 453 -307 137 621 -176 -446 376 -28 -462 153 505 -135 -60 572 171 56 257 76 260 137
5465 137 -501 -12 289 -311 -572 217 29 -503 133 271 -270 6 217 5 -28 611 447 -146 547 639 -316
5486 -316 -114 359 -298 -452 -164 -305 -178 -110 -600 -28 248 -95 -345 384 417 -388 279 432 -311 -281 505
5507 505 -89 -673 105 304 -235 21 121 107 -9 -12 -285 8 172 -303 -407 422 -66 -466 59 78 -46
5528 -46 175 186 -97 214 241 -391 -386 507 -56 -622 37 150 -304 -266 333 -93 213 21 -285 -69 111 -163
5550 -163 -52 193 -141 -129 367 21 -334 315 396 -299 -308 597 171 -306 228 240 -202 -37 -68 -45 329 233 -171
$$ packed form
5402c76L29L84l12j72N65k82k44Q8j66j33K07k75m6Q97k24o15M50M29n48m51O46
5423A51l93k09L97q5j27L69K78n31J44M53j61k04J18j07j68j23j58O5N57l18l72
5444d24Q09O8p60M44M84p97k70Q22m04m34O15L52o40P5O32m01j15K01j81J84j23
5465A37o38M89L01o00k61P89j88n32O36J38n41K76K11k12l3O39j64n93O93R2r55
5486c16K02M73o57j54K88j41J27O8m90N72K76l43k50P29L3q05O67J53p43L0P86
5507E05n94n84P78J99n39K56J00j4j16lk73K93J64m75j04Q29m88m00N25J9j24
5528d6K21J1k83L11K7o32NQ93n63n66O59J13m54L8N99m26L06j92l06K16J80k74
5550a63J11K45l34J2M96l46l55O49Q1o95rR05m26m77N34J2m42J65l1K3L74r6m04
$$ plain form
5573 -171 239 682 -260 -166 344 40 -167 121 -172 -81 154 40 -445 116 425 -72 13 622 195 -10 418
5594 418 158 -61 78 189 -406 168 187 -122 -32 258 -111 -304 217 -42 -77 619 118 -226 390 344 -210
5615 -210 170 554 -85 -94 246 103 -190 155 -97 -190 78 -85 -502 -97 60 -432 -271 236 -220 -508 57
5636 57 223 -220 93 464 -136 59 233 86 47 87 -492 -2 133 -526 -639 332 98 -722 -267 365 -294
5657 -294 -358 327 -155 -313 329 24 -53 257 95 -343 -30 173 -248 115 34 -367 -104 444 -155 -324 198
5678 198 46 -400 34 318 -259 -103 -15 -70 421 439 12 53 328 28 -585 232 490 -283 -190 229 72 -36
5700 -36 -140 -241 326 359 -408 -313 711 67 -550 355 718 -88 -224 577 172 -165 173 351 -130 -33 -173
5721 -173 -4 168 -12 -105 540 198 -355 26 571 -270 -323 278 -43 -79 349 257 -464 414 370 -377 -257 549
$$ packed form
5573a71M10M43r42R4N10l04k07K88k93R1K35j14m85N61L09m97Q5O09m27k05M28
5594D18k60k19J39J11n95N74J9l09R0K90l69j93N21k59l5O96n01l44O16m6n54
5615b10L80L84o39rL40j43k93L45k52r3K68j63m17M05J57m92J61N07m56k88N65
5636E7J66m43L13L71o00J95J74j47l9M0n79M90J35o59j13R71k34q20M55O32o59
5657b94o4O85m82j58O42l05p7L10j62m38L13K03m21L63q1m01K63N48n99j69N22
5678A98j52m46M34K84n77J56Q8n5M91J8m27M1K75l00o13Q17K58p73R3M19j57j08
5700c6j04j01N67L3p67R5J024o44o17R05L63q06j36Q01m05l37L38J78m81R7j40
5721a73J69J72j80r3O45l42n53L81N45q41n3O01l21l6M28r2p21Q78m4p47J20Q06
$$ plain form
5743 549 -16 -473 206 159 -193 -384 73 199 342 -303 -336 514 72 -641 -31 633 -478 -514 407 175 -710
5764 -710 -174 435 -109 -298 141 -372 -286 178 -83 36 204 138 -230 149 -114 -475 316 -175 -333 102 204
5785 204 -654 -323 263 -244 -626 365 304 -435 -103 502 -8 -306 347 179 -208 -125 240 127 10 -222 -139
5806 -139 -16 -187 -268 289 190 -400 221 469 -286 -58 760 -125 -666 424 302 -703 -303 429 61 -336
5826 -336 118 388 85 182 168 487 296 -130 9 622 -40 -664 220 748 -155 -182 485 76 -160 282 150
5847 150 -32 76 102 -311 378 387 -300 -31 383 -229 -371 -109 273 -146 -22 201 229 360 369 -78 556 321
5869 321 -320 -283 597 -63 -807 149 -69 -702 -477 288 -40 -80 98 258 143 159 54 -53 432 -209 -456
5890 -456 110 112 -198 15 -63 -293 -110 -151 -700 -531 224 -419 -535 246 181 -286 170 696 220 -4 355 88
$$ packed form
5743E49n65m57O79m7l52j91M57J26J43o45l3Q50m42p13O10O64j111l6R21k32q85
5764g10N36O09n44j89M39n13Q6M64k61J19J68o6l68L79k63l61P91m91j58M35J02
5785B04q58L31N86n07l82R91o1p39L32O05n10k98O53j68l87Q3L65j13j17k32Q3
5806a39J23j71q1N57r9n90O21K48p55K28Q18q85n41J090j22j005M00P32l68l97
5826c36M54K70l03R7j4L19j91m26J39O13o62o24Q84N28r03k7O67m09k36M42j32
5847A50j82J08K6m13O89Ro87K69M14o12j42K62L82m19J24K23K8J31Rm47O34k35
5869C21o41L7Q80o60p44R56k18o33K25P65l28m0J78J60j15J6j05j07M85o41k47
5890d56N66Kl10K13p8k30J83m1n49J69P55o43j16P81o5m67M56N26m76k24L59k67
$$ plain form
5912 88 1 -415 -50 -197 -87 -408 -302 451 -53 -443 396 349 -419 -386 567 -387 -741 -91 169 -248 -8
5933 -8 216 145 385 127 9 275 433 -220 -126 419 329 -69 7 233 -137 -141 -80 -431 188 -99 -427 38 435
5956 435 -113 -284 654 510 -170 521 713 62 -81 120 -160 -261 -283 -259 -133 229 -184 -41 463 -19 -91
5977 -91 264 466 -403 -54 189 -189 -214 212 -163 -76 288 -48 -245 236 104 -654 -216 380 -358 -590 -109
5998 -109 260 -99 -96 99 136 143 -216 -222 239 -84 -747 -328 269 -533 -543 420 171 -497 104 386 -121 152 68
6021 68 -220 13 338 -195 -113 -33 1 -274 188 -103 -93 225 -106 -196 163 66 -346 -12 284 -372 -317 354 -15
6044 -15 -652 375 153 -447 -151 371 175 -331 172 138 -106 -336 43 -25 59 -134 120 272 -121 -316 236
6065 236 499 -490 -38 381 13 -428 599 289 -260 226 706 -340 -279 350 210 -325 -130 197 140 101
$$ packed form
5912H8q7m16L65j47J10l21J06P53n04l90Q39m7p68L3R53r54l54O50K60m17K40
5933hK24p1K40k58j18K66J58o53R4N45r0l98P6K26l70mO1l51O19k87l28M65L97
5956D35n48j71R38j44o80O91J92o51j43K01k80j01k2K4J26L62m13J43N04m82p2
5977i1L55K02q69L49K43l78k5M26l75Q7L64l36j97M81j32p58M38N96p38k32M81
5998a09L69l59LJ95L7Pl59oM61l23o63M19N97q02j0R63k49o68O01K82n07K73q4
6021F8k88K33L25n33Q2Q0L4k75M62k91J0L18l31r0L59r7m12L34K96o56N5O71l69
6044a5o37J027k22o00K96N22j96n06N03l4k44k30L79o8Q4j93K54J52l93j95N52
6065B36K63r89M52M19l68m41J027l10n49M86M80j046O1O29j40n35J95L27n7l9
$$ plain form
6085 101 -86 307 630 131 -257 346 531 -394 -108 270 -240 -256 372 -132 -267 570 240 -202 107 590
6105 590 -122 -397 -51 138 -385 -177 30 216 304 198 291 571 77 -166 261 -179 -647 -300 171 -561 -822
6126 -822 189 253 -262 221 765 67 -74 392 174 -129 -25 28 -113 184 -329 18 399 -37 -303 39
6146 39 142 -519 -53 31 -422 -61 684 -40 -369 648 694 -371 -6 395 -56 -634 -226 9 -362 -300 -291
6167 -291 308 262 -129 17 568 -86 -622 322 72 -596 -192 207 -131 -302 605 293 -284 169 353 14
6187 14 -122 83 -56 -28 72 -58 24 316 -59 -101 341 -116 -137 -3 -247 -400 118 365 -671 230 770
6208 770 241 150 866 576 28 160 395 -199 -594 -170 -295 -273 -187 -69 -62 439 -1 338 544 -58 -116 593
6230 593 153 -252 118 373 -494 -444 354 -84 -440 -143 28 25 13 224 34 308 211 51 154 140 -152 -126
$$ packed form
6085A01j87L93L23m99l88O03J85r25K86L78n10j6O28n04j35Q37l30m42L09M83
6105E90p12k75L46J89n23K08K07J86Q8j06R3K80m94k43M27m40m68L47M71p32k61
6126h22J011O4n15M83N44o98j41M66k18l03J04N3j41K97n13L47L81m36k66L42
6146C9J03o61M66Q4m53L61P45p24l29J017M6j065L65M01m51n78M08K35l71O2R
6167b91N99m6l91J46N51o54n36R44k50o68M04L99l38j71R07l12n77M53J84l39
6187A4j36K05j39K8J00j30Q2K92l75m2M42m57k1J34k44j53N18K47j036R01N40
6208G70n29r1P16k90n48J32K35n94l95M24j25K2Q6J18PN01m40L39K06o02n8P09
6230E93m40m05L70K55q67N0P98m38l56K97J71lj2K11j90K74r7j60J03j4k92K6
$$ plain form
6252 -126 107 -211 -369 -7 -137 -519 -64 151 -258 83 465 11 51 271 -10 -309 228 55 -415 148
6272 148 10 -205 -291 34 -116 -213 143 -29 -59 376 -88 -248 248 120 -357 -58 158 -216 -179 -218 -98 -154
6294 -154 122 83 -263 390 208 -323 -49 96 -172 39 178 -77 173 269 -115 -211 484 93 -338 -163 385
6315 385 -263 -254 171 86 138 117 146 364 608 -112 -52 446 80 -710 -381 18 -574 -466 368 160 88 587 509
6338 509 207 321 483 -49 58 -27 -166 -45 179 -141 76 290 17 -20 311 -122 -173 108 -241 -488 84
6359 84 379 -350 -125 708 395 -438 64 519 100 -489 -109 222 -37 -295 -271 558 166 -350 97 626 -218
6380 -218 -531 295 176 -415 -343 131 -115 -91 383 22 -74 443 14 -348 -149 -147 -346 -113 -180 -253 -151 -91 -193
6403 -193 -25 160 -169 -112 452 -268 -354 125 -75 -543 -92 223 -276 -153 367 86 -257 192 193 -140 -127 -231
$$ packed form
6252a26K33l18j58L62j30l82M55K15m09L41L82m54M0K20k81k99N37j73m70N63
6272A48j38k15q6L25j50r7L56j72l0M35m64j60M96j28m77K99K16l74L7l9J20n6
6294a54K76l9l46O53j82n31K74J45k68K11J39k55K50R6l84r6O95l91m31J75N48
6315C85o48RM25q5N2k1K9K18K44p20O0M98l66p90L29L99n92J08Q34k08p2M99p8
6338E09l02J14J62n32J07q5j39J21K24l20K17K14k73l7L31m33n1K81l49k47N72
6359H4K95p29K25Q33l13q33N02M55m19n89L80L31k59k58K4Q29l92n16M47N29q44
6380b18l13Q26j19n91P2M74k46K4M74l61r6N17m29l62J99Kj99K33o7p3J02O0j02
6403a93J68J85l29N7N64p20q6M79k00m68M51L15m99J23N20k81l43M49Jl33J3j04
$$ plain form
6425 -231 -234 -91 48 -122 31 118 182 264 205 -168 164 308 -393 -532 367 299 -604 -304 563 228 -523 24
6447 24 317 -147 -391 58 111 113 8 -169 584 -52 -173 325 355 -321 -103 318 -102 -378 126 109 -574 -33
6469 -33 358 -100 -35 532 -24 52 101 150 -31 156 229 -270 348 -61 73 163 26 -122 164 29 -346 -114
6491 -114 498 -9 -525 263 337 -325 -226 199 54 -141 -192 -179 -94 -106 -61 -358 164 131 -78 -73 216 -49 16 45
6515 45 -156 194 222 -415 -304 412 -74 -720 80 218 -267 -345 198 66 -260 242 176 -67 51 -53 -73 -1
6537 -1 -251 -24 34 -141 -284 -65 43 -276 -161 492 11 -388 144 215 -42 -165 186 -56 -199 9 -143
6558 -143 -63 214 142 -70 -96 44 -98 94 126 23 393 135 -283 119 527 -62 -497 38 -259 -653 17
6579 17 9 -210 -19 229 79 374 333 81 97 509 251 -149 -46 -1 -372 -228 40 -138 89 125 -3 127
$$ packed form
6425b31lJ43J39j70J53Q7O4Q2n9l73L32J44p01j39Q99o8r03L00Q67l35p51N47
6447B4K93m64k44M49N3Kj05j77P53o36j21M98L0o76K18M21m20k76N04j7o83N41
6469c3L91m58O5N67n56P6M9M9j81J87P3m99O18m09J34R0j37j48K86j35l75K32
6491a14O12n07n16P88P4o62R9M25j45j95n1J3Q5j2M5k97N22l3k09NK89k65O5K9
6515D5k01L50K8o37J11P16m86o46Q00J38m85p8N43j32l26N02o6k43J18j04k0P2
6537ak50K27N8j75j43K19J08l19J15O53m81l99N32P1k57j23L51k42j43K08j52
6558a43Q0K77p2k12k6J40j42J92L2j03L70k58m18M02M08n89m35N35k97l94O70
6579A7qk19J91K48j50K95m1k52J6M12k58m00J03M5l71J44K68j78K27L6j28J30
$$ plain form
6601 127 132 -137 -139 322 -97 -168 228 317 -18 308 495 -48 -257 139 56 -489 -137 70 -207 -150 -81 24 -25
6624 -25 249 -121 282 230 -137 -132 162 -178 -252 285 -6 -243 439 309 -199 81 287 -14 -205 50 -181 -297
6646 -297 -139 -13 -600 -200 132 -68 -40 7 92 86 -3 -241 87 375 -210 -187 693 -123 -329 84 503 -276
6668 -276 -375 300 -146 -427 -48 112 -177 -207 -33 -19 137 -75 91 306 -8 -87 236 366 -224 -253 405 -10
6690 -10 -482 55 262 -388 0 161 -128 -119 373 -77 -378 241 327 -241 -156 61 206 75 -364 174 377 -5
6712 -5 -301 269 592 -354 -154 542 258 -565 43 436 -315 -377 492 81 -33 227 159 -33 385 187 88 -65
6734 -65 17 222 246 -116 -150 418 214 -402 16 431 -276 -385 212 150 -302 80 223 -235 -89 479 83 -415
6756 -415 -69 284 -18 -513 49 323 143 -397 -96 422 202 -622 105 325 -429 -422 413 -21 -439 -100 128
$$ packed form
6601A27Nk69kM61m19p1L96Q9l35L26J87n43k09L96q3n45L52K07k77N7O9J05m9
6624b5K74l70M03n2l67NK94l40p4N37k91k37O82j30n08K80K06l01j91K55k31j16
6646b97J58J26n87M00L32k00K8M7Q5oq9k38L28K88n85K3Q80q16k06M13M19p79
6668b76r9O75m46k81L79J60k89l0J74J4J56k12J66K15l14p9L23J30n90k9O58m15
6690a0m72N37K07o50L88J61k89RM92m50l01O19Q6n68Q5K17J45j31m39N38K03l82
6712ek96N70L23r46K00O96k84q23O08L93p51o2Q69m11j14K60o8j92M18j98r9j53
6734f5Q2K05K4l62l4N68k04o16M18M15p07j09N97o2m52L82J43m58J46N68l96m98
6756d15L46L53l02m95N62K74j80n40L01N18k20q24P27K20p54PQ35m34m18L39K28
$$ plain form
6777 128 -341 -97 325 -239 -400 306 -25 -397 -194 13 251 -11 -372 248 383 -286 -257 440 227 -723
6797 -723 -240 500 -123 -521 241 223 -290 -38 394 -151 -293 259 -13 -171 15 69 37 -73 -31 96 1 -270
6819 -270 -241 510 -142 -335 88 204 -322 -342 556 56 -291 225 364 -335 31 571 202 -163 188 427 -103
6840 -103 -64 196 -18 -1 -229 -227 408 27 -329 346 400 -108 -268 391 12 -367 318 29 -228 276 238 -129
6862 -129 -112 116 -75 1 50 -20 39 -185 -112 -52 136 -505 -50 382 -141 -656 289 449 -426 -242 480 215
6884 215 -588 295 183 -97 82 71 -72 -220 -222 -68 -207 -179 -365 -194 44 -218 -153 405 -120 -291 202 336
6906 336 -253 -111 360 -167 -51 93 165 -20 163 -70 -117 -153 133 -288 -243 150 -209 -95 33 83 -100 68
6928 68 -80 -220 232 -11 -323 106 296 -228 -337 310 80 -307 -106 39 -202 -169 -68 23 227 19 -250
$$ packed form
6777A28m69K44M22n64j61P06l31l72K03K07K38k62l61O20J35o69K9O97k13r50
6797g23M83P40o23l98P62j8n13K52M32n45j42N52k72j58J86N4l2j10M2J27r5k71
6819b70K9P51o52j93M23J16n26k0Q98n00l47N16J39o99L66N40l69l65L51K39n30
6840a03L9K60k14J7k28KO35l81l56O75N4n08j60O59l79l79O85k89k57N04l8l67
6862a29J7K28j91P6M9p0N9k24P3O0J88o41M55M32n23n15R45J60q75J84P22k65
6884B15q03Q83j12k80J79j1j43j48kJ54j39K8j86J71K38k62O5N58n25j71M93J34
6906C36n89J42M71n27J16J44P2j85J83k33m7l6K86m21M5L93l59J14J28N0j83J68
6928F8j48j40M52k43l12M29J90n24j09O47k30l87K01J45k41L3J01R1K04k08k69
$$ plain form
6949 -250 142 252 -53 -5 301 -192 -26 451 18 -290 329 327 -487 22 182 235 -196 190 195 -47 -72 39
6971 39 165 61 -26 -25 479 406 -127 120 221 -232 -99 222 -55 -205 208 102 -447 -105 227 29 -159 -94
6993 -94 95 119 -83 -295 -34 105 -344 -186 201 140 -347 -185 264 -142 -269 103 2 -121 207 -42 -352
7014 -352 215 68 -252 -42 230 -66 -62 6 74 -109 -216 -330 -330 169 -202 -348 119 16 -368 -19 158 -228
7036 -228 -394 213 52 -314 100 282 -318 -32 151 -8 -13 195 30 -182 91 -205 -42 105 -228 -319 122
7057 122 59 -339 188 461 -207 -166 384 -223 -153 226 102 -298 48 223 -50 27 69 65 -82 19 -147 151
7079 151 41 -252 57 348 -120 -270 326 307 -243 181 396 -51 -128 338 46 -100 95 292 20 -50 224
7100 224 186 39 145 53 280 41 -93 25 183 -313 -268 356 108 -291 131 422 -203 -96 247 2 -127
$$ packed form
6949b50L92J10l05M8L06m93J66M77m33l08O19kq14N09J60N3m31L86Nk42k5J11
6971C9J26j04q7JN04p3n33K47J01m53J33L21k77j50M13j06n49L42L32j98j88O5
6993i4J89K4k02k12K61J39m49J58L87o1m87J62M49m06j27L72j01j23L28k49l10
7014c52N67j47l20K10K72k96MO8O8j83j07j14%M99l71j46M67j03l84L49J77l86
7036b28j66O07j61l66M14J82o00K86J83j59nK08j65k12K73k96J63J47l33r1M41
7057A22o3l98N27K73o68M1N50o07P0L79j24m00L46J75k73P7M2mj47J01j66K98
7079A51j10k93L09K91m68j50N96j9n50M24K15m47p7M66k92j46J95J97k72p0K74
7100B24l8j47J06r2K27k39j34J18J58m96M5O24k48l99M22K91o25J07L43k45j29
$$ plain form
7121 -127 14 -154 -165 17 80 -286 144 -6 -37 -1 309 -217 -113 -7 -245 57 120 -240 -70 239 -57 -308
7143 -308 43 290 -309 -70 247 30 -203 120 91 -148 -154 65 -196 -207 -28 -194 -23 -103 -382 -11 256 -467
7165 -467 -66 271 75 -311 245 320 -158 -210 226 -137 -288 53 -110 -175 -87 -58 -6 185 -92 -182 -43 209
7187 209 -241 166 -118 -182 54 195 -76 -207 162 32 -271 145 347 -187 103 333 94 -33 275 52
7207 52 -88 122 -55 -19 29 -62 -19 73 281 22 134 409 -60 80 208 40 -42 108 67 -181 203 80 -167
7230 -167 -183 6 -128 -227 254 -203 -275 131 188 -12 96 377 32 -5 67 -46 -208 -104 -184 -192 6 -258 -115
7253 -115 193 121 -372 238 497 -126 -210 49 8 -254 271 110 -61 213 118 -220 77 137 -275 -83 94 -231
7275 -231 -275 -246 -45 -84 109 -111 -150 255 90 -211 -68 268 -203 -405 17 -193 -425 187 113 -119 -18 424
$$ packed form
7121a27J41j68j1J82O3l66M30j50l1L6L10n26J04J06k38L02O3l60J70L09k96k51
7143c08L51K47n99K39L17k17k33L23k9k39oK19k61j1J79j66J71q0k79L71K67p23
7165d67M01L37j96l86N56P5m78n2M36l63j51L41j63o5Q8K9N2J91k77r0J39K52
7187B09m50M07k84o4K36J41k71j31L69j30l03M16K02n34K90K30k39j27L08k23
7207E2j40K10j77L6M8r1M3R2K08k59J12K75m69J40J28j68q2J50m1k48L84j23k47
7230a67j6J89j34r9M81m57p2M06N7k00J08K81l45l7P2j13j62J04q0qJ98k64J43
7253a15L08p2m93O10K59o23q4K59m1k62N25j61j71K74r5l38K97O0m12J92J77l25
7275b31m4K9K01l9J93k20l9M05j65l01J43L36m71k02M22k10k32O12p4k32J01M42
$$ plain form
7297 424 -61 -22 -8 -82 -292 -59 -285 -53 -321 -425 -138 405 161 -185 223 264 -240 -47 378 0 -81 345
7319 345 89 -312 77 163 -299 -331 351 -123 -244 -253 80 145 157 76 454 265 20 15 363 202 -374 30 166
7342 166 -447 -523 274 -269 -334 222 204 -187 140 415 -71 -58 47 -38 -113 -197 19 202 221 -234 -37 559 -16
7365 -16 -191 268 8 -416 -15 80 11 -322 419 -12 -263 105 407 -215 -277 57 30 -83 -220 3 7 -35 -190
7388 -190 220 469 -58 -108 337 139 -439 6 308 -413 -76 321 -434 -590 181 142 -426 -265 451 89 -282
7409 -282 6 184 163 -324 -292 206 81 -459 29 319 -162 -604 318 102 -403 -79 316 -115 -400 243 100
7430 100 49 0 295 -54 -249 19 -81 -22 -195 -37 331 -267 -170 321 151 -30 21 298 -64 -455 383 263
7452 263 -455 -100 547 3 -303 117 412 -75 276 116 207 93 -150 68 224 128 -334 182 -11 -237 -200
$$ packed form
7297D24m85L9J4p4k10K33k26K32k68j04K87N43k44l46M08M1n04J93M25l78q1M26
7319C45k56m01L89Q6m62l2O82m74j21rL33O5J2q1L78j89k45nL48j61n76M04J36
7342A66o13p6P97n43o5N56j8l91L27K75m86J3J05q5p5q4K16J83J9m55J97N96n75
7365a6j75M59k60m24M01R5o9l33P41m31k51L68L02o22o2L34k7j13j37K23Mm2j55
7388a90M10K49n27n0M45j98n78M45L02p21L37L97p55j56P71l9n68J61P16l62l71
7409b82K88J78k1m87L2M98j25n40M88K90m81m42R22k16n05L24L95m31k85O43j43
7430A00n1m9K95l49j95K68j00N9j73J58L68n98R7M91j70j81N1K77l62l91Q38j20
7452B63p18L55O47n44l06M20K95m87L51j60R1j14k43K18J56r6m62N16j93k26L7
$$ plain form
7473 -200 263 -169 -76 331 173 -410 81 428 -175 -322 155 46 -275 124 317 -58 -75 259 224 0 -43
7494 -43 0 308 -66 -526 168 179 -439 -352 769 27 -347 258 494 -147 -375 211 180 -150 66 61 -136 167
7516 167 -6 -244 14 -63 -16 -76 -303 -364 34 -50 -312 132 380 -227 -176 330 68 -478 6 186 -307 -428
7538 -428 -87 -47 -267 48 51 73 259 94 -100 -30 -261 -78 22 -309 -373 66 187 -364 117 714 246 -232
7560 -232 191 310 -80 -423 155 39 -117 -57 40 176 194 19 -124 119 104 -168 197 -160 -165 142 168 -54
7582 -54 252 821 81 -314 536 346 -301 -291 -162 -88 -346 -80 -220 70 60 9 353 342 -120 129 221 26
7604 26 -78 333 172 -349 212 468 -107 -44 248 340 -263 137 -48 -114 179 26 -8 236 84 177 155 12
7626 12 -91 -182 198 -196 18 17 100 -189 121 298 -262 63 595 40 -318 148 27 -232 -297 -9 -144 -72
$$ packed form
7473b00M63m32R3M07j58n83M91L47o03j47M77j09l21L99J93l75j7L34l5k24m3
7494d3M3L08l74m60O94J1o18Q7J121p42l74O05K36o41k28N86l1l30K16nj97L03
7516A67j73k38K58p7M7o0k27o1L98q4k62M44K48o07N1N06k62n46M84J80m93j21
7538d28L41M0k20L15LK2J86j65j94P0k31J83J00l31o4M39J21n51M81N97m68m78
7560b32M23J19l90l43N78j16j56O0R7J36J8j75j43K43j5k72L65l57nL07K6k22
7582e4L06N69p40l95Q50j90o47J0J29P4k58K66j40K90j0n1L44j1m62K49R2j95
7604B6j04M11j61n21N61K56n75O3K92R2o03M00j85o6K93j53l4K44j52R3k2j43
7626A2j03r1L80l94K14jQ3k89L10J77n60L25N32n55l58M66j21k59o5K88j35P2
$$ plain form
7648 -72 -492 -372 172 61 -186 66 146 -25 114 101 57 -313 329 125 -337 -148 186 -97 -234 261 95
7669 95 -182 203 83 10 31 -93 212 -39 -51 -239 -41 66 -462 142 287 -256 -282 252 143 -316 148 361
7691 361 -68 -68 116 227 -46 -1 47 -57 97 -54 -11 42 -241 -134 124 -52 -288 -38 289 -181 -66 470
7713 470 -15 -247 144 75 -219 65 93 -30 -102 76 265 -53 83 -154 27 117 -124 -169 -163 112 -371 105
7735 105 193 -110 163 466 241 -175 300 42 -299 -151 11 -201 19 207 -16 25 143 65 -90 81 -14
7756 -14 -143 -61 -334 -149 -11 -257 -292 74 445 -157 -9 571 17 -274 141 183 -360 -254 49 -287 -119
7777 -119 -16 257 -65 124 -144 -60 -123 -366 73 0 -163 -144 354 190 -363 96 156 -188 -153 49 -57 -270
7799 -270 -146 118 -40 15 56 120 -39 152 5 76 -190 -121 -111 -4 -207 -135 87 117 -199 196 177 -76 -196
$$ packed form
7648g2m20J20N44j11k47K52Q0j71J39j3m4l70O42k04m62J89L34k83j37M95j66
7669I5k77L85j20p3K1j24L05k51j2j88J98J07n28O04J45n43k6N34j09m59M64K13
7691C61m29%J84J11k73M5M8j04J54j51M3N3k83J07K58j76k36K50L27m70J15N36
7713D70m85k32L91o9k94K84K8j23p2J78J89l18J36k37J81R0k41m5OK75m83M76
7735A05Q8l03K73L03k25m16M75k58l41J48J62k12K20J88k23M1J18p8j55J71r5
7756a4j29Q2k73J85J38k46l5L66L71o02J48N80n54k91M15M2n43J06L03l36J68
7777a19J03K73l22J89k68Q4o3k43M39p3j63J9M98j64n53M59O0l44L5K02j06k13
7799b70J24K64j58N5M1O4j59J91j47P1k66O9J0J07k03P2K22L0l16L95j9k53j20
$$ plain form
7822 -196 0 -5 -264 69 -11 -61 341 228 -139 147 267 -168 -204 22 76 84 121 -92 -183 180 130 -89 76 211
7846 211 -48 101 120 -92 -155 100 -233 -93 204 122 -309 111 326 -84 -92 118 99 -89 -12 -4 -116 3 -61
7869 -61 -47 311 64 -96 183 253 -228 1 185 -244 -300 41 -42 -306 232 77 -334 105 55 -138 -107 53
7891 53 -244 -92 -76 -158 -88 -149 -130 -1 63 191 -253 257 -1 -188 57 -55 -284 -202 176 -130 -423 -32 162
7914 162 -167 -26 58 -8 62 -19 -27 8 18 44 6 86 157 -19 184 -40 -163 -64 -1 -89 37 98 -273 -187 28 -18
7940 -18 -317 133 184 -174 -41 139 258 -101 -8 112 19 -208 -153 -242 104 -199 -124 47 95 -98 129 285 -22
7963 -22 -74 181 294 -249 173 213 -82 49 -63 -42 157 -46 -32 -99 77 25 41 59 80 22 218 -5 40 339
7987 339 49 -279 101 330 -164 -121 185 23 -339 1 201 -261 -184 181 -317 -307 -37 -61 -190 -81 -4 -47
$$ packed form
7822a96J96nk59L33q0n0M02j13l67K86J20m35l6K26N4QL7k13r1L63n0k19J65J35
7846B11k59J49J9k12o3K55l33J40K97q2m31M20K15m10qK10j9j88P7Qj12J19o4
7869f1J4L58k47j60K79P0m81K29J84m29n6L41q3k64N38j55m11M39n0j93L1J60
7891E3k97J52J6q2P0o1J9J29O4J28m44N10k58j87K45j12k29Q2L78l06k93L91J94
7914A62l29J41Q4o6P0q1qL5J0K6l8Q0P1j76K03k24j23R9O3q8J26O1l71Q6K15m6
7940a8k99M50N1l58J33J80J19l59R3J20r3k27N5q9L46l03P5J71M8j93K27J56l07
7963b2n2K55J13n43M22M0k95J31j12K1J99k03J4o7J76n2J6J8K1n8J96k23M5K99
7987C39k90l28L80K29m94M3L06j62l62L40K00m62P7L65m98J0K70k4j29J09P7m3
$$ plain form
8009 -47 259 -283 -110 359 79 -144 381 203 -260 -135 126 -95 -488 191 95 -478 -293 197 73 -133 106
8030 106 -31 -71 -13 56 115 23 -132 18 295 -27 -98 382 235 -341 -161 177 -130 -213 88 -10 -189 154 -63
8053 -63 -86 -70 97 45 -17 145 49 -33 29 32 -16 56 -238 75 352 -95 -369 190 289 -364 -135 288 13 -347
8077 -347 43 321 -95 -51 101 -56 103 150 -72 174 90 22 8 -45 -56 334 90 -296 13 217 180 -199 285
8100 285 264 -440 -90 215 189 -291 141 213 120 -51 58 172 54 64 269 60 -36 -194 125 44 -334 -193
8122 -193 311 -93 -347 162 128 -293 -144 277 -4 -152 136 47 -195 -8 -122 8 -150 87 -138 29 -50
8143 -50 31 210 167 -51 116 230 -166 -172 323 0 -488 79 182 -62 -65 87 -12 -79 17 5 -151 61 68 -155
8167 -155 60 17 -92 243 130 -117 115 144 90 136 -34 60 -173 270 109 -162 -15 61 -122 -325 251 158
$$ packed form
8009d7L06n42J73M69k80k23N25j78m63J25K61k21l93O79r6n73J85M90j24k06K39
8030A06j37m0N8O9N9r2j55J50K77l22p1M80j47n76J80L38l07q3L01r8j79L43k17
8053f3k3J6J67n2o2J62r6q2O2Lm8P2k94L13K77m47k74N59R9o53K29M23k75l60
8077c47L90K78m16M4J52j57J59M7k22K46q4o8j4n3j1L90k44l86L09K04l7l79M84
8100B85k1p04L50L05k6m80M32P2r3j71J09J14j18J0K05k09r6j58L19q1l78J41
8122a93N04m04k54N09l4m21J49M21k81j48K88q9k42J87j14J30j58K37k25J67p9
8143e0Q1J79m3k18J67J14l96oM95l23m88N67J03k44lJ52r9o7R6j2j56K12Pk23
8167a55K15m3j09L35j13k47K32K9n4M6j70R4k33M43j61k71J47P6j83k03N76r3
$$ plain form
8189 158 21 -66
$$ packed form
8189A58j37q7
8191f6
$$ Imaginary data points
##PAGE= N=2
##DATA TABLE= (X++(I..I)), XYDATA
$$ plain form
0 0 0 0 0 8 -8 0 -8 16 -16 11 -16 24 -32 32 -40 49 -64 72 -81 97 -116 133 -150 173 -198 226 -255 290 -324
29 -324 367 -413 463 -514 574 -642 713 -788 874 -970 1076 -1188 1311 -1455 1615 -1788 1985
46 1985 -2214 2480 -2784 3140 -3575 4111 -4786 5660 -6853 8575 -11243 15862 -25391 52566
60 52566 -277271 -1000866 187285 723120 -432060 -738748 438232 583714 -435521 -391385
70 -391385 505577 299238 -439645 -152969 399815 37476 -323449 58157 243478 -131566
80 -131566 -174227 108521 21933 -124052 104145 132844 -148200 -44528 218926 -53080 -285208
91 -285208 97455 234132 -240398 -247571 306299 220686 -323719 -114858 381813 38318 -408606
102 -408606 31744 388658 -129822 -371656 206723 324685 -269250 -238448 348340 171505
$$ packed form
0@%%%Qj6QqK4l2K7k7M0n6O4p2Q9j13J36j53J78k13K49k83L23l71M24m81N45o14
29c24O91p80Q76r77J088j216J355j501J662j844K046k264K499k766L070l403L773
46A985m199M694n264N924o715P686q897J0446j2513J5428j9818K7105m1253P7957
60E2566l29837p23595J188151N35835j155180l06688J176980J45482j019235M4136
70c91385Q96962k06339p38883K86676N52784l62339l60925L81606J85321l75044
80a31566m2661K82748q6588j45985K28197K8699k81044J03672K63454k72006k32128
91b85208L82663J36677m74530p173N53870q5613n44405K08861M96671l43495m46924
102d08606M40350L56914n18480k41834N78379J17962n93935L0802N86788j76835
$$ plain form
112 171505 -381301 -92180 374625 -1858 -343016 92690 285377 -187658 -248002 213911
122 213911 154919 -250246 -71562 271426 12381 -238515 85159 233642 -144036 -206751
132 -206751 180023 149792 -207847 -68379 250862 16977 -252600 34251 218310 -98510
142 -98510 -186823 130977 129854 -152065 -64584 168977 25784 -139799 33098 120792 -57983
153 -57983 -61061 110730 31029 -133461 -1101 120507 -65476 -127861 109855 111971 -150519
164 -150519 -75013 198366 52159 -198321 15810 211567 -69326 -202150 119212 175492
174 175492 -167132 -151716 183604 98183 -210294 -59713 216664 16997 -216694 22523
184 22523 213219 -42650 -173795 88679 148110 -120105 -121558 124813 70530 -134141 -33017
$$ packed form
112A71505n52806K89121M66805l76483l41158M35706J92687m73035o0344M61913
122B13911n8992m05165J78684L42988k59045k50896L23674J48483l77678o2715
132b06751L86774l0231l57639J39468L19241k33885k69577K86851J84059l16820
142i8510q8313L17800j123k81919Q7481K33561j43193j65583J72897Q7694j78775
153e7983l078J71791p9701j64490J32360J21608j85983o2385K37716K116k62490
164a50519P5506K73379j46207k50480K14131J95757k80893j32824L21362N6280
174A75492l42624J5416L35320q5421l08477J50581K76377j99667k33691K39217
184B2523J90696k55869j31145K62474N9431k68215j453K46371n4283k04671J01124
$$ plain form
195 -33017 116855 -11140 -93253 45619 64051 -66196 -31324 72330 -2591 -66839 35454
206 35454 53381 -71655 -50687 83775 29827 -95161 310 110402 -26702 -117488 49859
217 49859 105812 -84361 -96155 101789 64142 -123015 -33877 128348 -3979 -129939 32157
228 32157 117762 -54553 -96137 72523 69775 -92641 -55750 95764 36727 -92009 -10320
239 -10320 90592 -13613 -87357 27997 65606 -53298 -49405 66423 30354 -60463 8926
250 8926 67441 -27307 -53237 47053 38823 -57631 -23168 57304 -1116 -64077 11208 62276
262 62276 -16527 -47467 37110 50846 -36335 -32671 48666 18563 -58974 -10450 49193 -15484
274 -15484 -46829 33027 38426 -38005 -9540 63161 12251 -48984 9297 44271 -26692 -48720
$$ packed form
195c3017J49872j27995q2113J38872J8432j30247L4872J03654p4921o4248J02293
206C5454J7927j25036K0968J34462n3948j24988R5471J10092j37104r0786J67347
217D9859N5953j90173j1794J97944l7647j87157Q9138J62225j32327j25960J62096
228C2157Q5605j72315m1584J68660k748j62416L6891J51514n9037j28736Q1689
239a0320J00912j04205p3744J15354L7609j18904L893J15828l6069r0817O9389
250H926N8515r4748k5930J00290q230r6454L4463Q0472n8420o2961P5285N1068
262F2276p8803l0940Q4577J3736q7181L664Q1337l0103p7537M8524N9643o4677
274a5484l1345P9856N399p6431K8465P2701n0910o1235N8281L4974p0963k2028
$$ plain form
286 -48720 22835 35335 -30209 -30996 32503 27626 -30403 -17241 34323 10369 -30954 1960 28649
299 28649 -10207 -18612 19568 9007 -18709 12941 31946 -6598 -13024 20585 5229 -31967
311 -31967 -14756 11805 -9188 -27739 -2429 18174 -528 -14983 7158 20750 -3053 -10691
323 -10691 16244 14401 -14836 -4605 16423 -6504 -18989 10802 11250 -21245 -12789 13025 -4974
336 -4974 -25347 -5404 11368 -1945 -12216 81 14935 8866 -7454 -2300 14421 5768 -11734
349 -11734 -4144 4098 -7863 -11901 -3888 -3201 1086 9286 2235 -948 12186 7680 -11298 -6810
363 -6810 4544 -5334 -11576 -2070 89 -2676 -729 -1874 46 7586 4910 305 9232 10396 -1659
378 -1659 -1734 3368 -3592 -5542 -84 -4520 -5627 3140 1150 -4931 1377 3261 -2648 1434 3273 -3786
$$ packed form
286d8720P1555J2500o5544p87O3499m877n8029J3162N1564k3954m1323L2914K6689
299B8649l8856q405L8180j0561k7716L1650J9005l8544o426L3609j5356l7196
311c1967J7211K6561k0993j8551K5310K0603j8702j4455K2141J3592k3803p638
323a0691K6935j843k9237J0231K1028k2927j2485K9791M48l2495Q456K5814j7999
336d974k0373J9943J6772j3313j0271J2297J4854o069j6320N154J6721q653j7502
349a1734P590Q242j1961m038Q013O87M287Q200p051l183J3134m506j8978M488
363f810J1354r878o242R506K159k765J947j145J920P540k676m605Q927J164j2055
378a659p5N102o960j950N458m436j107Q767j990o081O308J884n909M082J839p059
$$ plain form
394 -3786 2287 11271 372 -3102 11838 9745 -5416 -1405 8396 1835 -5568 -3688 839 3633
408 3633 -2459 -9133 386 8346 -3737 -5471 10990 9949 -1994 6039 11827 -905 -3002 3890
422 3890 -3828 -9165 -1241 -2142 -8503 -2923 2692 -464 -1161 2313 5669 7811 2524 -717 7801 5945
438 5945 -9012 -4875 7065 -6277 -15456 2190 4478 -12297 -4669 10457 -2055 -10008 6404
451 6404 9036 -7245 -6591 7626 6814 -5984 -6800 8021 9098 -9520 -10237 9865 4004 -17396
465 -17396 -3928 14378 -4918 -13656 10186 8771 -14030 -3127 12732 -5994 -15128 5372 6711
478 6711 -14208 -11291 8819 4677 -11847 -2840 17711 7899 -13166 2176 21470 -5056 -23808
491 -23808 8354 16423 -22353 -18649 21673 6214 -27285 348 25494 -8286 -20976 16408
$$ packed form
394c786O073Q984j0899l474J4940k093j5161M011R801o561p403J880M527K794
408C633o092o674R519P960j2083j734J6461j041j1943Q033N788j2732k097O892
422C890p718n337P924r01o361N580N615l156o97L474L356K142n287l241Q518j856
438E945j4957M137J1940j3342r179J7646K288j6775P628J5126j2512p953J6412
451F404K632j6281O54J4217q12j2798q16J4821J077j8618p17K0102n861k1400
465a7396J3468J8306j9296q738K3842j415k2801J0903J5859j8726r134K0500J339
478F711k0919K917K0110m142j6524R007K0551r812k1065J5342J9294k6526j8752
491b3808L2162Q069l8776L704M0322j5459l3499K7633K5146l3780j2690L7384
$$ plain form
503 16408 19322 -17309 -11741 23346 11690 -21518 -3267 29463 4921 -25332 7366 31403
515 31403 -11655 -28438 17389 17456 -30837 -14779 28158 -1174 -29833 14073 29388 -17485 -14983
528 -14983 31477 13729 -28540 -91 34409 -3100 -31552 12118 30163 -21383 -29438 28007
540 28007 22981 -37432 -14571 45073 3947 -47299 10568 45313 -25219 -38581 38851 30368
552 30368 -42982 -12949 49517 771 -48893 11666 44807 -23485 -40107 33957 35025 -40344
564 -40344 -24459 49132 13246 -55243 -1686 53795 -16864 -52635 29347 38457 -46533 -25877
576 -25877 53723 7893 -54556 13230 54000 -28246 -44334 41388 28431 -57877 -22164 56563
588 56563 -313 -64238 15373 63973 -33353 -59203 52830 50613 -69106 -35124 81422 12469
$$ packed form
503A6408K914l6631N568L5087j1656l3208J8251L2730k4542l0253L2698K4037
515C1403m3058j6783M5827O7m8293J6058M2937k9332k8659M3906J5315m6873K502
528a4983M6460j7748m2269K8449L4500l7509k8452M3670J8045n1546q055N7445
540B8007n026o0413K2861N9644m1126n1246N7867L4745p0532j3362P7432q483
552C0368p3350L0033O2466m8746m9664O0559L3141o8292j6622P4064J068p5369
564d0344J5885P3591l5886o8489N3557N5481p0659l5771Q1982R110q4990K0656
576b5877P9600m5830o2449O7786M0770q2246j6088Q5722j2957q6308L5713P8727
588E6563n6876o3925P9611M8600r7326k5850J12033k217j19719L3982J16546o8953
$$ plain form
600 12469 -91251 7914 86868 -36237 -82937 53991 65665 -69847 -43119 83247 23971
611 23971 -86395 -2304 83035 -21896 -80235 38401 67446 -57431 -52700 72998 35655
622 35655 -79355 -9810 84540 -12903 -76755 40011 65192 -60719 -47756 70765 20317
633 20317 -78868 3131 75317 -26219 -64299 49448 53768 -60390 -31685 73893 12549
644 12549 -78646 11536 79787 -35492 -74528 58482 61033 -78284 -38610 96517 15643
655 15643 -101018 16430 101926 -41867 -86711 70676 69711 -89144 -44563 103263 19171
666 19171 -108298 7558 106234 -33765 -97554 60228 86050 -80649 -67484 97820 44534
677 44534 -107447 -15364 111205 -13356 -105275 41119 91650 -61452 -68173 78163 43159
$$ packed form
600A2469j03720R9165P8954j23105m6700J36928J1674j35512K6728J26366n9276
611B3971j10366Q4091Q5339j04931n8339J18636K9045j24877M731J25698l7343
622C5655j15010O9545R4350r7443o3852J16766K5181j25911J2963J18521n0448
633B0317r9185Q1999P2186j01536l8080J13747M320j14158K8705J05578o1344
644A2549r1195R0182O8251j15279l9036J33010K551j39317L9674J35127q0874
655A5643j16661J17448Q5496j43793m4844J57387r65j58855M4581J47826q4092
666A9171j27469J15856R8676j39999o3789J57782K5822j66699J3165J65304n3286
677D4534j51981R2083J26569j24561r1919J46394N0531j53102o721J46336l5004
$$ plain form
688 43159 -83104 -14661 82703 -10481 -75456 27708 55004 -51127 -42237 58785 16018
699 16018 -71784 2260 71982 -25546 -64035 52545 55519 -69697 -32776 87763 10399 -94339
711 -94339 15629 90183 -46107 -84185 66407 63989 -88845 -48422 95398 20600 -104446
722 -104446 714 102160 -26115 -98814 46378 88117 -65048 -70207 82673 49715 -91511
733 -91511 -21796 98895 -2129 -93391 26632 78919 -50247 -63166 60711 34681 -74570
744 -74570 -18394 68059 -8923 -65138 27287 54413 -41816 -36090 61286 26606 -61550 -269
756 -269 69199 -17919 -63949 41017 54401 -61362 -40745 72395 17308 -80224 7142 80875
768 80875 -30655 -73799 50744 61491 -65228 -44412 75193 25022 -79435 -2459 85712
$$ packed form
688D3159j26263O8443R7364r3184o4975J03164K7296j06131Q890J01022m2767
699A6018q7802P4044O9722r7528l8489J16580K974j25216L6921J20539p7364j04738
711i4339J09968P4554j36290l8078J50592k418j52834M0423J43820p4798j25046
722a04446J05160J01446j28275p2699J45192M1739j53165n159J52880l2958j41226
733i1511O9715J20691j01024r1262J20023N2287j29166j2919J23877k6030j09251
744g4570N6176Q6453p6982n6215R2425K7126r6229N726R7376l4680q8156O1281
756b69O9468q7118m6030J04966J3384j15763K0617J13140n5087r7532Q7366P3733
768H0875j11530m3144J24543J0747j26719K0816J19605n0171j04457P6976Q8171
$$ plain form
779 85712 -10147 -75080 35518 73331 -46203 -53561 66079 38359 -77590 -20935 76418
790 76418 -6601 -78811 22730 64114 -45307 -52531 57284 36821 -60409 -14977 65304 2365
802 2365 -55650 20793 56733 -27730 -43554 40353 31474 -48721 -18256 49679 -4341 -55413
814 -55413 16249 44801 -35881 -35398 46941 18851 -54746 -253 59536 -13080 -53175 28191
826 28191 45229 -39235 -34242 46901 22527 -51635 -11219 52293 -1841 -50446 13803 41734
838 41734 -32380 -39303 38188 22314 -50177 -10641 50519 -7839 -49451 23437 43709 -35315
850 -35315 -34145 42270 21739 -45740 -9092 45366 -3665 -45918 10197 39978 -18488 -32703
862 -32703 26904 24443 -33446 -14735 36738 479 -40357 8303 32792 -22805 -25874 33708
$$ packed form
779H5712r5859o4933J10598L7813j19534p358J19640k7720j15949N6655R7353
790G6418q3019p2210J01541M1384j09421p224J09815k0463r7230M5432Q0281o2939
802B365n8015P6443L5940q4463j5824Q3907q879q0195L0465O7935n4020n1072
814e5413P1662K8552q0682M83Q2339k8090p3597N4493N9789p2616m0095Q1366
826B8191J7038q4464M993Q1143k4374p4162M0416O3512n4134m8605O4249K7931
838D1734p4114o923P7491j5874p2491L9536O1160n8358m1612P2888K0272p9024
850c5315J170P6415k0531o7479L6648N4458m9031m2253N6115K9781n8466j4215
862c2703N9607k461n7889J8711N1473l6259m0836M8660K4489n5597l069N9582
$$ plain form
874 33708 17341 -38342 -6173 39781 -2247 -34326 14133 32043 -18421 -24628 23392 18645
886 18645 -26082 -13045 24944 2743 -25867 7586 27080 -13516 -20696 23039 14594 -27717
898 -27717 -3459 32279 -6162 -32621 14258 28143 -20299 -20761 25089 14691 -24995 -5968
910 -5968 28460 5726 -22100 1860 20941 -6536 -17349 11918 13830 -15801 -7350 20674 2207
923 2207 -18884 8524 18915 -16364 -16923 20248 10399 -22512 -4135 22048 -745 -18770 6424
936 6424 18243 -5596 -12510 8464 10112 -9646 -7567 9486 966 -15305 -1058 12568 -5590
949 -5590 -11749 10672 8075 -15435 -4375 16658 -455 -15848 4343 12919 -6128 -7629 8414
962 8414 5701 -8469 -6140 2659 -913 -7423 -3912 1310 -2934 -5195 3691 5593 -3134 1103 10746
$$ packed form
874C3708j6367n5683L2169M5954m2028l2079M8459J7910n0464o207M8020m747
886A8645m4727J3037L7989k2201k8610L3453J9494m0596p180M3735q445m2311
898b7717K4258L5738l8441k6459M6879J3885m8442m62M5850j0398l9686J9027
910e968L4428k2734k7826K3960J9081k7477j0813K9267J912k9631Q451K8024j8467
923B207k1091K7408J0391l5279n59L7171r849l2911J8377K6183k2793j8025K5194
936F424J1819k3839o914K0974J648j9758K079J7053q520j6271J4247J3626j8158
949e590o159K2421k597k3510J1060K1033j7113j5393K0191Q576j9047j501J6043
962H414k713j4170K329Q799l572o510L511N222m244k261Q886J902q727M237R643
$$ plain form
977 10746 302 -8164 6385 8876 -10048 -9775 6280 95 -11495 -1049 7097 -2837 -5478 2928
991 2928 2738 -3514 -3141 276 -1259 -4732 -1557 5703 3550 -2995 3453 9880 185 -5583 4929
1006 4929 5196 -7658 -6478 1962 -1728 -4660 300 616 -277 3852 2322 -1355 3936 5248 -3845
1021 -3845 -5746 2059 2217 -3421 -3231 2777 6317 2578 -1273 5816 10942 494 -5316 4548 4978
1036 4978 -7220 -5520 2980 -2559 -6860 -16 850 -2995 660 3176 -824 527 4587 3490 2468
1051 2468 3458 2752 2840 3011 -270 -616 441 -2875 -4296 -1969 -4350 -5190 740 -839 -6104 2782 9996
1068 9996 -799 -3592 9678 8303 -6369 -4061 6315 1150 -8257 -5141 2085 1450 -4999 -4044
1082 -4044 4417 4156 -4519 -2653 5304 1216 -4425 339 672 -3828 622 2201 -5592 -2912 6451
$$ packed form
977A0746j0444q466J4549K491j8924K73J6055o185j1590J0446Q146r934k641Q406
991B928j90o252L73L417j535l473L175P260k153o545O448O427r695n768J0512
1006D929K67j2854J180Q440l690k932M960L16q93M129j530l677N291J312r093
1021c845j901P805J58n638J90O008L540l739l851P089N126j0448n810R864M30
1036D978j2198J700Q500n539m301O844Q66l845L655K516m000J351M060j097j022
1051B468R90p06Q8J71l281l46J057l316j421K327k381q40N930j579n265Q886P214
1068I996j0795k793J3270j375j4672K308J0376n165r407L116P226o35o449R55
1082d044Q461k61q675J866P957m088n641M764L33m500M450J579p793K680R363
$$ plain form
1097 6451 -282 -8494 632 6459 -3732 -7314 1481 3951 -2374 -4654 1697 5541 -757 -4259 3271
1112 3271 4662 -4647 -3226 5571 -2134 -9192 2382 5506 -8777 -6307 8897 2841 -8816 879
1126 879 11106 1518 -6022 2535 8489 -276 -8013 -895 5730 -3424 -9282 1987 5657 -4969
1140 -4969 -2028 8976 2589 -3536 7360 7919 -5784 -1989 8477 -2310 -12473 -449 6422
1153 6422 -6152 -9972 4077 9100 -2209 -4977 7762 10717 -2138 -3217 9452 5567 -7012
1166 -7012 896 8118 -5690 -7539 7637 1125 -14358 -933 11525 -6911 -13683 8819 12704
1179 12704 -8604 -6949 14977 11544 -9189 -4118 14778 4908 -14948 -3481 12228 -4982 -16330
1192 -16330 5555 10713 -11430 -5544 15925 1194 -15254 6111 13827 -13677 -13707 13969 5466
$$ packed form
1097F451o733q212R126N827j0191l582Q795K470o325k280O351L844o298l502P530
1112C271J391r309J421Q797p705p058J1574L124j4283K470J5204o056j1657R695
1126H79J0227r588p540Q557N954q765p737P118O625r154n858J1269L670j0626
1140d969K941J1004o387o125J0896N59j3703L795J0466j0787j0163J2024O871
1153F422j2574l820J4049N023j1309k768J2739K955j2855j079J2669l885j2579
1166g012P908P222j3808j849J5176o512j5483J3425J2458j8436o772K2502L885
1179A2704k1308J655K1926l433k0733N071J8896r870j9856J1467J5709j7210j1348
1192a6330K1885N158k2143N886K1469j4731j6448K1365P716k7504l0K7676q503
$$ plain form
1205 5466 -19860 -3791 19897 1091 -17114 6275 20000 -6865 -16711 11224 11984 -19896 -13253
1218 -13253 18019 1624 -24694 4016 25315 -9891 -19875 19862 17780 -23597 -12511 23148
1230 23148 1320 -27571 -315 21942 -6103 -18362 12325 17825 -10955 -8867 16882 5059
1242 5059 -19185 -611 15392 -11760 -18671 15222 11200 -23124 -4384 29415 -1369 -27695
1254 -27695 12320 27760 -18700 -24082 23129 18003 -26206 -11735 28270 6829 -26397 483
1266 483 25347 -7173 -24094 11159 17536 -18473 -11891 24153 6131 -22945 7732 27300 -11604
1279 -11604 -19328 21414 13755 -26778 -7819 25686 -3252 -27031 9767 23863 -14237 -16562
1291 -16562 23128 14838 -24329 -7139 28239 -141 -30806 7318 30277 -15747 -26383 26450
$$ packed form
1205E466k5326J6069K3688j8806j8205K3389J3725k6865r846K7935P60l1880O643
1218a3253L1272j6395k6318K8710K1299l5206r984L9737k082m1377J1086L5659
1230B3148k1828k8891K7256K2257k8045j2259L0687N500k8780K088K5749j1823
1242E059k4244J8574J6003k7152o911L3893m022l4324J8740L3799l0784k6326
1254b7695M0015J5440m6460n382M7211n126m4209J4471M0005k1441l3226K6880
1266D83K4864l2520j6921L5253O377l6009O582L6044j8022k9076L0677J9568l8904
1279a1604p724M0742p659m0533J8959L3505k8938k3779L6798J4096l8100k325
1291a6562L9690q290l9167J7190L5378k8380l0665L8124K2959m6024j0636N2833
$$ plain form
1303 26450 24634 -29113 -13656 35140 5186 -35951 1284 29315 -13002 -29106 14382 19307
1315 19307 -18679 -10913 22854 7732 -18380 4309 21991 -8129 -17761 14955 11685 -25392
1327 -25392 -10219 25770 -1885 -31862 7937 29605 -16685 -24424 26265 20915 -27853 -10360
1339 -10360 31365 3289 -31225 2354 25052 -13109 -26805 13694 17829 -21684 -14476 24619
1351 24619 8386 -25600 1652 28397 -7593 -24223 16171 18597 -23545 -12875 24256 628
1363 628 -27567 5103 21930 -14389 -17758 19373 11235 -22818 -3917 25621 -2002 -25736 9720
1376 9720 26213 -15416 -23153 23167 19446 -29158 -13870 32570 5312 -35137 3232 33131
1388 33131 -11059 -26825 20167 22940 -21688 -12712 24790 5037 -25065 556 20986 -9192
$$ packed form
1303B6450j816n3747J5457M8796k9954m1137L7235K8031m2317j6104M3488M925
1315A9307l7986P766L3767j5122k6112K2689J7682l0120r632L2716l270l7077
1327b5392J5173L5989k7655k9977L9799K1668m6290p739N0689n350m8768J7493
1339a0360M1725k8076l4514L3579K2698l8161j3696M0499M135l9513P208L9095
1351B4619j6233l3986K7252K6745l5990j6630M0394K426m2142J0670L7131k3628
1363F28k8195L2670J6827l6319l369L7131q138l4053J8901K9538k7623k3734L5456
1376I720J6493m1629p737M6320l721m8604J5288M6440k7258m0449L8369K9899
1388C3131m4190j5766M6992K773m4628Q976L7502j9753l0102K5621K0430l0178
$$ plain form
1400 -9192 -20656 12771 16046 -16632 -9461 22830 6274 -22090 4372 25839 -8769 -20781
$$ packed form
1400i192j1464L3427L275l2678P171L2291j6556k8364K6462K1467l4608j2012
$$ [...]
8191C10
##END NTUPLES=NMR FID
##END=
