##TITLE=1H_CA-8650p
 CDCl3, 8 sc, 
 23.9.2019
##JCAMPDX= 6.0         $$ Bruker NMR JCAMP-DX V2.0
##DATA TYPE= NMR FID
##DATA CLASS= NTUPLES
##ORIGIN= UXNMR, Bruker Analytische Messtechnik GmbH
##OWNER= root
$$ XWIN-NMR		Version 3.5
$$ Mon Sep 23 14:12:46 2019 Russian Standard Time (UT+4h)  she@DPX200
##.OBSERVE FREQUENCY= 200.1315
##.OBSERVE NUCLEUS= ^1H
##.DELAY= (6, 6)
##.ACQUISITION MODE= SIMULTANEOUS
##.ACQUISITION SCHEME= undefined
##.AVERAGES= 8
##.DIGITISER RES= 18
##SPECTROMETER/DATA SYSTEM= spect
##.PULSE SEQUENCE= zg30
##.SOLVENT NAME= CDCl3
##.SHIFT REFERENCE= (INTERNAL, CDCl3, 0, 15.7039)
##AUDIT TRAIL= $$ (NUMBER, WHEN, WHO, WHERE, WHAT)
$$ ##TITLE= Audit trail, XWIN-NMR		Version 3.5
$$ ##JCAMPDX= 5.01
$$ ##ORIGIN= Bruker BioSpin GmbH
$$ ##OWNER= she
$$ F:/spectra/data/she/nmr/H-F/1/audita.txt
$$ ##AUDIT TRAIL=  $$ (NUMBER, WHEN, WHO, WHERE, WHAT)
(   1,<2019-09-23 14:11:45.64 +0400>,<she>,<DPX200>,
      <created by zg, POWCHK disabled, PULCHK disabled
       configuration hash MD5:
       00 E9 B6 7A A2 85 ED C7 34 08 36 98 17 FE 4E 26
       data hash MD5: 16K
       C0 B7 E2 75 3A 6A 17 CB B4 F4 C4 EF FA 8C F9 1E>)
$$ ##END=
$$ 
$$ hash MD5
$$ D6 C0 9F 36 A0 90 75 33 61 B6 42 7C 68 22 73 E6
##$RELAX= 
##$RELAX= 
##$RELAX= 
##$RELAX= 
##$RELAX= 
##$RELAX= 
$$ Bruker specific parameters
$$ --------------------------
##$DU= <F:/spectra>
##$EXPNO= 1
##$NAME= <H-F>
##$PROCNO= 1
##$TYPE= <nmr>
##$USER= <she>
##$AMP= (0..31)
100 100 100 100 100 100 100 100 100 100 100 100 100 100 100 100 100 100 
100 100 100 100 100 100 100 100 100 100 100 100 100 100 
##$AQSEQ= 0
##$AQ_mod= 1
##$AUNM= <au_zg>
##$AUTOPOS= <>
##$BF1= 200.13
##$BF2= 200.13
##$BF3= 200.13
##$BF4= 200.13
##$BF5= 200.13
##$BF6= 200.13
##$BF7= 200.13
##$BF8= 200.13
##$BYTORDA= 1
##$CFDGTYP= 0
##$CFRGTYP= 5
##$CHEMSTR= <none>
##$CNST= (0..31)
1 1 145 1 1 1 1 1 1 1 1 1 1 1 1 1 1 1 1 1 1 1 1 1 1 1 1 1 1 1 1 1 
##$CPDPRG= <>
##$CPDPRG1= <>
##$CPDPRG2= <>
##$CPDPRG3= <>
##$CPDPRG4= <mlev>
##$CPDPRG5= <mlev>
##$CPDPRG6= <mlev>
##$CPDPRG7= <mlev>
##$CPDPRG8= <mlev>
##$CPDPRGB= <>
##$CPDPRGT= <>
##$D= (0..31)
0 1.2 0 0 0 0 0 0 0 0.06 0 0.03 0 0 0 0 0.0002 0 0 0 0 0 0 0 0 0 0 0 0 
0 0 0 
##$DATE= 1569233505
##$DBL= (0..7)
120 120 120 120 120 120 120 120 
##$DBP= (0..7)
150 150 150 150 150 150 150 150 
##$DBP07= 0
##$DBPNAM0= <>
##$DBPNAM1= <>
##$DBPNAM2= <>
##$DBPNAM3= <>
##$DBPNAM4= <>
##$DBPNAM5= <>
##$DBPNAM6= <>
##$DBPNAM7= <>
##$DBPOAL= (0..7)
0.5 0.5 0.5 0.5 0.5 0.5 0.5 0.5 
##$DBPOFFS= (0..7)
0 0 0 0 0 0 0 0 
##$DE= 6
##$DECBNUC= <off>
##$DECIM= 24
##$DECNUC= <off>
##$DECSTAT= 4
##$DIGMOD= 1
##$DIGTYP= 9
##$DL= (0..7)
0 120 120 120 120 120 120 120 
##$DP= (0..7)
150 150 150 150 150 150 150 150 
##$DP07= 0
##$DPNAME0= <>
##$DPNAME1= <>
##$DPNAME2= <>
##$DPNAME3= <>
##$DPNAME4= <>
##$DPNAME5= <>
##$DPNAME6= <>
##$DPNAME7= <>
##$DPOAL= (0..7)
0.5 0.5 0.5 0.5 0.5 0.5 0.5 0.5 
##$DPOFFS= (0..7)
0 0 0 0 0 0 0 0 
##$DQDMODE= 0
##$DR= 18
##$DS= 0
##$DSLIST= <SSSSSSSSSSSSSSS>
$$ [...]
##$SUBNAM2= <"">
##$SUBNAM3= <"">
##$SUBNAM4= <"">
##$SUBNAM5= <"">
##$SUBNAM6= <"">
##$SUBNAM7= <"">
##$SUBNAM8= <"">
##$SUBNAM9= <"">
##$SW= 24.0689530833862
##$SWIBOX= (0..15)
0 0 2 0 0 0 0 0 0 0 0 0 0 0 0 0 
##$SW_h= 4816.95568400771
##$TD= 16384
##$TD0= 1
##$TE= 0
##$TE2= 300
##$TE3= 300
##$TEG= 300
##$TL= (0..7)
0 120 120 120 120 120 120 120 
##$TP= (0..7)
150 150 150 150 150 150 150 150 
##$TP07= 0
##$TPNAME0= <>
##$TPNAME1= <>
##$TPNAME2= <>
##$TPNAME3= <>
##$TPNAME4= <>
##$TPNAME5= <>
##$TPNAME6= <>
##$TPNAME7= <>
##$TPOAL= (0..7)
0.5 0.5 0.5 0.5 0.5 0.5 0.5 0.5 
##$TPOFFS= (0..7)
0 0 0 0 0 0 0 0 
##$TUNHIN= 0
##$TUNHOUT= 0
##$TUNXOUT= 0
##$USERA1= <user>
##$USERA2= <user>
##$USERA3= <user>
##$USERA4= <user>
##$USERA5= <user>
##$V9= 5
##$VALIST= <valist>
##$VCLIST= <CCCCCCCCCCCCCCC>
##$VD= 0
##$VDLIST= <DDDDDDDDDDDDDDD>
##$VPLIST= <PPPPPPPPPPPPPPP>
##$VTLIST= <TTTTTTTTTTTTTTT>
##$WBST= 1024
##$WBSW= 4
##$XGAIN= (0..3)
0 0 0 0 
##$XL= 0
##$YL= 0
##$YMAX_a= 900666
##$YMIN_a= -1053569
##$ZGOPTNS= <>
##$ZL1= 120
##$ZL2= 120
##$ZL3= 120
##$ZL4= 120
##$ABSF1= 10
##$ABSF2= 0
##$ABSG= 5
##$ABSL= 3
##$ALPHA= 0
##$AQORDER= 0
##$ASSFAC= 0
##$ASSFACI= 0
##$ASSFACX= 0
##$ASSWID= 0
##$AUNMP= <proc_1d>
##$AZFE= 0.1
##$AZFW= 0.1
##$BCFW= 1
##$BC_mod= 2
##$BYTORDP= 1
##$COROFFS= 0
##$CY= 11.3945322036743
##$DATMOD= 1
##$DC= 2
##$DFILT= <>
##$DTYPP= 0
##$F1P= 20.1720416913024
##$F2P= 0.152960286110954
##$FCOR= 0.5
##$FTSIZE= 0
##$FT_mod= 4
##$GAMMA= 1
##$GB= 0.15
##$INTBC= 1
##$INTSCL= 1
##$ISEN= 128
##$LB= 0.24
##$LEV0= 0
##$LPBIN= 0
##$MAXI= 10000
##$MC2= 0
##$MEAN= 0
##$ME_mod= 0
##$MI= 1.114404
##$NCOEF= 0
##$NC_proc= 0
##$NLEV= 6
##$NOISF1= 3.799351
##$NOISF2= 2.8
##$NSP= 1
##$NTH_PI= 0
##$NZP= 0
##$OFFSET= 15.70392
##$PC= 1
##$PHC0= -9593.933
##$PHC1= 50.60096
##$PH_mod= 1
##$PKNL= yes
##$PPARMOD= 0
##$PSCAL= 0
##$PSIGN= 0
##$REVERSE= no
##$SF= 200.130013532006
##$SI= 16384
##$SIGF1= 3
##$SIGF2= 2
##$SINO= 400
##$SIOLD= 16384
##$SREGLST= <1H.CDCl3>
##$SSB= 0
##$STSI= 0
##$STSR= 0
##$SW_p= 3612.71676300578
##$SYMM= 0
##$S_DEV= 0
##$TDeff= 0
##$TDoff= 0
##$TI= <>
##$TILT= no
##$TM1= 0
##$TM2= 0
##$TOPLEV= 0
##$USERP1= <user>
##$USERP2= <user>
##$USERP3= <user>
##$USERP4= <user>
##$USERP5= <user>
##$WDW= 1
##$XDIM= 8192
##$YMAX_p= 0
##$YMIN_p= 0
$$ End of Bruker specific parameters
$$ ---------------------------------
##NTUPLES= NMR FID
##VAR_NAME=  TIME,          FID/REAL,        FID/IMAG
##SYMBOL=    X,             R,               I
##VAR_TYPE=  INDEPENDENT,   DEPENDENT,       DEPENDENT
##VAR_FORM=  AFFN,          ASDF,            ASDF
##VAR_DIM=   8192,          8192,            8192
##UNITS=     SECONDS,       ARBITRARY UNITS, ARBITRARY UNITS
##FACTOR=    0.0002076,     1,               1
##FIRST=     0,             0,               0
##LAST=      1.7004516,     0,               0
##MIN=       0,             -1053569,        0
##MAX=       1.7004516,     900666,          0
$$ Real data points
##PAGE= N=1
##DATA TABLE= (X++(R..R)), XYDATA
0@%%%qK4l2L2m0O4q8J04j28J68k11K52k99L63m42N24o14P19q44R82j132J304j497
26g99J713j952K215k506K827l184L576m002M471m992N559o175O852p601Q428r332
42d902J0325j1431J2669j4043J5580j7329J9332k1638K4330k7532L1416l6234
54a9457M2389n0582O2107p9617J09666j74789N34514m97873r75873J434522M43902
65H28909j269186l54130J303236M2562j098000R9108J007683k88680p65092L59021
75a34569O00812m43147l69176M13437J92124l89699r068K62400j22085j35187
85a34158K46370k1864k74645J77088K70290l40886k06586M60341J10554n58926
95b72422J2030N97922j44070o00501K83294N61735m04554m86769N17278L85752
$$ y = [0, 0, 0, 0, -8, 16, -16, 16, -24, 40, -48, 56, -72, 96, -115, 137, -162, 201, -241, 283, -331, 388, -456, 526, -606, 698, -799, 914, -1038, 1177, -1329, 1498, -1686, 1890, -2112, 2359, -2633, 2926, -3249, 3603, -3998, 4430, -4902, 5423, -6008, 6661, -7382, 8198, -9131, 10201, -11437, 12893, -14639, 16777, -19457, 22932, -27650, 34457, -45160, 64506, -110283, 424231, -73642, -1049515, 385007, 828909, -440277, -794407, 508829, 551391, -546609, -447501, 560182, 271502, -493590, -134569, 466243, 23096, -346080, 67357, 259481, -130218, -139286, 123114, 1029, -134158, 112212, 90348, -184297, -7209, 263081, -77805, -284391, 175950, 286504, -272422, -260392, 337530, 193460, -407041, -123747, 437988, 33434, -453335, 63943, 449695]
105D49695n99036k64177O45810J16444o60808L7987O43206j80686n81477L03546
115h9496M77199m03111l44910M73185K04202n01500o3975M88656p1292m49719
125b80761J83174L81812k72627k91900L43636J95315l85864r5080L94894j0271
135A62328l75394J15099L37002j97782k72572K54433J84578k87139r1745K88581
145A17389K283k61209P5079K11141j34684j46965J71577P5465j85161L540J85991
156A14446p4657j69565J34140J28533j89295p4090K33741R704k57834O2805K58299
167A76227j39239k34986K12265J94559k68236j34880L06187O5181l26827J096
177a48653L23404o6166l02917J26408K73181j76739k34880K12877J87489k37038
$$ y = [449695, -149341, -413518, 232292, 348736, -312072, -274085, 369121, 188435, -393042, -89496, 387703, -15408, -360318, 112867, 317069, -184431, -248406, 240250, 168958, -280761, -97587, 284225, 11598, -280302, 63334, 258649, -127215, -222295, 172599, 162328, -213066, -97967, 239035, 41253, -231319, 23114, 207692, -79447, -171192, 117389, 119672, -141537, -66458, 144683, 9999, -136966, 34611, 110076, -75085, -71545, 114446, 39789, -129776, 4364, 132897, -56398, -130488, 103253, 112957, -144877, -82072, 176227, 36988, -197998, 14267, 208826, -59410, -194290, 111897, 177078, -149749, -148653, 174751, 108585, -194332, -67924, 205257, 28518, -206362, 6515, 194004, -43034]
187d3034j29090K52589P1037k51622j5555K29348l8802j94224Q1175J47871j05440
198D253r1966J14051L7003j08765J0143Q8623m7377n7084P6459K2896r7464R072
210d0156J04907m4450j02136Q2570R4703j15239p5864J41773M4890j62604q240
221g9846J71140l0836j63586O9171J43608j03129j16677J24441Q3895j32728m7598
232h2145J34279J3769j30136J2778J18803l7164j00485O0672Q1469p9218n7661
243f5039Q9158K6520r4755M824R1321l2329p4855N6589N2157p3336k7200P9134
255C2189L645p5198J8705O5829l7578n6259M7716M3476n5203k7008O2895J3253
267C6462o5268L364O2758k3011n6738M0576M4277n4739k6259O1756M007o3422
$$ y = [-43034, -172124, 80465, 151502, -100120, -115675, 113673, 74871, -119353, -38178, 109693, 4253, -87713, 26338, 63341, -45424, -35281, 53342, 5965, -51119, 25340, 48236, -49228, -40156, 64751, 20301, -81835, 735, 95438, -19801, -95665, 46108, 90998, -71606, -79846, 91294, 60458, -103128, -33957, 109651, 6522, -110155, 14286, 98181, -34547, -82145, 52134, 65903, -64233, -51455, 67348, 30184, -70301, -9629, 71840, -7378, -65039, 24119, 50639, -44116, -39292, 52029, 19700, -55155, 1434, 53591, -19745, -46945, 32189, 35834, -39364, -20659, 45170, 7592, -48667, -951, 42525, -12678, -39686, 23209, 36462, -28806, -25442, 37316, 14305, -42433, -1857, 42420, -12319, -38578, 23178, 27185, -36237]
279c6237J6506N9612k9815m6160M1324L2902m8538k3107M7240J2394m5435k912
291b2226M3991m613m0527J2211L3933k0794k4480K9245J3759l2221k1K9143j5634
304A766k3703K6722J5309l0282j312L1674q386l0392J2810K3855j7050j9274J9278
317A015J6276k0561j4130K1113J0104k3735l329K6954k281k4534J0557J9414j8812
330a949j3036K2946N084k1891L325J7829r133j5553Q996R843p682o861P273P887
344G078n299q055N698P715o811n427Q749J775r158J189M005n534J28O632l238
359e53j855Q263j666q665M396N177q085k075P761q93n636J487K380n12j283k98
375b057K950L709m420l160O557o25q883L302P674n684m133P370L35o129J592K208
$$ y = [-36237, -19731, 39881, 10066, -36094, 5230, 38132, -10406, -33513, 13727, 26121, -19314, -22226, 21765, 17152, -23375, -11164, 22769, 1975, -22505, 6740, 20499, -11722, -11743, 17400, 1766, -21937, 4785, 20094, -10188, -11500, 20174, 11788, -18604, -5794, 18061, 1011, -18263, 1015, 17291, -3270, -17400, 3713, 13817, -9918, -13247, 13707, 11426, -13108, -2551, 16863, -1949, -14985, 7961, 13045, -8846, -5521, 12308, 3175, -12378, -3382, 6461, -1221, -8082, -809, 7078, 1779, -6276, -578, 7137, 326, -5101, 3648, 5423, -3735, -2546, 1459, -4075, -3947, 2685, -553, -2408, 5855, 4189, -4476, -80, 5097, -2988, -5063, 2698, 1805, -3831, -2344, 36, -476, -1759, -2057, 893, 4602, 182, -2978, 3579, 2954, -5929, -2627, 5047, -637, -4770, 2600, 2935, -3194, -1602, 606]
391F06j848J832Pl787L210L206o816j339Q229l56o143K976M508k754k246m48Q60
408c03K569k466l792N014K853p797n22Q290k969n697P387L012p973J661O348n847
424b32m368P271J351p004K26N373j156m743o87N868K845p009j561J0645q87j2560
440f628M268J1072r013p905J2113K813j2552K028J0146o543o748Q688L849q084
454b496j500P628M96p910q79R334O79j1051K250J2678o514j3123J0975R283j4663
469d813l584J6923k381j5905Q415J1459j2859o603J4334K266j3940J107J2586
482G005l619j2807N409J3278p153j3034J2357J2400j7515r285K1627K657k4673
495a3353N056K4233j3505k0656J9775J4053k3496o959K5118J013k3573L931K1999
$$ y = [606, -1242, 590, 597, -3190, 20, 3226, -3590, -4929, 3300, 2944, -3199, -223, 4285, 1531, -715, -1163, -303, 2266, -200, -3992, 1022, 3875, -3922, -4444, 3846, 877, -4820, 2567, 5579, -2394, -733, 5615, -232, -4600, 2671, 4022, -2982, -2756, 2617, 1461, -3282, -3969, 1899, 4744, -2265, -3826, 6819, 5932, -6628, -2360, 8712, -301, -8206, 3907, 6720, -5832, -3804, 6342, -201, -6949, 1739, 5588, -2496, -3996, 3632, 4128, -3782, -4661, 4673, 5352, -5699, -3449, 9229, 2715, -10408, 567, 9850, -4813, -8397, 8526, 6145, -9760, -1345, 10114, -2745, -9348, 4986, 7252, -6688, -5581, 7005, 3386, -9421, -4012, 9266, 2113, -10921, 1436, 13836, -3679, -12964, 8663, 11320, -13353, -8297, 15936, 2431, -18225, 1550, 15603, -7893, -14852, 10266, 11279, -12294, -8363, 13636]
508A3636q221k0663J1532J9067j5191j5876K0266J1309k4665m411K7109n455k6019
521a7582J5317K1479k4460j3874L0439L181l2426P071L1652j5613k7537K2670
533C17K2619k7691j7090L1985J1626l6080l822L8409n373m0032J5556L7548k7028
546I44l0802L7438K0982m4791p347M6747o330m4487J9163L8697k9013k9810L5507
559F898J9886l9963j0378M1966P27m1929J0019M0279k1241l5282L1939K6464m1001
572a1616j3802M7241k273m8329J8560M2819l4097l2468M6224J9640n3164l561
584b4826N5630j2218n4450K6831M9354m0654m1918N2505L1794o3562j7917P1067
596C1636J537p4754J7960P3004l7248o4382N4245M9317o7675l0611P4691R003
$$ y = [13636, 5415, -15248, -3716, 15351, 160, -15716, 4550, 15859, -8806, -13217, 13892, 8437, -17582, -2265, 19214, -5246, -19120, 11319, 14500, -17926, -10855, 20797, 5184, -22353, 317, 22936, -4755, -21845, 10140, 21766, -14314, -18136, 20273, 14900, -25132, -9576, 27972, 944, -29858, 7580, 28562, -16229, -23576, 23171, 16841, -27646, -8483, 30214, 1201, -28609, 6898, 26784, -13179, -23557, 18409, 19136, -22793, -12774, 27505, 6264, -29018, 2921, 29385, -11616, -25418, 21823, 19550, -28779, -10219, 32600, -1497, -33965, 12259, 31899, -21265, -24826, 30804, 18586, -35864, -9033, 40321, -333, -42251, 10254, 42048, -21514, -39431, 31636, 33173, -41581, -23621, 49383, 12135, -52247, 1998, 51315, -16360, -46971, 27720, 36723]
608C6723p4901J2432O9463l0676n9294M6339M5784n8186l0297O6334J2495p0827
620c4611O010P0573k5946o4723M5258N3779o1137l5982P2120J4481p6334Q360
632b8152P2106l0523o1113M7985M4362o0213k4473O7068L427o7800J7938O4236
644D4848l8313n5472N7103M1810p3687k3783Q5824J010r2250K4644R0543n0133
656A2144q0900P3624O4399r1750m1482J03002J5889j06232R698J02296l3792r2261
668f5365N3896P7557p0952n8676Q3093L7097q9851j2569R1037j2711q5083L6737
680a5790P1833n7671n1870P2281K7642p9622j154P7882k3534o8784M5463N3747
692E0423o1292l4560P1553J3392p6471Q025P5093l0009o8690N0415N6336o8122
$$ y = [36723, -38178, -25746, 43717, 13041, -46253, 86, 45870, -12316, -42613, 23721, 36216, -34611, -28601, 41972, 16026, -48697, -3439, 50340, -10797, -46779, 25341, 39822, -36512, -28152, 43954, 13431, -47682, 303, 44665, -15548, -40021, 27047, 30474, -37326, -19388, 44848, 6535, -48937, 8166, 49976, -23711, -47494, 38330, 39340, -52910, -28266, 62277, 12144, -68756, 4868, 69267, -22483, -63965, 39037, 54926, -51306, -41608, 60688, 26896, -65365, -11469, 66088, -4864, -63540, 19553, 56650, -33201, -45770, 45267, 32556, -52527, -15790, 56043, -1628, -53498, 18783, 46425, -33197, -34351, 43531, 19997, -48787, -3324, 50423, -10869, -45429, 26124, 39516, -36955, -28930, 46163, 16154, -52536, -2121, 54215, -13907]
704a3907l9120Q2228J7436r0067Q388R0887l4338q3375N8379O8156p7529m8384
716f1246R0427K4807r6248r08R5535k2246q9301M3244P7924o0996o2570P5545
728A3967M3682q5915k1715R0388k408q8354K6631P9360m8344o3167O5124M2206
740E1455p5132j8366P7386n149p3037K6073O2588m3900m8377N6521L1254o5147
752b3831j2125O9504p739o7635K7498O1838m6527m9639O2687L1732p3317j0581
764c8135P6896j2510p4379L4078O5015n2220m9620O5840L1693p3593j2491P6012
776C6586o695p4162K4763O7645m1034n7692N5522M4200o6459k6701P3495P151
788C6619p4338J3191O9171l2480n8368M7196M2337n7194k4733O1563O019o0067
$$ y = [-13907, -53027, 29201, 46637, -43430, -35042, 55845, 21507, -61868, -3489, 64667, -12862, -61246, 29181, 53988, -42260, -43168, 52367, 30121, -59180, -15936, 61988, 992, -61578, 13967, 57649, -28266, -49981, 40407, 37999, -50355, -23724, 55636, 7292, -55875, 9249, 51455, -23677, -42043, 35343, 30194, -42843, -16770, 45818, 1918, -46459, 10062, 41316, -23831, -35956, 33548, 25809, -41826, -14328, 47510, 983, -48656, 14031, 45763, -27554, -38135, 38761, 26251, -48128, -14050, 50965, -1255, -50875, 14965, 46658, -26935, -39426, 36586, 29891, -44271, -19508, 48137, 7103, -50589, 4933, 49133, -17326, -44027, 29468, 36619, -37719, -24528, 44643, 12163, -46205, 991, 43328, -13866, -38599, 22964, 28983, -31084]
800c1084J1113N4578k5042m5617L7497L4405m6254k1019N2024O457n4297R429
812a7810N1786k5542m5044L9507L2901n0297j8038N5926J079n5813J5318N1259
824C5232k9186m1823L9874L0324m6450j7964M9738N097m9689P207M7070j9120
836A0310m1595L0667L2858l9934k1212M5953O985m8701P755M5833k1748l8744
848c1573L2939K8626l9883j6715M3325M962m2831N909L9489j5163l4502K2623
860b794K7715k8577j9588L3273J0107l5411N61L4977j1734l1352K1731K4206k9916
873f802j4671L4283L750l5007O500L2519j4932k6936K0825K1157k4851j4618K7348
886H565P686k8087j166K7493o012k5568J3081K1740j9973j5196K5045P095k7516
$$ y = [-31084, -19971, 34607, 9565, -36052, 1445, 35850, -10404, -31423, 20601, 27058, -27239, -17810, 33976, 8434, -36610, 2897, 35798, -14499, -32537, 23389, 24468, -31345, -16027, 35232, 6046, -35777, 4097, 34421, -12029, -29993, 19745, 24842, -24847, -17640, 29430, 10310, -31285, -618, 32240, -7694, -28906, 17047, 24032, -24669, -16914, 28919, 7171, -31573, 1366, 29992, -9891, -26606, 16719, 21681, -21150, -15241, 24248, 9085, -25417, -2794, 24921, -3656, -23244, 10029, 20136, -15275, -14714, 20263, 8529, -22823, -1092, 23114, -6802, -21473, 12810, 16560, -18447, -11947, 20572, 5640, -21296, -471, 20686, -4165, -18783, 8565, 16251, -11836, -13002, 14491, 8479, -17089, -4008, 17732, -2241, -17437, 7608, 14703, -12813]
899a2813K088K6701j0651k2914J7226J7065k1536j0705K3283M495k2682R46K1447
912A1950n498j8933R446J6465j3567j2981J6957Q352j9864k366K1086m582j9690
925a3225J1136J6597j6158j1327J8838N292j9508j01J7852l818j5641O763J2934
938I634q376j0157R907P882j1207n116J2526J464j3168K605J2431p178j0043J0630
952A834O286j2930j525J2709k610j1191N901Q621p374n387P635L484p601j297
966c445O893n1p258J180P003l428p081O270N747q850k629J0900k37j1184L915
981b255R754o553p856P827M654p529k803O413J761m771j392M306Q19l861q99L816
997A431m93l876J959K582l174k01M552j919l652M224J901n117n46N111k121l939
$$ y = [-12813, -10725, 15976, 5325, -17589, -363, 16702, -4834, -15539, 7744, 12239, -10443, -9497, 11950, 6452, -12481, -3035, 13430, -137, -13118, 3839, 12191, -7673, -10039, 11047, 6465, -13225, -2089, 14508, -1650, -12977, 5861, 11153, -8355, -8456, 9396, 5578, -10063, -3300, 9634, 1258, -8899, 1008, 8890, -2317, -7433, 5093, 6557, -6611, -4006, 8425, 1247, -8796, 1834, 8120, -4810, -6335, 6374, 3764, -7427, -1526, 7095, -279, -5666, 1969, 5453, -2148, -3445, 3448, 3397, -3861, -2681, 4322, 894, -6187, 83, 5830, -3020, -5649, 5251, 5014, -6170, -2255, 7499, 946, -6910, 917, 5571, -1958, -4761, 1652, 3413, -1358, -2750, 1556, 2375, -1486, -2385, 1431, 938, -2938, -979, 1603, -1571, -1772, 2780, 861, -2791, 1433, 3334, -1783, -2329, 2782, 661, -3278]
1013c278K717K219k501r57J941P66m43j357O91J569j303j888J743J069k819K60
1029a571L030j730k023L522O22l153J464K213k508p55K538j486j493J780j01j721
1045a372Q52J092j391J27O20l19R07l4j307J185J469j828r91K462n23j723J174
1062D00r7j364J339L48k711J240L192k658k185M290R97m229J07L436o66k468O0
1079i69J552Q00k091j244K690J515l485l70L623p28l305K500J495l238M75K549
1095A769k334j199L163q1k858J318K128j746j299J212O22m78q71o0J477n55k057
1112a849J901K012l457j39M238j708m104L668K892n462j464N848n42n335J633
1127a868M486j893l360J685L399j389l435J588L979k980l490L881K286n326k66
$$ y = [-3278, -561, 1658, -843, -1800, 141, 907, 464, -893, -202, 1367, 64, -1824, -81, 988, -1831, -1571, 1459, -271, -2294, 1228, 1850, -1303, 161, 2374, -134, -889, 1649, 163, -1330, 450, 349, -1372, -520, 572, -819, -692, -72, -391, 516, 482, -825, 360, 1829, 1, -990, 1472, 949, -774, 400, 303, -1061, 278, 626, -2085, -845, 2347, -311, -2496, 1794, 2791, -1438, -1331, 2105, 1439, -1029, -969, 583, 1383, -708, -1952, 738, 2253, -1232, -1602, 2021, 1293, -2012, 488, 1983, -1255, -780, 1769, -565, -1764, 1399, 1318, -1540, -222, 1906, 160, -1139, 73, 695, 217, -654, -714, 763, 208, -1849, 52, 2064, -1393, -1532, 2706, 998, -3106, 562, 3454, -2008, -3472, 2376, 1834, -3501, -1868, 2618, 725, -2635, -950, 2449, 1060, -2375, -787, 3192, 212, -3278, 603, 2889, -2437, -2703]
1142b703N502k026m861M570L342n838m22N885j251n344K087M434k970m103K901
1157g97L496k991l458L473L747m202k767N631R91n707J304N447l893l849N656
1172B081J108o749J626N976m254m655N539L055n793j620O239Q36n998r5O564o74
1188C186p428K559P376n102o836P375M747r564j731J1077k066r992N318Q430p776
1203d27o009Q759L165r177r09Q612o18p855K104P487l463o524N148N471p351l486
1219e073R090J1j0335L896R539p373p110J0511L821j1619o4J1015k898r950M577
1234a962Q095o320n979P027M545p788k255Q495O5q938L240Q585p019p342J0164
1249B613M601j2929o18J3989l473j3647P669J1768j0467r156J2075O233j2728
$$ y = [-2703, 2799, 773, -4088, 482, 3824, -2014, -2436, 3449, 2198, -3146, -1059, 3375, 405, -3698, -797, 2699, -292, -3750, -277, 3470, -732, -3499, 2132, 3123, -2584, -1280, 4167, 274, -3575, 2081, 3189, -3560, -1934, 4042, -212, -4867, 672, 3727, -2066, -3686, 2553, 3389, -2609, -2704, 3860, 3186, -4242, -1683, 5693, 591, -6245, 1130, 5877, -3687, -5418, 5659, 3593, -6399, -1081, 7349, -427, -6436, 2323, 5488, -3689, -4598, 4014, 3396, -4459, -2355, 5132, 1669, -4855, 293, 5764, -1587, -5073, 4017, 4028, -6307, -2411, 7128, -245, -7355, 3156, 6977, -4642, -4706, 6309, 3411, -6539, -1962, 6133, -187, -6166, 861, 5406, -2382, -4637, 3858, 3923, -5015, -1775, 6810, -209, -7551, 2613, 7214, -5715, -6333, 7656, 4183, -9464, -1795, 9973, -494, -9650, 2425, 8658, -4070]
1262d070l235J2306J114j1706J100J0870l367j0118N802Q140q758m728J0284R80
1276D614j0755L565R908p475p138J0543L506j1861j9J1640l848j0475O731Q551
1290G487q644o308J0849L844j1897j482J3109j882j4070N468J3540r558j1822
1303a1366J3518R045j6170m318J7313l3j6865M291J4534p891j1559R666Q028j0767
1317b574m998J1365J896j1148J702J0612m337r852Q120P579j1166m694J3535r0
1331E950j4458M512J3397q866j0738J2341P017j3618k716J4267j283j3177M270
1344c102J1876p235j0260R438P894j1648n758J3607K126j4564J986J4915o032
1357C243j3355J0661J0074j3739n503J4808L44j4443L965J2529p751r850J0160
$$ y = [-4070, -7305, 5001, 6115, -5591, -4491, 6379, 3012, -7106, -1304, 6836, -1922, -6650, 3634, 4614, -6141, -2576, 7332, -143, -7281, 3262, 6768, -5093, -5112, 6528, 2680, -7795, -1064, 7487, -1157, -7465, 3384, 7228, -4669, -6151, 6958, 5076, -8994, -3526, 10014, 456, -11366, 2152, 11197, -4973, -9291, 8022, 7989, -8876, -4585, 9949, 2058, -9501, 165, 8193, -2574, -7572, 3793, 5689, -5459, -3757, 6855, 2518, -7334, 786, 8365, -2801, -7495, 6040, 5950, -8508, -3996, 9401, 535, -10203, 2138, 9155, -4463, -7179, 7088, 5805, -7372, -3102, 8774, 1539, -8721, 717, 8611, -3037, -8795, 4812, 6938, -7626, -5640, 9275, 3243, -10112, 549, 10623, -3116, -8619, 6189, 6533, -7910, -3945, 8584, 833, -9017, 1143]
1370A143O889j1944l410J2838L84j3206K775J3753o718j2595R960J0904j3660
1383b887p684J6036L073j6587J446J5951o038j3461R578R939j1422n738J2018
1396D224K009j1626J081J0522m108r346O333P834q910n380J1492K190j2876J690
1410d871J3166n907j2128J0132R317j3181n477J5131J100j4582K886J3384o212
1423B758j1763Q517R107j0708o949J1637M695j2741j327J3560j686j2603N637
1436a866J1558r131q650J1306M311j2732n59J2299l840j0664P513P863r225m853
1450f670J0690J872j0902Q88J0434l363r961N386R445q196p713J0518N375j2136
1464d333k143J3165j918j2379N602J0087q434p121J0191L748j0547m83R765k072
$$ y = [1143, 8032, -3912, -7322, 5516, 5900, -7306, -4531, 9222, 2504, -10091, -131, 10773, -2887, -10571, 5465, 8538, -8049, -6603, 9348, 3310, -10151, -573, 9366, -2056, -7794, 4224, 6233, -5393, -4312, 6210, 2102, -7244, -911, 6923, -1987, -7367, 4125, 6315, -6561, -4871, 8295, 2388, -9740, 392, 9709, -3472, -8949, 6182, 7282, -7300, -4414, 8970, 2758, -9005, -488, 8619, -2089, -9038, 2599, 7294, -5447, -6774, 6786, 5100, -7503, -1866, 9692, 561, -8089, 3217, 7528, -5204, -5763, 6536, 2696, -7968, -455, 7408, -1817, -6670, 4020, 5892, -5010, -4122, 6312, 2949, -7012, -1626, 7819, -377, -8090, 2428, 7803, -4333, -6476, 6689, 4771, -7608, -2006, 8081, -353, -7474, 2717, 6465, -4082, -4565, 5200, 3128]
1478C128q800L867P356n690o099P192M498q358k008R539o2r751L357Q492o208
1493D53o852Q431L661j0206k90R944l093q350N531P012p153n070Q364L144q864
1508c338j430R166l62r454K491R113m541q374P093O511r091l894R894Q36j0021
1523e401K326Q395m474o442O116M304o424j781N979J50n692J045N308k662m982
1538d235L969L945n307k497O542O95p165K079O954m528n662O865L396p868j150
1553c967P853j147p306K665O246l730n009M398M236m784l023N187K159n911p04
1568b837O161j293n735L127M406n030k372N810M41n830J936N306l840l989M767
1583A028K710n099j858N309O23n184j01N305m94n240J393N571l013m731M006L418
$$ y = [3128, -5672, -1805, 5551, -139, -6238, 954, 5452, -2906, -4914, 4625, 4563, -5188, -1831, 6661, 453, -6399, 2032, 5693, -4513, -4803, 5141, 2048, -6302, -771, 6241, -912, -5982, 2382, 5526, -3338, -4768, 4398, 4036, -5418, -2927, 6186, 1645, -6729, 364, 6875, -2216, -6110, 3784, 4620, -5401, -3075, 5320, 846, -5596, 520, 4824, -1600, -3381, 2598, 2748, -2944, -1899, 3409, 747, -4235, -266, 3679, -1628, -4125, 2417, 3112, -4053, -1974, 4980, 452, -5210, 1655, 5051, -2817, -3967, 3886, 2739, -4567, -1902, 4344, 614, -4395, 3, 4239, -545, -3568, 1619, 3778, -2133, -2837, 3324, 2031, -3704, -577, 3829, -1201, -3573, 2237, 2678, -3152, -1216, 4090, 250, -3739, 1028, 3738, -1361, -3219, 2090, 2713, -2471, -2572, 2733, 2239, -3001, -1608, 3963, 950, -3781, 225, 3643]
1599C643m800j957N162k47m159J791K914k647j212K814k66k239R27J952j720j511
1615a555J821J002j633j391K758Q15l615k53M201p59m227K197L969l550k959M370
1631A191J454m183m22L684r12k416P06K132r01j508R34J469q73j556J518J270
1647A587k062q11K082l90k219J660J367k031n05K684o50k118J577J406k132o96
1663a251J911j6j328P6R97J61r96j28J118J55j525J34J649r93j342J556Q69k186
1681a139M76J915j276j060J988K69j996Q33J142j099m89O22K19p70p4M46K13j89
1699C1r06P15R68j161n04J642P8j694O31J489j385n30J610l74j425R29L78j048
1717e56O04L48o20l6P35k65l49K34l7J19l02n30M77R94j379n35K086j73j951J031
$$ y = [3643, -1157, -3114, 2048, 1801, -2358, -567, 2347, -300, -1512, 1302, 1036, -1203, -276, 1676, -44, -1555, 266, 1268, -365, -1756, 1002, 1817, -1798, -2051, 2150, 1391, -2836, -639, 3330, -220, -3179, 1191, 2645, -1538, -1960, 1724, 812, -1604, -898, 1234, 333, -1175, -241, 1228, 355, -1201, 317, 1587, -475, -1286, 796, 406, -1813, -153, 1214, -817, -1322, 1362, 712, -1406, 171, 1577, -555, -1251, 660, 644, -684, -608, 389, 550, -446, -574, 544, 699, -826, -692, 957, -36, -1378, 178, 1047, -1139, -663, 1252, -24, -1084, 904, 1173, -823, 10, 1152, 53, -436, 186, 405, -365, -439, 7, 220, 31, -875, -160, 808, -353, -857, 785, 863, -831, -200, 1289, -96, -626, 984, 610, -815, 114, 492, -556, 48, 396, -224, -260, 475, 210, -139, 95, 58, 177, -125, -655, -178, 816, -563, -1098, 988, 815, -1136, -105]
1737a05J812j655j320K000L69j756n7J270m38p45L36M62j64k38k74R54K41j241
1755e49J59J114o38j097J600k39j349J084N85j443M4J903j121j192J503M83j615
1772g68j38J549j13j180O5R00N74j478m93J724M18k053R9K342j171j856J667J122
1790A210k179J2K029r04j260J230N61j041k65J175k57p07q1J151n5j455J4J918
1808A096m99k196J284J890k003j240K698K97k787R02K258j667j347J551Q18j742
1824f87j70J344K8j248L56J179l71j056L39J498j139j239J536R13k306J30K467
1841A574j485k054K470J403l152p6L108n11k959J294K193j468j923J262K053j774
1857d5k171K399J721k794j167L153O03l289Q14K923j649k312K504J043k993L39
$$ y = [-105, 1707, 52, -1268, 732, 1101, -655, -712, 558, 120, -625, -289, 173, 9, -229, -503, 451, 692, -549, -390, 724, 86, -1011, 589, 350, -999, 85, 670, -773, -729, 1174, 53, -1139, 364, 847, -768, -906, 643, 530, -650, -585, 315, 889, -589, -1082, 642, 1060, -993, -894, 1448, 277, -1579, 88, 1210, -969, -957, 1072, 168, -1092, 138, 699, -342, -607, 568, 311, -396, -477, 674, 619, -836, -822, 1096, 597, -1599, -315, 1575, -428, -1668, 1030, 1327, -1460, -558, 1700, 33, -1314, 237, 1055, -687, -857, 487, 515, -733, -377, 802, 431, -625, -286, 1212, 73, -1166, 370, 1283, -1023, -893, 1574, 89, -1965, 505, 1908, -1244, -1320, 1788, 1277, -1682, -388, 1805, 337, -1586, -324, 1729, -45, -2216, 183, 1904, -890, -2057, 1096, 1699, -1590, -776, 2147, 498, -1814, 690, 1733, -1260, -921]
1873i21K135r91j602J461J214j822n56J613M30j621L7J677m06k020Q38J945j344
1890F7k050K640J019l025K34K918r27k559J783J781k539r20K265J22k099L88J912
1907A010q52j234P35J365q66j357J598Q41j845m43K183n86k294J647J806k429
1923g21j106L107J33k973O87K633j438j963J522J296j227j038J219N29r41n57
1939h38R54M85r50j46J376o25j040J467K4j627M88J676j389j306K214M22k298
1956a113K57J989r31j499J426J123j408n87R48P20j192m93J089O06j659p0J784
1973I90l68j871J307J254j784k84J820k71j843J208P20j199k96J322m52r36P18
1990C5N40q97r1Q08J49q51j03Q08K48j268k14J777m89j840J276J844k007r41K283
$$ y = [-921, 1214, 223, -1379, 82, 1296, -526, -1082, 531, 961, -660, -623, 1054, 648, -1372, -534, 1411, 67, -1983, 657, 1676, -1349, -1115, 1803, 876, -1683, 100, 1881, -658, -1578, 687, 809, -1290, -902, 1010, 158, -1076, -341, 1024, 158, -1199, 399, 1240, -605, -1048, 1135, 549, -1745, -98, 1708, -721, -1827, 1280, 1413, -1560, -873, 1760, 322, -1641, -119, 1177, -50, -1088, 131, 660, -281, -838, 116, 601, -349, -495, 881, 256, -784, 683, 707, -920, -432, 1244, -145, -1451, 763, 1185, -1113, -856, 1133, 202, -1297, 129, 1252, -156, -743, 205, 925, -267, -760, 329, 935, -724, -794, 990, 622, -1249, 58, 1312, -472, -756, 1064, 793, -1050, 158, 878, -321, -617, 705, 253, -683, 35, 575, -322, -413, 395, 544, -307, -410, 398, 646, -622, -836, 941, 452, -1388, -112, 1732, -275, -1216, 1067]
2009A067j09j865M49J438j257m67J045o6p97J34Q75r4q17J82Q93m08j065M48J388
2028I74j263p95J575M81j948K2K177q83j588J566O51j539J18J144n03j059P47
2045a23O25p56k20O54M07r68m23J171N56j623n9K075p50k031J060J867j763j028
2063a329K226rj951M69J633j046r77J170O85j003m31P87O35j203m49J424J44j431
2081f56J3J506p25j289J260Q98j657K40J497o74j449J496Q04j878N1J324n65j037
2099h41P71O98o27q71O42J094r31o44O15J292j573p40K128j91j923R90J397j439
2117a53j037J924K20j950N93J542j059r54P18Q23r02p63J038P92q68q13J220L13
2135F84j122l75J470l25j094R50N97j320lJ506q00r84J137P24j577l02J697n86
$$ y = [1067, 958, -907, -458, 980, -277, -744, 301, 235, -562, -428, 447, 353, -464, -282, 611, 203, -862, -414, 974, -289, -1084, 491, 972, -976, -954, 1223, 340, -1248, 318, 969, -570, -452, 692, 189, -870, -123, 502, -254, -474, 180, 587, -381, -804, 367, 923, -700, -759, 1316, 566, -1465, -405, 1462, -301, -1329, 897, 888, -1063, -594, 1039, -7, -984, 186, 871, -132, -563, 224, 859, -344, -793, 631, 775, -656, -643, 863, 138, -1151, 109, 1007, -650, -410, 1087, 413, -1036, 460, 1264, -614, -563, 761, 196, -841, -70, 628, 1, -870, -228, 866, -65, -709, -94, 1198, -375, -1115, 1013, 822, -1101, -111, 1286, -153, -1190, 734, 954, -996, -403, 1139, 80, -874, -156, 667, -235, -998, 40, 832, -36, -849, 371, 684, -438, -813, 657, 332, -762, 188, 785, -535, -538, 968, 168, -816, 321, 1045, -532, -834, 863, 277]
2153B77j430O37R41j73j009L79J233m03j461J010J206j299q33J760L2j741N20
2170c54J396j051p93J474n3j119P6Q02l41n85L33L44q3k22J75L27k55n17O59M94
2190G07j051k4J027n98q76Q45N25j218K80J152m36j022Q40N59j055j04N17J53
2208B21j63j32K77O4o12JR75k13r52O30Q51j064p93J528O7j658O48J406j053j010
2228i82J176M95r94k88Q08K48k05p19M16O39m75p22Q25N24j021l8R29o25l51M07
2248D7r2n05Q10J63j022M66Q13p79n08P46M52o40k28O21j87n03m7L18M13n06j98
2269c66P83R6j116L64J025p69q28J231K08j427L06J218p94o46O23O13l77m13J25
2288a44L26k09m77L66N28m02n63Q26J08o64J20O96n99m40J027j98o66M35L82q70
$$ y = [277, -1153, -516, 425, 252, -757, -378, 855, 452, -1009, 1, 1207, -92, -925, 835, 867, -874, -354, 1042, -9, -802, 672, 619, -500, -424, 378, 37, -548, -215, 129, 46, -176, -1, 326, 71, -446, 213, 707, -344, -368, 659, 61, -815, 30, 555, -663, -383, 769, 333, -689, 151, 710, -345, -449, 68, 221, 58, -74, 203, 267, -345, -344, 631, 418, -534, 96, 947, -117, -910, 618, 685, -973, -325, 1081, 28, -982, 194, 689, -305, -593, 215, 463, 258, -461, -45, 594, 119, -603, 222, 746, -275, -313, 616, -9, -360, 47, -45, -550, 260, 423, -599, -133, 680, -99, -607, 139, 591, -49, -277, 344, 157, -346, -393, -75, 338, -168, -366, 417, 513, -603, -239, 786, 17, -811, 420, 628, -799, -493, 725, -69, -715, -92, 521, 144, -269, -144, 182, -27, -504, -138, 390, -12, -575, 251, 359, -305, -185, 511, -88, -528, 499, 301, -365, 70, 452, -418]
2308d18M6O18l28q0K72J15m68L03J47m14M00j0k73L27l88L2M27r9q79P74O36r37
2330a97n14J083J31j391L45J203l37r10Q33M20o24l53L43Q2r6k93J83Q21p97m86
2350e54N68L90p12L07P20q51r7N67l76l98M18K96m99m7P58l59p20N90J07k40M8
2371h4K41Rk38k14m6O45m87k63O44O38j318J78J055p50o70O92M63p46j55P10k89
2392A5o0j00M72k11n7M8K43l75l41J58L90o05j51J080j63j072O39R15r30q29J504
2413E70K42j239M4R29n36o19M45L20j79k34K26L78m42o35Q34K52q53J43J098l42
2433D02r47Q89M00q82l70J157l39j023Q81L30j102j42J085o4p66K55R03m68q20
2452f21M88R34p17j075R32J131j296p50J392L61j678L23J798q75j159J094N45
$$ y = [-418, -372, 246, -82, -162, 110, 225, -243, 60, 207, -207, 193, 183, -90, 237, -151, -119, 308, 209, -670, 104, 740, -197, -711, 372, 503, -888, -543, 660, 323, -587, 246, 666, 42, -311, 32, 114, 18, -275, -92, 729, -68, -554, 14, 404, -308, -1, 719, -132, -229, 338, -38, -436, -18, 278, -221, -268, 490, 131, -589, 1, 108, -132, -84, 157, 166, -72, -286, -332, 313, -174, -437, 207, 845, -473, -295, 760, 10, -660, 32, 495, -251, -406, 304, 15, -45, -145, 327, 116, 59, 107, 350, -25, -366, -208, 182, -423, -574, 506, 343, -729, -90, 825, -105, -934, 570, 812, -427, -383, 546, 10, -609, -164, 156, -23, -257, -31, 347, -95, -730, 104, 356, -497, -354, 744, 402, -545, 344, 744, -138, -508, 649, 310, -713, 168, 498, -604, -746, 339, 275, -491, -236, 667, 199, -621, -133, 801, 84, -991, -59, 1072, -224, -974, 418, 779, -899, -576, 1222, 347, -812, 282, 827]
2469H27j187j71R64p9n42R2M93j31o09L11N31o23l52Q20K17j001J37J128p02j006
2489h83J032R11j491j71J333k69j383N31J102p60o73P74P17q35o33R92L41j218
2507e83P1J241k00j322M73J172p09j289J223N89j225l1J214l81j067P39O03o04
2525h6k34P08j43m45j23M86qn81J61O17J4j056P06M34p93l9R26p4j098M33Q54
2546F59p93o79R78J20p07K56O63n16k73j5M30j53l99L08P31o09m13N41N24r73
2566c20j25J253m48j268Q63P39j135k43J264k76n86M32M45n48m03M78K9j93k03
2585b45R3O28n68k99P89L8r24L31J003p81p59Q45J93j056J61R23k57m20L75K75
2605C45m40k5K09J8j36j11K24K31m53nN08j46p36L90Q94o56m82P03M5q37L85M10
$$ y = [827, -360, -531, 433, 354, -188, -96, 397, 266, -343, -32, 499, -124, -476, 344, 561, -440, -303, 825, 123, -883, 149, 1060, -431, -602, 731, 462, -921, -390, 712, -48, -721, 53, 770, -65, -698, 294, 635, -583, -512, 729, 529, -793, -320, 852, 143, -1146, 77, 666, -559, -590, 624, 243, -824, -85, 518, -86, -320, 388, 245, -200, -323, 163, 155, -426, -265, 352, 366, -690, 16, 450, -343, -382, 544, 470, -628, -195, 659, -134, -813, 165, 285, -422, -166, 497, -19, -292, -307, 123, -30, -429, -121, 610, 1, -412, 129, 653, -320, -445, 808, 360, -908, -45, 694, -441, -684, 580, 304, -282, 150, 595, 47, -356, 122, 151, -42, -245, -152, 476, -92, -391, 398, 436, -488, -157, 846, 65, -694, 151, 344, -712, -551, 372, 115, -305, 70, 345, -95, -120, 89, 107, -29, -140, 84, 315, -138, -143, 365, 219, -517, -127, 767, 111, -371, 332, 377, -460, -75, 335]
2627C35n86K41L20k34k48J31J51l32K70J2L5k67O0K46P3k70m9N16l9p30J74N75
2649C84n78l99Q07On97M1P00j79n65M34J30o9k45J6K43Jm03q4M52l25M4K43K42
2672B99n62K7N06l56k09M86k33m51O02L50q28L58K75k97p9L27n4k35j70L17j46
2693g3N7n78M77O25m54l48P38J63r90J58P22l44o31P09K1m91k11M75M3j94L45
2714B19m4k76K53r4n3j22K45P1J3k10k01K09p6m56P07K97q95K06J001n20r22M06
2736b42O40m10n79R02J08l62k28L1K47o7m52N56L02m60l21N46%m61L90L3k63J01
2758A1L93m78j83M97j16o95O82N54p75l08Q16jo36o4L89K63k97l97L05P44j058
2779c54m03J098K3q38k19J089l64n28L93M56l78j51K52J27j28m3l44J79K76l6
$$ y = [335, -251, -10, 310, 76, -172, -41, 110, -222, 48, 60, 95, -172, -112, 134, 207, -63, -112, 404, 365, -365, -191, 384, -194, -593, 214, 220, -377, -336, 364, 185, -380, 54, 184, 115, -130, -114, 129, 130, -273, -357, 95, -230, -186, 57, 299, -263, -236, 270, -86, -295, 191, -42, -493, 109, 459, -369, -11, 264, -33, -112, 215, 161, -74, -244, 73, -73, -16, -594, -117, 508, 54, -294, 444, 607, -383, -225, 497, 153, -478, 231, 252, -239, -450, 25, 68, -126, 219, 175, -101, 152, 58, 5, -117, 128, 199, 212, 2, -199, 10, -66, -522, 185, 482, -413, -207, 794, 274, -648, -242, 398, -12, -591, 311, 419, 57, -171, -140, 107, 40, -412, 144, 446, -14, -335, 211, 211, -250, 140, 173, -90, 11, 404, -74, -257, 240, 124, -571, 111, 665, -110, -418, 398, 397, -239, -303, 86, 349, 52, -345, -40, 704, -354, -757, 341, 364, -474, -693, 396, 32, -496, -103, 353, -25, -176, 76, 203, 75, 32, -312, -133, 143, 107]
2799A07l41K25l4l6R8j89K3K49j70l43P22L5o67K21N44m09l30M74J33n41j26N82
2821B27l07P7n7K22J55l15k25M09J8m51k14Q50l03l62L74J78n85K88J95k72k21
2842c19O31j18k23l7Q6o6P2K44l65L36r5k92K02o9r8j3K67k12j65K96k3k73L56
2865A22N1k86L68k6l59J40J25k14k03L98J54l77J13k6J08j35R1k07J36J74l34
2886a87L3N20k23m69N74J12n67J57L80l57k14J22M20m45J49n1N9J90m12o5M34
2907A60n6m77N09K14n15q5M17q3l27K36K36k37oj17Q0K86j78l7k6K40l50j64O16
2930C36j21n92K24L30l02q8K98j34K00r6l61L06L26k82m27O17j05n74L89M14m28
2951g0j06M34j1k43m4R1J64l49J18p9K14N8m02L28k7q0l6J99p3k99J71j01J14
$$ y = [107, -234, -9, -43, -79, 19, -170, -147, 102, -68, -411, 311, 346, -321, -100, 444, 35, -295, 179, 312, -229, -355, 227, -80, -3, -60, 162, 317, 2, -223, 186, 204, -247, -461, 389, 86, -276, 98, 276, -309, -21, 174, -98, -319, 312, 194, -29, -66, 20, -46, 26, 270, -95, 241, 146, -146, 56, -13, -111, -124, 143, -69, -234, 62, 39, -234, 122, 173, -113, 255, 229, -130, 10, 135, -79, -282, 116, 270, -107, 6, -20, 88, -47, 44, -163, -27, 147, -187, -154, 366, 143, -326, 248, 360, -207, -50, 330, -27, -241, -119, 301, -144, 5, -46, 13, 203, -209, -274, 160, 104, -373, 136, 350, -165, -250, 167, 84, -243, -7, 229, -8, -14, -131, -51, 235, 57, 20, -6, 234, -116, -280, 336, 215, -377, -153, 177, -125, -213, 85, -49, 151, 55, -306, 0, 326, 44, -383, 234, 129, -445, -56, 358, -70, -176, 258, 247, 4, -40, 51, 215, -134, -16, -95, 119, 177, -225, 103, 76, -4, -40, 159, 86, -213, -42, -143, -29]
2974b9J74k27l27L06L06k78j38M13q2l30J76K44k61J80o7J0j5j22O7J61j5j92
2996d6k6L96l44k08O20l12l58M21J77l07l45M66j13k46J96o1o9J67j68P5J03M2
3018F0L3l4N3k93J20L01n13M4N77l09l99M36N8m12J79L05k88j44M40j63j17M34
3040C68k81l29L9K64k37mK17J77o8j18k70L98J79n74m3N93l36n38N25M07l81j75
3062a87L23p0k21J42o8RJ79Q2k03K7J06k27J54j66n7J54J70l87L50J94l73k01
3084b70O20j28n30J32L26k29j42K20k06J86m9N5J34J0J0m5Q6j54l9J41Ql50J85
3107b9L91o16J71M48l53l54L80K68m35K09R7Mm77M05j8j25QJ1J10k72R9J27J79
3130B28m09j37M58M1l60J01P52o31m41N47J57m36N3L18k72k22M71j88o3j56M15
$$ y = [-29, 145, -82, -409, -103, 203, -75, -213, 200, 118, -212, -36, 208, -53, 127, 60, 70, 55, -67, 0, 161, 146, -46, -72, 324, -20, -228, 392, 80, -278, 143, 320, 13, -332, 134, 21, -225, -29, -90, -159, 8, -160, -85, 18, 60, 93, 59, 112, -181, -61, 240, -273, -229, 348, 39, -360, 76, 134, -278, -99, 206, -82, -226, 214, 51, -66, 368, 87, -242, -203, 61, -176, -180, 37, 214, 146, 28, -242, 156, 335, -239, -282, 311, -25, -563, -38, 369, -12, -187, 136, 66, -155, -13, -81, -72, 107, 189, -14, 13, 119, -108, 46, -120, -177, -23, 147, -240, 110, 304, -69, -270, 350, 222, -308, -176, 150, -79, -221, -1, -207, -21, -70, -15, 119, 129, 139, 94, 180, 26, -13, 128, 136, -214, -29, 362, -254, -83, 365, 12, -342, 38, 306, -129, 80, 177, 181, -296, 109, 91, -34, -26, -15, 95, -177, -78, 49, 228, -181, -318, 140, 181, -179, -78, 674, 43, -398, 149, 306, -130, -77, 241, -31, -253, 218, 30, -33, -189, 226]
3151B26j56j64N7l5J70m60J24O21k95n39O79L06p44j79P39J0n01J74K12k50j10
3172a15L89l02K9J08k3j0j90l8J39K56k17j21M59j00m25L75Jl24J4J76q8k51M72
3195B14r6k29J24J55k35KM6o9o7Q6P4j8k22J72J36J05k58QN58j81m27j4K92j90
3219c4k14M36o8k70J65L68m08m8o6K92k67K66k87J81J24k98K9L90k15l18M58m2
3241A74k94K93K5l66K24J41k15j53M63j37l26L52j82Pk81M44m1j7o4K1K6J3k31
3264a24J2L47l24l30O10jl18L2K46J73l84m1L37l43Q4m5Q8J53j14k09L27j9k67
3287a10%K5J9m0k6J64n4J80k27l4J68J97n39K70L23l01l01L50K02m13j08L90j98
3310f3P6k37J77L37m66j48L25K43l99o5L16K36m38M9J16j04J51rk53Q4L05k28
$$ y = [226, 70, -94, -37, -72, 98, -362, -238, 383, 88, -451, 228, 534, -210, -389, 350, 360, -141, 33, 245, -5, -115, 274, -28, 1, 109, 86, 76, -114, -152, -13, 243, 26, -95, 364, 264, -161, 214, 215, -109, -95, 81, -7, -258, 214, 118, -111, 13, 168, -67, -65, -19, -88, -155, -69, 5, -13, -235, -63, 73, 178, -80, -72, 486, 305, -122, -136, 156, -34, -248, 188, 120, -150, 15, 383, -25, -73, -139, 153, -114, 152, -135, 46, 170, -128, -99, 291, 76, -242, 216, 174, -120, 173, 198, -168, 56, 197, -18, -171, 292, 155, -171, 181, -1, 6, -275, 169, 128, 111, 47, 68, 94, 107, -124, -112, 235, -89, -419, 191, 190, -128, -96, 150, 323, -61, -102, 235, -108, -24, -69, 19, 172, 58, -151, 176, 157, -110, -110, -85, -66, -106, -132, 32, -22, 158, -69, -103, 65, 262, -277, -7, 316, 15, -286, 64, 266, -147, -255, 135, -63, 13, -224, -47, 290, -176, -324, 1, 244, -155, -220, 96, 332, -106, -57, 59, -45, 106, 97, -156, -72, 233, 5]
3332Ej74K39Q8j55J05j72O7J42j07j66K2L28m36M15j31l9k06M9J28n1J21J39l25
3355a14J21J56m4j37J11j47J18k73mL41m6n9j07L59k75JP6J51l73J43K13l48k32
3378c69M57J81m72J58K64j30l66M16j8k93m2L37Kk23J18m1J68M0n96M63K43m97
3400b00L8L49j89l26M60J29m34J04K82k73O2J47j13L7o9L2n5m3K9rJ61j71K7J90
3424A65k02k02L84P5j93k18M13j69m20L51K61l30j78K36O5j23p9L14J8j39j88
3445a59J51N3N6l07J37K39l01L6J71j31j11J74j78J8K67j5j81R8Q0k59j11K56
3467a7K44l68K75p6R6m2k63L11J39m77q8K10j16J39R9K24k82k56L71j13j68J99
3489D1K76m08JJ7j3J6M5R1J96r6j63M1O2j75m06M30L91m74J39K69k98rJ99j54
$$ y = [5, -169, 70, 158, 3, 108, -64, 3, 145, 38, -128, -106, 222, -214, 201, 70, 31, -175, -126, 2, -49, 72, 211, -114, 7, 163, 119, -18, 93, -54, 64, -209, -213, 128, 82, 23, -84, 275, 0, 1, 77, 228, -145, -2, 211, -137, -369, 88, 269, -203, -45, 219, 89, -277, 139, 121, -172, -214, 123, 125, -98, 20, -21, 147, 187, -409, 54, 297, -200, -162, 187, -2, -328, 132, 261, -173, -69, 213, -60, 2, 149, 36, 73, 4, 36, -19, -62, -33, -42, 119, -52, -25, 165, -37, -239, 145, 220, 27, -191, 222, 53, -367, -16, 245, -85, -263, -27, 38, -85, -164, 150, 168, 29, -159, -8, 45, 101, -206, -69, 170, -131, -95, 76, -55, -166, 8, -170, -152, 115, 100, -81, 17, 97, -162, -273, -17, 227, -141, 134, 58, 154, 112, -151, 160, 299, -178, -266, -56, -172, -33, 66, 290, 8, -248, 123, 10, -158, 41, 317, -91, -90, -73, -86, -70, -25, 66, 262, 166, 3, 44, 106, -69, -475, -45, 346, -128, 11, 280, -18, -27, 172, 18]
3513A8k25P8J04l40K77J56j85K11J18p6J24k03j19K21J1k41J6J68l1l16L34K2
3535A22l15K40J00k90LM57k40l45K97L14l09J33k69L8J77l28L04J09j80m25K00
3556b07M21k73q3L82k27m46M67J26o3j83J51O8l09L3J93j62K95nl71J99Q6p6L3
3579D9J07j86k11J43KJ00mJ12j89J03J01j96K30R6k36j38L37k61j38L34L6k91
3601a00J75k0O3j29k0P0L0J2k46L32j55M7k40K54%k24J76K71m08J37J73k24j67
3624a93K73n4j35J11n6J59J52k68J07J9Q6m1m2J76n97M10j37K92l58K48j93j46
3646a87K64l9n1j63L30l22Q7M9K40j99j26K16k1Jk48K59J21j82o7J07J64k66L4
3669AL8J33k21l5J79j94K7K38q4l00N24m01m2K89m2p4j18K3k9O5J5j18K82m5k36
$$ y = [18, -207, -129, -25, -365, -88, 68, -117, 94, 212, 136, 260, 57, -62, 159, 170, -71, -55, 113, 82, -234, 100, 122, -193, 47, 147, -143, -140, 317, 77, -268, 29, 343, 34, 167, -102, -64, 113, -215, 89, 198, 18, -407, -207, 214, -59, -142, 240, 13, -433, 34, 160, 97, -86, 65, 133, -176, -143, 50, -112, 183, 178, -193, 6, 92, 16, 49, 156, -30, -241, -98, -96, 4, 0, 112, -77, 26, 127, -69, 161, 257, 21, -117, 220, -41, -179, 155, 191, -100, 75, 55, 118, -11, -31, 39, 69, 81, -165, 167, 12, 59, -181, 73, 73, -151, 25, 296, -112, 25, 198, -26, -193, 80, 26, -109, 2, -54, 105, 257, -11, 96, 115, 201, 160, 118, 294, -303, 107, -30, 262, -96, 152, -41, -187, 77, 38, -13, -176, 154, -168, -81, -32, 208, 9, -117, 99, 78, 79, -169, 90, 211, 29, -38, 69, 233, -33, 1, 39, 172, -49, -84, 95, -99, -72, 166, 82, -218, 306, -95, -137, 152, 110, 36, -82, -59, -88, -23, -8, -126, 156, 111, -125]
3694a25o0L71j25j90L29n7j13m5J25k26k12M62o1j45M4P8j60J91j61M7lj39J90
3717A5R8j61j15K34Q4l58mK21K01l68K62P3j31R2k6o9k13J13J16j97O0J82l4j66
3741i1n9R2J88N2k23J44K2j30LK24k33K3Q3Ll21M10j48j40p9K21K6k28M15r3l16
3766a55K4R5O0k7K64j33L28m94L0J55Jj21k52K56J11j70j87J52J1R2NMj18J35
3790F6j10k8M0k08K75j9J01j82J35O0j92N0K38l50J19J61j42j12K00j50nk8J45
3813F4r8j4K61j44j64J01R7l41R2R9J34p1l7N2n7J65j67NN3k17J2j7L34l91K34
3838a5L5r0J50o1nl4J06k92K71r1p1o5K69j84J67J46k11k50K86o4r2Q6J23K2j71
3863c5P2j12M6M7J6j36N3K5R7j38J16k0j68J48M7j29R8L9K7J29j92k02J38O5o3
$$ y = [-125, -185, 186, 61, -129, 200, 143, 30, -15, 110, -116, -328, 134, 73, -72, -28, 50, -110, 81, -80, -33, -36, -175, 15, 113, -48, -163, 71, 155, -203, -207, 14, 215, -153, 109, 182, 51, 143, 117, 48, -165, -52, 64, -133, -73, 109, 75, -91, -150, -58, 130, 182, -41, 103, 125, -5, -2, 222, -11, 12, 95, 98, -223, 187, 39, -101, -180, 41, 67, -161, 254, 161, -155, -131, -36, 24, -3, 261, 128, 456, -38, -8, 147, 148, 27, -225, 31, 142, -28, -215, -63, -52, 40, 45, 49, -69, 66, -44, -72, -32, -240, 35, 16, 117, -65, 70, 130, -62, -12, 226, -124, -5, 156, 14, -98, 102, -48, -53, -81, 64, -34, -48, 213, 69, -95, 6, 103, -238, -146, -47, 87, 16, -21, 31, -26, 139, -28, -23, 30, -187, -175, -192, 142, -249, -15, 20, -70, 80, 19, 14, -20, 86, -206, 65, -26, -97, -162, 107, -77, 90, 236, 25, -225, 61, -3, -95, -9, 114, 136, -35, 37, -75, -29, 18, 34, -102, -49, -24, 73, -65, 51, 31, -137, 11, 58, -71, 27, 66, 93, 222, 30, -172, -34, 31, -32]
3888c2j78J53K74j76J86k60N8o3Rr3J52K7j02j9J72o0q1P3n5P5J18j94j80J18
3912g8J32j38J6K09m5j79J09o8l7J35k2r6QJ19j42m6J90n5m5j85L29p2M6j15L2
3937BR2j20m9K18j36k4j20K13j33k3K29k89J18L1Q2j0k1l3k90J24M00k76K7oK5
3962C1r9k7Q1L7l6Qn5l3J94l0n1J03k83N2J43J2m9O2L5k3j45M8J44o9j65O4O3
3989A2P6l0p7M00j37l42J41LK1j07J08j24M0ok18O8K50r6k5j5K59l59%K56J26
4014B24l10J87L0k40J85np5pk08J76J43j11j4r3q4Qp3K61P5oP3L1k30J21O7j74
4040d9O8K11j56j19J70O4k21RJ76j86K49k18k28L41j60j30K03K2Nk16J68J40j56
4063a3l9RK13j46o3J06l11K20P3P0R7j41k74L26J5k75j19M44k90j00N6J59L3J94
$$ y = [-32, -210, -57, 217, 41, 227, -33, 25, -38, -29, -122, 30, 57, -45, -64, 108, 48, -33, 40, -15, 60, 178, -16, -196, -78, 54, -84, -68, 141, 96, -83, 26, -42, -79, 56, 34, -62, -54, 65, -77, -123, 67, 12, -33, -218, 111, 39, 85, -30, 2, 94, -26, -75, 143, 7, -17, -137, 76, -57, -80, 149, -140, -22, 9, 91, 81, 60, 27, -263, -139, 261, -15, 12, 6, 31, -68, -95, -14, 23, -13, -5, -60, -93, 101, 71, 20, 123, -160, -108, 35, 47, -2, 60, 95, 72, -73, -25, 119, 50, -115, -51, 12, 88, 58, -19, 381, 244, -98, 43, 46, 67, -40, 68, -56, -16, -22, -240, -172, 78, -18, -43, -58, 201, -158, -158, 98, 224, -86, 101, 131, -109, 76, 71, -4, -11, -219, -43, 100, -11, -25, -118, -202, -194, -267, -6, 69, 63, 136, 167, -63, 58, 125, -49, 19, 230, 74, -45, 125, 189, -32, -23, 153, -33, 216, -2, -230, 111, -49, -179, 24, 46, 51, -165, 3, 143, -13, -52, -43, 170, 24, -39, 67, -244, -24, 49, 119, 216, 75, -199, 127, 142, -133, -252, 192, -98, -198, -142, 17, 50, 244]
4087B44j53j44J51K14j28j52m9J52k28j34L25n2p3q0J25%K0r7J51n5Q1j78K30
4110A70k54q7K63l2j09L8Q3J2j61L2q4K05j81M1N5J10k88L7J30j33K50K03J2o92
4134c80M16N1j84n1K37J58l68jL39k01n5k6n4P9pQ5O9k08J06M8j9k18K6L87k35
4159fj84J47J24l06Q4K46Jk41J68m4J83k16J33l17K68Q8q7O9j48k29K17K7j41
4182a64o3K71J3k06L38k08o6O7K64k04j73L07k6j95K9Kj25N8Q4m3l4J48j68J03
4206IJ82l69K16O0k23K20k0o7j04K50o7k33K5K41k96J03J49l0l20K08N2N4K4m
4230F0j55l3M2q2J45M1j12jJ43m5k30K38K19k45K7Q4l6k62K53Lj03K39k11P1r6
4255d6N6P3m7j54j49K87j5p6J04J97l16J22k36K74j54K12O1j87o7KK98l28J33
$$ y = [244, 91, -53, 98, 312, 184, 32, -17, 135, -93, -227, 98, 46, -27, -107, 18, 18, 38, -59, 92, 37, 118, -60, 170, -84, -171, 92, 60, -49, -11, 72, 84, -77, -45, -129, 76, -105, -64, -9, 101, -187, -150, -20, -153, 97, 300, 312, -380, 36, 87, -97, -148, 89, 247, -121, -122, 217, 16, -39, -65, -119, -40, -47, 38, 107, -101, 5, 53, 34, -184, -158, 229, -6, -190, -43, 81, -225, -141, 105, 106, -135, 33, -11, 172, -44, 89, -228, 40, 128, 41, 110, -38, -267, -50, -23, -164, -227, 44, 57, -149, 189, -19, -85, -18, 246, 42, -131, 176, 150, -45, -16, -14, -139, -81, 3, -40, -74, 74, -94, 9, 191, -178, 38, 98, -125, 95, 75, 8, -96, 154, 87, -146, -121, 120, -176, -73, 76, 46, -274, -66, -14, 40, 64, 60, -95, -128, -86, -168, -23, 18, -94, -95, 48, 3, -227, 11, 230, -15, 12, 96, 60, -202, 51, 54, -49, 190, -21, 50, -46, 10, 83, 36, -118, -267, 20, 5, -71, 33, 230, -86, 36, -200, 74, -80, 132, 193, 6, -61, -59, 239, -89, 44]
4278D4j3m3l8qN8j4kN5j19m7j0M05k06J19k93J02j14o4K46pj97j08J72j20J84
4303a8N5Q2k8j34J6q8P1K7J02J15j15k34M48j34l67J61K52j63r4k7Nj58J91K68
4327B33j28o7r9O1j44K22L3j33o7J22p2N6j29m5K91j07j64L5L11j64j46L40k27
4350A2L5k07P6m9K22Q6j32O1k37P6J40o8qq0N0K10j48J29p1k83K11K02n1j66P5
4375H5N5j41J27q7M0k5n3p9o2Q9J09o1M1J94j80j15M9l6L58m30P0J99Oj63N3P5
4401A18K9j91J19j78J24k80J85m5J55O5L9J3l4j76J64L0k46J65k3l5nJ08j91K85
4425A95k91K07k04J16O6j70J42ok9j26N1k1N5JL3j16J10O2j05m6K11j63R6J7j06
4450b1j13J05jJ05j43J20r9j4J93k2j09k0P1k63L78o8r2K4jk10K25J78l94J39
$$ y = [44, 31, -12, -50, -58, 0, -14, -16, 39, -80, -127, -137, 268, 62, 181, -112, -10, -124, -188, 58, 51, -146, -254, -82, -202, -18, 37, 119, 91, -43, -27, -115, -44, -17, 85, 200, 85, -149, 299, 165, -202, -41, 211, 48, -46, -73, -68, -226, -35, 233, 105, 38, -61, 0, -144, 78, 111, -22, -89, 33, -39, 17, -112, -157, 134, 27, -137, -102, 209, 45, -101, 239, 12, 47, -160, -84, -133, 89, 175, 43, 104, -133, -57, 83, 15, 7, -73, -23, 187, 39, 168, 97, -186, 25, 227, 176, 10, 85, 140, -1, 126, 39, 79, 54, 1, -78, -140, -51, 58, -3, 38, 232, 52, -63, -14, -50, 308, -122, -52, 147, 153, -10, 43, 118, 147, -44, 75, -103, 21, -259, -74, -119, 36, 101, 140, 153, 119, -57, 107, 137, -109, 56, 33, -2, -7, 101, -90, 195, -96, 111, -93, 23, 89, -81, 61, 55, 26, -100, -49, -70, -15, -14, 19, -97, 13, 75, -30, -76, 135, -28, 68, 85, -21, -134, -29, -30, 75, -68, 52, -47, -61, 132, 110, 1, -19, 52, -211, 167, 99, 7, 31, 30, -180, 45, 223, -171, -32]
4474c2n7R2JK04j88k33L70j04P8l2k33J69l0r5J04J09j10o1R6Q8k57k2J37J03
4498I7k12PL21k07J06q4j19R7Nj33J37N7j02QL9j11J58j96L10j16j28P3k3O4j05
4523e7R3j13J48P1k71j0K01p5p7J09L4n5rK26j52K4l9r0R0M9O3k51R3J6j60J43
4549AL07m97J60O4j98K27m1j61R4K10q9j18J28o0k69K54J30k47N1J41r4o8J70
4572I5m0l4j66J39J23p4j34o9L12j6k41J5K19j17m6pJ67l16J13P8j16J22K5M5
4596G7o3o9K50l46J62n7j11J98o2J72j86o7Q8l2l0m1n6Q6Q1J1M4Q5j22o1K8q6
4622a07L8K34k90J24k7O2p0Q5j0J6k14M5J56k58K42J27j42L10l60K17k28J48l55
4645b57rM22k32Q6l3J08r3l6r9oK39j05O0O9j13n2N5j53J25J01l5j4j96L00k09
$$ y = [-32, -89, 3, 4, 208, 20, -213, 157, 53, 131, 99, -134, 35, 5, -90, 14, 123, 13, -48, 48, 136, -121, -143, -6, 97, -115, -108, 213, 6, 112, 28, -91, 6, 11, -122, 15, 72, -30, -22, 17, -94, 64, -132, 178, 62, -66, 7, -16, 48, -57, 36, -77, 71, 142, -129, -139, 62, -13, -90, 19, 53, -2, -11, 215, 63, 87, 48, -42, 48, 97, 160, -91, 2, 18, -142, 1, 308, -189, -29, 35, -163, 64, 23, -138, -44, 166, 77, -41, 87, 27, -242, 12, 142, -105, -54, 87, -7, -75, 95, 55, 21, -145, -6, 117, 43, -91, -160, 152, 136, -105, -90, 129, 12, -34, -41, 126, -190, -77, 1, -115, 7, 32, 77, 14, -55, 195, -151, 11, -46, -157, 41, -21, 151, -35, -102, -14, -46, -76, -117, -173, -87, -6, 5, 49, 134, 12, -49, -21, -107, -69, 165, -125, -1, -28, 34, -36, 49, 39, 55, -159, -114, 42, -216, 26, 153, 11, 321, -39, 178, -50, 98, -257, -266, 156, -76, 10, -23, 85, -8, -44, -143, -149, 90, -15, 45, 114, 1, -51, 4, -149, -24, 77, 42, 28, -168, 132, -77]
4670g7K40L9j56j21K21Rl57K75N2j27Q2j73K37j32Lj07J41M4l26O2K61k40J84
4693C4j43q1l4J65R9j74J64q3J56j29O0J22k62R3P6Q2j26J07j98j5L07k48no4
4717i7J66j61J97j06Q4J38j00j13J29K4j73m2L29k69j15K82rj13j00QJ24j9j93
4740a29K02j22J51o5K9J9r8l2QJ63k67K36p2r6K6J36k3p1j45K41k13M14k70j1
4764A1J35o9k2k28J97k29K19r4Q3k5K4k21L36J18k26n6J60j33j10J07k0K48j66
4787C9j38K79j57rJ25j94J4o8K9Q6J52k05M9J7J9j83K97j85m6K5J5Q1l7m5O6K4
4813E0J56l64K00n2o8J98j88R1O3J2j08m7R2Q9l06L63N6r0k94J6K76j27N3j50
4837g9Q1L6j36J60j50J46J71k28l4J5j00m3lJ48oJ65k56m0J06o6J91r8J98j07
$$ y = [-77, 163, 202, 46, -75, 146, 155, -202, 73, 125, -2, 80, -93, 144, 12, 15, -92, 49, 93, -233, -171, 90, -150, 34, -109, -190, -224, -59, 40, -134, 30, -53, 103, -26, 34, 156, -106, -13, 63, 145, 19, 126, -72, -87, 220, -28, -33, -97, 69, -92, 105, -1, 83, 221, 121, 8, 137, 161, -12, -54, 275, 6, -109, 173, 164, 51, -49, -41, 83, 64, -129, 73, -49, 102, 37, 66, 85, -13, -45, -37, 126, -141, 95, 23, -73, -47, 89, 66, -5, -150, 91, -122, 292, 22, 11, 146, 77, 55, -173, 24, -205, 14, -80, 3, -22, 2, -219, 117, 235, 9, -47, 113, -20, -130, -23, -43, 205, 39, -99, 180, 23, 14, 139, -55, -41, -109, -80, 6, 158, -47, 2, 19, 38, -145, 152, -33, -79, -54, -39, 42, 5, -40, 26, 50, 206, -158, 42, -10, -78, 120, -68, 23, 86, 98, -10, -57, 35, 124, -182, 181, 237, 147, -147, -131, 145, 18, 71, -79, 2, 38, -98, 62, -88, 58, 229, 1, -33, -18, -118, -161, -164, -16, -22, 143, -113, -153, -47, -113, 78, -20, 178, 71]
4861G1k69K83j45J84r6rq8J13Pj61J79j99j30K28j5op6J61q4J93Jk02J8J8P1k05
4887a58J21k8J35j12q0K12p3N1M6n3k4O6j02J51J52k21j41J85j7q5j83L8K52j5
4911A17j8k05J89o9j20K40j71l9J46j04P4j73J65%LJ26l8j16J4P5j98K11j91K03
4935A21p4K8j85o9K67k77J02K47k11j8J31j0j80O2J13j45n1J78m8J3J0K6j08R7
4959A9m4j63RK52k37J92M8j60J29k0j05N3O9l1L5n4j8L3j8r6L07l9Jk34J35j38
4985g5p1K08L2j07J68J1j93J3p9K19j78mo0K12k51M0K20p8j06P8J17j20K3l9j38
5010a58L62j09j70k0J9J64k09J29QmJ05L0J11k95J26k05J77K6J09k46J4n6K11
5033A19J64j92J01j72q4m2o6J96r5j1J80r1j76J91J13k73J57P6l0p7r6mJ30J54
$$ y = [71, -198, 85, -60, 124, 28, 19, -69, 44, 51, -110, 69, -130, -260, -32, -47, -53, -129, 32, -52, 141, 142, -60, -42, -24, 47, -158, -37, -65, 70, -42, -122, 90, 17, 68, 114, 61, 37, 103, 1, 152, 304, 83, -58, 127, 110, 25, -158, -120, 132, 117, 99, -106, 83, 14, -106, 134, -37, -76, 70, -34, 40, -133, 32, 32, 35, 161, 123, 7, 21, 96, -102, 109, -82, 121, 47, 75, -110, -179, 88, -189, -87, 160, -51, -69, 62, 52, -128, -66, 47, -98, -149, 29, -19, -6, 4, 30, -78, 19, -25, -188, -179, 73, -164, 28, 76, -84, 45, 25, -80, -27, 42, 11, 46, -8, -26, 7, -11, -107, 200, 161, 162, -72, 63, -75, -146, 62, 94, -13, 155, 166, -27, -14, -93, 126, -52, -56, -116, 96, -155, -115, 105, 27, -79, -1, 116, -4, 19, -20, -158, 204, 95, -75, -95, -76, 88, -121, 8, 16, 12, 117, 147, 258, -37, 89, -116, 61, 87, 196, -50, -36, -92, 119, 283, 91, 192, 20, -64, -106, -172, 24, -71, -82, 98, 7, -169, 22, 135, -138, 19, 95, 65, -12, -108, -112, 18, 172]
5057A72l19J50j91O3O9N5j28K3L49m21L73j63j9l0j26K34k98Q7Q2O8LK5q2J35
5081A11k02J15j65J11J68k55J04m7l5J51j10P1o7oP7J18j38K03n6k67P6J9Q9j99
5105a34K58N2k58p8J59j0p1o8K22m9q9NM2K1j83R1m1L1MP2Q6rj60Q1O8P7n4j02
5133c7Q4p6m4J46O8j60n7O1r5plJ13o9K27k12O8N4j78P7J07k07p1J10J65j29Q5
5159B0m0K17j58m0j55J61q8J08j48N4J26O5m7j3j11j63L17j5j81j31K45m0M3J4
5183D0J43k86J5L29l42l1K09o7m8P0nj16K35j92p4J28L2L9j04o2K10k23O8j88
5207b20K26N8m5o5m2K11j75O7j61JJ11M3j3m0J21J8O4m7Q0k20o0J62k42J55K64
5232B51k87J03j41J5J69L1Kq3L7j07k5j02J66J2M3N5m8k94J63n3J89qj11Q4oK7
$$ y = [172, -147, 3, -188, -125, -56, -1, -129, -106, 243, -178, 195, 32, 13, -17, -143, 91, -207, -120, -38, 30, 33, 58, -24, 111, -91, 24, -141, -30, 138, -117, -13, -60, -95, 56, -54, 17, -50, -56, 21, 139, 1, 204, 148, -119, -43, -24, 65, -134, 124, 176, -82, -160, -1, -11, -82, -150, 72, 23, -66, -61, -19, 2, -181, -90, -131, -100, -96, -24, 62, 53, -107, -26, 42, 119, 65, -37, 47, -29, -73, 73, 141, -19, -76, -15, -110, -117, -120, -7, -76, 151, -61, 7, 61, -117, -40, 67, -140, -211, -101, 64, -65, 20, -20, 197, 39, -1, -156, 5, -83, 25, -123, -69, 57, 122, 75, 62, -49, -212, 105, 90, -91, -222, 23, -17, 26, 40, 183, -103, -88, 241, -101, -132, 77, 10, -38, 32, 27, -89, 146, -46, -120, 8, 40, 79, -25, -87, 123, -100, -32, -220, 6, 64, 19, -46, -88, 123, -52, 15, -146, -145, -34, 9, -4, -44, 77, 95, 159, 112, 192, -28, -88, 74, -168, -13, 251, -36, 67, -74, -59, 110, 141, 143, 60, 97, -10, -35, -137, 29, 41, 84, 139, 91, -203, -40, -93, 96, 88, -23, 61, 55, 82]
5258H2r2j57J64o0J83j50K56k81J36j91J2J95m54M76k90J18okM8J35O3k19m4L24
5282B46k99J6J28j51l8K9K52l29K28N3r8L6j28J81j95K65j60J76k35Mro1J38k54
5306b05R9J85l7Jl7j1J35k18J38p6j72M21k33J3O7j20m9K15j25k4k1n1R4j99K24
5331A4m8Q9qj16O5qrj22M4K5K10j02p4K92k69R5K7j56R0K6k66K54l4j8m2J35j22
5358b8J91m3k89J77m9N4j10K88k68J0m6J95j93Q4O1j33J53j17K78k04k08K84k13
5381a26J13M3K49m62J59J53M8k81J1Q3J26j31M6J0k61J16J43K1j40K33l18K56
5403I1j55J64p2J50j49J65k55QJ60q0p0J59l02L34k28K2l7J49j6O0p6p6Lo9M0
5428h0k9K63o9j65j7J84J75k85q2L63k24p6l9K8no9J93k0j43K13j44J34p7j65
$$ y = [82, -10, -167, -3, -63, 120, -30, 226, -55, 81, -110, -98, 97, -357, 119, -171, -53, -59, -61, -13, 122, 185, -34, -78, 246, -53, -37, 91, -60, -98, -69, 183, -146, 82, 135, 37, 73, -55, 126, -69, 196, 36, 212, -23, -19, -28, -89, 49, -205, -106, 79, 42, 43, 6, -5, 130, -88, 50, -26, -198, 223, -10, 3, 70, -50, -99, 116, -9, -33, -54, -105, -11, -210, 14, -34, 55, 47, -69, -4, -12, -21, -143, -99, -74, 136, 34, -40, 252, -17, 78, 105, -51, 39, 65, -201, 53, 19, 1, -41, 94, -28, 163, 120, -169, 8, -41, 13, -97, 191, -77, -67, -113, 82, -111, -27, 34, -99, 54, -63, 215, 11, -197, 87, -126, -13, 30, 279, -183, -24, 129, 177, -104, -93, -10, 116, -15, 31, 41, -220, -104, 39, 60, -80, 153, -165, 91, -64, 100, 28, 178, 29, 194, -61, -53, 107, 27, -43, 116, -186, 148, -80, -58, -95, 54, 38, 98, 22, -54, -51, -120, -80, -109, 154, 85, -80, -97, 87, 262, -23, -105, 258, 34, -42, -81, -53, -58, -127, 66, 46, -97, 116, -28, 106, 29, -136]
5452a36j6O3L59l73J72k37K01j3q0Q3L6m7n8R9l5Km2L4J13k3n9M6J22j79l9k6
5478c3K6r5m1K59j48n8J81j52M4P8Nj65M2j7K40l06M1J35m3J4M0m6mJ39k08L5
5504c7MJ16nj07J52J2L2J3l63N9K85j63l1J18P4k35NJ67p8j16K12k06J21j33J70
5529F6L8k70L35l04K59q9j70K14J8j18R8j07J68j73Q8k26QJ44M3p1J23O5p7j8
5553D4r6p5k9J43r9J27j9J45k79QK08J59l17M1J70L3j82K44k74k1l8M6N1j40J76
5578B6j40J65j1m1P0l5n7l0J32l1o1K45k60K84l32L5J62L8j65N1r0J83j92J17
5602F3j43P9J43l03J71j79L18j04j22J34J2n4k0L6n6k9p6k3K22j46J86r9Q5j04
5626iK0j06L01l05J45q5M1R8k43K41j13pl4J26J5j6j40r4J75P9p2J83k5n6k43
$$ y = [-136, -152, -89, 270, -103, 69, -168, 33, 20, -60, 23, 59, 12, -46, 53, 18, 20, -22, 12, 125, 102, 43, 89, 211, 32, -7, -33, -7, -102, -143, 116, -32, -90, 91, -61, -17, 61, 66, -99, -57, -74, 166, -140, -99, 36, -7, 7, 47, 1, -3, 136, -72, -37, -33, 83, 78, -29, 123, 135, 167, 180, -183, -124, 161, -2, -33, 85, 159, -76, -71, 96, 18, -98, 114, -92, 29, -104, 66, 104, -166, 169, -135, 124, 35, -135, 79, 97, -21, 77, -30, 138, -35, 53, -173, -165, -21, 22, -49, 74, 139, 62, 44, -52, -127, -156, -13, -112, 15, -4, 141, -138, -130, 78, 237, -80, -39, 131, 164, -18, 226, -48, -69, -107, -61, -10, -150, 26, -114, 51, 40, -1, 69, 34, -23, -53, 79, 48, -13, 232, -28, 256, -76, -41, 121, 159, -6, 45, -45, 138, -54, 63, -80, -1, 142, -161, 10, -169, 149, 45, -77, 57, 69, 15, -5, 31, -25, -54, -130, -153, 69, -77, 109, 10, 95, -9, 11, -95, 206, -99, 46, -39, 2, 100, -143, 98, -15, -22, -56, 70, 85, 69, -71, -165, 10, 89, 17, 200, 175, 119, -124]
5651a24J46Q2j00p3R7M6J30j98j0J55j97J63k02K7P6j29J23J06j31M7K2Qk6J44
5675A82k26K46j41q9M5K3O9p2l8K9j4o6K9K3n5j6J62k8jq6N0J65k20P1O3j5k9
5702F1lm3P7k88K83K2m3k22J20L5O2N0m5p5nrR1JQ3j17j44K77j23qp2R3J9p8L3
5731C2j31R0K23j79k4j89J85j55K51k50pK22J15k45q5R6R5j93K10J0l5R4j90O5
5755Eo9O7j66K61j57L4Rj8P3J38k21J52l30K71M4j13j8L6J04j48N9m2J48j26M
5780cj03j9j8K72k07J76r6r6K31k08K3pj06J94m8O1J7K3j03m8P2L4J10k94K71
5805A28l1k47O2J95j82r2J89k18K03n0J7O5J4r4J8J9j01J22n1K39j07j93L8k4
5829h1K02j32q5J97j21j5K31o6j87J2O9K5LR1k01J4j71K13p4k3q0K32j80K82j70
$$ y = [-124, 22, 104, 4, -69, 28, 74, 204, 6, -4, 151, -46, 117, -85, -58, 18, -111, 12, 118, -13, 34, 56, 64, 38, 182, -44, 202, 61, -28, 17, 40, 109, 37, -1, 28, 14, -52, -23, 0, -55, -71, 91, 63, 62, -24, 26, 191, -29, 42, 105, 90, 61, 58, 15, 92, -196, 87, 109, 66, -156, -36, -1, 61, 111, 66, -9, -14, -23, 68, 69, 152, 35, -109, 168, 45, 37, -35, 58, 77, -1, 32, -99, -9, 214, 35, 11, -178, 7, -148, 103, -147, -154, 68, 183, -62, -147, -51, 44, -149, 61, 71, 36, 130, -60, 5, -64, 3, -163, 98, -59, -25, -16, -34, 39, 177, -44, 108, -222, 49, 93, -20, -38, -2, 102, -46, 13, -29, 119, -7, -3, -106, -125, -143, 129, -78, 98, 2, -94, 137, -71, -48, -55, -161, 33, -15, 46, 63, 86, -17, -65, 7, 41, 151, -143, 128, 97, -150, -88, 107, -75, -167, 22, -196, 7, -43, -26, 39, 53, -41, -23, -4, -105, 17, -34, 205, 98, -95, -57, -81, 121, -11, -96, 101, -20, -35, 196, 130, -57, -45, 24, 49, 52, 143, -58, -44, -215, -2, -76, -99, -179, 53, -127, 155, -15]
5854a5J29m0rJ37q5k9P7r7j49J26j81L24j87p9J11J0P4k89J70J2M4K2q6oJ0J06
5880A00r0N9o2K54k08p9L2l6J24rq6r4P8j6n2J15q9j57K81M3J51k81J83j83J89
5905A67L4l96J05P0j35J69L3j63K24k38J94j20J48k9l2qjqo6N2n1Q8j06O2q1L4
5931e4p8M5K79k76l5J95J35k72J84j24k71K14Q9rKk8J3k10K60N5j62j1J05J8j08
5956d4K26m7m4L3j81Q5j92K7K12J65r8j91J42k4K4j0j73j7K81l05R9j6q2J16n
5981a9K49k57j40J28J20l1j74j0J71k09K09J02k09R1Q6N0j47j71K18k7K4q6K11
6004A79k36J64j04%Nl4N5j52J5oJ80j4j32J00J04j76L81m00J37p0r1K57j59J98
6028B01j54k4k56K24j95M46j61r2J20K7j9p6J00j16On5j7K00k85J79j72K73p0
$$ y = [-15, 114, 74, 65, 202, 117, 88, 165, 68, -81, 45, -136, 188, 1, -78, 33, 43, 117, -172, -2, 10, 54, 76, -10, -16, -6, 100, 10, 69, 7, 261, 53, -26, 6, -30, 94, 85, -1, -95, -17, -33, -85, 30, -59, -216, 65, 108, 259, -22, 161, -22, 167, 201, -195, -90, -20, -155, 14, 47, -116, 108, -130, 64, -56, 92, 63, 31, 23, 22, 14, -52, 0, -51, 37, -69, -7, -88, -54, -132, -87, 192, -84, -119, 76, 211, -61, 123, -1, -272, -58, 31, 22, 24, -4, 9, -201, 59, 114, -48, -59, 46, 64, -44, 182, 135, 91, 124, -57, 28, -164, -137, 75, 240, 142, -49, 93, 69, 93, 83, -90, -107, 174, -131, -32, -48, -130, -14, -19, 230, -27, -167, -39, 81, 50, -124, -134, 37, -172, 37, 139, -70, 21, 107, 157, 10, -161, 57, 30, 54, -32, 179, -57, 107, 3, 3, 8, -26, 29, -123, -108, -114, 66, 52, -80, 20, 124, -52, 329, -71, 66, -4, -95, 162, 3, 201, 47, 23, -233, -9, -204, 242, 81, -11, 109, 136, 117, 41, 141, 25, 31, -24, -41, 159, -126, 53, -119, 154, 84]
6051H4j69l9J34j32R5M8J01j92J21J01j46rJ37R9l44N2O8M9N9j53J12j87L5M5
6075c1K8R6N5j03k1j32Q6J4J60j17l4J99j13M9m2j99O1k8K40j59L0J05K1j72o5
6100g2K60j37J27j33R0k7n0n3J21q6J94j64K2n3j40N6R1L9O6j69J57o7j1r0K40
6125B11l00n8K88k97K12K2j41M6J36j91KJ4J33p8m5J20J63k23j23J11j00K48k18
6148f8k0R0k04K4J58q1R0j6Mo1J97k72Q2J02k38K01K3j35J19J0j17K8J17j41J54
6173D6j72O3k8J63j38K2K49k33J19j36o8J67j14J89k19L8R3jn1j59J17J47q4P5
6197H5q3Q4n1j13l9R5K30j50m0K5nJ79k86L6J05j09J34r4J03q9OJ76k50J88k74
6222a37R4Q1j62O1l8L8J62j55J24j5j01j70K57k26O8J90o2K0L2l04K63j98J87
$$ y = [84, -85, -124, 10, -122, -27, 21, 122, -70, 51, 152, 6, -3, 134, 233, -111, -59, 9, 58, 117, -36, 76, -111, -76, -31, -3, 93, 148, 45, 24, -108, -22, -8, 152, 35, 1, 200, 87, 136, 94, -105, -44, -72, 168, 9, 39, 144, 165, -7, -72, 188, 51, 178, 45, 135, 108, 58, 5, 126, 40, 234, 70, 92, 39, -101, -45, 46, 85, 151, -18, 139, 72, 61, -29, 211, -89, -147, 141, -156, 56, 78, -63, -17, 119, -72, -70, -56, 77, -1, -46, 74, 237, 14, -109, 2, -98, 150, -68, -88, 2, -202, -178, -20, -101, -11, -27, -23, -84, 113, -159, -77, 25, -213, -12, 11, -124, -5, 5, -112, -84, 33, -108, 46, -126, -63, -91, 72, -66, -44, 205, -28, 91, -45, -113, 54, -60, 129, -90, -52, 41, 40, -11, -170, -53, 94, 10, 85, 2, 86, 35, -78, -117, -22, 208, 58, 18, 43, 38, 217, -69, -33, 72, -37, 97, 3, 106, 17, 23, 199, -51, 137, -137, -43, 38, -124, -63, -101, -63, 99, -56, 68, 53, -48, -218, 39, -187, -119, 71, 9, 29, 61, -243, 20, -178, 9]
6245IK3rn0L4J1P9R7k69J62k71J02J61o7K0J29l4k6j91M0J51j34J40r7l2P8j12
6271e6L5J25L7k81N2J52L5n6M9k85K14J1J21j70l2N0pp1P6K01j32l7M6M8j53J21
6297I3j09j9M1K9O0q1l11L64J11k99K42o1l3k78L41k27O2L9J40J76l26J93r2n2
6321Cq5L7J31j35J33%k01k9J07J24l5q0j6o7j9J43n7P6K4J06l77L28k21L0k44
6346c24L00J31j26J2J86q6m2j3L9j01P4J04j95k0j20L06j84J26j14L4O6J7j99
6369a29N5K9J0K1K41k81J16j84J7Q4O0q5J87k9k50J99J7m8jJ7p7Kl6L43l44p3
6395a39j16K53k7q3P5j43J36q1J12J88k40J00j12Q7J6qJ0j59J64J52j03k24J06
6418c6J00n1j11J03rr1J26k26M0R4mJ46r9J00j20O2K6l4R2K4j39P1k2jL9nRj18
$$ y = [9, 32, 23, -27, 7, 18, 97, 194, -75, 87, -184, -82, 79, 12, 32, 161, 127, 101, -90, -50, 101, -33, 107, 10, -22, 56, -56, -21, 104, 141, -140, -88, 64, 99, 43, 92, -193, 21, 32, 153, -17, -49, 1, -6, -77, -1, 200, 68, 31, 77, 125, -28, 93, -16, -35, 6, 35, 95, 14, -297, 67, 178, -121, 121, 60, 27, -251, 90, -137, -75, -36, 104, 280, -46, 147, 55, 3, -82, -45, 86, -49, 84, 84, -117, -146, -39, 85, 50, -30, -46, -113, -132, 11, -46, 30, 54, 160, -217, 111, -110, -80, -324, -24, 107, -19, -7, 179, 93, 51, 38, 77, -24, 50, 154, -41, -61, -181, 125, -59, 67, -47, -13, 53, 70, -129, -74, -45, -35, -14, 227, -54, 62, -122, -105, -21, 39, -46, 141, 112, -138, 61, 78, 30, 29, 46, -31, -29, -65, 278, -66, -139, -255, -2, -29, -112, -37, -180, -44, -125, -13, 175, -65, 35, -77, 10, 26, 18, 28, -131, 33, 185, 82, -142, -36, 64, 13, -98, 5, -4, -95, 31, -195, -155, -61, -65, 81, -18, 82, -38, 24, 50, 16, 108, 132, -7, 64, 42, 41, 80, 75, 84, -34]
6446c4j7P2J32l85K24o1q7J36J29r3p6LL01j04j30L5j82PR5o4O6K61m30R6K47
6471A41j12p7J50j31m8J29j03n7J75M1q4l4M9M9k7j88J81o2J55j38l01M44k13
6494f1p7K63k07j05J83O4o5m1J48p3r6R5k16L29q9j6j7o6J72j15o2L9O9j25%Q2
6520A3N7m0j7L5qj7j9mJ55k79O6K06k11K95k00L8Qj12J20k80K03n5l7K10j62k6
6546f1J84p9j95J52N6po4lo0J17j76J17j38K20K7J7J8l04J78L0k3j7M1K00q5n3
6572I2k22J26k02J61J17p3k7N2l8l1Q0r0O2P1j56J9J68j66Q5j47j3p6J38O8j14
6597a16j37J72j10K40p2l8n9N6P9j45J85R2k83K82r3j10l9MP7n8J32M6q3r9J73
6622I6j21m3J04R0j67P5R2rn5l28L78j57l4M8Q1O0n3l9L4K1k64K12O6J2p5R6j80
$$ y = [-34, -51, 21, 153, -232, -8, -69, -156, -20, 109, 16, -60, -57, 244, 140, 10, 45, -137, -130, -35, -99, -33, 228, -202, -106, 141, 29, -48, 102, -29, -77, 52, -51, -108, 67, 108, 24, -10, 39, 88, 61, -127, 54, -8, 147, 9, -292, 152, -61, -138, 125, -82, -187, -4, 60, -5, -46, 102, 29, -67, 28, -188, 141, 52, 36, 19, -47, 125, 10, -52, -13, 56, -69, -69, 13, 70, 30, 13, 48, 40, 23, 4, 0, 155, -124, -58, 148, -63, 232, 32, 70, 78, -34, 86, -194, 9, -46, -83, 127, -35, -61, 123, 44, -151, 1, 57, 50, -14, -17, -77, 40, -136, -19, -157, 63, 90, 107, 125, -179, -1, 29, 6, -11, 30, 230, 145, 92, -130, -4, -206, -45, 72, -1, -28, 24, -14, -45, 35, -55, 7, 78, -78, -59, 109, -57, 28, -119, -132, -208, -70, -2, -116, -253, -81, -191, 49, -23, -61, -120, -64, 15, -130, 55, 147, -136, 146, 53, -57, -96, -92, -15, -73, 59, 105, 22, -77, 96, -25, -68, 36, 126, -41, 34, 126, 117, 62, -266, 112, -45, -79, -31, 50, 110, 57, 18, 52, 73, -191, 21, 87, 99, 24, 120, -60]
6649f0j55J2L44r9rM9R3j89K26j03j22o1j50M40r7j79j32L43j79j69M80k52j76
6672a45R7J68Jk4k49O7L9K8k2mM6J6J1O6j73J65j79L27k16K40k51j39JJ8J60k26
6698a78K64K1p3p3K3Np4J35Rj40j07J30J11n0J68j67P2J7j40J89j54KQ3j1R2l58
6724b04K11l7Q2k51K54j88M6J02j23L8k9J78oj16o9J97j06J05l3J5p5J21k04j47
6748b39K36j39K46Ll8n3p1R3r0J24j70Nk0K50j87J43K1j28nl6K51mq2J7j15J7
6774B9M4j34J32R9j56j1J75j55M9P0j93l2jK04k68M6J62k06K21k12J64k8l7j1
6798d9L2J22p9n3m6p5J46j0O6k46Q7J18O9j39K68j79j38p7JL2jL39j90N2r4n4
6824i8K21r9l04K76J32l19J56J31j55M2J74l00J06j7o9J15j29J63j27N4Q7r3l0
$$ y = [-60, -215, -203, 141, 42, 33, 82, 175, -14, 212, 109, -13, -74, -224, 216, 119, -60, -192, 151, -28, -197, 283, 31, -145, -48, 120, 121, 97, -152, -85, -46, -18, -40, -44, 2, 18, 29, 95, -78, 87, -92, 235, 19, 259, 8, -131, -130, -112, 48, -178, 86, 107, 34, -39, -16, -11, -85, 50, 59, -81, -188, -58, 53, 3, 171, 4, 76, 93, -47, 142, -12, -10, 73, 62, 154, -204, 7, -30, 52, -199, 55, -133, -87, 15, -108, -70, -99, 79, 73, -43, -112, 85, -21, 84, 51, 66, -9, 112, -92, -239, -3, -142, 104, 107, 69, 16, -55, 38, -52, 72, -98, -93, -113, 137, -50, 93, 114, -14, -19, -55, 196, 192, 110, 127, 12, 29, 73, -61, 71, 170, 14, 3, 178, 23, 72, 142, -51, -83, -84, 120, -148, -102, 60, -146, 75, -137, 27, -1, -38, -49, -17, 105, 26, -27, -73, -148, -2, -12, 54, -192, -105, 13, 82, -57, 211, 32, -106, -183, -182, -150, -151, 188, -2, 50, -44, -98, 123, 24, -280, -4, 128, -191, -35, 96, -59, -17, 157, -143, -37, -54, -123, -8, -137, 26, -101, -47, 40, -53, -83]
6847h3L4M7k7n0J36K5q3o3o1M7O3j29J92J9m9j69KJ05n8r4K63P4l34J85Lj22j9
6874a46R3J10jl7k04L12n3j25O3j68J98m0k4N0n6j06K90k21J20j69K64O0j71K8
6898F7k19K61j29j55N8J28j63J73L34n03Q3J17j13j93K34O4m3J0j66J12%J5j16
6921a44J65k8J03p8J2n8oK75l01K87j05j52L7K4j60O1l7P1M1j07L73k87p1K68
6945A83k78o6J92n1Q6r7P9k6J36k24MK11j02K7l7r5J00k96K72O6k11N3Q2j6J90
6970A82k95J06p7J29Kl1j40K11o3p2j14K85k12J82J5k49J88j6J8j65J51J4j9o2
6994c2R7j36J38k15M0K2OJ43nL4j99O6j31J87K0j55L8O9K65j96k2j69J25r4K18
7019A14L7l32K90r9J0M0j65O5n8J24p3N2Q4j51Q3J22l07J07j53K26j66J97J3j13
$$ y = [-83, -49, -2, -29, -79, 57, 82, -1, -64, -125, -78, -15, -144, 48, 67, 18, -151, -149, -44, -102, -196, 67, 141, -193, -8, -5, -127, -146, -53, 57, 56, 19, -185, 127, 74, -51, 12, -156, 42, 2, -22, 28, -28, -134, 156, -65, 55, -114, 150, 210, 39, 67, -152, 109, -20, -175, -117, 11, -152, 21, 355, -148, -65, 52, -61, -254, -20, 44, 1, 11, -155, -43, -43, -28, -144, 21, -7, 96, 18, 30, -28, -34, 241, -60, 227, 122, -30, 7, 31, -129, -68, -105, -34, 7, -100, 273, -14, -85, 183, -95, -161, 31, -20, 66, -31, 48, 22, 158, -66, -62, 149, 47, 74, 37, -58, 42, -254, 18, 84, -127, -74, 8, -8, 182, -113, -7, -84, 45, 47, 16, -124, 87, 24, -48, -162, 123, -89, 93, 108, -141, 47, 31, 49, -116, 35, 49, 30, -32, 65, -71, 67, -148, -108, -86, -80, 63, 58, 92, -107, -41, -172, 15, 35, -120, -82, -13, 252, 56, 34, -135, -10, -104, 114, 151, -181, 109, 10, 20, 60, -105, -40, -98, 26, -47, 5, 89, -62, 21, 143, -164, -57, -210, 16, -150, 47, 60, -53]
7043e3j27K25K2q2q4O0n5N5J04j81R7J91l30K09n0k2p0J50m6j04J07r0m8J39j20
7068a03K9mJ66J8j96p4K81j66n0J56j00m3m1J34oO5k63M43k26Jj42J49O0M8k45
7093a09K87j57j95K08o6p4J55K8k06J91Mk13j4J43j44L00rq7j21J37Oj46J15J36
7117A69n6Q9j2j40j49J53j25J2J8K7q9J49n9mQ6q4N9j10j32K35k2L6n9KK31j84
7143D1q8O1M2n3k8J95k04k0OJ78k31L4J88J26j96J49m8k29J65o7j03P6J54j01
7167D7j58K93k97J78j4j16Q3j1q8QJ27j42o3K63K6k81J22M2Ml7O8k01J69j7J3
7192A8KJ04j91PQ1N7p0R6%j58J8nlq6P4N1l5J27j63J80j53J42n7k58J73q2J50
7219A9P4%k7K9o6j5P1r8k4k12L65j17J52j78p1N8o6J21o6K60l5k18p3M4J41p0
$$ y = [-53, -180, 45, 67, -15, -99, -39, -94, -39, 65, -116, -19, 172, -158, 51, 1, -21, -91, 59, 13, -91, 16, -74, -122, 17, -103, -74, -78, 88, 106, -90, -164, 117, -49, -99, 57, -43, -86, -127, 7, 1, 66, -197, 246, 20, 21, -121, 28, 88, 136, -109, 178, 21, -174, 34, -32, -106, 49, 77, -129, 62, 66, -147, -161, -18, -162, 138, 129, 42, -79, 58, 64, -82, 33, 169, 113, 202, 190, 50, -99, 54, -71, -59, -41, -14, -103, 46, -13, -17, 69, -15, 44, -66, -198, 37, 15, 51, -8, -6, 225, 41, -47, 14, 56, 3, -25, 170, -34, -54, -48, 130, -101, -67, 121, 247, 51, 200, 152, -77, 88, 21, -82, -6, 148, 47, -111, 182, -115, 63, 49, -67, 16, 5, -83, -75, 52, -90, -153, 110, 136, -145, -23, 19, 23, -14, 54, -147, 22, 5, 18, 20, 124, -67, -60, 21, 78, 8, 104, 104, -54, -36, -41, -44, -130, -56, -5, -40, 87, -76, 104, -49, 93, 36, -222, -49, -131, 19, 93, 93, 66, 95, 29, 14, 85, -13, -37, -249, 116, -1, 151, -27, -98, -40, -106, 15, -51, 209, 174, -44, -117, -73, 68, -2]
7245bJ86m56K37O0k9P5k5o4R8J36j59l8L8p4p0nM2j41J19Q6m9J73j18J46r9k25
7271a58J22J6o8Q6M5Q1j86n2J9L2N0l2R2r9rJ18K9j50L0n9J11kN6j01p8O4J21
7298G8j48J70n4k4j64J53J9l6l4n4M4J83k18J85n9K0j26N2K35m27K19J52l61J39
7322e6P8M0k59J22J75l07R5Q9J33j40J07r2J02R1j56J36J24l65oK3J32j74J27
7345A9m0j19J46J9J1j22J6J71j89j37L54p7m2K85k76Q1j07J8J97j42j23O2K85
7368B90k17k12R3K55k80Q6P1j09J01j8j07P9p1K16k70m1R1J16n8j85N1N5J04j51
7392a11J93k3k10n1J92p2J73j63J18qj13J75J81m22J48pj52J42O7j80J31n4J33
7415H7k04J30j90J71M1k29O7J39j31M8P4J12k33j16L02k39o3K03J1M6q2K35k11
$$ y = [-2, 184, -272, -35, 25, -4, 71, 46, -18, 80, 216, 57, 19, 57, -17, -87, -92, -50, -191, -72, 14, -35, 138, 20, 166, 67, -158, -36, -20, -88, -2, 43, 124, -62, -114, -95, -63, -13, -45, 47, -52, -61, 57, 86, -64, -34, -93, 18, 16, 72, -29, -107, -43, 78, -70, 100, 46, 22, -142, 11, 30, -6, -40, -94, -50, 133, -85, 100, 41, 61, -65, -13, 222, -205, 14, 166, -195, -56, 22, 62, -197, -75, 100, -207, -112, -23, 110, -30, 77, -15, 87, 178, 22, 158, 282, -83, -89, -66, 66, -108, 19, -21, -140, 6, 25, 36, -86, -70, 101, -88, -225, 129, 52, 10, 295, 19, 100, -7, 11, 208, 66, -57, 5, 290, 73, -139, -46, 209, -71, 15, 86, -23, 78, 60, -47, 32, -39, 177, -93, -134, -43, 73, 15, -170, -119, -64, 40, -111, 82, 59, -151, -202, -10, -82, 91, -72, 46, 38, -75, 100, 281, -141, 7, 0, -152, -10, 57, -123, 8, -46, 87, -117, 13, -177, -6, 35, -194, -127, 12, -119, -71, 3, 115, -118, -234, 68, -171, -234, -31, -20, 26, -56, 179, -32]
7438c2p0L8j65K22J58p7P9j97M5n7K85k61NK23j7j91mO4Q1j7n9l9p6J1J36k15
7464a30K84J4p0l44O3K32L1m8k4K6O2j87k3J74k3k31L13r5p1km5J79m52M69j07
7489ej32J83J41r3R8p5j76k4j9k9J00J26j22K28k15K6j42K92j05J7n0j10K5J52
7513I1j10j50J14R9p8L7k7N1J9q7m9m9L26k34PJ78r3j27l6K16j24J4m5K02l22
7538a77J71R0K1Rk20J22J88j56k85K36m0J73k84K31q1K8J8p5j5K11k17l7K09Q6
7562B06k63k0K48j92M5M3Lk05J15K29k50k23L30j09k3p8J41nK5J52k70K05j20
7585a6K9j61K74j53j84L62j31L3k30J51j15N7J85k26J38K02k91J11L3K0j51J89
7607A26j55O6k66L55p7r0J14j47J89m14K48M8R2n4n4qJ33j53J98l6j87J45J24
$$ y = [-32, -102, -64, -229, -7, 151, 74, 153, -44, 1, -56, 229, -32, -27, 196, 179, -12, -16, 48, 129, 112, 53, 14, -62, -51, 85, -130, 154, 168, 98, -246, -183, 49, 80, 32, 8, 34, 96, -91, -114, 60, 37, -194, 119, 24, -47, -49, -94, 85, -367, 102, -5, -137, 46, 187, 94, 192, 117, -59, -83, -102, -131, -31, 95, -27, 201, -14, 12, -130, 162, 57, 74, 24, -86, -61, 91, -19, -169, -55, 44, -34, 3, -24, 27, 46, -41, -90, -139, 187, -47, -40, 138, 45, -82, -118, 98, -26, -12, -57, 145, -177, -6, 84, 105, 114, -106, 16, 204, 48, -237, -1, -41, 132, -152, 79, -2, 26, 44, -31, -46, 165, -52, -89, 120, 206, -57, -77, 171, -21, 24, 67, 70, -135, -20, 209, -41, -264, 66, -43, -66, -144, -3, -8, 17, 169, -101, 104, -16, 13, -148, 126, -27, -211, 151, 20, 53, -177, -26, -141, -84, 101, -125, 13, 215, -76, 35, 68, 88, -63, 126, -29, 37, -229, 126, 49, -41, 73, -74, 115, -299, -51, -3, 89, 35, -19, -27, 106, -47, 151, 115, -72, 73, 197]
7630A97j41j91J58J44j93K2J42j88M7K44l91j8K17j07k6K20p0J6k01K33j52J63
7652A25Lm2J03j56o4k6LN8L0j9oJ2OJ2J13k33R7lk04L69j51p9P8r7J49j10Q2P3
7680A23j14P1j98R6J00n9l21L02N0o0L7k6r6L4K88l53J0R1P4j16k7l6K35j1l3
7705F1L4k19M1J49m9J74j67n7J15j53J04L5k04J4J16n0J71k94J94K0J98q3k50
7728a00K79k47Jkj3O3j6K66j91r5J49q9j71J23K75l22J16M5k2j5M5J6j3l3j44
7753i5J26O7l6j34M2n1Q4M0j08Kj31J97J28l49K73J62l24j59L59q7K3o7O2j33
7777a09j78K75JJ0OJ32j37J04N4j95r7M8K25k25K34j29j11K08j30p9P8r1N3J18
7801F5k52P3K14j52J32j48R2k3K1p4J02l0j3N5j85O9J24N5j55J13j94M4Q9J4k9
$$ y = [197, 56, -135, 23, 167, -26, -4, 138, -50, -3, 241, -150, -168, 49, -58, -84, 136, 66, 82, -119, 114, -38, 125, 128, 86, 189, 33, -31, -57, -54, 4, 34, 15, 9, 21, 27, 39, 152, -81, 16, 13, -191, 178, 27, -52, 26, -71, 78, -32, 50, 123, 9, 80, -118, -22, 78, 19, -302, 0, 50, -10, 27, 1, -95, -61, 227, -126, -116, -25, 49, -67, -94, -130, 105, 94, 61, 95, -124, -83, 66, 17, 191, 24, -33, 82, -71, 33, 68, -136, -122, -6, -56, 115, -179, 15, 35, 233, 150, -100, 179, -68, -67, -69, -82, -19, -35, 231, 40, -55, 94, 5, -166, -43, 232, -90, 26, 71, 49, 34, 79, 95, 82, 49, -95, 31, 98, 62, -72, -30, -81, 3, 43, -65, -63, -194, 3, 131, -218, 55, 217, -107, -266, 93, 6, 29, -38, 24, -109, -287, -12, -11, -1, 5, 137, 0, 104, 158, -37, -134, -86, 139, -86, 148, 19, -92, 116, -14, -93, -15, -106, -53, 65, -187, -114, 100, -52, 80, -68, 24, 1, 22, -52, 50, 20, 7, 62, -123, -54, 70, 125, -30, 83, -111, -67, 22, 36, 7]
7826Gk06M9j11K88m9k25M22j67m4M5k4l9L7J90j93N9K1l9pL0n8o9n6J60o5l2P9
7853Ck4M6j57R5p5k5J78O3j07L4J38j81k8M6j0J34k51K09j74j02J54P0q2MJ41
7878I9M5k27p0K61j82Q4J0J3O9o2n0M4j77J90j25n4K34j8j75K42j84L9n1J8J3
7903a4j4M3k27K43l9j1j02K90l25J51j30N2r5K2L13j56J08j17J14PJ7j39K3L2
7927D6M8j39jO8J02j16j44J11q7L8o6NJ48o9N0K18j05j67j24J80N3N5j0l3q1O8
7953D8m9k1M4M8k93L27n2o7J04R4k18J0J58L2j78J46j79K34j87O6r2j98P9J53
7977Im4Q7k3l7R9k12J75j01kp0K7M2K5k18L65n3j8o2j66J83R4O4j01p1J10j08
8003fpk03K03j8k22K34L6l3J6O4j81R8p1K02J18k34J34n2k31R2Q9j12R8j19L24
$$ y = [7, -199, -150, -261, 27, -22, -247, 175, 8, -36, 9, -15, -54, -17, 173, -20, 39, 60, 21, 14, 44, -14, -83, -139, 21, -44, -76, 3, -21, 25, -132, -37, -112, -137, 41, 104, -3, 31, 169, -12, -40, 6, -4, 130, -121, 88, -86, -188, -34, 36, -46, -42, 99, 144, -83, -153, 108, -74, 10, 20, 33, 102, 40, -10, 34, -143, 47, -78, -132, 102, 84, -91, 151, -33, 6, -45, -27, -14, -28, 15, -212, 31, -8, -19, -121, 169, -156, -5, -135, -83, -178, -156, 157, 1, 109, -8, 106, 113, 130, -9, 14, 46, 94, -45, -46, 22, 124, 8, -136, -25, -112, -74, -140, -135, 13, -56, -6, 212, 107, -60, -184, -4, 49, 104, 94, 61, -20, 48, -1, -22, 22, 70, -223, 104, 52, -15, 89, 183, -35, -25, 133, 165, -13, 133, -46, 188, 1, 67, -25, -223, -144, 9, -35, 52, 29, -8, 91, -121, 54, -47, -49, -119, -92, -50, -25, -243, 122, 69, 51, -11, -177, 6, 100, 164, 63, -8, 102, -6, -13, -216, -13, -31, -253, -19, 17, -16, 0, 64, -117, -19, -90, 112, 230, -4, 130, 78, -153, -61, 28, -84, 14, -105, 219]
8028B19l52J19M7q4J02j64K68k05r1M9J04J2j05K2L7K04k06N7JK7p5J02q3k5K57
8053B37j85k71J64M4J62n9j28J61j41J68k87J57L8p9K22l13o5K10P3J3m3j19J49
8076A08j55Q6j07J90k1P0j74l6L1N2j34J06K6M2j47l7J47j03lKj41J30J05o4M8
8101B1OM5j12Q8n0J8k3p9qO5K2o0J24J92j33j39j06K44Jj06j65J37p9J80q6j09
8127a12J83r0J5J83k14rJ3R8j11J44Nj96J77M2o2k1j44J25j64K02j90J34K7L5
8151G0r7J95k75k2J78j6o1j72L55j77J77k69J64r5P6j2k15L32p5n2n3K59k46m4
8175g5J98n1j40L36k40j03K8l6J21r6J43j00K3J27k66K25
$$ y = [219, -133, -14, 33, -51, 51, -113, 155, -50, -141, -92, 12, 24, -81, -59, -22, 182, -24, 33, 34, 61, -14, 88, 5, -20, 237, 52, -219, -55, -11, 151, 92, -36, 125, -16, 152, -135, 22, 60, -19, 203, -110, -175, 35, 108, 121, 78, -41, 108, -47, 39, -68, 122, 101, 171, -3, -39, -8, 44, -90, 16, 42, 84, -63, -100, 47, -56, -59, -57, -198, -68, 37, -27, 21, 27, 72, -40, 48, -2, 16, -7, -86, -94, -29, -7, -67, 57, 249, 116, -23, -129, 115, 116, 10, -155, -18, -97, 83, -3, -112, 71, -19, -4, 179, -35, -44, -31, 67, -44, 100, 105, -91, 86, 128, 66, 45, -99, 26, -138, 64, -126, 8, 35, 70, -27, 168, -107, -129, 49, 33, -28, -200, 155, -22, 155, -114, 50, -45, 31, 19, -196, 136, 61, 9, -44, 215, -31, -75, 123, 72, -68, 268, 28, -75, -47, -83, 38, -58, 85, -15, 8, 135, -131, 94]
8191I4
$$ Imaginary data points
##PAGE= N=2
##DATA TABLE= (X++(I..I)), XYDATA
0@%%%Qj6Q%J6l2K4k4M0n2N6o0P6r7J13j27J49j80K06k32K66l07L51l96M45n01
29b66N65o37P13p92Q81r83J095j210J337j485J649j822K009k224K469k739L038
46A598l384L790m257M802n461O278p306Q632j0427J2998j6940K3614l6868P2200
60D9269l18543p84295J293614O60621j326126m11741J314604J90837j191859K9078
70d94541J065088k05203q85102L23376O84980m14377m84033M29758K79306m11138
80a11886r3970L31648n5951k00278J93590N7263k67986R6511K78544k63862k44362
91b80739M03710J62985n15395n0571N84621p5581o03779K15430N86048l45464
101H1265n28198M62911M38452n62077l28638O26608J92735o56609l8814O57142
$$ y = [0, 0, 0, 0, 8, -8, 0, 0, 16, -16, 8, -16, 24, -28, 28, -32, 44, -53, 60, -67, 82, -98, 108, -124, 142, -165, 186, -210, 235, -266, 299, -338, 375, -417, 464, -519, 576, -634, 703, -782, 867, -955, 1054, -1170, 1299, -1440, 1598, -1786, 2004, -2253, 2549, -2912, 3366, -3940, 4692, -5735, 7263, -9677, 13937, -22931, 49269, -269274, -1053569, 240045, 900666, -425460, -837201, 477403, 668240, -523619, -494541, 570547, 365344, -519758, -196382, 488598, 74221, -409812, 19946, 299252, -111886, -205856, 125792, 69841, -130437, 63153, 120416, -147570, -51059, 227485, -36377, -280739, 122971, 285956, -229439, -280010, 304611, 229030, -374749, -159319, 426729, 81265, -446933, 15978, 454430, -107647, -436285, 190323, 383058, -273551, -312365, 344777]
111C44777j11691o18234K44969N34135l56641m13476M42720K74343m93246j34296
121b86640M98961n404m71993J30771M19520k30055l38114L11008K44095l68616
131i6467j45947L94934M2994l87835O4350L58416j60148l08710K28565K30156
141B20308k73795j38348K92071M6105k78081L8998K38551j07225j79891J56195
151A4888J12367j80782l6092J86969m0825j80911J04665J51918j62612j02480
161a32895K13484M3301k48678K5856K61200j00663k48829J76918K16654k42543
171c6195j66953K88993J00101l19037l1585L28079l4038l14527R7530K89025j53397
182D7996k55193J96611K12782k26027j59027K45815R9009k54751m3219K42644
$$ y = [344777, 233086, -385148, -140179, 393956, 37315, -376161, 66559, 340902, -152344, -286640, 212321, 206917, -265076, -134305, 285215, 55160, -282954, 28054, 272149, -96467, -242414, 152520, 195514, -192321, -127971, 230445, 70297, -238413, -9848, 220308, -53487, -191835, 100236, 146341, -131740, -92742, 145809, 38584, -141307, 14888, 127255, -53527, -89619, 97350, 56525, -124386, -19721, 132197, -30415, -132895, 80589, 123890, -124788, -98932, 162268, 61605, -187224, -10306, 206348, -36195, -203148, 85845, 185946, -133091, -164676, 163403, 129365, -185162, -87632, 201393, 47996, -207197, -10586, 202196, -23831, -182858, 62957, 161966, -92785, -136004, 106640]
192A06640j2133k12938O2166J72702r5267j20770J11828O3989j13337j2224J00158
203E0814k9918p3671O2426L9733q8457o941J02794k6248j04111O3685R9332r9971
215a0533q6985J29105O1581j53024k6699J68755j1361j69120N0277J54626q7105
226A9517j30676J15454J00945j29862o5686J33998K9762j33235L14J25555k5214
237D0872j09819M9270R0995p1103p0318Q5026M2732r2615j0170R4843j8755q4400
249e3442M4767O4032o6066m0130P7742J5273p8342P356P0956k8760o1348M3620
261d342N0529n1081l5211N9504K0147o5014n807O4356j3186o0420L2229N1339
273D3043m8537l5812N9212J5691o2981P016O2435k3769n3400L5485L8790m6089
$$ y = [106640, 94507, -118431, -56265, 116437, 21170, -99600, 12228, 76217, -37120, -49344, 50814, 20896, -52775, 9651, 49384, -39073, -46014, 56780, 30532, -73579, -9894, 89438, -10533, -97518, 31587, 93168, -59856, -86555, 82200, 70839, -98281, -48004, 106622, 19517, -111159, 4295, 105240, -24622, -90308, 43690, 73452, -59783, -59469, 66086, 40872, -68947, -19677, 71318, 215, -70103, 14923, 57655, -34960, -45130, 49713, 30958, -53442, -8675, 55357, -10709, -50839, 26903, 42176, -36166, -28810, 42146, 13386, -47962, -4342, 46187, -4894, -40105, 19399, 39546, -25468, -31275, 33081, 19895, -40525, -8296, 43043, -5494, -41306, 17906, 33597, -29384, -22368, 40067, 16298, -37102, -1617, 37173, -8916]
285h916k7958M8420J8071m6226p352M5041r30m2745Q548L7539j6394k9570K5308
298B836J9288l1461p100L0985p967k6490K2406K0212k9165q688L1102m351l1897
311b0290J0890K7004j5161k1204J8662J7536j9949j5281K0641J2572k1872o685
323a3137K5893O74k6641N805K2190j4826j6464K1284R089k2760j079K0064p135
336B957j6913R622J2938p693p788P492P274o229q067M987P957o199p062P994L230
351D500r457l36O991k889j490O920j396m452N720j79r561K986P007o580l776Q219
367B227P21o983J595M175j125q12K61J896K297m043l888N000J308p873K161R034
383E951m732o154O741K062p181Q48M374j866Q8J075l100J539L794m950k349Q118
$$ y = [-8916, -36874, 11546, 29617, -16609, -23961, 21080, 20150, -22595, -14047, 23492, 7098, -22472, 2836, 22124, -9337, -16437, 14548, 6581, -19909, 2497, 22709, -6456, -15144, 15958, 11607, -20290, -9400, 17604, 2443, -18761, -99, 17437, -2512, -17793, 2848, 15420, -6452, -13137, 12756, 13430, -13211, -7406, 14784, -42, -16506, 4778, 13867, -8893, -9972, 10092, 2957, -13956, -4334, 8604, 911, -6877, 615, 7889, 1660, -6407, -1420, 6537, 338, -6724, 1270, 4500, -4957, -5293, 1698, -1191, -2681, 4239, 2843, -1609, 4111, 3932, -5629, -2643, 4364, -2216, -5992, 2227, 2948, -4035, -2440, 1735, 610, -202, 59, 1955, 4252, 209, -3679, 1321, 2629, -5244, -3083, 5951, 1219, -4935, 1806, 3868, -3313, -2465, 1909, 43, 131, 1206, -1894, -355, 3439, -1511, -3860, 4258]
399D258N79p280J769N021l291l422R94J531J412j721l072L640L608o350j903Q557
415D330q56p168N715M241q296r07P188m173n789O890L143p360m66N857l94m932
431b977K31N495K402o263k525Q907k7j2118K342J2166o812r669J0811N586j2855
446e306k26J1396m357q525Q249N398q886k582P882O02p609m71Q676Q86j0041L74
462d540J1885m576j3096Q776J1628j2987o705J6634L90j7038N513J3736j0765
475a145r169J3876M227j4215m83J3203k555j2102M585J3247o108j3119R728J2445
489A2415j5125j1123J9607O111k3394J198K4991r656k2697J6964J7755k1772j0400
502a5126K4414M046k4668J547K2815o026k1239J0043J9929j3270j7566J7501J3910
$$ y = [4258, 4837, -2443, -674, 4347, 1056, -2366, -1372, 159, 1571, -150, -3222, 418, 4026, -2324, -4227, 4330, 3474, -3694, 2021, 6262, -2034, -2941, 4247, 74, -5715, 1175, 4318, -3042, -3508, 2349, 1955, -2977, -2746, 2749, 5151, -1112, -3637, 5270, 5243, -6875, -4533, 7633, 821, -8848, 1963, 7549, -5306, -5532, 5864, 1507, -7018, 1231, 6629, -2257, -4839, 3043, 3645, -3964, -4435, 4241, 5127, -4914, -4540, 7345, 2769, -10327, -1551, 10077, -2910, -9615, 7019, 7409, -9629, -4116, 9620, -1145, -10314, 3562, 7789, -6426, -6909, 6294, 3739, -8363, -3778, 9469, 3361, -9758, -30, 12415, -2710, -13833, 5774, 11885, -11509, -10311, 14680, 5024, -17673, -709, 17046, -4726, -15126, 9288, 13334, -11334, -9787, 13028, 7002, -14237, -4194, 15735, 2465, -15101, 2400, 16310]
515A6310k2883q113K6039k99k7004J0458K4064k0052j8212K8084Q830l1677K032
528a2423L2467j1441k9839J9012K5393k5457j9934L0146J4285l4226p999L7058
540A7042n37l9468J0336L9376k1131l4750L2741K6348m1581j4514M6161P88m6207
553b5396J3037M1754k4618l4300L2570K4908l8092j4962M1394N456m2199M642
565a5806M1171j5765l8021K6430L1471l6946k0490M4567O168m8576J0299M6476
577C0978k6294l8378M0797K6586n0376j1850N4698m704n5614J9674N2364l3545
589D336m6232M6902L6922n8012k5408O7855J0343p3337Q068P4339k7699o9668
601e1591M5979N7617o1743m0215P2168K0069p5781K038P2813k1769o5123L8814
$$ y = [16310, -6573, -14686, 11353, 11054, -15950, -5492, 18572, -1480, -19692, 8392, 17222, -14455, -12423, 20044, 8603, -21236, -2224, 23169, -2288, -22222, 7924, 22209, -12017, -20016, 17042, 16505, -22963, -12627, 26749, 5618, -29132, 3609, 29957, -11624, -26138, 20023, 20811, -25396, -12359, 29395, 4777, -29523, 3047, 27955, -10137, -25099, 16295, 21751, -20448, -15806, 25365, 9600, -28421, -1991, 29480, -7466, -27956, 16611, 22779, -25797, -15498, 30978, 4684, -33694, 7103, 33689, -16687, -28537, 26161, 21457, -34157, -14483, 37881, 4336, -41896, 5006, 41928, -16084, -41492, 26363, 36706, -36631, -28563, 45776, 18077, -51591, -5612, 52005, -9738, -49953, 22215, 42284, -33497, -31459, 41354, 19585, -45538, -6724]
613f724N3144n2912l8224O2411K1680o9148l211P1535j5832o8281L5813O0089
625E0340n3837m5659O7457K5432p5255k885P4825j9739o7323L9558N3688n4526
637g924l4713O4512J3993o8041P131O6676k8372o0316M7779M9085o5808l3200
649d9198Q0244J2800q9664J1580R2510l7382q6646O2595P3501q4071n3143R8327
661C1453K8808j05719l033J04965k1964r8041M4404Q5247o2747o8301P7352M8249
673F0673q7143k4743R1013q5q8982K4919P9196m7619o2771O6004M0146p6935j4166
686d0493P9684j1646p4014L5054O1817n4519m4216O6798K4152p4981k501P6265
698D1400j9197p2159M0181O3603n9671m8410P6105K8767q7052m602R1140k1333
$$ y = [-6724, 46420, -6492, -44716, 17695, 39375, -29773, -32984, 38551, 22719, -45562, -9749, 50340, -3497, -49156, 18301, 43733, -31522, -34407, 40418, 20679, -46644, -7086, 46602, -7924, -42637, 21875, 35868, -32173, -25042, 41634, 13262, -47054, 725, 49810, -15998, -49198, 31046, 43846, -45818, -34238, 58272, 20890, -65756, -3161, 70340, -13731, -66874, 31453, 60261, -45458, -48491, 56474, 34510, -63531, -19127, 66120, 3373, -64928, 12424, 60673, -26470, -51213, 39800, 39715, -49267, -24348, 54848, 7229, -55542, 10462, 50608, -26327, -40493, 39191, 27545, -46469, -11415, 50402, -4117, -48333, 18465, 42617, -32364, -34865, 41400, 22203, -49956, -9775, 53828, -5843, -54253, 21852, 50619, -36433, -41035, 50105, 28772]
710B8772q8277M6591P6669o8715n8986Q4954L6725r4055j2728R6575j0940r2922
722e6337L3145Q4092n2426p0880O8506N3826q1416l3130Q9268R538r0137J4776
734c1175Q4935l8049p2171N7375N3165p1005l0518P6876O858p6046J5933O7993
746D4171l5362n5739N1003M0121o1086k1940O7927K667o9564J7737O5492l7622
758G805n6298N4803M1185o8493k1933P6260p19p6746K3641P0738m3919n7395N9635
771H564M0983p0620k2125P5629K577p5725J6070P1258l2831o3350M8855N1282
783E0567o1370l5867P0624J6929p4814K793P2525k3160o4474M0547N0935n3135
795g900l3684O0523J5410o1476K883N8190j8665n0428L1741M0119m2219k8239
$$ y = [28772, -59505, -12914, 63755, -4960, -63946, 21008, 57733, -36322, -49050, 47525, 36585, -56337, -23192, 60900, 8474, -62406, 6100, 59926, -21490, -54620, 34648, 44186, -45951, -31175, 53760, 15711, -56460, 915, 54080, -16925, -47443, 29433, 36291, -39755, -23822, 44171, 8809, -46930, 4073, 44194, -16892, -38832, 29095, 31762, -37802, -20065, 45427, 7805, -48493, 6310, 47495, -20998, -42931, 33329, 32610, -44136, -20495, 50243, 6324, -51071, 8564, 49547, -21073, -43198, 32431, 35008, -40717, -24647, 46611, 13780, -49570, -715, 50567, -10803, -46670, 23954, 40883, -33931, -31138, 41387, 18227, -46247, -5700, 45235, -7900, -41584, 18939, 34349, -27127, -24244, 33946, 15281, -35147, -3406, 36713, -5506, -33745]
807c3745M9375J4041n3811J416N3605j7603m9235L2800L9374m5375k5700N3952
819A9094R920n6615P542N4265k2987m6781L4936L6284m3880k4075M8301J1610
831B7614n0016Q91M9032j3608m4614K4843L7707l5849k7283M3233J4198m7618
843b1470L04M7776j4669m2627K7808L4118l6866k2854M1983J0684m3454P20M1335
856B2788j0795l7147J9099L1130k5748k3696L1113J5334l4822n141L5651o068
868A1698l3897J6950K8219k6185j9402L2586R112l4941J482L4196j0595l0301
880b1078J8288K4278k3272j7955K6249J0801k7513m540K8118k614k6901J0058
892f081K3534j6727j8664K2907J1452k6696k412K7394o535k5174J4186K0156j9505
$$ y = [-33745, 15630, 29671, -24140, -22724, 30881, 13278, -35957, -3157, 36217, -9158, -34858, 19094, 29014, -27601, -20059, 34206, 11219, -35562, -626, 35658, -8222, -32297, 16004, 27614, -22402, -21511, 27521, 13913, -30701, -5858, 31849, -4000, -31283, 11950, 26148, -21470, -21166, 26610, 11941, -30686, -2878, 31240, -5626, -28480, 13503, 24187, -19267, -18547, 22788, 11993, -25154, -6055, 25075, -673, -24369, 6744, 22078, -12744, -17885, 17766, 11698, -22199, -5249, 22970, -3215, -22617, 9969, 19081, -15860, -14378, 19818, 9223, -21078, -2790, 21488, -1784, -19739, 6510, 17311, -10202, -14742, 13376, 10762, -16139, -6081, 17453, 726, -17938, 4969, 16421, -10275, -12687, 14707, 8172, -17002, -2816, 17340, -2165]
905b165j3846K2793P365k3380j227K2071l296k0499P364J7891j1511j4742J5080
918A898J1001j8688n175K0696j173k0704Q076J8467j4161j4115J8143Q125j9796
931g406k564J9199k207j6816N608J4330p677j1461R097Q805j0380o473J1570L517
945G142j3099M77J2942m789j1546R132Q205j1902l970J2813k65j1971M401R755
959G325o647o867P430M178p493k379O910P67o983K89P147k162p008N154O454p650
975a535m046R794J362j1151J929J0545n445q985P086O521p833l625P227K253n724
990a627j422M447J156m415j063M088K11l990J732L363k419j753L979l45m551K851
1006B42L015m948j572N521j186m484K460L380k489j552K402P93j265r56M16J201
$$ y = [-2165, -16011, 6782, 14147, -9233, -10460, 11611, 8315, -12184, -4820, 13071, 1560, -13182, 1898, 12899, -5789, -10964, 9732, 8559, -12145, -4069, 14398, 237, -13878, 4265, 12390, -7406, -9970, 9229, 7022, -9794, -4186, 10144, 2467, -8994, 103, 8908, -1472, -7945, 3625, 7142, -5957, -5480, 7462, 2673, -8873, 259, 8464, -3438, -7408, 5405, 5140, -6831, -2430, 7325, 678, -6189, 1241, 5419, -2074, -4453, 2457, 3224, -3759, -3470, 3677, 1515, -5493, -339, 6115, -1535, -5581, 4213, 5575, -5576, -3647, 6898, 1453, -7532, -446, 6075, -1758, -5383, 1844, 4097, -1627, -3049, 1398, 2554, -1861, -2924, 1164, 1375, -2615, -883, 2480, 61, -1692, 2287, 1942, -2609, 242, 3257, -1691, -3263, 2258, 1072, -3412, -952, 2428, -61, -1613, 789, 1582, 317, -639, -223, 978]
1022I78q92j891J692J337k268l09L312r30k577K786J362l539P8K983k230j682
1038a790K674m40k113J624P05j866O20J668j272n1R18k47N7L74j060L94J372j535
1056C2j420K122L9k127P14J091j460N70J349k131N90L213k053k888L764J698m638
1073a535m21L789n23k967L75J900N24j925r31K296J680l244j001L872l14l962
1089b387J932K387l080k54L029j714j769K869N80l332J010K401j544j658J277
1104b53O69p17m95P2J336j22j699J015K188k531j262L753o48m416K795L446m669
1121a538k257N944K20n516J233N007j769m062K237L293j509l729J210L740j972
1136E32l829L112L150m693j169N320n38n068L401M152n251j996N691j99o201J618
$$ y = [978, 86, -1805, -113, 1224, -1044, -1353, 1959, 1029, -1548, 1238, 2600, -939, -861, 2122, -108, -1790, 884, 444, -1669, -45, 660, -1206, -586, 1082, -190, -241, 677, 430, 487, 861, -199, 195, 1567, 32, -1388, 734, 773, -1354, -640, 451, -1009, -439, 910, -1221, -631, 2582, 529, -2359, 1405, 3103, -1535, -1956, 1833, 1310, -1657, -1282, 618, 1142, -783, -1714, 582, 2262, -982, -1983, 1889, 1575, -2387, -455, 1932, -1148, -1402, 1627, -87, -1856, 1013, 1593, -1739, -729, 1672, 128, -1530, -253, 416, -301, -796, -724, 612, 490, -1209, -194, 1994, -537, -1799, 1954, 1306, -3110, -315, 3131, -1538, -3795, 2149, 2369, -3147, -1914, 3093, 1324, -2738, -501, 2792, 1283, -2446, -1236, 2504, 532, -3297, -185, 2965, -1728, -2897, 2423, 1885, -3183, 218, 4370, -881, -2877, 2814, 2615, -3586, -1968]
1152a968N064k755l952K977L528k548l487L200L726l576l391N039J918o018K26
1167b017N600k886m593M891K352o454K69O674l126n105M977L773n721k030O241
1182B845J146o454l86O352m07p108J495P468m005p193O348O036q514l334J0534
1197D823k16j0543L597R432o907p246Q327M462r077j842R094K49q247J387P734
1212E027k742p361M185O153o399m682Q247K012r618J830J0094n604q335Q978N603
1227G388j1444k088J1516j331j1048M053R013n378p020P010N304p593l244Q200
1241C338R68r039J443R228n123q131Q370O167j1730k311J3562j448j4219N749
1255c176J3262r653j0579J1787P641j2624m730J2613K355j2227O6J1086k034j0745
$$ y = [-1968, 3096, 341, -3611, -634, 2894, 346, -3141, 59, 3785, 209, -3182, 1857, 3775, -2243, -2017, 3583, 697, -3896, 995, 3347, -3107, -2838, 3836, 710, -4395, 582, 4355, -1366, -3396, 2845, 3991, -2463, -2849, 3503, 3096, -4012, -2517, 4951, 946, -6247, 101, 6137, -2377, -5711, 4823, 4607, -5936, -2339, 7093, 186, -7060, 1267, 5729, -3348, -5190, 3904, 4153, -4094, -2707, 5027, 2285, -5076, -891, 5262, -1137, -5819, 2428, 4440, -5178, -3348, 6746, 1142, -7193, 1785, 7388, -4056, -6144, 5372, 4041, -7007, -2954, 6059, 681, -6339, 671, 5975, -1618, -4862, 3338, 4306, -4733, -3290, 5938, 815, -7316, 1054, 7221, -4509, -6820, 6742, 5294, -8925, -3176, 10086, 433, -10146, 1641, 9282, -3342, -8072, 4541, 6896, -5331, -5265, 5821, 3787, -6958]
1269f958M695R035p123o468R747L214j1042J370J0856n496r296R137N475j1630
1283d484j511J1891k057j1072N249R619p811p183R644M991j0988k958J2376p0
1297E636j3628L350J4290p396j2732J1441J0759j5005o980J7277J869j7637K416
1310f340J5818o593j3027R095J0063j0529o266J1292L353j1195k63J1032k899
1323C541j0570O230Q632r724o224J2448K310j4040K200J4086o648j2062J0643
1336H22R072j3203m821J4073P84j4227K842J2710n772j1310Q237R350j0727o679
1350h849J2761L847j3796l81J5123m117j4155Q450J1568j2367q063J4478L033
1363G532j4887J679J3912n863j1480R301Q238j1002n278J2492K123j3198J068
$$ y = [-6958, -2263, 6772, -351, -6819, 2928, 6142, -4900, -3530, 7326, 1830, -7466, 1671, 7146, -4484, -5995, 5896, 3839, -7233, -1984, 7635, -176, -7359, 2285, 7276, -3712, -6670, 5706, 5636, -7992, -4642, 9648, 2252, -10480, 961, 11720, -3285, -10265, 7012, 8881, -8756, -6340, 9478, 2885, -10142, -1047, 9016, -1513, -7779, 3513, 6866, -4329, -4592, 6440, 3541, -7029, -799, 7833, -1891, -8115, 4333, 6643, -7397, -5197, 8889, 2241, -9821, 822, 9894, -3309, -8130, 5943, 6727, -7500, -4658, 8052, 2280, -9030, -793, 8557, -2170, -8849, 3912, 7759, -6037, -6418, 8705, 4588, -9567, -1117, 10451, -1916, -9979, 4499, 7532, -7355, -5676, 8236, 2373, -9107, 194, 8432, -2570, -7848, 4644, 6767, -6431, -5363]
1376e363J3543m777j3172Q459J1735j1867r473J5101N422j6653q14J6869m052
1389D958j4753P822J1900j0742p831J1655L927j1793o70J1218k507j0111N219
1402a708Q681p589o540J0110M109j2355k28J3268l992j2873Q253J0766j1907p477
1416i482J4475L190j4998P84J4275m918j2815P622J0313r253q003J1224N798j2038
1430c826k804J3254r1j3352L503J2225p441j0420R969O781j2309k559J2885j646
1444D169j1348N726R214q534n870R841L083j0691o16J0709k068j0392M344R992
1458G559o982q530R660O469j1566l859J2808J32j3067L802J1376p059q732R491
1472A502N439j0303k247J0115r92r154L062Q001m546o548O279N208p343l479Q918
$$ y = [-5363, 8180, 3403, -9769, -1310, 10425, -1442, -10915, 4186, 9608, -7045, -7859, 9010, 4958, -9795, -1973, 9927, -815, -8646, 3009, 6936, -4857, -5527, 5691, 3184, -6927, -1708, 6973, -616, -7156, 2954, 7063, -5292, -5520, 7748, 3756, -9117, -864, 9902, -2005, -9482, 4993, 8183, -6815, -6031, 8244, 3326, -9489, -1867, 8446, -807, -8810, 2414, 8212, -3826, -6630, 6624, 6533, -6819, -3316, 8909, 1468, -8952, 1017, 7798, -4511, -7070, 5815, 4169, -7179, -1453, 7761, -773, -6643, 3198, 6281, -4410, -5026, 5683, 3615, -6777, -2433, 7559, 577, -7953, 1707, 8176, -3390, -7249, 5559, 5691, -7376, -3574, 7802, 743, -7989, 1502, 6941, -3362, -5609, 4506, 3514, -5640, -2578, 5423, 877, -5671, 608, 5816, -1527, -5006, 3912]
1487C912Q73r716J734R147n186p838P647N090r477j734J0384j372r507M520Q094
1502F571o715n935P994L633q566k129R019N16r155J069R808l647r281O014P693
1517F889q247n394R493K610j0191J003R486l640p432N534N144o404k760O368O95
1532C154o343N55N688j871n052L227M357m168l414N940J899p147Q19P181l465
1547A360o344N621M405p348k435Q067J75p618J882O738l277n386L927M526m459
1562a66l713M995K647n773j368N832n1n768K122N173m072l653N707J465o080P41
1578a962N955l015m963M175L410m830k450N300J188n008m75N093l9n448J083N490
1594C504j744n644L475M245m651k421M912P16m735J300L545k482j949K663N61
$$ y = [3912, 4785, -4931, -3197, 5950, 764, -7074, 573, 5663, -3814, -5548, 4836, 3464, -6043, -1523, 6571, -144, -6079, 1915, 5548, -3018, -5147, 3872, 4388, -4767, -3698, 6110, 2463, -6818, -804, 6889, -1358, -6752, 2741, 5351, -4840, -3837, 5649, 2009, -5423, 111, 5255, -1149, -3909, 2459, 3154, -3189, -2634, 3054, 1183, -3869, -642, 3715, -453, -3867, 2073, 3972, -3175, -2356, 4825, 1360, -4984, 637, 5042, -2306, -4741, 3326, 3501, -4117, -2235, 4503, 1226, -4160, -233, 4293, -166, -3879, 1116, 3763, -2010, -3378, 2454, 2403, -3365, -1243, 3930, -142, -3795, 1912, 3377, -2703, -1962, 3993, 978, -3985, 190, 3600, -1230, -3680, 1620, 2808, -2200, -2675, 2418, 2379, -3069, -1986, 3504, 1760, -3884, -409, 3836, -815, -3236, 1676, 2392, -2343, -1043, 2502, 20, -1929, 734, 1295]
1609A295k639N35K216j490j518J704J216j990j146K155J454l087q93L920P4m468
1625b662J487M497k925l634L827K329m485p86L895m19k947R27K370j166j686J124
1641b54J600j086j488J063J374j660j042K209L17k322Q90K205k119r82K567p7
1657A195k619J537J491j883j124J904L31j394j9J264j82p71k48Q07L96j328o8
1674g11J695p39j395J226J377j976j63K103q96j483J509N35j857L72J347j023
1690g9r74J190K0m80j50N32L51l99n26N08J203j374o58J577L40k036M18J836j323
1709b4j026J481Q0j472P60P02j036J00Q37o16k31Q37r1q35N13J08k30j46n7J69
1729a77P34o64p62J649J78j810O00J855j632j363J611P77k026j27J769m35q56
$$ y = [1295, -1344, -809, 1407, -83, -1601, 103, 1319, -671, -1817, 338, 1792, -1295, -2188, 1732, 1806, -2662, -1175, 3322, 397, -3237, 590, 2919, -1566, -2352, 1543, 1124, -1823, -896, 1474, 308, -1378, -254, 1346, 260, -1228, -165, 1209, -451, -1493, 716, 1033, -1289, -399, 1806, -313, -1295, 1272, 1195, -1424, 113, 1604, -279, -1403, 501, 832, -562, -581, 683, 501, -270, -518, 289, 685, -643, -711, 984, 245, -1150, 76, 1453, -523, -686, 1417, 521, -962, 547, 1082, -775, -403, 944, -79, -1053, 137, 157, -323, -473, 59, 410, 11, -515, -7, 1196, -178, -836, 741, 1081, -955, -537, 1299, -24, -1050, 431, 511, -961, -201, 501, -535, -435, 402, -214, -445, 392, 301, -534, -21, 87, -143, -289, -346, -177, 557, -107, -869, 780, 958, -852, -252, 1603, -29, -1392, 219, 996, -1030, -1157, 612, 177, -679]
1746f79O01M27L3m69p7O31J87q55j36J118o49j240J343N02j414K72J354j378m27
1765h56J878p83j337J237Q74j587m73J677J07j382J20J056K97j059p95J657M19
1782A050j887nK136p56k021J267J709j818q09J977l45j494J014J256j570j74J103
1799F33j10q54j11Q92K68j365j85J430o0j847Q84K266j753j596K476O04k745K84
1817h89K376j108j683J553J016j998j83J638M2j303O1J152l3j304K82J174n77
1834B16j412J210R79j941k99K680r70k399K321J755k994n08K964n74k881J195
1850f58K416j415k182J447K002j739j936K202J536k195j327K736J150l431k2L324
1866A908j314k753K134J543k368o86K621o28k155J318J666j491q87J533M40j607
$$ y = [-679, -78, 349, 382, -87, -164, 467, 654, -201, -337, 781, 132, -1108, 235, 737, -677, -405, 949, -429, -856, 1022, 239, -1098, 139, 1013, -574, -1047, 630, 737, -645, -525, 531, 828, -231, -1026, 631, 1050, -837, -842, 1294, 538, -1483, -216, 1493, -325, -1134, 843, 498, -996, 18, 1274, -296, -470, 633, 523, -331, -442, 450, 718, -647, -832, 598, 538, -1309, -425, 1841, 88, -1508, 968, 1572, -1173, -889, 1487, 379, -1304, 249, 1265, -733, -916, 722, 764, -539, -478, 674, 641, -663, -381, 793, 216, -1196, 14, 993, -948, -1247, 1433, 463, -1936, 385, 2140, -854, -1362, 1602, 1028, -1853, -658, 1758, 343, -1839, -392, 1610, -129, -2065, 137, 1673, -522, -1849, 887, 2037, -1394, -1416, 1908, 594, -2159, -25, 1518, -850, -1536, 1085, 457, -1698, -380, 1286, -205, -1092, 441, 881, -726]
1882g26j55J500K80j997K36K097r67j800J792J334k516o28L109n40k851J308K427
1899A903k269j176K368L86k158L13J821n05j614P62J245j012j218J315Q78j510
1915d71q30K078J28k443J184K177k054j621K896N14l148O19K729j243k149J495
1931a39J537j326j095J147P14q44o88Q16P75j005m89J272k34j250R55N83j564
1948h35K38J633r01j486J703R32k316P4K335q10j906J117J602j461r52J247O35
1965H49r70p55J135N83j464k30J590j14j533Q33J183j375p30J855pj860M63J389
1983H42j055o32J228j13r67O67O72q35k75P79R0o61n10J017K54r91l16J604j83
2002F15j727P03J977j814j145K047L98k141K42J642r71q10J062O10j094o7Q57
$$ y = [-726, -881, 619, 899, -1098, -862, 1235, 268, -1532, 260, 1594, -922, -1550, 1559, 1019, -1832, -524, 1903, -366, -1542, 826, 1212, -946, -633, 1188, 683, -931, -169, 1076, 64, -1154, 161, 1039, -471, -1301, 777, 905, -1538, -354, 1823, -231, -1852, 1044, 1558, -1590, -971, 1758, 515, -1634, -139, 1398, 72, -1023, 124, 838, -6, -694, 122, 897, -108, -597, 675, 441, -809, 146, 729, -835, -597, 1036, 135, -1351, 352, 1284, -1032, -958, 1377, 567, -1339, -222, 1380, -81, -1033, 214, 849, -121, -876, 259, 842, -622, -852, 738, 624, -909, -76, 1107, -268, -998, 857, 850, -1010, -547, 842, -213, -845, 383, 270, -697, -30, 642, -193, -468, 311, 401, -260, -770, 247, 501, -490, -806, 798, 615, -1112, -409, 1568, -246, -1391, 656, 1054, -1087, -845, 797, -174, -984, 78, 688, -406, -473, 384]
2019C84k4p43J85O37k05p81K59J261r66j218J412Q20j679j93K006o23j709R56
2037b21J247j348l67J248j72j206P69P25p55n21O20N21p73j83P14O89j399l96
2055h08J725j66j982Q00J795j313j520K152M66k095K69J847r23j348J419O11j101
2072a72n93J131J28r49j56J370k06j166j65J546l86j545J293J045j548m55J862
2089A034o34j380R05J030j518k39J546l60j268L23J313p38p76O83R28p48r71J061
2107A91P64j366o55J659K57j954O17J513j174j348J960N59j755P0J698q11j456
2124a231R62J135q58r97R40J023j015r68J040P80j172l74J436j62j423O19J001
2141G36j031k67J302n74j130J158R38j970j9J361l48j063N41J185l68q60L21J001
$$ y = [384, 360, -383, -198, 439, 234, -547, -288, 973, 7, -1211, 201, 1021, -658, -851, 1155, 532, -1177, -221, 1026, -322, -689, 559, 387, -819, -50, 675, -80, -601, 19, 540, -233, -416, 298, 987, -412, -808, 917, 751, -1231, -431, 1364, 51, -1469, 683, 1149, -946, -677, 1170, 247, -1101, 318, 929, -172, -765, 366, 494, -455, -611, 759, 553, -613, -778, 768, 382, -1163, 130, 1175, -373, -828, 1034, 400, -980, -75, 955, -563, -802, 744, 384, -884, -561, 752, 14, -762, -79, 849, 101, -870, 191, 955, -411, -1066, 593, 850, -1104, -487, 1026, -148, -1496, 464, 1023, -732, -662, 1036, 225, -1231, -269, 866, 8, -989, -49, 974, -41, -1009, 31, 811, -361, -735, 701, 539, -884, -265, 736, -295, -562, 740, 166, -964, 194, 1132, -838, -857, 504, 156, -907, -366, 819, 451, -409, -88, 913]
2159I13l17j516P56J257j114j089J580M71j607R9J378m89j187J187M86j264o8
2176e24R65l80o17O31K79j24j84k71P38l05q22O57N22p12m85Q57M5j162P16P78
2196F02q48k86J277k54j320Q12Q87j085n52J117L3n76J5M39Qm34q7N82J61j022
2216e31L73R11r64o91J207M39j644N57J504r92j261J081P78r38o33R58M69o56
2234c3l97L34O51m06m73N52M06o85n13P35pp17L80L70n41N88J10p29J70O21l70
2255D6r19J110M81r49j58N77j82l17n8N43J67n01k06O54j08q55L07J083p72p49
2275h06J124N25j388j3J271m85j123R46M72l86p42O22K67k77k65R7O41l46n55
2294d21N66N25j058J95O24k94m12P01j32r70N55N58o02k56P17K2m31L27J12m25
$$ y = [913, 596, -920, -164, 1093, -21, -1110, 470, 941, -666, -567, 811, 322, -865, 322, 808, -456, -524, 441, 61, -556, 75, 354, 230, 46, -225, 513, 208, -614, 43, 565, -147, -632, 225, 270, -892, -176, 602, -246, -532, 745, 491, -829, -17, 870, -215, -767, 350, 383, -193, -178, 261, 269, -165, -252, 330, 491, -531, -158, 753, -211, -902, 305, 744, -900, -343, 1161, 169, -1092, -11, 767, -171, -804, 154, 623, -33, -430, -96, 555, 149, -324, 228, 634, -51, -564, 171, 164, -553, -173, 197, -344, 244, 354, -375, -205, 416, 46, -873, 237, 718, -231, -389, 188, 6, -311, -369, 174, 341, -160, -366, 288, 180, -675, -368, 715, -57, -806, 318, 843, -545, -558, 713, 228, -895, 51, 523, 137, -605, 17, 284, 7, -258, -161, 480, 134, -421, 145, 670, -388, -193, 431, 137, -275, 426, 294, -676, -121, 437, -165, -421, 296, 318, -113, 214, 326, -99]
2314i9J31K9j03O6J19j6j39o3j0L15o4n14L23P86q48p53J264M22j479K72J359
2335I98p42q92O74P10p90n38N07K98l30j35J10M67k54o33O03N92q02J9Q46p45
2355c7m95O92p9o23M06N95n50n6N12k93p15O24K17r0k06J03J64k01l82K32O13
2376D31k98n63O72M05r26j53Q46l95p35N05P35q89k25R02m64k96L51L76j27k53
2396a01R2Q4l98j51L56M63n22k58R84r0j047M97J059q77r12J440L27j477p4R99
2416C94k71p60M34O91m32l66K67L30m77j79M87L82n94j45Q78r6p55K82P11r47
2436a66o20J330j61j213O43Q53r75l46J204J31j046K56Q54n18q21K70J104q02
2454b3j079J081J155j384p17J396O41j689rJ762p24j309O24R43r65k87J045j44
$$ y = [-99, 32, 61, -42, 24, 143, 127, -12, -75, -85, 230, 166, -348, -25, 761, -87, -840, 424, 846, -633, -361, 998, 256, -636, 38, 748, -42, -580, -73, 225, -105, -240, -130, 337, 83, -550, 53, 645, -157, -138, 708, -37, -532, 160, 81, -542, -136, 459, -91, -147, 365, 72, -643, -19, 198, 108, -98, 5, 169, -32, -414, -182, 431, 133, -430, 242, 647, -279, -432, 414, 19, -716, -211, 524, -365, -590, 312, -152, -448, -97, 279, 152, -101, -9, 75, -323, -474, -118, 345, -177, -435, 549, 459, -588, -91, 968, 91, -821, 619, 946, -531, -605, 394, 123, -637, -203, 488, 56, -310, -43, 287, -190, -369, 118, 500, -94, -239, 639, 543, -212, 70, 781, -166, -786, 544, 383, -830, -187, 666, -309, -655, 549, 680, -366, -110, 744, 226, -595, -325, 779, -23, -1102, -21, 1134, -250, -967, 429, 1070, -619, -628, 1134, 410, -899, -275, 668, -297, -584, 461, 317]
2472C17o81L34L11m9o38L53M09k77l33M81M31j138j54J212k45j104O98R58j321
2491d36o23J439M4j396N66J160o07p97Q94L24p45l72Q65J78q29r9P73M01j457
2510g17j24J729p31j357J301Q10j293m00J321j54j165O61P93p47m44Q01p7n47
2528c40L5M40J53o94OP05k6r90O03Q11q29n33J217K90j456K87J130o69p38Q45
2548B47L32p09K4L77j46o26K36M69r3l90M73L96m26o89O30M12r98j12J191j55
$$ y = [317, -364, -30, 281, 232, -406, -53, 356, 79, -254, 227, 658, -480, -634, 578, 333, -771, -73, 885, -436, -1059, 380, 424, -972, -406, 754, 147, -650, 244, 568, -177, -549, 316, 494, -335, -434, 339, 740, -717, -841, 888, 157, -1200, 101, 911, -382, -782, 539, 385, -780, -119, 674, -73, -517, 284, 207, -340, -305, 135, 288, -406, -400, 305, 279, -711, -108, 703, -126, -659, 558, 848, -608, -321, 809, 140, -598, 247, 579, -130, -106, 271, 125, -501, -265, 204, 111, -279, 194, 590, 164, -525, 105, 517, -481, -593, 598, 443]
$$ [...]
8191a14
##END NTUPLES=NMR FID
##END=
