##TITLE=1H_CA-8650-5
 CDCl3, 8 sc, 
 10.1.2020
##JCAMPDX= 6.0         $$ Bruker NMR JCAMP-DX V2.0
##DATA TYPE= NMR FID
##DATA CLASS= NTUPLES
##ORIGIN= UXNMR, Bruker Analytische Messtechnik GmbH
##OWNER= root
$$ XWIN-NMR		Version 3.5
$$ Fri Jan 10 14:20:48 2020 Russian Standard Time (UT+4h)  she@DPX200
##.OBSERVE FREQUENCY= 200.1315
##.OBSERVE NUCLEUS= ^1H
##.DELAY= (6, 6)
##.ACQUISITION MODE= SIMULTANEOUS
##.ACQUISITION SCHEME= undefined
##.AVERAGES= 8
##.DIGITISER RES= 18
##SPECTROMETER/DATA SYSTEM= spect
##.PULSE SEQUENCE= zg30
##.SOLVENT NAME= CDCl3
##.SHIFT REFERENCE= (INTERNAL, CDCl3, 0, 15.7039)
##AUDIT TRAIL= $$ (NUMBER, WHEN, WHO, WHERE, WHAT)
$$ ##TITLE= Audit trail, XWIN-NMR		Version 3.5
$$ ##JCAMPDX= 5.01
$$ ##ORIGIN= Bruker BioSpin GmbH
$$ ##OWNER= she
$$ F:/spectra/data/she/nmr/H-F/1/audita.txt
$$ ##AUDIT TRAIL=  $$ (NUMBER, WHEN, WHO, WHERE, WHAT)
(   1,<2020-01-10 14:19:35.96 +0400>,<she>,<DPX200>,
      <created by zg, POWCHK disabled, PULCHK disabled
       configuration hash MD5:
       00 E9 B6 7A A2 85 ED C7 34 08 36 98 17 FE 4E 26
       data hash MD5: 16K
       6F 0A C2 53 B4 88 A4 E6 46 63 96 A0 97 A3 8D 01>)
$$ ##END=
$$ 
$$ hash MD5
$$ 38 26 52 8F AB 6E DD 8C E9 49 24 F9 1F DC 92 68
##$RELAX= 
##$RELAX= 
##$RELAX= 
##$RELAX= 
##$RELAX= 
##$RELAX= 
$$ Bruker specific parameters
$$ --------------------------
##$DU= <F:/spectra>
##$EXPNO= 1
##$NAME= <H-F>
##$PROCNO= 1
##$TYPE= <nmr>
##$USER= <she>
##$AMP= (0..31)
100 100 100 100 100 100 100 100 100 100 100 100 100 100 100 100 100 100 
100 100 100 100 100 100 100 100 100 100 100 100 100 100 
##$AQSEQ= 0
##$AQ_mod= 1
##$AUNM= <au_zg>
##$AUTOPOS= <>
##$BF1= 200.13
##$BF2= 200.13
##$BF3= 200.13
##$BF4= 200.13
##$BF5= 200.13
##$BF6= 200.13
##$BF7= 200.13
##$BF8= 200.13
##$BYTORDA= 1
##$CFDGTYP= 0
##$CFRGTYP= 5
##$CHEMSTR= <none>
##$CNST= (0..31)
1 1 145 1 1 1 1 1 1 1 1 1 1 1 1 1 1 1 1 1 1 1 1 1 1 1 1 1 1 1 1 1 
##$CPDPRG= <>
##$CPDPRG1= <>
##$CPDPRG2= <>
##$CPDPRG3= <>
##$CPDPRG4= <mlev>
##$CPDPRG5= <mlev>
##$CPDPRG6= <mlev>
##$CPDPRG7= <mlev>
##$CPDPRG8= <mlev>
##$CPDPRGB= <>
##$CPDPRGT= <>
##$D= (0..31)
0 1.2 0 0 0 0 0 0 0 0.06 0 0.03 0 0 0 0 0.0002 0 0 0 0 0 0 0 0 0 0 0 0 
0 0 0 
##$DATE= 1578651575
##$DBL= (0..7)
120 120 120 120 120 120 120 120 
##$DBP= (0..7)
150 150 150 150 150 150 150 150 
##$DBP07= 0
##$DBPNAM0= <>
##$DBPNAM1= <>
##$DBPNAM2= <>
##$DBPNAM3= <>
##$DBPNAM4= <>
##$DBPNAM5= <>
##$DBPNAM6= <>
##$DBPNAM7= <>
##$DBPOAL= (0..7)
0.5 0.5 0.5 0.5 0.5 0.5 0.5 0.5 
##$DBPOFFS= (0..7)
0 0 0 0 0 0 0 0 
##$DE= 6
##$DECBNUC= <off>
##$DECIM= 24
##$DECNUC= <off>
##$DECSTAT= 4
##$DIGMOD= 1
##$DIGTYP= 9
##$DL= (0..7)
0 120 120 120 120 120 120 120 
##$DP= (0..7)
150 150 150 150 150 150 150 150 
##$DP07= 0
##$DPNAME0= <>
##$DPNAME1= <>
##$DPNAME2= <>
##$DPNAME3= <>
##$DPNAME4= <>
##$DPNAME5= <>
##$DPNAME6= <>
##$DPNAME7= <>
##$DPOAL= (0..7)
0.5 0.5 0.5 0.5 0.5 0.5 0.5 0.5 
##$DPOFFS= (0..7)
0 0 0 0 0 0 0 0 
##$DQDMODE= 0
##$DR= 18
##$DS= 0
##$DSLIST= <SSSSSSSSSSSSSSS>
$$ [...]
##$SUBNAM2= <"">
##$SUBNAM3= <"">
##$SUBNAM4= <"">
##$SUBNAM5= <"">
##$SUBNAM6= <"">
##$SUBNAM7= <"">
##$SUBNAM8= <"">
##$SUBNAM9= <"">
##$SW= 24.9337058887773
##$SWIBOX= (0..15)
0 0 2 0 0 0 0 0 0 0 0 0 0 0 0 0 
##$SW_h= 4990.01996007984
##$TD= 16384
##$TD0= 1
##$TE= 0
##$TE2= 300
##$TE3= 300
##$TEG= 300
##$TL= (0..7)
0 120 120 120 120 120 120 120 
##$TP= (0..7)
150 150 150 150 150 150 150 150 
##$TP07= 0
##$TPNAME0= <>
##$TPNAME1= <>
##$TPNAME2= <>
##$TPNAME3= <>
##$TPNAME4= <>
##$TPNAME5= <>
##$TPNAME6= <>
##$TPNAME7= <>
##$TPOAL= (0..7)
0.5 0.5 0.5 0.5 0.5 0.5 0.5 0.5 
##$TPOFFS= (0..7)
0 0 0 0 0 0 0 0 
##$TUNHIN= 0
##$TUNHOUT= 0
##$TUNXOUT= 0
##$USERA1= <user>
##$USERA2= <user>
##$USERA3= <user>
##$USERA4= <user>
##$USERA5= <user>
##$V9= 5
##$VALIST= <valist>
##$VCLIST= <CCCCCCCCCCCCCCC>
##$VD= 0
##$VDLIST= <DDDDDDDDDDDDDDD>
##$VPLIST= <PPPPPPPPPPPPPPP>
##$VTLIST= <TTTTTTTTTTTTTTT>
##$WBST= 1024
##$WBSW= 4
##$XGAIN= (0..3)
0 0 0 0 
##$XL= 0
##$YL= 0
##$YMAX_a= 358545
##$YMIN_a= -273643
##$ZGOPTNS= <>
##$ZL1= 120
##$ZL2= 120
##$ZL3= 120
##$ZL4= 120
##$ABSF1= 10
##$ABSF2= 0
##$ABSG= 5
##$ABSL= 3
##$ALPHA= 0
##$AQORDER= 0
##$ASSFAC= 0
##$ASSFACI= 0
##$ASSFACX= 0
##$ASSWID= 0
##$AUNMP= <proc_1d>
##$AZFE= 0.1
##$AZFW= 0.1
##$BCFW= 1
##$BC_mod= 2
##$BYTORDP= 1
##$COROFFS= 0
##$CY= 11.3945322036743
##$DATMOD= 1
##$DC= 2
##$DFILT= <>
##$DTYPP= 0
##$F1P= 16.9975609425685
##$F2P= -3.02152046262296
##$FCOR= 0.5
##$FTSIZE= 0
##$FT_mod= 4
##$GAMMA= 1
##$GB= 0.15
##$INTBC= 1
##$INTSCL= 1
##$ISEN= 128
##$LB= 0.24
##$LEV0= 0
##$LPBIN= 0
##$MAXI= 10000
##$MC2= 0
##$MEAN= 0
##$ME_mod= 0
##$MI= 1.114404
##$NCOEF= 0
##$NC_proc= 0
##$NLEV= 6
##$NOISF1= 3.799351
##$NOISF2= 2.8
##$NSP= 1
##$NTH_PI= 0
##$NZP= 0
##$OFFSET= 15.70392
##$PC= 1
##$PHC0= -10143.83
##$PHC1= 11.2008
##$PH_mod= 1
##$PKNL= yes
##$PPARMOD= 0
##$PSCAL= 0
##$PSIGN= 0
##$REVERSE= no
##$SF= 200.130013532006
##$SI= 16384
##$SIGF1= 3
##$SIGF2= 2
##$SINO= 400
##$SIOLD= 16384
##$SREGLST= <1H.CDCl3>
##$SSB= 0
##$STSI= 0
##$STSR= 0
##$SW_p= 3612.71676300578
##$SYMM= 0
##$S_DEV= 0
##$TDeff= 0
##$TDoff= 0
##$TI= <>
##$TILT= no
##$TM1= 0
##$TM2= 0
##$TOPLEV= 0
##$USERP1= <user>
##$USERP2= <user>
##$USERP3= <user>
##$USERP4= <user>
##$USERP5= <user>
##$WDW= 1
##$XDIM= 8192
##$YMAX_p= 0
##$YMIN_p= 0
$$ End of Bruker specific parameters
$$ ---------------------------------
##NTUPLES= NMR FID
##VAR_NAME=  TIME,          FID/REAL,        FID/IMAG
##SYMBOL=    X,             R,               I
##VAR_TYPE=  INDEPENDENT,   DEPENDENT,       DEPENDENT
##VAR_FORM=  AFFN,          ASDF,            ASDF
##VAR_DIM=   8192,          8192,            8192
##UNITS=     SECONDS,       ARBITRARY UNITS, ARBITRARY UNITS
##FACTOR=    0.0002004,     1,               1
##FIRST=     0,             0,               0
##LAST=      1.6414764,     0,               0
##MIN=       0,             -273643,         0
##MAX=       1.6414764,     358545,          0
$$ Real data points
##PAGE= N=1
##DATA TABLE= (X++(R..R)), XYDATA
$$ [...]
2483a900K612l11n93J010j236k232K301K355k123q54J048r57p09L150k31l116
2499a786M55J780o20O36J227k274j771K748J262j725K00L8k192J117L012j168
2515I39k519J068K87q87K105Q53l039j135L183j6r96J252q20k415K186K350j870
2532E26j084R70j194p8K709L01l421Q1J878p19N12J643k081k401K440J566j085
2549E63K4K28k436P28L655j134k280K14J77k87J753J490l208j489K774J56r03
2566B5J135p79k982J950K642j315j298N86o95j108L132Q78l287n64J756k95N34
2583C15J438j792k444K015K334j484L17n3k144KL432k71k438K31P88j131J332
2600D47K189l177k023K519Q88q10J522m78l397J406L358j079j656O99p04r07K682
$$ y = [-1900, 712, 401, -192, 818, -418, -2650, -349, 2006, -117, -971, 77, -880, -1589, 1561, 1330, -1786, -1331, 449, -171, 465, 1692, -582, -2353, 395, 1657, -68, 132, 170, -2022, -905, 2107, 939, -1580, -512, -225, -1112, 993, 1846, -1193, -2328, 855, 839, -157, 1095, 275, -2140, 46, 2396, 526, -558, 412, -782, -860, 1849, 2150, -1271, -1190, 688, -31, 481, 2124, 43, -2358, 82, 1648, 563, 587, 815, -1621, -893, 2762, 1628, -652, -438, -261, -548, 1205, 2695, -513, -2002, 772, 928, 25, 1160, 381, -2601, -651, 1991, 676, -622, -36, -731, -1839, 1293, 2171, -1116, -1680, 76, -219, 315, 1753, -39, -2483, -468, 1866, 382, 699, 646, -1498, -1496, 1936, 1665, -773, -542, 246, -885, 447, 2636, -541, -2564, -45, 843, 33, 1555, 1077, -2320, -914, 2444, 1365, -291, 408, -296, -1203, 1479]
2617A479J195k821j111J675m17K07J736j144k712J123K424j182OL62k369q0L550
2634A921K16k767j97P82r50J506K104k611k348J711J378o87P96k4l124L65L261
2651A332o52j088Rj054p59K203K037l005j340J502n6P7K286j393l131J160K264
2668C92m27l21O40k516o76L425Q54k392l92N39p76J032K348j743k790J404J443
2685D4o40R59K54l067L0L194K75j641O39j138j187K773J875k173j608J201j78
2702c88K33K098p45l179N54K866n92j16M52k068j030K993J465k213o51K77q11
2719h55J176K443j357k806N51J716m04J139J50l001m36L121P16j872L18p03j585
2736a689J921K366k389j499J273k01j54K281n62l058L52K436m32N7M95k033j528
$$ y = [1479, 2674, -147, -1258, 417, 0, 207, 1943, 799, -1913, -790, 1634, 452, 458, 820, -1549, -1629, 1921, 2137, -630, -827, -45, -995, 511, 2615, 4, -2344, -633, 745, 58, 854, 830, -2294, -1929, 1332, 680, -408, -399, -1453, -2212, -9, 2028, -977, -2317, -815, -871, -794, 1492, 99, -3032, -1872, 392, -35, -356, 284, -2232, -2908, 517, 1371, -1021, -1413, -874, -1650, -618, 1730, -13, -2803, -1399, 44, -596, 363, 617, -2450, -2420, 774, 1049, -592, 47, -1091, -2278, 495, 2370, 197, -1411, -210, -388, -155, 1943, 1198, -1981, -1427, 1439, 847, 731, 1183, -885, -1915, 1078, 2543, 330, -321, -44, -855, 321, 2764, 1407, -1399, -848, 868, 464, 1603, 1753, -1248, -1684, 1437, 2153, 281, 599, -104, -1689, 232, 2598, 209, -1290, -17, -218, -372, 1909, 1347, -1711, -1359, 1077, 645, 702, 1197, -836, -2364]
2753b364K593J999j975j003P21j260R66K402r66k958O15J430k94J236M13k840
2769a285j300L250P73r48q0o33j576J674K862j842j864N04K15RK094O6l139l88
2787a608K355N18k97M22j383j810K190K209j990q40K70j014N48L016m50k921k26
2804a011J584k01Q82P96k701j738K987J363j235j13o14j608J000L074j300k028
2820h63L02J08J16J732J68k742q72K503O6j66Q98j562k235K186K246j169j475
2837g59L93j182M58L027n42k774j49J181RQ41R56k576j456K079J820j379K74n40
2855c19j677J031K731n05k331L47k49J14J938J039l040j289K269M56m56J023j383
2872c01k285J939K248p74j320j76p67p6K809L80k755n71J289L3R52Q86j844k330
$$ y = [-2364, 229, 2228, 253, -750, -29, -1289, -323, 2079, 1113, -1845, -1230, 200, -94, 1142, 1555, -1285, -2585, 665, 1438, 490, 410, -223, -1799, -125, 2737, 895, -969, -465, -250, -241, 1853, 1919, -1220, -1608, 747, 1265, 968, 1390, 7, -1803, 387, 2596, 606, -234, 36, -978, -430, 2586, 2136, -785, -1011, 573, 372, 1254, 2050, -651, -2389, 598, 1961, 726, 613, -1, -1609, -609, 2465, 1165, -863, -561, -453, -337, 1395, 1563, -1179, -2051, 452, 518, 352, 1250, -312, -2547, -361, 1885, 716, -759, -366, -1548, -1090, 1937, 1395, -1379, -1528, -347, -338, 503, 1459, -1117, -2573, -494, 1326, -53, 221, -319, -1996, -965, 1766, 1261, -1070, -723, -972, -858, 1080, 2119, -921, -2210, 59, 515, 59, 1082, -301, -2586, -647, 1601, 827, -493, -669, -1436, -1512, 1297, 1677, -1078, -1649, -360, -327, 625, 1511, -333, -2663]
2890b663K286J388o38J8n37j623N19L080n37k474J05K26l19J916J582k847k088
2907b606K395M44n1Q59j098k289J410K634n35j307M3o87l77K520Q00k605p28J138
2925d0l12P46J590j769k341J560J805o28p1k58j766L16K848j8j921l60J8RJ707
2944A115J158k348j563J306J118j91R51q54k686M99L290l20j506J05p85q80K493
2961I02J369k574j213Q36N7R85J529j445k480O02K163ll29J6j959o00L017Q76
2979A749j965q79K70o44J759J322j859k012R79J209j4Q66n66k315J60K540J78
2996G78j109J42j176q19K472J621j984j537Q99L5O58J761j088k825M38K337j52
3013D51L1L32k207n55K642J510j937p17J23q04J452J833j340k394J094J111K6
$$ y = [-2663, -377, 1011, 373, 391, -146, -1769, -1250, 1830, 1293, -1181, -1076, -850, -1169, 747, 2329, -518, -2606, -211, 233, 182, 1041, -57, -2346, -936, 1698, 1163, -144, -101, -788, -1165, 1355, 2155, -450, -1178, -40, -352, 394, 1984, 215, -2126, -566, 1239, 611, 540, 282, -1484, -1168, 1680, 1662, -259, -619, -601, -592, 1115, 2273, -75, -1638, -332, 786, 595, 1546, 692, -1994, -1495, 1795, 1475, -31, 74, -711, -1591, 902, 2271, -303, -1516, -680, -623, 362, 1891, 446, -2034, -1432, 731, 728, 399, 415, -1544, -2144, 873, 1749, -216, -1095, -825, -1469, 290, 1612, -247, -2259, -1280, -71, -85, 781, 215, -2100, -1940, 600, 778, -331, -189, -1365, -2184, 288, 1909, -75, -1612, -713, -678, -20, 1741, 653, -2172, -1734, 603, 451, 482, 814, -1393, -1948, 694, 2204, 267, -450, -327, -1131, 321, 2154, 814, -1580, -486, 625, 651]
3030F51J049m46k638K4K560L52p86m60m13j387K107K122j893j524O23L85J75J808
3048B309r79k575M0K039L77j12Q8k121m32K343J406j530q75M6j096J392J926j035
3066A211k342O14N94L89M71L06k546o80K564P07q68k29p65j442J983K002j478
3083D91j757L15M14J31J829k06k730j02J566J44J41L60j601j086J767J886j507
3100E5p43O7j033Q22K351n60k884L88J300j36J014L02k338r99K359P89p07j75
3118a28l39j613J397K508j640j586O71R5j68J993R2k806j56J892M02l28M96j533
3136g51j503J855J792q99r52L92j239O95K438m51k509QJ229j87R74O57k142j597
3154b190K256J185p79J46o53j591R64K656n44j876j37J21K94J672L97k557j008
$$ y = [651, 1700, 1254, -1384, -1360, 1200, 1552, 766, 306, -107, -1494, 613, 2735, 842, -682, -59, 326, 501, 2309, 1330, -1245, -1205, 834, 1211, 1099, 1187, -934, -1366, 977, 2383, 853, -22, 24, -1072, 320, 2246, 1211, -1131, -517, 77, 466, 937, 1243, -1303, -1983, 581, 1288, 420, 191, -574, -2016, -33, 1969, 491, -1266, -951, -537, -406, 1423, 1217, -1513, -1615, -49, 95, 236, 596, -1005, -2091, -324, 1562, 55, -688, -621, -1654, -832, 1519, 959, -1925, -1537, -237, -373, 641, 943, -1395, -2394, -35, 754, 47, -128, -467, -2080, -683, 1825, 185, -1401, -730, -635, -803, 1190, 1282, -1524, -1680, 212, 614, 286, 782, -751, -2254, -399, 1393, 494, -458, -66, -1305, -610, 1828, 1377, -1132, -1124, 105, -82, 892, 1549, -593, -2190, 66, 1251, 472, 618, -35, -1626, -662, 1994, 1450, -426, -563, -442, -148, 1524, 1921, -636, -1644]
3171a644J884O06j97L81j163j481J425K221p03j173j11r56K09K386K62k340p81
3188a175J307M9P53J026k120j923K317J096o12P9j066j480N55K968k43j832q0
3205c81m9k35K023L76k560r22J564N02L56P5p58j787J089K269m31j214m38o58
3223a179K01K317K57k348r71J406PP50R75j745j985J391J814q31nj97j546J49
3241a540K369K25j959j46J81l58J463J028j765j645J268M91Q7R18q34j837N54
3258a500K203j98j372K34r29nK119Q68k316o11O03Q1O26J454j407j880J054J455
3276D79k81J00k77j689J83K823j81j368n89J10m6J159J166j566j693J491M67L03
3294E91P62o45k063K41K485l8j132N6m83o73J974R23j456j025N24Q5N43J317j288
$$ y = [-1644, 240, 846, 649, 1030, -133, -1614, -189, 2032, 1329, 156, 45, -911, -702, 1684, 1946, -394, -1175, 132, 181, 934, 1960, -160, -2083, 234, 1330, 718, 797, -269, -1749, -1194, 1774, 1531, -301, -381, -430, -665, 1358, 1734, -826, -1748, -184, 318, 674, 749, -9, -1796, -707, 1562, 1131, -83, -521, -1179, -978, 1339, 1596, -752, -1723, -317, -310, 440, 1415, -330, -2315, -924, 890, 59, 54, -143, -1689, -1540, 829, 1054, -905, -1051, -870, -1228, 235, 1263, -502, -2147, -879, -388, -301, 617, -217, -2054, -1500, 703, 505, -867, -633, -1562, -1567, 552, 1420, -896, -1507, -904, -823, -197, 1257, -150, -2030, -976, 479, 198, 298, 21, -1668, -1485, 1338, 1157, -211, -800, -690, -736, 423, 1589, 23, -1670, -179, 288, 591, 1353, 708, -1355, -1114, 1371, 1333, 201, 257, -226, -899, 1075, 1998, 542, -483, 41, 126, 669, 1986, 698]
3313F98k024J014J592k22P4l59j575J30J841Q34j455l79l24k94J530J150j541
3330F90j846Q11R65m8Q29n89k351M19K257J28o89j78j071o38J581J412j699j136
3348a153M40L40L83J434r31k325Q37J557k81L55J67k042j99J858R23j469n69M0
3366f35m15R06J803j101k107P84J000KO84k91k091mK142L95q99Q4o14r88J876
3385E31J162j115j447N14J23M45J414q71j887N9J859L25l91K41j461j053K227
3402F75R28j022p11k20k73R86J723j071k071K86Q61L56M11j88j384p65K024N29
3420A074o54k14j000p47J785J272j182j381J3N16j19J504j39k128J09J263K6K20
3438B18J00j071q87J400J350j006p63r7l64N77J749m51j921j08J103J24Q57k32
$$ y = [698, -1326, -312, 1280, 1058, 1132, 773, -802, -672, 1169, 2003, 548, 169, -155, -449, 1081, 2231, 690, -1156, -345, 620, 572, 1401, 812, -1539, -1120, 1137, 1265, 576, 398, -673, -1311, 270, 1682, -17, -1153, -713, -373, 10, 1444, 513, -1812, -975, 582, 301, 656, 823, -1219, -1418, 440, 1363, -106, -675, -635, -1050, -144, 1659, 558, -1549, -765, 235, 237, 921, 630, -1461, -1465, 677, 1072, 173, 257, -357, -1345, 531, 1693, 578, -869, -355, -232, 213, 1627, 756, -1131, -1072, 787, 1112, 721, 962, -499, -1552, 675, 1603, 581, -130, -350, -623, 363, 2086, 1015, -1056, -770, 91, 447, 858, 670, -714, -1479, 545, 1074, 420, 206, -794, -1541, 244, 1516, 334, -1047, -1034, -518, -637, 867, 728, -1400, -1291, -28, -2, 218, 318, -753, -1640, -240, 1110, 104, -659, -756, -1120, -543, 1206, 755, -1166, -1274, -171, -47, 810, 578]
3456E78j680n33J669P28o79O7m69j119J082J843q29j385L5O1L97J354l0j655m46
3475a011J200L77m9K83j011j268J438J631q40q72k56n29Q69J344l8j701m28O22
3493b39K69O37M70j488j066J733O87n27l63k86j086J080J459l92j354N6k25L59
3511b76J353p6j640q75J510K81J10L37j122j189J473J283o25o62l38p24O29J805
3529A254l9k148l45R06K11K28J099j719j166J349J127o85K17o75r03N59J753j25
3547H98j696J10k8K33J401L17j974o49J000P57p1M98j179j140J069J424k99p43
3565g2r1p21J98J466M69j635n97O37M5N89R96j643j133J316Q41j87j31m66j133
3584a252P71J768J15j619k77L04m49J295Q41j605p61R84N17j09O63r48j316P77
$$ y = [578, -1102, -1635, 34, 762, 83, 150, -319, -1438, -356, 1487, 658, -727, -692, -631, -234, 1120, 1090, -565, -1011, 189, 566, 517, 800, -211, -1479, -41, 1590, 750, -122, -378, -907, -38, 1306, 1268, -433, -861, -239, 30, 667, 1137, -351, -1417, 316, 1003, 476, 113, -173, -1259, -179, 1280, 888, -466, -410, -635, -276, 1077, 1001, -639, -1514, -4, 277, 387, 724, -398, -1587, -114, 1169, 544, -118, -456, -1180, -551, 1254, 1215, -933, -1278, -372, -161, 67, 1166, -553, -1719, -370, 757, 72, 289, -386, -1289, -730, 1023, 898, -798, -688, -716, -483, 918, 1235, -739, -1388, -388, 369, 298, 796, -383, -1523, -454, 970, 671, -72, -163, -884, -686, 780, 1249, -386, -983, -346, -301, 288, 1284, -359, -1492, -176, 665, 478, 347, -119, -1252, -481, 1287, 1402, -217, -494, -190, -639, 656, 1497, -108, -869, 115, 632, 523, 1186, 238, -1078, -301]
3602c01J767n27r73J63o44J02J591L49j657j38K72K68M23P36j001j134M15J456
3620A167n14k04J31j229K94J511J72j340m50J77r2R88Q51j351j129P24R21k87
3638C40N79o23j435N73J634j44q00k60p66P0J743N45j708p06O13o7M26O18q60
3657b28j041K26J569j41j18q2j171l18J810O09j537k30o1j50P55J179j550p68
3675a247L21O81K06L12k61j578K11J664Q0m10n60k68q8J150O09j110p88R41l63
3694d98K43J154p85j473N55J263j27j49j23r75k41J732M32p90o18j3j99P53J391
3713A532j327j205N98O80K7L06J08j416l66J774Q6m51n0p53m72J456Q78j001j025
3732f21M32K20K93Q63n60j580K60J233K45l35L3r08n23J435P43o99p16no85J040
$$ y = [-301, 1466, 939, -34, 129, -515, -413, 1178, 1527, -130, -268, 4, 272, 695, 1431, 430, -704, -289, 1167, 653, 449, 580, -649, -355, 1156, 1328, -12, -462, -285, -377, 611, 1462, 111, -1018, -294, 627, 340, 919, 296, -1139, -566, 1068, 924, 124, -136, -902, -832, 911, 1456, -252, -958, -345, -412, 14, 632, -228, -1269, -1043, 526, 385, 267, 185, -986, -1304, 506, 1115, -422, -652, -713, -863, -108, 1071, -479, -1247, -926, -245, -39, 273, 12, -1566, -1355, 309, 389, -21, -581, -849, -937, 213, 822, -288, -1076, -135, -498, -255, 899, 114, -1359, -804, 459, 332, 183, 60, -915, -1156, 576, 1008, 218, -400, -413, -612, 141, 1532, 205, -1000, -402, 278, 305, 611, 719, -697, -1063, 711, 797, 346, 296, -457, -929, 527, 1405, 404, -621, -189, 31, 324, 1187, 627, -953, -693, 540, 785, 450, 483, -425, -948, 487, 1230, 531, -185, -190, -875, 165]
3752A65J168j013r81N7O28L6O39r8j333k94J503P6l01j64l98o88Q08J509j226
3771I3m45k85P1M94Q14j5j776n7J262L52n17K86q81n47J045J188r21l20Np28P22
3792a60J214m62j490O9R60L7M20J52j634k03J300L72l51q1m31p98J181J112p16
3811D91j141L22J38K33Q65o9j344n26J331Q8l53L23q61o77J290R74o79n39J84
3830E0q67P68J216l36j196l12M86M73J31N20j299p84J283N00l28n3j30r32K89
3849e21J583n72q99M13l31M5Q11L66j626l27J222L51l04K74p59o96K25J516k26
3868E45q55K20l41J97J252o9j556p7P62k62O05L85j246l67N63O17n26L31n0j085
3888i57N54J074K45j330k45J18j6J401J91j460n17P77J43K7N85l18j032L47J422
$$ y = [165, 1333, 320, -661, -604, 24, 60, 699, 601, -732, -1026, 477, 553, 252, 88, -310, -998, -190, 1319, 93, -352, -637, -566, -72, 742, 727, -1049, -1106, 156, 508, -9, 277, -604, -1151, -106, 1082, 161, -159, -154, -882, -160, 1054, 592, -898, -829, 131, 168, 588, 740, -894, -1097, 203, 575, 224, 143, -288, -1086, 95, 1207, 491, -650, -328, -190, 43, 908, 839, -505, -1031, 300, 388, 35, 358, -503, -1180, 110, 1084, 405, -134, 50, -817, -49, 1167, 831, -365, -677, -191, 282, 413, 933, -366, -1150, 133, 633, 305, 252, 122, -810, -521, 1062, 490, -409, 4, -327, -282, 529, 895, -731, -1058, 164, 515, 211, 485, -274, -970, -745, 771, 545, -310, -90, -431, -234, 1018, 949, -607, -684, 78, -184, 421, 806, -440, -807, -244, 373, -153, 178, 128, -957, -403, 671, 916, -414, -659, -541, -557, 844, 1035, -425, -942, -165, -22, 5, 590, 272, -760, -413, 1009]
3907A009l33m43j02n44o3J153N6j152j41N94m78R06O10j106j435J026J079k65
3925C71J90m21r64J88J545L0j321J60j7j32J084J66j125p02J072J11j44M88m52
3944A27j288O46J452q61k86K59l27n57J312N81j082m15L40L2N02N96r89q98M27
3963d29J004k93L09n37n77J19J383k6r22m63L50j62Q60M85j201p46O83M74Q6K48
3983F45k05j000K69J039l39o2j96l83l83J181P16j249l88J91J09rJ079q16j041
4002h42P31O56k53n6l12l50oQ39K18r61J05K16q78J218K87n76r31N67M05j77K93
4023A93oj182n4J112P8p17L15l75l97J066M89j180l09N11m12O48M78k63j235O25
4043f15M08Q7J23J36j076k23J427L55o65k81L6m60N45R39n48j236P70L77K0N35
$$ y = [1009, 676, 233, 131, -413, -476, 677, 733, -419, -560, 34, -444, 462, 1072, -34, -1469, -443, 636, 371, 561, 140, -824, -636, 909, 939, -382, -222, -239, -371, 713, 879, -246, -948, 124, 235, 91, 579, 127, -1161, -515, 937, 76, -210, 49, -278, -835, 477, 1058, -24, -439, -99, -67, 435, 1031, 42, -856, -429, 575, 282, 591, 54, -523, -404, 979, 953, 31, -432, -82, -244, 616, 1101, -100, -846, -163, 311, 397, 645, 440, -560, -291, 748, 409, 347, 151, -232, -615, 566, 1282, 33, -355, -164, -55, -64, 1015, 199, -842, -111, 545, 292, 236, -76, -426, -432, 407, 625, -336, -231, -15, -893, 325, 612, 36, -895, -328, 77, -100, 193, 187, -995, -1049, 63, 141, -576, -261, -636, -1033, 33, 522, -658, -967, -456, -868, -220, 258, -5, -1240, -615, -207, -120, 3, 139, -937, -1160, 267, 622, -43, -324, -288, -748, -203, 736, 188, -1048, -278, 99, 119, 654]
4063F54K3j575L43J126P3l31mj86p60J206P08j163l64K59k33M64J124o17q12k2
4083h7P77r8R7N5r67q0Q98M79n49m56J82m16M10P96n98j048L90O31m70Q49j73
4104F22j255K29Q41L10o39L09n95q25J083Q67q03q09P87o54L71O36j88j050j27
4123h90R94k10O9N33r25m29P70Q00r10J4K11r21N35J007l36j314K45N41J90L6
4143A0N34j143o61J418J49j18Rl67p54J070J139j281k54J24k02J93P75O4j167
4162d62j65Q95N8J19J30n49o29O12P65o91j04r6k10K81Q31L06j545M08L24l99
4182a21N88Q74j421m64R39L24n98K19k45q10O87J225m97j125L15p1J40O67K47
4201H73j172r4R07k6p08O08r6j095O68R85p81j40L56n09p9J268k36j140K65L77
$$ y = [654, 677, -898, -555, 571, 644, 313, 309, 123, -637, 569, 1277, 114, -250, 9, -224, 240, 1364, 747, -65, -87, 690, 592, 689, 744, -223, -303, 595, 1074, 525, 69, 251, -165, 245, 1041, 443, -605, -215, 416, -54, 795, 622, -633, -404, 437, 747, 108, 417, -178, -1003, 80, 947, 144, -665, 122, -532, -161, 475, 287, -763, -890, 104, -106, -37, 496, -429, -858, -88, 712, -198, -184, 27, -894, -359, 648, 312, -1002, -757, -216, -26, 10, 544, -599, -1260, 158, 307, 189, 198, -169, -923, 147, 1286, 5, -249, -125, -327, -134, 641, 705, -462, -627, 268, 326, 445, 575, 26, -603, 9, 774, 83, -21, -117, -327, -46, 785, 1091, -454, -46, 278, -121, 467, 1341, -80, -544, 395, 719, 121, 340, 95, -715, -28, 1197, 700, -425, -110, -181, -41, 626, 873, -299, -393, 514, 488, -220, 388, 292, -803, -135, 850, 69, -71, 285, -224, -303, 965, 729, -411, -146, 231]
4221B31l02J71M82n33p08M50O53l23L9o4o13R9J095m66o98K60p9j35M81O16r34
4242b78l23O22k89j0N64k60q81O67O88o49m8K73l84l57R06J33j169OO35k52N45
4263A39J80o11n55M27M57k74OJ87p80Q7J067Jr14M04J15n42N21O49o87n65O61
4284b7j42K21L30m28q33L44J002o08J82O8o99J87P37L32q95j37K72J28j33Q55
4304G56p19p87R65M31l34P5N6o61l13J484n15n46M95q8o33M31R33q19m58K86K87
4325C26m81N11k12q37M03M40Q7m39N90n67m62J142j81l42l42M06m18L23O54n19
4345H2j034R35M47r45P35R8o52k10J014j79o09K0L14o24O47L60l81p01O33J36
4365H6P1M76l01j039M27R23k86p90N53k55j51M31R12j074k56N33j83k42Q63j45
$$ y = [231, -71, 100, 582, 49, -659, -209, 444, 121, 160, 96, -517, -418, 677, 211, -487, -227, -306, -441, 40, 656, -278, -601, 21, -268, -278, 286, 26, -855, -188, 500, -149, -197, 76, -308, -665, 241, 374, -795, -789, -154, -406, 139, 319, -292, -847, -420, 37, -237, -231, -44, -824, -737, 330, 331, -583, -179, -64, -606, -85, 564, -123, -688, -27, -169, 52, 382, -46, -879, -535, 467, -141, 41, 109, -590, -403, 334, 666, -229, -366, -94, 34, -99, 756, 37, -750, 215, 646, 312, 387, 443, -218, -531, 953, 438, -108, 387, 299, -334, 97, 1030, 211, -247, 39, 326, -155, 356, 144, -693, -290, 150, 237, -202, 388, -179, -641, 501, 320, -22, -364, 42, -376, -53, 601, 82, -952, -17, 430, -515, 220, 318, -334, -544, 470, 291, -318, -298, 16, -608, 39, 399, 18, -683, -50, 86, 157, 633, 332, -707, -280, 643, 357, -433, 120, -135, -286, 145, 1057, -17, -273, 260, 77, -165, 698, 553]
4385E53j041M95K98j45J50K45m93n80J218k44k60k24M91q40K79R94r48l54L74
4404c2J10j50N96r2r49K40P70j84j95K24k37p05P91L19j056J42N82l49O6K93Q5
4425B69q27K49L48l27N02J18n95m08J028N2p40k6K29o06O60M45l34n55M64J37
4445H3n17L99J41l90j26N60j71l01M98l72n24O11P65p77m04O67l86q6P36l22p01
4466f17J80L52Q1k36N04l19p20O10P19q19L87j05n01L25M62j85p31O46M01p08
4486b74M12M26p08l80J142M3p30L37l11n52L57Q98m46n31L71k73j00Q63p2r03
4506d31J64M68k54J64J61l02n08P02L3l57J78M75p31J87O42j18r39N00P0l34L53
4527A23L79o21k71O57k62k71L29M11j287M14J055n14n53M67k3l83P36J66q39K9
$$ y = [553, -488, 7, 305, 160, 310, 555, 62, -518, 700, 456, 196, -28, 463, -377, -98, 896, -52, -406, -32, 78, -72, 524, 432, -517, -277, 493, 309, 114, 338, 101, -604, 187, 506, -550, -408, 174, -175, -109, 184, 269, -558, -309, 39, -288, 214, 332, -263, -671, 357, 409, -331, -357, -128, -734, -74, 371, 37, -518, -54, 83, -434, -35, 106, -284, -410, 150, -21, -322, 176, -196, -720, -109, 656, -121, -525, 142, -244, -330, 406, 84, -617, -437, -85, -4, -240, 264, -55, -775, -165, 554, -265, 122, 17, -484, -159, 303, 118, -613, 33, 434, -274, 138, 564, -144, -524, 618, 661, -69, 268, -43, -595, -238, 660, 214, -317, 54, -219, -319, 544, 472, -431, -267, 201, -53, 111, 272, -30, -538, 164, 197, -160, 18, 493, -238, -51, 591, 473, -466, 34, 104, -230, 123, 502, -119, -390, 267, 5, -266, 63, 474, -813, -399, 656, 142, -411, 56, 33, -350, 386, 552, -287, -258]
4547b58M57j83n6P75p79k74J57O43o23N4K05l03j04P97l0q70K16R2k01M38K13
4568C66m28m05M99M5j11N5K57p68K31Q68o03n30P10k55k31N69k6m96m23R13J24
4589C61o12P17J8j249O10M98m71K1L64n55m1N74K0o82K32J86k83K39M50n28l53
4610d84L48L25l64L86M47j119j30P87J08m57K47l3k25pQ84p87m70O55j76j85P20
4631D70l08q90N82N20o16O5N92l84m45L78N01q77L83K41m74J65N41l31o02O29
4651A40K19m55K01L45p53PP89l91j53K56r5n76O09J81k51m08N66J60l96J74L91
4672E60q90j06J063n64o4M22p34j5O58K11n72l2M71o01K4O84k55p36N47N5l55
4693b29k7N26m83j59M76m5k57K22j38l31J36O46m69l38M02M1k22O25l8q45R7N69
$$ y = [-258, 199, 16, -40, 735, -44, -318, -161, 482, -141, -87, 118, -185, -289, 508, 478, -392, -176, -84, -285, 153, 366, -62, -467, 32, 77, -34, 21, 278, -490, -259, 609, 6, -524, 186, -69, -300, 269, 243, -253, -676, 237, 361, -251, 466, 484, -765, -155, 343, -128, -107, 257, -298, -339, 235, 255, -427, -195, -9, -292, -53, 397, -131, -484, -136, 189, -175, 211, 658, -461, -591, 196, 304, -153, 94, 61, -164, -171, 713, -74, -544, 111, -65, -250, 470, 162, -728, -146, 374, -242, -177, 415, 31, -414, -36, 465, -412, -29, 212, -262, -97, 444, 113, -489, 140, 359, -96, 105, 450, -303, -296, 493, 102, -51, 205, 110, -466, 143, 324, 73, -335, 231, 391, -5, 169, 560, -330, -436, 627, 63, -1, 421, -313, -328, 330, 541, -31, -63, 408, -193, -169, 515, 260, -476, 71, 126, -229, -256, 270, -213, -372, 104, 59, -198, 24, -114, -445, -309, 337, -132, -470, -68, -27, -249, 376, 338, -507, -410, 159]
4715A59N7n51N57l65m41M62M36l00k27L82k59j65N91M8o34j11M82j69JL93o49
4736c03n28R41j5k97J88N10r26L84L40j53j42M33j06n71N15L14p04p7N55q1n5
4757B22J18J91p12m3O33l93k50M41j50k80P28j08k07m33N36k81j86O61n47l82
4777d42Q19K43r76N99K7k79l94R28k02o04M12j88o31P97K98q25K74J81k4k5J55
4798A43j77m23L54K65k57j43N52m61l40N88L09r05L85J29k48J38N29l28n76L04
4818a62M58n83J76M41j040N41N44m53k11J15J32l63N47L17n37m54N79K08n15M16
4838A56J06p06j6O96j83l14O42l99j60M07j28m12%L18j32K63K88j39o08N6N80
4859C15l44L3K67k52n50Q35Q3n40K11J01j31l30Q45m40n59N98J39n55L95J32n07
$$ y = [159, 216, -335, 222, -143, -584, -122, 314, 14, -213, 169, -90, -255, 336, 384, -250, -361, 121, -48, -47, 346, -303, -831, 110, 95, -202, -14, 496, -430, -46, 294, 141, -1, 432, 326, -245, 270, 584, -120, -197, 358, 277, 222, 340, 531, -181, -224, 409, 16, -234, 207, 57, -223, 505, 397, 190, -243, 293, 12, -174, 487, -60, -442, 377, 620, -356, 243, 270, -9, -403, 525, 323, -281, 131, -57, -688, 109, 407, -418, -144, 37, 13, -12, 143, -34, -457, -103, 162, -95, -238, 314, -147, -487, 101, 410, -495, -110, 19, -229, -91, 438, 110, -466, -162, 296, -287, -111, 330, -710, -169, 375, -78, -289, -174, -42, -405, 142, 459, -78, -532, 47, 255, -260, 156, 262, -444, -460, 236, 53, -261, 381, -18, -178, 229, 101, -311, -311, 7, -125, 138, 426, 287, -321, -265, 315, -29, 4, 271, 19, -531, 304, 387, -153, 58, 159, 28, -302, 543, 103, -456, 142, 281, -274, 121, 253, -254]
4880b54p3N17J56m07j3K22m76K77M69l60j13K44j52J05N42n22n71J94N10l47n7
4901a09L68k09o88J148j20p08O34R1j121P35O41o69l10J30J18l15L21M02o04M3
4921b22L36k92M5J87J78o53J36N13j22n19N65l05n28J006K00j108L76P2L7j67
4941b65P01n97l14O16R7j04r7J81m98K39O7K98o80M58K43n32J93O67n45m24P81
4962D85k99n23R15m65n65N59K8j03m13O48n39J16K84N94q68J01L09K2k90M87m17
4983F6k57K58L43o54L04M36m83l87R07l3o90L91jl86K41P02p35J5J05K20l55J26
5005A33J75p23J28O13l39KJ62Rn90P70p7l85k14L61k49q6N36m34m52M41K88k33
5027a64o2K73n29m7N36K56p66K25L14l56P8K92q6n55N57j86l32N32L24p14j98
$$ y = [-254, -327, 190, 346, -61, -74, 148, -328, -51, 418, 58, -55, 189, 37, 142, 684, 162, -409, -215, 295, -52, -109, 259, 50, -638, 510, 390, -318, 316, 407, -714, 21, 662, -7, -317, -187, -69, -384, -63, 339, -265, -222, 114, -178, -133, 54, 232, -421, -285, 228, 106, -413, 152, -153, -681, 325, 525, -583, -207, -135, -98, -265, 436, -161, -475, 141, 238, 134, 37, 218, -280, -41, 26, 324, -356, 102, 345, -187, 6, 673, 128, -296, 485, 186, -337, 578, 113, -452, 107, 135, 32, -381, 267, -272, -156, 128, 722, -146, -45, 264, 286, -4, 483, 66, -191, 67, 410, -244, 60, 496, 13, -374, 533, 500, -190, 201, 200, -186, 55, 757, 22, 37, 142, 362, 7, 133, 308, -415, -287, 326, -13, -11, 151, 160, -430, 340, 263, -122, -336, 25, -224, -310, 226, -208, -660, -219, 69, -164, -226, 47, -482, -529, 7, 263, -503, -278, 36, -320, -242, 50, -36, -591, -34, -220, -552, -20, 304, -410, -608]
5048f08Q48l21j39J94M4m16L68K37l97j04N02k80m0O21n73j74r5M91l33M1J10
5069b4j44l87P08J35k46j95L69l86K00N90n26l21J11J75k9L8K39n60LP43l30m31
5091b68O47m14j47J40N58l94k34K26k18j28P18j08p14N25L61m89KN7j60l90P54
5112C24l2k67OJ93k14M5L27k53k62L6J61q1J53M23q57k86O68M3j3r0J52l88N9
5135a53O79o76J72Q2j52l95P12j8n97oL94K2l32M82m85k30M53K17m62K54J48m55
5157c46L13L15j95l20K67k64r6K82K57m31l21P09p2j82J38M40q84M67M49o96J09
5178f1L23m33j63O23K13n69j05L49O1m82N40o46J71l9N84m43j75R7k95K16N86
5199C52M0m92K30k49J08j67N24n54j44L93J84l14O80l29m91k59R94p79M5K86O
$$ y = [-608, 240, -81, -220, -26, 18, -398, -30, 207, -190, -294, 208, -72, -112, 509, -64, -238, -333, 158, -175, -134, -24, -168, -555, 153, 288, 42, -153, 216, -170, 30, 620, 94, -227, -116, 59, 30, 68, 307, -253, -250, 493, 163, -268, 379, -35, -182, -42, 516, 122, -112, 114, -104, -232, 486, 378, -336, 189, 550, 61, 63, 120, -40, -430, 324, 292, 25, 31, 224, 10, 55, 382, 129, -133, -97, 64, -17, 136, 559, -298, -584, 84, 127, 114, 24, 176, -212, -153, 526, -150, 22, 104, -48, -443, 269, 251, -346, -352, 42, 64, -268, 214, -271, -501, -48, 169, -293, -39, 109, -346, -33, 282, 87, -233, 34, -230, -326, -44, 213, -218, -539, 170, 98, -84, 54, 494, -390, 77, 526, -170, -61, 262, -171, -334, 289, 502, -67, -172, 177, 238, -244, 296, -350, -179, -218, 366, -77, -252, -155, -450, -234, 352, 392, -100, 130, -119, -11, -178, 346, -208, -352, 41, 225, -89, 591, 262, -229, -488, 506, -273, -228, 58, 64]
5220F4m55N01J18j47n35L03K30n32O53l12k66J94P32n24J91j43j97k32Q23Jo05
5241a38j81K53j69L07M0N5q72Q84M05m47N5K77p23j71Q22j59m18K58j7m50N63
5262A74K4l83j55N18j80KL76k38l46R9M36k18m25M85l98k2M60J90p30j96N96l76
5284c07J65O35l50n77L82L54n13K52r3k00O4L09q5j71MK6k77N47K09o08p8N18
5306B06l85j15M77j9p38K07N30k63J3J87l52k30N19K72k92N1Lq8j18N81J16r72
5328d10L31L15l86L36L12m58m68O87K11n54J26k77k40Q37J91m41j00q8K56l94
5348b14O24l05l45R3M26J16m37K01l05j54M49K24j71k95JJ5k09O03j48o14J85
5369b60N09j86j56J62n47K4N64N12n39R3j69n95O60L77m50n40J41K09n3J14K92
$$ y = [64, -391, 110, 228, 81, -454, -151, 79, -453, 200, -112, -378, -184, 548, 24, 215, 72, -125, -357, 466, 467, -138, -319, -66, -235, 72, 112, 167, -705, 179, 584, 137, 192, 469, -254, -425, 397, 238, -180, 78, 61, -389, 174, 198, -185, -340, 178, -2, 0, 376, 138, -208, -109, 327, 109, -316, 169, -229, -251, 209, 399, -331, -527, 69, -307, -142, 493, 143, -434, -52, 302, -211, 41, -52, -252, -188, 121, 36, -135, -131, -105, -382, 165, 374, -234, -312, 206, -179, -294, 183, 164, -574, -367, 163, -100, -87, 100, -252, -482, 37, 309, 17, 68, 71, -17, -135, 446, 562, -410, -79, 236, -150, 186, 498, 40, -428, 259, 470, -84, 42, -235, -475, 362, 553, 112, 12, -76, 180, -214, 410, 105, -240, -147, 279, 395, -42, 159, -146, -300, 149, 373, 202, -93, -92, -77, -286, 317, 169, -445, -260, 249, 63, -93, 69, -478, -454, 110, 622, 83, 176, 7, -588, 72, 449, -1, -541, -400, -191, -244, -130, 162]
5390A62l84l52N69K65l06J8J59m10K38L14k76l33K51j54J52N60j10n33j73O83
5410C40k50J31L04p77m72Q26L02m22j3Q3m74L69L51J18q37K17j46N80k13L10m92
5431a65j7M24m2j80lJ24k81r6O82j29m10J77m20L30L35j01k79j18L1J5K47K32
5453C56l89n63N87L43n7m21N49l99j22M30j04o82L51k9n1L55K96n45l03M20L69
5474C91m29J86j36m27K43Q57k47q39N92l19l09N56K86p26m1N67k77P2L60l78m80
5495d98J86M88k88P1L60o03k04R22q9n42j57M59m26K68O66m96l06j04K87P3J69
5516B36k2o09K71M22j84j09J78l2k43L38L09o59l91K78K97n7K40J12p81M4K06
5537a56M04j09q1k51j49N77j1n83J0M51k59J68J18m41k69L12R0L1J34M13q36k27
$$ y = [162, -222, -574, -5, 260, -46, -28, 131, -279, -41, 273, -3, -336, -85, -239, -87, 473, 363, -170, -343, 340, 90, 221, 525, -252, -724, 102, 404, -18, -31, 52, -422, -53, 298, 416, -421, -204, -350, 230, 17, 327, -165, -182, 242, 200, 20, 17, 141, -140, -236, 446, 317, -93, 84, -336, -6, 329, 228, -51, -169, -138, -123, 124, 356, -33, -596, -9, 334, 277, -144, 405, 6, -116, 314, 210, -472, -121, -150, -201, 154, 450, -95, -398, 22, 391, -38, 148, 12, -415, -172, 685, 438, -401, 191, -128, -437, 119, 405, -321, -362, 205, -72, 0, 360, -18, -498, -312, 176, -112, -41, 319, -284, -488, 434, 345, -197, -354, 105, -321, -53, 613, 117, -189, -293, -6, 67, 236, 214, -395, -124, 298, 114, 5, 183, 151, -92, 246, 555, -104, -495, -217, 80, 23, 263, 375, -406, -362, -156, 248, 139, 58, -193, -342, 235, 224, -359, -349, 102, -157, 11, 129, -312, -581, -269, -179, -148, -14, 399, -437, -664]
5559f64J134l08j79J31k35m49R10k0k38m33K2L02K36J75l09n20K22O53l57k31
5579a58K37m37M1M06M20m65j94J47o6l25Q38k27m31Q6K19k37K62n1q82N12N48
5600B43j8j88j78N1k73K70N38l16l31L72j25Q2R5j54l36K46J37P0k90J41j56l63
5622d83R25L4n34oJ28l76K48L51oj91j64L59j24j39K28n58j93O45K33l94J65J61
5644C09m45K8O13m90j26N31k90K60mJ10o76J8O41j47j55R7m78l43R07K87o67J02
5666H2L05l92q6M21K80o36o7L92l12J04%l8m32M55K62j13k01j46q3J78L32l81
5688g6j63J3K53J57q1J50n83q6O72j06o6j49l12k43O74L22n57k35L51R8qJ38K05
5711C68q81J24K84j03J65J52n11j91L49M98m37K94k85l72K51O71N1r02J05L90
$$ y = [-664, 470, 162, -17, 114, -121, -570, 340, 320, 82, -351, -329, -27, 209, 384, 75, -445, -223, 430, 73, -158, 79, -358, -317, 89, 509, 44, -150, -3, -69, -394, 444, 217, -214, -128, 91, -146, 116, 65, -817, -305, 243, 225, 37, -141, -90, -363, -93, 445, 129, -202, 170, 45, 127, 222, 68, -268, -22, 115, 185, -105, 36, -120, -483, 442, 476, -58, -64, 64, -312, -64, 287, 281, 90, -74, 285, 161, 22, 250, -308, -501, 144, 377, -17, 148, 309, -136, -108, 505, 15, -111, 420, 130, 390, 386, 496, -180, -162, 479, 332, 177, 274, -204, -547, 360, 647, -20, 82, 387, -5, -91, 330, 610, -26, -93, 299, -13, 91, 91, 53, -379, 76, 338, 225, 24, -122, -205, -27, 305, -76, -239, -226, 27, 184, 103, 253, -330, -416, 256, 150, 84, -65, -377, -620, 54, 376, -181, -416, -65, 33, 25, 163, 368, -513, -389, -105, -208, -43, 109, -402, -593, -244, 254, -183, 111, -174, -546, -295, 376, 427, -475, -370, 20]
5731B0l49N18K97q11l18P89No5j77K59o40O12L04p13N1J08l7k80N44K69n67j94
5753c75N64o4P9N24r89m71R34Q4k80K04q4j77k39P77m28j64J11Q2k1O30k67l06
5775A24k88K01M03j94P3j05p18P00K78j97m4j59k54l33Q99m8n95o5Q4M5K76P6
5797A59j35l18J79K84l59N5M32n48j92P51q9n78L44n3m05O21J32k18p41N60N33
5818D14p32M05J7o46k7O35L9m09J63k03K08m3M11m90j77N22k78m0O50l03r49M33
5840d00M69j17l0N55r18m24J022L96r38K05J24k0m2O03m96n22Q42j24Pm6L8n19
5862c35q4O90m4l0km7J9o1N9rm49N07J34l07L73k87k35j36P36l81J38J20n24m3
5886a98O47j73l99J80o3o7j4L75k53j71K67L30k52k9k5n01Q9Q64k93j41k85J44
$$ y = [20, -329, 189, 486, -325, -643, 146, 151, 86, -91, 168, -472, 140, 444, -269, -218, -110, -147, -427, 117, 386, -181, -375, 189, 125, 204, 728, -261, -732, 202, 286, 6, 210, 126, -51, -290, 487, 59, -105, 6, 88, 67, 697, 430, 124, -164, 37, 440, 246, 319, 214, -504, 196, 474, 277, 233, 74, -180, -513, 386, 338, -257, -322, -238, -193, 83, 159, 24, -294, -115, 169, -190, -135, 297, -251, -443, 308, 219, -359, -15, -68, -473, 148, 280, 62, -679, -119, 414, -318, 87, 104, -542, -569, 66, 105, -304, -141, -344, -136, -179, 232, -258, -435, 87, -191, -231, 419, 116, -833, -400, 69, -48, -78, 477, -441, -865, 157, 553, -385, -180, -56, -76, -118, 485, -11, -533, 309, 185, 192, 146, 184, -335, -419, 271, 227, 197, 195, 148, 167, 106, 165, 156, -293, 214, 348, 41, 414, 127, -108, -244, 492, 111, 249, 369, -155, -198, 449, 276, -123, 57, -6, -73, -87, 288, 35, -136, 131, 461, 209, 180, 155, -346, -257, 607, 314, 173, -112, 32]
5908C2j94L29N19n51m56K55J33j20K87j02n46K40M89p0k82K01k44j2L04K45l51
5929A06k51J02l16O21Lk80p07K29O19l40J99K82o47J23M87M4n69K59J15l89M23
5950A13N77r43j87K76R3K30J97m01j91j02M04j87Q9K58j47n90L47N02k18k83M3
5971a20q4j9P32k04r10K12K53L9L5J02l05J63J76L83n21m0J48m01L44N00n05L9
5993A7j64K5J52J43N1m32q5M95p6kK45k10n87N31K24k7n50K52k86J99M65j29q72
6016f21M68J95M8OJ70l87k58P00K85n81j12O2k72L26N93k89o42K48j26K80K58
6037C51N2n29k52M00J82j98J77q9o22L84M16o4m36M29k28k18N86o6p43L07M11
6058B50j62QL68l31m77N22K0j22k41J94j64j70O61k47l45q5L88M5J47qn03j13
$$ y = [32, -162, 167, 686, 135, -321, -66, 67, -53, 234, 132, -414, -174, 315, 245, -37, 164, -80, -92, 212, 457, 106, -145, -43, -359, 262, 265, -15, -722, -493, 126, -214, -15, 267, -380, -257, 230, 274, -295, -36, 79, -310, 113, 690, -253, -440, -164, -71, 159, 356, -45, -236, -338, 66, -121, -32, 226, 79, -511, -164, 338, 120, -163, -120, -204, -223, 509, 305, -605, -393, -140, -101, -66, 36, -269, -106, 70, 453, -68, -108, 40, -361, -17, 483, -22, 17, -147, -122, 30, 173, 224, -208, -293, 202, 126, 124, 369, 159, -428, 103, 327, 300, -250, 2, -284, -85, 380, 251, -621, -153, 42, 90, 96, 266, -121, -379, 321, 606, 25, -87, -25, -297, 29, 622, 333, -309, -61, -187, 93, 351, 403, -126, -378, 22, 204, 6, 183, 94, -528, -144, 272, 208, -228, 201, -27, -245, 341, 275, -468, -161, 250, 88, 96, 464, 133, -344, 178, 198, 76, -165, 29, -135, -305, 356, 109, -236, -321, 67, 112, 259, 251, -252, -365]
6080c65L85Q8j54M5R2n31K59M71M5n26K31l71K15N87l81k24m37M04P2O6K95j9
6102B47l63p9P24n30L43k73k88N8N05j70k51j36K29o0M51k02m58k82N81P7J14
6123B37r1l45r3J13M04J49o81M64j55n04P86O6o82N7L72l22L89j68P3o29N62L45
6145C47j14j39j00j89K1P03m26l68l93N10R4J50O20o59n14O93K8j61M2k22n97
6166f74P19J61O4m17j53J07J43J66J52l21j45P0L8L87J98m28m15K61K33J07k72
6187a9M7o1k79O95j16l66J72k17nL61K07m18n83O71R8kj93j11m9J52L65j42m26
6210b19K88j36M7J27M89l92l96M55j03R3n1q9l82O3K61J32j31J10l71J37R9M31
6232D62n86R0J80J6n7K82k85k92K41m1M49k13J56q23J15P52m3j37l96K39l75J31
$$ y = [-365, 20, 108, -46, -1, 91, -440, -181, 290, 335, -191, 40, -331, -116, 471, 90, -134, -571, -167, -95, -29, 266, 247, -116, -195, 529, -1, 342, 69, -219, -161, 344, 174, -77, -213, 16, -44, 407, 205, -253, -535, 46, 123, 237, 146, -199, -292, -179, 225, 374, -307, 157, 2, -502, 284, 350, -332, -275, 97, -225, 164, -4, 69, -560, 2, 347, 233, 94, -6, -195, -174, 529, 103, -265, -658, -148, -54, 96, 716, 57, -457, 236, 264, 103, 145, -77, -674, 45, 206, 270, -147, -300, -193, -50, 116, 268, -53, -198, -128, -90, 297, 495, 67, -348, -87, 146, 253, -19, 28, -33, -312, 383, 267, -99, 73, -144, -149, 212, 419, 1, -582, 89, 187, 185, -8, -119, -168, -16, 349, 207, -219, 69, -67, -20, 107, 596, 204, -192, 263, 160, 253, 202, 113, -269, -206, 55, 187, 56, 166, -205, -68, 31, 462, -124, -34, 146, 162, 105, 387, 102, -190, 51, 10, 459, 246, 402, -421, -306, 446, 403, 266, -130, 109, -266, -135]
6254a35M61k57n60M37P2l23L63K86q25M90J92k07l45K96l71K88L57P3l12k13P9
6275a54L39l13O59p73j61p4O10k7M5J74q03K47K23K47l41l1J19k60J70L96l25
6296c3j29n5L6J50M69m66m20KQ74j98k63N2j93j74O40mj78j90j37L96k07L83J2
6319C67o51J70M39k26J29n1j98l22M29M61q00M08j94k53M5Q71m80l11K44k9n76
6340e28O82q1m99K10K91K84j21k91l5k12L71N12m80j24l4J8k11N18n1k12j75J70
6362Bl5q4J12k32m02N13N56q00J93p5l76K60Q62n83l86K45O1QM74j29m83n8L81
6385B4L18n81J81P0l10L47M41k67l51j14J74j9L34J83r73M67O6r0M18j72j13k42
6407b09K72K53k37O4pj12j32M25j14q8k65J78k59N28J53n22q2RK70lO1j92k43
$$ y = [-135, 326, 69, -491, -54, 18, -305, 58, 344, -481, 9, 201, -6, -351, -55, -426, -138, 219, 292, -20, -233, -154, 185, -128, 531, -242, -403, -477, 133, 106, 151, 325, -478, -231, -8, 239, -102, -133, -14, -274, -104, 292, -33, -162, -217, -181, -31, 438, -28, -448, -446, 428, 230, -33, 19, -174, -348, 292, 288, 110, -80, -217, 179, -28, 355, 367, -284, -114, 325, 99, 228, 177, -21, -343, 86, 547, -253, 155, -39, -292, -247, 624, 144, -167, 77, 48, -528, 154, 73, -426, -216, 75, 359, 238, -53, -88, -300, 71, 583, 103, -21, -55, -37, -248, 270, 219, 7, -168, 2, -33, -117, -5, -237, -639, -126, 430, -370, -177, -252, -628, -368, 494, -89, -475, -230, -169, -161, 313, 184, -299, -357, 24, 342, -239, -58, 12, -298, 49, 490, 223, -128, -242, -68, -87, 247, 430, -543, -76, -10, -100, 318, 146, 33, -209, 63, 316, 79, 143, 136, 24, -108, 317, 203, 115, -150, 28, -231, 297, 450, -72, -154, -145, 125, 122, 183, -9, -252]
6430b52M40M80l47k77q0Q3p9M32k09l06qK9N05K2l07K45m58K43K13j77q5j95k4
6453a12J39K25k09l70K92J19j60N4N51m80j71L19R7q9k18J78m51K18L91j46l53
6474a76J07J49l39M08K09o02r1L99j42kK06n1l70%M51k23j18K5l06J23N22j47
6496C2l36M92j85j35M27R9l91k74J00L79m42J73l33K40j6N42k07l92K13j14o5
6517a93P0O41n86m80O08k9l3l0j30k35N52L44l36m38N30l88o1K74K54m56j79N58
6539B57k99qL00j93m98N12j59K08n0j3n23M43M55j86pj36P4l38M41J78m22k27
6561a91L53J02k49J00O8l19k62J006l75l52J20L6k13M89Q9m16j83M88k34N3M36
6582E46o05l50K53L93m29L49k5l08NK59j1k70K37k98K00M62j95k80j55L68l4j99
$$ y = [-252, 188, 668, 321, 44, -36, 47, -32, 400, 191, -115, -123, -94, 411, 433, 126, 371, -87, 156, 369, 192, 107, -88, -112, 27, 252, 43, -327, -35, 84, -76, -22, 529, 49, -122, 197, 294, 205, -13, 165, -286, -68, 323, 177, -176, -69, 80, -259, 149, 358, -244, -335, 64, -78, -80, 126, 75, -295, -295, 156, -67, -185, -160, -466, -343, 179, 32, -304, 188, 3, -132, 295, 394, 3, -271, -171, 208, -234, -61, -394, -154, -170, 372, 165, -227, -14, -128, -193, -123, 518, -68, -548, 60, 31, -2, -32, -162, -397, 155, 499, 163, -275, 255, -133, -194, 80, 334, -122, -301, 257, -42, -50, 250, 57, -441, 71, -88, 120, 70, 57, -466, -23, 432, 246, 239, 103, 177, -161, 280, 458, 36, -191, 162, 264, 15, 115, 183, -136, -398, 608, 233, -119, 1, 37, -176, 313, 402, -14, -197, 291, 57, 110, 546, -59, -409, -156, 237, -192, 157, 132, -176, -171, 88, 77, -193, 44, -254, -54, 408, 213, -67, -222, 146, 112, -87]
6604h7L52k96n14n7N97J00n27n3L89QJ47N65n75k85J90L8m67K83K12m67K39M5
6626a63J80J93N5p09o9N24M24p56J85j25O4M90q0j71m08J2N69Nl60Mk9k86R01
6649D50k47n12M02k15P7K7L93m49j61K26J52q5L50k42p03L97M65m8j81J04n56
6670c56p2P31j54j54o6j04K64o5J18r9k79P5J93J15K64j96l00m4J86J25k92K23
6692A13l83q2L13L99j81k16N6J28l9J02K22o58k93P67n9m31L03k76J21M61k60
6713A07k23J61l78K40J70J66l16r9M8R0R4j0J63m44N9N21K6o54J73j36J85J79
6735A22j48j93O1k74J01J66M55l63j49P4J98J45k85Kj62l29N42L07j90l28L29
6756H1n5kJ69j56j57k15K1M72J35%m53jP1K31j55K89j11o39L73M55j04m01L46
$$ y = [-87, 265, -31, -545, -602, -5, 95, -432, -485, -96, -88, 59, 624, 49, -236, -46, -8, -475, -192, 20, -447, -208, -163, 17, 210, 265, -444, -513, 11, 435, -321, -136, -261, -197, 293, 213, 42, -366, -354, 215, 220, -140, -136, -165, -451, 450, 203, -309, 93, -122, -45, -18, 375, -74, -235, -9, 143, 58, 408, 166, -537, -140, 325, 277, 96, 200, -356, -428, 303, 149, -5, -71, -175, 89, 24, 142, 43, -236, -161, 32, 147, 411, 215, -85, -129, 57, 182, -110, 113, -270, -352, -39, 360, 179, -37, 19, 147, 108, 210, 432, -226, -519, 248, 189, -242, 61, -215, -94, 367, 107, -116, 45, -333, -93, 77, 243, -73, -172, -124, -34, 60, 50, 213, -231, -172, 349, 375, -279, -106, -242, -57, 122, -26, -219, -158, -432, -331, -165, 290, -73, -222, -148, 50, 195, -90, -88, -250, -579, -37, 270, 80, -248, 81, 26, 24, 193, 37, -120, -335, -314, 158, 293, 293, -160, -161, -90, 141, -14, 275, 164, -475, -102, 353, 249, -152, 194]
6779A94N3k86M30k88j93j37M60p8J52J14o30J0L31K32k10m73L05J00q0L39j73
6800A72n39M86m6R5M52l52m29l36M16L41J42l71ok16J88M91j49p93L39Q9k35N12
6822B51ko94r0O52J17jj59n5l51N96p1n88K33p9M4R8M60r7m54k29o1N98L03j2
6846D09m17k50L56K8l27M09m1m02mL88J98k36l51J87J6J41K64l42j65J72mJ64
6868A93K8l14k09N5M58O9l88J13j19r3M47l1n19j9M71M9m37P71n93n73P38L05
6890D02k90k37Q3K93j19M17n21l67K77J46j18J96K44m95l79P17L7k10j91J38l74
6911c51K08K94j64r1L0j13K17J78R5l66j28L58j29j01M28n19o3K53K7nn2k64j01
6934c59J76M14j81j50j50R0J94r5K29J36m15K26j44j0Rk82j58R8M68j07l59K37
$$ y = [194, 247, -39, 391, 103, -90, -227, 233, 155, 307, 421, -209, -199, 132, 364, 154, -319, -14, 86, 6, 345, 172, -367, 119, 73, 168, 620, 268, -161, -497, -81, 260, 402, 31, 25, -191, -3, 488, 339, -454, -115, -26, -261, 251, 249, -445, -535, 117, 234, 233, 74, 19, -332, 264, 193, -395, -162, -241, -197, -99, 361, 264, -190, -419, -480, 118, 421, 409, -8, -258, 98, 126, -201, 208, 167, -235, -239, 149, 347, 111, -240, -53, -37, 104, 368, 26, -139, 33, 29, 193, 221, -93, -302, -247, 211, 280, -108, 5, -114, -207, 240, 209, -310, -329, 142, 191, -246, 525, -68, -641, 97, 402, 112, -125, -42, 251, 132, 549, 28, -339, -62, 84, -34, 162, 406, -89, -468, 249, 286, 76, -115, 23, -351, -143, 151, -13, -104, -74, -187, 30, 208, 303, -63, -191, 167, 38, -63, 365, -154, -217, 36, 63, 58, 6, -258, -359, -183, 231, 50, -100, -250, -160, 34, -61, 168, 304, -111, 115, -29, -39, -30, -312, -470, -372, 96, -11, -370, -133]
6956a33j05J29p2K02j62l57N27j03l2L98j16m22Q7L37j1lj52k68K01L20r7k96
6978a28J09l5KQK26K5m11K25J30j96J53J05o36N20L50k59K04j69m24K74J77%n5
7001A95k87L40K07m98L71O9n09K0N56k88J29m25L6J22N25k67k00nJ56j94l13N39
7023B79k77J16j67L97l70L42j27l94j16O53l20J42k94r1J8K89K59l54l09k88P61
7044A49p6K38l45k30mM78j14m14L66o6j3K19O0k50n32N11l57L29L57k15k14j51
7066b74J72J17j57Ol93M26K6J37l73K94l9m94Q95j08j27P9J31j15j67Q9Rl14K24
7089D4J30p8m3J16k16J40j20L41m63K17%l97L78K95j02m94j19L51K12R1L9o99
7111c77P2O12k12j51K2j09N4K02J81m98o1J71K68j79q7L75l24j62J23N36m08k48
$$ y = [-133, -238, -109, -181, 21, -141, -498, 29, -74, -106, 292, 176, -246, -159, 178, 167, 164, 12, -256, -55, 265, 168, -128, -19, -54, -52, -44, 182, 207, -204, 21, 151, -45, 108, 213, -423, 97, 447, 188, 392, 223, -201, 73, 250, 250, 195, -92, 248, 455, -43, 328, 397, -112, -92, 464, 176, 305, -120, -84, 38, 563, 296, 96, 91, 247, 53, -260, 279, 2, 118, -49, 348, -22, 320, 193, -201, -317, 336, 16, 158, -136, -227, -209, 80, 339, -15, -324, -612, 149, 73, 311, -34, -264, -268, 210, 96, -318, 48, -18, -31, 188, 248, -2, -534, -23, -380, -51, 306, 91, -123, -274, -102, 15, -142, -136, -529, -103, -77, 60, -313, -19, -58, -552, 343, 235, 108, 187, 318, 203, 36, 125, 134, -180, 44, 174, 96, 53, 169, -47, 93, -27, 314, -149, 68, 68, -329, 49, 344, 242, -252, -371, -20, 192, 283, 322, -377, -305, 307, 95, -56, -34, -143, -89, 113, 294, -204, -265, -94, 174, -5, -92, 283, -41, -203, -80, 456, 48, -200]
7133b00Q1K01m7M13n04j11q5m3J73R8J51N3l92L19l8J85j63k77J07K66n7k62J2
7156a20Jq2J30j80M81l66l13Q63K2k15l1k34m1R5Q9p5Jp6m1J18K50l19R6p4k99
7181c20K37N4K49n81K54L6K0Mr2q6j84J69N87l15k74J42j68L8K02J84o14L00M2
7204a16QL61N5m87k90O73k46J54nM4l15KK95P6m39qJ57k1M97q4l36l5j06N61l74
7229B1P5K36o01M30K61n32J50m9n6N3L69J8p53O92j67n6J16R8l55l11N73m26L9
7252a75R0k7J64o5L41k79P3m78J76L98j07L81p30j91K89K47k27J67k41j17K39
7273g2K94rj69J88n33K29K04O7l22J68jp9K67j13l08j07M55J2k80J15J44l64J21
7296i3J84L37n30N8L7r6J32M42p26r2N58l06NL96j31k75J65qP0m4j97K00l55N64
$$ y = [-200, -119, 82, 35, 448, -56, -167, -252, -295, -122, -24, 127, 180, -212, 107, 69, 254, 91, -186, -79, 187, 130, -132, -120, -119, -201, -71, -251, 230, -136, -449, 414, 436, 221, 190, -44, -85, 10, 99, 24, 25, -51, -92, 26, 276, -43, 53, -21, -320, -83, -29, 220, -361, -107, -71, -51, -47, -139, -225, -409, -240, 347, 32, -242, -100, -268, -230, -28, 156, -458, -158, -116, -108, 253, 308, -179, -469, 204, -42, 112, 107, 151, -164, -162, 133, 209, -230, -238, -81, -102, 395, 311, -25, -60, -166, 395, 21, 96, 332, -269, 161, 422, -110, 40, -9, -65, -12, 357, 375, -378, 314, 147, 91, 207, 305, -50, -361, 212, -214, -175, -85, -112, 52, -13, 328, 49, 122, -356, -180, 218, 111, 492, -238, -429, -140, 107, -120, 47, -194, -311, -72, 222, 213, 44, 232, -301, -72, 132, 199, -123, 45, 44, -35, 232, 119, -189, -296, 159, 171, -109, 6, 150, -214, -93, 91, 428, -102, -44, -7, -103, 29, 471, -255, -347, 211, -95, -90, 306, 175, -100, 65, 57, 127, 83, -114, 86, -269, 295]
7320B95J85m22k12K26K2j18L20k79k99P9J72p3K34q9j89J47K98j25k82j68r2M47
7342G7m3K62l92j02J57k4J62K2r0l43J13N63k16k94K73k14k30L60L74o17o3J98
7364f7J29l72M17j80l18L87J44k84K02p6J05n4p3L60m33J93l13K08J69O0k94L6
7386e4JK42q4j81K43m38O6M87k63q5K06m99K89N2L25k84k43M11m53L72K8k99J29
7409c2j04J44J36j06M9k07j58K12K87l9l26j76K46K91K3o1n37M87j54L2L59j93
7431A73l49N3K96j10j80K11l25l7M16K17m90k01L68j49K79J36m34j07m2L18J70
7452B13l98J42k3m9M19j83j80O3l31L27K64m1kl23M04o2l20J77k62L4k44M76J47
7475B48j09q2j98J72J1K96k18l03J28P4L27k06J72n83k3K44P1oL64m49j33L03
$$ y = [295, 480, 58, -154, 72, 94, -24, 296, 17, -282, -203, -31, -104, 130, 41, -148, -1, 297, 172, -110, -278, -370, 77, 34, 296, -96, -198, -41, -65, 97, 119, 29, -314, -201, 362, 146, -148, 125, -89, -319, 41, 415, -202, -265, -67, 62, -310, 107, -73, -391, -4, 140, -144, 58, -18, 87, 33, -40, 320, -113, 80, -233, -25, 144, 204, -90, -54, -53, 189, 105, -76, 167, -271, -205, 282, 19, -66, 140, -359, -70, -18, 307, 23, -220, 191, -262, 110, 138, -161, -32, -136, 8, 144, 38, 87, -120, -278, -66, 221, 182, -144, -320, -74, 217, 240, 179, -358, 129, -25, 7, 366, 173, -176, -123, 173, 63, -117, 94, -231, -268, 148, 365, -125, -326, 42, -107, 172, 308, -126, -233, -275, 43, 213, -185, -43, -66, -115, 304, 121, -59, 4, -327, 0, 264, 223, 221, -102, 302, 240, -80, 97, -165, -131, -375, 101, 248, 139, 57, -141, 31, 42, 338, 120, -183, -55, 19, 346, 140, 312, -271, -294, -50, 21, 15, 379, -70, -203, 100]
7497A00l6j27mJ55k69KL58M2o12L12K0j74K36M3k08j83L63J33l53J42k70L4OL91
7521A01k85P9L43j63L8j51j6P2l45L92j26J80j94k86q5M62K26j81k02k16L68q2
7543g1M02o43LK12J31j43L31m1l29J19L43l01L7J70j49j21L02j64J06j50k22J95
7565A7Q9Q6k14k66K74j2J40Q2k72L38n45K45M25j79q0j15j53rM04o5k31J13J87
7588B59l26K43J05o33L04K63P3o39O42m54k5M01L75o81j79L14l0j12K52Q1n17
7609b84K58P3J11m8M2m04l2K49K23k3l96J32M9j41J84J47l76j6K40j11K97l04
7631a30k09K49L95j09l74L01k49J67l26N73j42j60j88J09P5K2J90m07N6n4L57
7652A46l17J52J55n13L78J95j31j62P8j15J84N37k89m06k28M28J69k31k5m7Rk20
$$ y = [100, 64, -63, -67, 88, -181, -179, 179, 221, -391, -79, -59, -233, 3, 46, -162, -345, 18, 151, -202, -60, -330, -296, -290, 101, -184, -105, 238, 75, 113, -38, -54, 18, -327, 65, -61, 119, -75, -361, -446, 16, 242, 61, -141, -357, 11, -71, 331, -312, -309, -97, 34, -109, 222, 181, -148, -29, 314, 13, 50, 220, 71, -50, 252, 88, 194, 44, -178, 17, 106, 192, -22, -288, -14, -26, 114, 196, -76, 262, -283, -38, 387, 208, 128, 13, -140, -149, 255, 190, -41, 72, 259, -67, 176, 281, -352, -48, 215, 288, -351, 291, -163, -188, 213, 588, -93, -272, 42, 12, -100, 152, 233, -284, -26, 47, 158, 110, 152, -252, -284, -35, 188, 165, -231, -99, -50, -191, -7, 140, -236, -252, -12, -123, 174, -130, -339, -90, 305, 196, -178, 123, -126, 41, -285, 288, 146, -14, -202, -93, -18, 4, 194, -213, -157, -211, 146, -171, -19, 136, -377, 1, 196, 65, -97, -19, -134, 50, 587, 298, -108, -336, 92, 261, 30, 5, -42, -33, -253]
7674b53J02K04l66N01k77J41J60J81j71m20L53j92l2K65l84K16om7r9K51J94o82
7696c61J82J56k00J44O2Q4j20K77j78q8M5L9J5j01K31j57n5m16K71K38M9j54m62
7719d99L09K06o3J6j64P9j07j46L61n41K25K63m2K64l17M25o57N11J89m85o4j5
7741b52p6K3L60j70j69J70K58j5j74L85l18k81R1K51J37m02j07J83l6K73O5r6
7763A00k74K7J38J31J00k74o5k6M37j28j8l3J8k94M34Q7l15K10l13M1J79L7r1
7786A08k84J25k07N25j05K4m17M59J19j49k20Ok76Q5N74q3l16j03L66l22M65k78
7808I6l62K03k22K90J34m7J25k30j26K35K99n84O1J74k95O6N34l71l68K61J4n0
7830a63L82m47p9L00J76lRk76q3J23J80j41j26K57M4m26K73Oo2k79N14j31m8J83
$$ y = [-253, -151, 53, -313, 188, -89, 52, 212, 393, 222, -198, 155, -37, -69, 196, -188, 28, 22, -25, -124, 127, 321, -361, -179, -23, -223, -79, -17, 67, -53, 224, 46, -42, 3, 42, 57, -44, 187, 30, -25, -441, -170, 68, 117, -37, -499, -190, 16, -47, -31, -195, -116, -223, -369, -8, -549, -324, -61, -103, 161, -156, 269, -388, 123, 312, -173, -237, -252, -328, -305, 55, -115, -284, -114, 144, 129, -45, 340, 22, -259, -168, 83, 220, -182, -289, -106, -142, 131, 196, 100, -174, -147, -9, 122, 222, -52, -117, -143, 294, 166, 148, 115, 133, -161, 273, 360, 45, 255, -58, -17, 162, 199, 108, -176, -51, -258, 267, 162, 186, -231, 228, 347, 198, -22, -16, -292, -207, 367, 284, -32, -135, 231, -91, 374, 96, -266, -63, -285, 5, 139, 92, 217, -13, -139, 96, 395, -189, -128, 46, -249, -183, 351, -20, -388, -127, -113, -163, 219, -228, -307, -7, 169, 166, 175, -101, -184, -61, 119, -22, -148, 109, 153, -273, 0, 6, -56, -335, 179, 48, 0, 183]
7854A83k08qj63J93n1j63QL62l87L55K66m18r2K14j87k0J00J23m84J76J54j0J26
7877F9L21m03oR6J09k71j00M54l37O2J50J12k43O8l18L81j90J64l38j33L66M6
7899E9R3k98N9J20L04l75O2o3l40J55K16M9j31J43j98M66k97M0J75l70K3k2M39
7922C09l57KK53m69J95p2N66j37o15M85j21j45M22k79j19J63J91k22k70J54mJ40
7944G0k2K41j71k43k3K77j7K31o69J83J64J40l26L86j8o04K41J12j2rk9j98L35
7967C9J83J26o86J72P3K98l1j41k91j32L62L73l26J0m6j04PL31r0m01J14L28r4
7990G4P2K17o79J43L32l3m26M10j60o2o0L96l72n9k2K68L5K90n1m69j19M67l22
8013a30m4N99l04k98J88K00N3k09kj13k50M61Nm30L2J29J30J26k23J13LJ93m67
$$ y = [183, -25, -33, -196, -3, -54, -217, -209, 153, -234, 121, 387, -31, -123, 91, -96, -116, -16, 107, -377, -201, -47, -57, 69, 390, -13, -19, 77, 186, -85, -185, 269, -68, -6, 144, 256, 13, 81, -237, 144, -46, 118, -220, -353, 13, 59, 152, -146, -87, 33, 337, -38, 24, -39, -379, -224, -8, 41, -90, 53, -145, 321, 24, 64, 239, -131, -108, -130, 309, -48, -46, 207, -262, -67, -139, 427, 290, -325, 160, 39, -106, 316, 37, -82, 81, 272, 50, -220, -66, -70, 70, 48, 289, 118, -125, -148, 129, 112, 343, -326, -143, 21, 161, -165, 221, 203, -401, -160, -48, -60, -69, -98, -296, 39, 222, 348, -338, -166, -93, 205, 174, 33, -258, -390, -28, 345, 19, 29, -17, -121, -114, 217, 127, -274, -160, 168, 74, 146, 363, -316, -173, 159, 126, -300, 110, -50, -112, -172, 224, -148, -207, -229, 39, 74, 364, 313, -156, -275, 192, -130, -174, 425, 121, -177, 11, 211, 264, 55, 53, -60, -310, 151, 156, -274, -242, -113, 17, 143, -80, 33, 36, 229, -238]
8036b38L91m2r2j95J43L35l98K38m94M26j14J93j17J37o46M34K0Q0J97k64J7j07
8058i6J51n5r5n2m4K78n5J84m4j67j29N2J19J25l19k27N07Nk3j9l82K86O4l3K25
8083B56R0m70n8J36P1N4l52L03r0K29j56J43j07k85j8K08J8oO7k3l46M58k77j66
8107c21J70j9K44l20M78j64k55l3L60j64K94k1o78N81j39J24J41j96l19NJ87J91
8129A46l38k6M21r6N3J79l28l22M75j0J25l30N1j53L1M32q5l81P3L1K30o9k96
8152a87L72j90R2J58j98K32j38k93J41J15j49K17l48r6o9M69j52J34j39J41j13
8173aj12R7j68P1M6J21K94k00m11M51l00K70j07J41l03J13l8o1
$$ y = [-238, 153, 111, 19, -176, -33, 302, -96, 142, -352, 74, -40, 153, 36, 173, -473, -39, -19, 61, 258, -6, 11, -96, 55, 0, -95, -147, -191, 87, 32, 216, 172, 5, -124, -72, 47, 172, -147, -374, 133, 138, 115, 96, -286, 0, 64, 31, 256, 346, -124, -182, -46, 25, 79, -273, 30, -60, 169, 13, 156, 49, -236, -254, -46, -28, -34, 33, 10, -336, 122, -155, -321, -151, -170, 74, -246, 232, 68, -187, -220, 140, -24, 270, 249, -429, 152, 13, 137, 278, 82, -237, -232, -45, 146, -192, -218, 203, 107, 160, 339, 11, -311, 164, 154, 279, -51, 0, -153, -122, 310, 225, -156, -83, -52, 178, 109, -187, 185, -5, 87, 245, 47, 279, 141, -152, -11, 104, -45, 172, -176, -272, -341, 128, -24, 110, -29, 112, -1, -113, -16, -184, -113, -67, 54, 348, 148, -263, 188, -112, 158, 51, 192, -111, 2, -36, -97]
8191i7
$$ Imaginary data points
##PAGE= N=2
##DATA TABLE= (X++(I..I)), XYDATA
0@%%%%%%Qj6J6k1K9l2M0n6O7p7R5j14J34j61J88k17K55k94L36l86M41n01N71o47
30c42P27q18R18j025J145j279J421j580J756j946K155k385K638k923L242l592
46a888L988m440M954n553O257p094Q116r394J1046j3278J6483k1499L0537n1940
60c3705J93796J98454k73282j14475j36J28649J47527J8536k43807j60159J01731
71c6871J82548N7796m0937j72282j39881J15389K39263K1899j48397j25342m2192
82h9007R1975K03810K9635k13228j51406N9175J21033R9853k671j87824j72435
93b11090R0747J88597L3016r2307j31632j08626P8733K14477M0730j71069j24395
104a92819R938R5471J54198M6267j76669j55834P8964J58438P2156k0865j36742
$$ y = [0, 0, 0, 0, 0, 0, 0, 8, -8, 8, -13, 16, -16, 24, -32, 35, -42, 53, -61, 73, -88, 100, -117, 138, -156, 180, -206, 235, -266, 305, -342, 385, -433, 485, -540, 605, -674, 747, -833, 923, -1023, 1132, -1253, 1385, -1538, 1704, -1888, 2100, -2340, 2614, -2939, 3318, -3776, 4340, -5054, 5992, -7286, 9197, -12302, 18235, -33705, 160091, 358545, 85263, -29212, -29348, 99301, 246828, 265364, 21557, -138602, -36871, 145677, 203473, 162536, -9746, -149627, -34238, 205025, 226924, 78527, -46815, -89007, 2968, 206778, 236413, 23185, -128221, -69046, 51987, 151840, 149169, -38655, -211090, -120343, 68254, 101270, 8963, -122669, -231295, -152562, 61915, 102645, -68424, -192819, -182881, -87410, 66788, 113055, -63614, -219448, -140484, 17954, 90110, 69245, -67497]
115f7497j45453P2515K06309M3281j25037j18699n7833O2630J80688N9171j70187
126f0112j45480M0064J16691J11408L5296j37716j54379P1968J90018O6625n2661
137H1722j02428j02212N3243J99781O7861j38482j26073j2253O6702J33904N9647
148A81412j47913j64006L8989J34488P3778k497j08384j41846L9110J87911P0645
159A61687q7911r9743n7218M0852J63008Q3154j28482j41814J0668Q8312R4951
170A27464M1788j14364j64099K0548J49037O3246m4833r7859j13069J1622J64444
181D3925Q2500j07829j21254k7030M9247J23313Q1256j05499j54499J3612J20521
192a737Q2115J6067q5709j40564L942J59805Q1486p0982j01179p4105R361J35120
$$ y = [-67497, -212950, -140435, 65874, 109155, -15882, -134581, -192414, -129784, 50904, 110075, -60112, -205592, -165528, -48837, 62571, 97867, -39849, -194228, -122260, 67758, 134383, 81722, -20706, -122918, -69675, 130106, 197967, 59485, -66588, -78841, -12139, 121765, 181412, 33499, -130507, -91518, 42970, 116748, 114251, 5867, -135979, -96869, 91042, 161687, 73776, -25967, -83185, -42333, 120675, 203829, 75347, -66467, -55799, 32513, 127464, 169252, 54888, -109211, -88663, 60374, 123620, 78787, -19072, -132141, -120519, 43925, 126425, 18596, -102658, -129688, -80441, 42872, 124128, 18629, -135870, -122258, -1737, 80378, 96445, 10736, -129828, -125886, 33919, 115405, 44423, -56756, -130861, -121500, 13620]
204A3620R3605j01962j44946j3727P2243R2777O1127p9360j51944l78J41084Q6184
216F8323j3995p0253j00849n499J49436J04940p3451j12347l8480K7748J03643
227C9216Q9787p6844j53043j7597R4677P6064K6842o1134j33131k3351J37428
238a086R6982l9610p9566o6358l278J19967J13457n9510j27907k5439N6946Q4371
250F8969P1120n1068j45222l2488J10382Q2721m938o2911j05284l6186J16574
261A1669J08216m9035j07429n0748J2735R1011J01634m2612j39204l4240Q3105
272a4898Q3296M2980l8167j22577m5088J13483J03792k2278p6927p5751k7052
283g9187R1326J11354m0903j27808m8804L5310P1840P4596k8938j33720n1161
$$ y = [13620, 107225, 5263, -139683, -153410, -81167, 11610, 72737, -6623, -158567, -158945, -17861, 68323, 54328, -15925, -116774, -122273, 27163, 132103, 58652, -53695, -92175, -64427, 39216, 129003, 52159, -100884, -118481, -23804, 52260, 79102, 17968, -115163, -138514, -1086, 95896, 56286, -23280, -89638, -92916, 27051, 140508, 80998, -46909, -72348, -15402, 68969, 140089, 89021, -56201, -88689, 21693, 104414, 99476, 36565, -68719, -104905, 11669, 119885, 70850, -36579, -87327, -74592, 16419, 118053, 75441, -63763, -98003, -14898, 68398, 111378, 73211, -49366, -94454, 19029, 122821, 100543, 23616, -52135, -79187, 12139, 123493, 82590, -45218, -94022, -58712, 13128, 87724, 58786, -74934, -126095]
294a26095R3010R0500J4217m0461r0936m6637R8186J18226k0114r2712n3197k334
306e8347P0783J01368j9495j30654n5648N6606O9518M3478k3428j13757o6012
317a25588Q5410J02994l434o0354o8180l6369P4719J19647p905j07066n1552K6810
329e0868O6162Q1550m103j17943o7695P0327Q6642K1490l3186q8972o6194O9056
341c3734J13670m663q6466o2004j5643N7171J02450M282j13377o4122M6372P3339
353A7275N5313k549r5744p2786O8624J05421J3540m9960o6603m7690N2175J10772
365H7788O660j00157o4120P999M9933P4965R069j04572p7770N0835Q2799L1535
377E4964j6420p2244o7545N2992J13900J7001o7112n5454k0960M3095R7712K1444
$$ y = [-126095, -33085, 57415, 71632, 31171, -59765, -106402, -8216, 110010, 89896, -2816, -56013, -58347, 12436, 113804, 94309, -36345, -91993, -35387, 34131, 77609, 54181, -59576, -125588, -40178, 62816, 59382, -972, -69152, -105521, -30802, 88845, 80940, -26126, -77678, -50868, 15294, 96844, 92741, -25202, -92897, -22570, 64072, 85562, 52376, -36596, -102790, -33734, 79936, 75273, -11193, -73197, -88840, -31669, 70781, 75063, -38314, -102436, -56064, 17275, 72588, 70039, -25705, -98491, -29867, 75554, 89094, 39134, -27469, -75159, -22984, 87788, 94448, -5709, -69829, -61830, -11897, 63068, 72137, -32435, -110205, -59370, 23429, 54964, 38544, -33700, -101245, -48253, 65647, 82648, 15536, -39918, -60878, -17783, 79929, 101373]
389A01373r8175p2525K6795N9050M9603N398q6063q5092M2413R5782K0776m0234
401A9101o0878n2784L5946J08347K7132q0923o2322L722M5878P7714K8137q5540
413C530q1595L5194P8561L7081q509o6582p7151K9721J03189K5354o1637o0914
425d3758l1490K6411Q9702L4316q2878p6533J5942N5808N4973K0503o6623q2745
437h6372K9275R3509L5159k6855n1720n5108J9453R7346L7674o8331o6908j0839
449e3717K9909O6336L4214p2288q6892J5465O8266L9297J991n2250p4115J5437
461f8347R7081M0973m3006n1421l0580J8291Q3972M8057o4146p5715L952M5369
473D480N0228K6086n6470q7875Q373Q0857L7081k0991m8602n8935M858Q8681M8491
$$ y = [101373, 3198, -69327, -42532, 16518, 66121, 71519, -14544, -99636, -57223, 38559, 59335, 19101, -41777, -94561, -58615, 49732, 76864, -4059, -66381, -62659, -16781, 60933, 89070, 3530, -78065, -42871, 35690, 72771, 64262, -2320, -79471, -49750, 53439, 78793, 17156, -43758, -75248, -48837, 40865, 75181, -7697, -84230, -68288, -12480, 42493, 62996, -3627, -86372, -57097, 36412, 71571, 44716, -7004, -62112, -42659, 54687, 92361, 24030, -42878, -53717, -23808, 42528, 76742, 4454, -82438, -66973, 1293, 40590, 42581, -9669, -83784, -68347, 28734, 69707, 26701, -24720, -55300, -37009, 46963, 95020, 30874, -44841, -40889, 4480, 54708, 80794, 24324, -63551, -55178, 25679, 62760, 41769, -6833, -65768, -60910, 27771, 76262]
486G6262n3171o3243j4035K5932O6422M6745n2640q2771N899O4429M3663R831
498G3323m2423p5342j324Q4423M4873l6863n3363l8883K381P0352N1240n2631
510B5763p6716q220L7026M7612L3492l9974q1754k828P3548M4581p734l7516n4642
523d7362o308P5913N5640l9528o2004k2460J1924N2766M7494m1217q3852j1511
535g0505M9677L9736J3884l2411p2494j4924P3695N2449k1704m4207l6206l060
547f6070O4057O1538l3204p0977j4367L0524M4736L8367k7411q0600j8077O1421
559a0063M5274l624l3158n6638j9792O4808O0826k6839n7384k5598P807M9869
571d512N6920k1676p5446j6956M6785M4661K3612j8624o5541k4852O2677N6375
$$ y = [76262, 23091, -40152, -54187, -28255, 38167, 84912, 32272, -50499, -44600, 19829, 63492, 73323, 30900, -44442, -45766, 38657, 83530, 46667, -6696, -45579, -43198, 27154, 78394, 25763, -50953, -59173, -22147, 25465, 58957, 18983, -62771, -65599, 7949, 52530, 44796, 7280, -47362, -53670, 22243, 77883, 38355, -23649, -46109, -34185, 18581, 66075, 24858, -58994, -70505, -20828, 18908, 32792, 381, -72113, -87037, -13342, 39107, 17403, -26804, -63010, -66070, -2013, 59525, 26321, -44656, -59023, -28499, 16237, 54604, 27193, -53407, -71484, -10063, 35211, 31587, -1571, -58209, -78001, -13193, 47633, 20794, -36590, -62188, -54381, -4512, 52408, 30732, -44714, -61670, -14885, 29776, 53388, 34764, -30777, -55629, 7048, 63423]
583F3423j2605m0206l9502j4588M9130O1624k1560o8415k4428K0275L8086M1356
595E2590j3629p1821k7199N1333M9246P318k1354m8469k5820N3009O4504j1509
607E8199n1266k8834j690L7532N5152j1428p2543l0768L1737L7960K2433j3166
619C3318o2656l6629M7560N7042k940l3939l7629j9676M1417O5760n581o0333
631a4286k7936J5216L4815M3628k278o6625l7269L9325M7026R537j7857m8414
643b5118l6858L8302O2562l573m7653l1600q201L0440N6933K714o2420l3827K6874
656c1425L8743K9215J3n1400m0691L7901N7796N810k6859l5170k6336K7531O1588
669D6716L648n4779l4303N520K6521M1492P049n7620m2705K9196M6286J6935q236
$$ y = [63423, 50818, 10612, -28890, -43478, 5652, 67276, 45716, -22699, -47127, -26852, 11234, 52590, 38961, -32860, -60059, -8726, 40520, 47838, 26484, -21985, -47805, 5204, 69708, 58199, 6933, -21901, -23591, 13941, 69093, 57665, -14878, -45646, -13909, 24051, 46484, 33318, -29338, -65967, -18407, 38635, 35695, 1756, -35873, -55549, -14132, 51628, 46047, -14286, -42222, -27006, 7809, 51437, 49159, -17466, -54735, -15410, 31616, 41153, 23296, -25118, -61976, -23674, 38888, 35315, -12338, -43938, -52139, -21699, 35234, 37948, -24472, -58299, -31425, 7318, 36533, 36546, -14854, -55545, -17644, 40152, 45962, 19103, -16067, -42403, -14872, 46716, 50364, -4415, -38718, -33198, -6677, 34815, 41864, -15756, -58461, -29265, 17021, 33956, 25720]
682B5720l9089l7295K9237O4010R627l7861l0435j1304K3095N4232J2663n5245
694G355m1118J5369L2742K7129M186m7498m8504K3604N4549J2101k2167l2692
706a4944k9584J8881O1939J6186m5424l4247K119K3848M3006J7642m7509m7241
718c5328J9172M3356J9182l640l5268m4451J4203N7365J5166l4265l2318j8009
730c4835J2307M9640K1546m5891m2862R084K9785K9022J4154l5709m8422J4784
742b7397N1953J8442j4577k7899l2303P492N4094K1680l9389l7900o213J4191
754a7826L6024K0728l9861n0954P942L8356K1029J109k7766m3761O618N5274K3334
767C0246k5170k9293j8143P472M6695K8441l6973m4761J226K4457K6933J5549
$$ y = [25720, -13369, -50664, -21427, 42583, 52210, 14349, -16086, -27390, -4295, 49937, 62600, 7355, -33763, -18394, 14348, 41477, 45663, -1835, -50339, -26735, 27814, 39915, 17748, -14944, -44528, -25647, 36292, 52478, 7054, -27193, -25074, -1226, 41780, 59422, 11913, -35328, -16156, 27200, 46382, 42742, 7474, -36977, -22774, 34591, 49757, 15492, -16826, -34835, -22528, 27112, 48658, 2767, -40095, -31011, -1226, 27796, 41950, 6241, -42181, -27397, 24556, 42998, 28421, 522, -31781, -24289, 29805, 51485, 12096, -25804, -32017, -17826, 18198, 38926, -935, -51889, -43947, -5591, 15438, 16547, -11219, -54980, -48362, 6912, 30246, 5076, -24217, -42360, -34888, 11807, 40248, 3275, -41486, -40260, -15803, 11130, 26679]
779B6679l0337n2093K839M6174K0822j1407k5676l3549M3N0415K9760k9371l5052
792d0753p298J2764L6451K9459k7164m7777K590L6399K3721P596k0666m3110l377
805d1165M8097K7131j9578k7101k0819j059L9832L3446k7231m3131k965K0876
817a3667K6539K2476j7640m7111k708M3212K6769l158j8320l0586o547M4065L4468
830E7792k1648l4979j1886N049K9501L0608k1300m9204p512K9373K2683R602j6030
843B2049m1761j1105M2879L1842j2274k4411k0459m660L5392L7295j7948m2486
855e647r098J5685K3027K2923j4384m7551j4120L4252K5663k878j7656l2902j4738
868c7424L5394L5387j5222l2919j4243J790K5344L3912j0779m4491j1617K5449
$$ y = [26679, -3658, -55751, -52912, -6738, 14084, 2677, -22999, -56548, -56505, -6090, 23670, -5701, -40753, -48051, -35287, 1164, 30623, 3459, -44318, -41728, -5329, 18392, 25988, 5322, -37788, -41165, 6932, 34063, 14485, -12616, -33435, -34494, 5338, 38784, 11553, -31578, -34543, -13667, 12872, 35348, 17708, -29403, -32111, 11101, 37870, 34712, 16392, -14194, -20741, 23324, 57792, 36144, 1165, -10721, -5672, 23829, 54437, 33137, -16067, -23579, 5794, 28477, 38079, 22049, -19712, -30817, 12062, 43904, 31630, 7219, -13240, -17900, 17492, 54787, 36839, -5647, -14745, 940, 23967, 46890, 32506, -15045, -29165, 5087, 30750, 27872, 10216, -22686, -37424, -2030, 33357, 18135, -14784, -29027, -27237, -1893, 32019, 21240, -23251, -34868, -9419]
880i419K3334J2500q076l8527j7622L4297L1918p889k2144k1772j1617K6029L7203
893B8215j1396m0280j3383J1126J9657K4959m373m2576j6900L0500K7962M083
905A7594j0099k6843j7646L0399L9669p484k9280j5607j641J9817L3629m172m2930
918a4594j7999J9554K1124J3234m103l5678k2576K7937L4481j887j7297j9470
930a7274j3039K2324M0138j880l5213j5352Q822J7904K5729J153l8276k3269K2490
943e743K6506M909q112k6468k3220K0290L7720j835k7105j6306n214J4400L4079
956B3901M039l6581j9883J5831K0458J5787K273k8800k5837K1052L3194K147j4752
969A2829j8464j7539J3717L6623K744l3387j8810L316J2976K3989O354l3556k6285
$$ y = [-9419, 13915, 26415, 18339, -20188, -37810, -3513, 28405, 20516, -1628, -23400, -35017, -8988, 28215, 16819, -23461, -36844, -25718, -6061, 18898, 14525, -28051, -44951, -14451, 13511, 17594, 7495, -19348, -36994, -6595, 33074, 25590, -3690, -19297, -20938, -1121, 32508, 28336, -14594, -32593, -13039, 8085, 21319, 17216, -18462, -41038, -13101, 21380, 19493, 2196, -17274, -30313, -7989, 32149, 30269, -4944, -20296, -11474, 6430, 32159, 33312, -4964, -28233, -5743, 20763, 25672, 17560, -8908, -32128, -11838, 25882, 24047, -3058, -19364, -24578, -10178, 23901, 27940, -8641, -28524, -12693, 7765, 23552, 25825, -2975, -28812, -7760, 25434, 27581, 12829, -5635, -23174, -9457, 27166, 29910, -3477, -22287, -18971, -5995, 17994, 24348, -9208, -35493]
982c5493J8213K6567Q185l124k0793k4353J5814L8586M729k2763j5812p221J0170
995g295L1962Q965l3487k4343J0119J7028J4197M793k6387k9550J3548L1904N602
1008A7056j2492j5582j8321Q780L6068J0339k6681j8478K085J1001K3672J2159
1020B9606k7022k8077J1442K4487Q877j425j7691k7124O942L3823P905k0089j6077
1033a4423r475M306K9006J4353k6738k4243O849J6212J5193R854j9118k8652Q432
1046a8444L0949R309q811j3701j8797K491L2872J3193k3611k0852j641O486K0433
1059I876J4369k2497l0163O437K2757J0169K738j3443k5960L382L3224J2920j4598
1072I211j4358r709J934K7045J8264k1925k5441K590J2417J3272J1372j6045l0770
$$ y = [-35493, -17280, 9287, 17472, 14348, -6445, -30798, -14984, 23602, 28331, 5568, -10244, -17465, -7295, 24667, 33632, 145, -24198, -14079, 2949, 17146, 21939, -4448, -33998, -20450, 11454, 17056, 4564, -11018, -29339, -20559, 15509, 25848, -833, -19311, -17226, -6225, 17447, 29606, 2584, -25493, -14051, 10436, 19313, 17888, 197, -26927, -19985, 13838, 21743, 1654, -14423, -23898, -19592, 9414, 23767, -2971, -27214, -20365, -4153, 11040, 20894, 1776, -26876, -18444, 12505, 21814, 13003, -698, -19495, -17004, 15868, 29061, 5450, -15402, -17043, -10557, 9876, 24245, 1748, -28415, -21978, 779, 10948, 13686, 243, -25717, -22335, 10889, 23809, 9211, -5147, -14856, -12922, 14123, 32387, 10462, -14979, -12389, 28, 13300, 24672, 8627, -22143]
1085b2143J513K7174J0362p026j1206j8889k660K9193J8113j7734j8834k629M669
1098a0097J8490J9181j5668k8657J984K0379J0330M710r905k5812m221K7952J4194
1111B2860j2527j4494j1321l137K1562K0354j6186k5610p07J1042J2589J3563
1123A7988r205k8469k383K5298J3567l166q753j7628o382K5163K0378j4336j9836
1136g764m933R35J4340J9314j1098k9808l266J7528J0330N589n749k4362p452
1149b6396K5557J8347q404j1575r538n349J9215K3105j0301k4421k939Q854J0188
1162F343J4036m975k8441p561K0675J2862k052o589j6744j1119K0608K1861r244
1175I660j7303n882R3J2398K1159m690k6248n506J5463J0862O609j738k2002j1681
$$ y = [-22143, -20630, 6544, 16906, 9880, -1326, -20215, -22875, 6318, 24431, 6697, -12137, -14766, -10097, 8393, 27574, 11906, -16751, -14767, 5612, 15942, 20652, 10747, -15065, -19286, 8666, 22860, 10333, -4161, -15482, -18619, 2943, 23297, 7111, -18499, -19206, -8164, 4425, 17988, 8783, -19686, -22069, 3229, 16796, 13630, 4877, -12751, -19133, 6030, 26408, 12072, -7764, -12697, -11762, 2578, 21892, 10794, -19014, -22280, -4752, 5578, 11167, 5418, -18944, -26396, -839, 17508, 9104, -2471, -12009, -17358, 1857, 24962, 14661, -9760, -12699, -3845, 6343, 20379, 15404, -13037, -20598, 77, 12939, 10887, 4298, -12446, -23565, -2957, 18904, 9660, -7643, -13525, -13432, -1034, 20125, 15435, -10813, -16319, -856, 10006, 16615, 14877, -7125, -18806]
1189a8806J9986J8563o425j1065j0759q087J3035K2581o608k3588n904O352Q706
1202b019J4429n42k4903j0211J8130J4794N03l688j4521j2347J6561K3254n756
1215A3684j7080o252k559Q395J9865j595k5054r930J2024R297O570L60j9597j4612
1229b6484J6583J9598k932q520q355r041J0925K3999j020k0267o761N036P087
1242a52J4526L497k2020j3586J4505J3450R46k103j2943j5031J1949K2317j959
1255A3396j5121o461k751N870K0117L764k1301j0230J1061R483P610L705j5911
1268C231j5426J2488J9137q80p782q184j0566N981K1959J221j9754q600L215M550
1282E90J2755N782j9096j5712J1730J3935K124k40r800j5440Q233K2024J099j3346
$$ y = [-18806, 1180, 19743, 13318, 2253, -8506, -16593, -3558, 19023, 12415, -11173, -17077, -10725, -2019, 12410, 11868, -13035, -23246, -5116, 9678, 10181, 6493, -8028, -20375, -3814, 19440, 13684, -3396, -9648, -12207, -3812, 16053, 14458, -10596, -20526, -8502, 795, 7365, 7725, -11872, -26484, -9901, 9697, 6765, -1755, -10110, -19151, -8226, 15773, 14753, -5514, -12275, -7239, -152, 14374, 17871, -4149, -17735, -3230, 10220, 11166, 9063, -3880, -18911, -6962, 15355, 13396, -1725, -8186, -10937, -5067, 15050, 18814, -2487, -12717, -1656, 7827, 15437, 19142, 3231, -12195, 293, 19430, 18550, 10768, 2584, -7982, -2001, 19958, 21179, 1425, -7175, -3960, 590, 13345, 19127, 31, -15681, -3951, 9984, 12108, 11868, 2068, -13372, -5139, 16885, 17984, 4638]
1296D638o796m421L027J7796N581j9818j2856O552P043N952M478j3583j8455Q057
1310a2805J7880Q84o382o200j1255K800K1077N495j6123q325J978L646J1927Q380
1324A2977j4856j6689P627J2682K540O11p792j6510L742K0273K744j2015o262
1337a0928m328k9J6474R646j5810j2609N645P601O723P763r790j7396N801J7944
1351F707L155m460n330j0661k01J8862P790j4373r941N96J817J0156J0052j2279
1365A890j6931N216J1994L721J966m589j4787L88J9358O209r039n404m468j407
1379e883J4131J1355j2663j3935L233N394M763P171o935j8108J146J5222L851
1392H742m198l347j0309l330J6986R973j1408r322N74Q89Q407J1589q516j6471
$$ y = [4638, -2158, -6579, -3552, 14244, 19825, 7, -12849, -6297, 746, 6698, 11176, -2407, -20862, -12805, 5075, 5959, -423, -6623, -17878, -15078, 5999, 11494, -4629, -12954, -10976, -7330, 4597, 12977, -1879, -18568, -10941, 1741, 4281, 4892, -2900, -19410, -15668, 4605, 7349, -4666, -10928, -15256, -15285, 1189, 10835, -4975, -17584, -11939, -4338, 2385, 10148, 358, -17038, -11237, 6707, 9862, 5402, 72, -10589, -10790, 8072, 15862, 1489, -8452, -7856, -6039, 4117, 14169, 1890, -15041, -9825, 2169, 5890, 7856, 3267, -11520, -11132, 8226, 14435, 5396, -8, -4476, -5883, 8248, 19603, 6940, -6995, -3762, 1632, 6395, 13566, 6631, -11477, -10331, 4891, 8742, 4544, 1197, -9112, -12442, 4544, 14517, 3109, -6213, -5639, -4750, 3657, 15246, 6730, -9741]
1406i741K857J0922L000K728l368j4961k891J6367O620q442n537n113l684J1313
1420G0J2126r682j3956K476N021M454Q612l655j6241j071J4633N247k533j797
1434C704r477n462J4506J0963r333r703n45j131O143J1638n660j6327q12J0064
1448a432L059L057m36j3436n401J4717Q984n828m257l376m778R526J3170o298
1462G271j3173N44M171L159Q058j407j5722m138J2070N226k080j507q285p065
1476a2878J1068J2774p318q666l73j043M632J2623k222j5162j042R056L195L271
1490G915J316j2220o942J2093Q990n467m281l589n918O352J3274m444j2784p51
1504f456L456K295Q419J091j4008n380J1350O286j234K47o323q532R054J2470
$$ y = [-9741, -6884, 4038, 7038, 9766, 6398, -8563, -11454, 4913, 11533, 3091, -2446, -7559, -11243, 70, 12196, 2514, -11442, -8966, -3945, 509, 9121, 5466, -10775, -11846, 2787, 8034, 5501, 3704, -5773, -11235, 3271, 14234, 4901, -4802, -5347, -6478, -335, 11303, 5643, -10684, -11496, -1432, 1627, 4684, 4248, -9188, -14589, 128, 9112, 3284, -973, -4349, -9127, 399, 13569, 7271, -5902, -5358, -1187, 1972, 10030, 8623, -7099, -11237, 833, 6059, 3979, 2472, -5813, -12878, -1810, 10964, 3646, -5020, -5393, -6436, -1804, 10819, 8597, -6565, -7607, 1449, 4644, 7915, 9231, -2989, -9931, 2162, 11152, 5685, 1404, -2185, -8103, -1751, 11523, 7079, -5705, -6456, -3000, -705, 7714, 8805, -5203, -10583, 767, 7053, 5819, 6066, -257, -8789, 265, 12735]
1518A2735m243q527j137k392K313J1512k72j4415l892P244K444K731K569j0359
1532c689q726R658J0042l436l711k349n874M324J3221j050j1730j635K870J207
1546h78P215L410j2502p502Q956N541j480K25n456r275N637J2299k161q318j021
1561e310k228J101J1300K340j2181m653P099K658K832M005p932r704P440J0268
1575G035k733l045k163p020J863J2402O87j1232k761K464M67O273M874j0385p906
1590a1180P426O394n07J679l349r423M401J2193n37p044r60k113n28R850L817
1605A0119j0736o309N251K446J387M571o214j0616N296R544j360k241j029o365
1619f256k0J2133K761r171k798K252k19N429O130q099q919N322O106j159J580
$$ y = [12735, 8492, -35, -1172, -3564, -1251, 10261, 9989, -4426, -8318, -1074, 1370, 4101, 6670, -3689, -12415, -2757, 7285, 3849, 138, -2211, -8085, -3761, 9460, 8410, -3320, -4955, -2085, -878, 6337, 9747, -2755, -10257, -1301, 4240, 2760, 2985, -2471, -11746, -6109, 6190, 4029, -4289, -5310, -7538, -6437, 4863, 7203, -4978, -9631, -2532, 126, 2958, 6963, -969, -10673, -3233, 7035, 4302, 1257, -906, -7926, -6063, 6339, 7026, -4206, -6967, -4503, -4036, 2237, 7111, -3274, -11180, -3754, 2640, 2133, 3812, 463, -8960, -4559, 7634, 7097, 53, -907, -3020, -3548, 6302, 10119, -617, -6926, -1675, 771, 2158, 6729, 515, -10101, -4805, 4739, 3379, 1138, 109, -6256, -6276, 5857, 8618, -553, -3351, -1099, -1318, 4111, 10241, 2142, -6777, -1455, 4651, 3492, 5072]
1634E072k688r125J096J0971N49o724j053k288j603Q491N747r183o263M746K251
1649dJ397N664l863j0163K755R605m04k369l72o103k062J0073M020q456l867J822
1665b327j655M100O471o108q985L735N857p05K097l74q657k98J0302K190n484
1680A59n60j630l060P254O457p087o789L263J323N99M951k098j0404J163Q250
1695A791L05k412O58n326l113Q570N739o659l405J935j305K819P306l881q907
1710e885K524N562m60J761L93q072k478R204K936n107j144j412l705N134P658
1725F909n579o592K317J814N02N292m80r086j34Q247R02j977J529m431m477P359
1741B115O163n764m002J317k230J736P151k603q854P79N021j67J335J700o577
$$ y = [5072, 2384, -6741, -5645, 5326, 5875, -849, -1902, -4190, -5793, 2698, 8445, -738, -7001, -2255, -4, 1393, 7057, 3194, -6969, -4214, 5391, 4987, 2618, 2246, -3857, -5919, 4154, 8174, -282, -4149, -2327, -3982, 118, 6589, 481, -8504, -4769, 1088, 383, 2480, 2106, -6551, -6849, 3453, 5643, 159, -401, -2031, -5091, 2163, 8620, 1533, -5256, -1993, -670, -71, 4880, 2782, -7622, -6459, 1791, 2096, -316, 342, -4984, -8097, 473, 6212, -447, -3852, -1917, -3222, -403, 6903, 3022, -5885, -3361, 2201, 1741, 3502, 3895, -4177, -6655, 2549, 5485, 378, -766, -2178, -5883, -749, 6909, 1330, -5262, -2945, -1131, -629, 4663, 4183, -4903, -5037, 3210, 4112, 2135, 3664, -767, -5244, 2115, 8278, 2514, -1488, -171, -2401, -665, 6486, 3883, -4971, -4192, 829, 662, 1997, 3697, -2880]
1756b880l641Q330L543m064k35p18m351M023P749l773o777J989J372p63M790M33
1772E027p897k252O890M86j880J684l735n038N703O489m530l515J550j663O13
1787b068O881l40q151J07M642k54J182K614n823m918O339M052l881o14k90m883
1803e405K395P344k253o365J228J245q20M003K316o919k667O047J657j649K314
1818B471k470n429M064O762l494l364J258k034m10O339O72p197j308M102j010
1833a048P28L654m532n329N388M550l354j25P36m051Q20P484q62n809J094J157
1849E01j492L635K769o006l292M773J450j861J722j154o011K635O495k023l719
1864a578J503j513j387N866K053o539j430M109j89p3M131l450n496L706M241k203
$$ y = [-2880, -6521, 1809, 5352, 1288, 1053, 335, -4016, 7, 7756, 3983, -2794, -805, 567, -196, 4594, 5027, -2870, -5122, 1768, 2254, 374, 2058, -1677, -6715, -1012, 5477, 947, -2568, -1018, -2681, -2068, 4813, 4473, -3678, -3571, 1071, 817, 1999, 4613, -1210, -6128, 211, 4263, 382, -232, -522, -5405, -3010, 4334, 2081, -4284, -3056, -1811, -2631, 1372, 3688, -3231, -5898, 149, 1806, 157, 2471, 1, -5428, -1364, 5398, 1904, -1460, -202, -2236, -2646, 3693, 4365, -2832, -4140, -38, -1048, -320, 3334, -1198, -6527, -1139, 3411, 57, -68, 668, -3383, -2563, 4921, 4059, -1750, -656, 501, -991, 2644, 5413, -593, -3885, 888, 2338, 477, 2199, 1045, -4966, -2331, 4164, 2141, -1578, -75, -1588, -2975, 2891, 4944, -1595, -3025, 1084, 895, 822, 4953, 1503, -3993, -287, 3954, 1751]
1880A751o75N21m058o61O792j08n562L45J426k182K611L881m665m011L815K018
1896A238j729K257K26n342Q57O119j232l072J413j245k580M992K650n490k187
1911c125L408r38l73L852k180n756K808M197k249l45J794l447j567N985J517n190
1927a609M51J690k388K212M065l820l962L217J799k025J802O69n195k33N504m60
1943A717k845J147o87l202M171L712m824k095L294o77m01L997p81n469J778M235
1959C070k012o82K089k965k390M717J837m181l94J075k079R38M263k537m167K790
1975f28J488j845J877J720m888n49M963L29l038J766j64l640L144L691l530k501
1991a805K710p79j335L471q8n048P31L550j376j199K535k109k925L869K452l420
$$ y = [1751, 1076, 1597, -2461, -3122, 3670, 3562, -2000, -1655, -229, -2411, 200, 4081, -584, -4595, -780, 1238, -491, 1766, 1992, -3350, -2493, 3626, 2394, -678, 735, -510, -3090, 1902, 4552, -938, -3125, 283, -655, -1028, 2824, 644, -5112, -2304, 1893, -356, -701, 1093, -2354, -3921, 2064, 3581, -1609, -1158, 532, -1856, 356, 4421, 601, -3361, -144, 1655, -370, 1432, 2101, -3094, -3327, 2177, 1717, -1128, 19, -668, -3870, 301, 4013, -811, -2906, 388, -289, -690, 3307, 2526, -2943, -1165, 3070, 1058, 376, 2465, -500, -2890, 1827, 3664, -517, -911, 164, -1915, -977, 3286, 749, -3418, -628, 860, -985, 892, 2612, -2276, -2825, 2138, 2467, -571, 1195, 1031, -2609, 535, 4226, 696, -1805, 905, 126, -1209, 2262, 2174, -2874, -2143, 1407, 31, -1168, 1367, -742, -3667, 202, 2654, -766]
2007g66m52K025k152k92M937j300m797K472J501k101J638J873m019j817M239O81
2023A670l057J478N1l413J666M134k414k580K295k33j983L509Q70m404O9L677
2039A335j190r28K754j962l263L125K680l270m19K178k503r08M169n39m163J469
2055a435J996k497J386K225k941k079L536J163k520J606M34l213J408L739j762
2070A046k589K291j78k338L029J444m209n11L110j031j462K824r37l332J791L230
2086B178k871j41K024k008j156M099L46l864J361J645k336P97L224k748k560K874
2102H64R88k381J128J208l345NL696j390k207K080m3k685K340K309l027j253K815
2119A102m91j648L054k49l425J136L122k254q06K433j752k072L258P94l539O16
$$ y = [-766, -1218, 807, -1345, -1637, 3300, 2000, -2797, -325, 1176, -925, 713, 2586, -1433, -3250, 989, 1670, -1387, 91, 142, -3271, -1605, 2529, 115, -2465, -170, -403, -2386, 1123, 1993, -2411, -2342, 1335, 145, -783, 1971, 9, -3254, -129, 2551, -719, -1138, 1040, -1463, -2371, 1798, 1259, -2904, -1435, 561, -1936, -550, 1675, -1266, -3345, 191, 1354, -1166, 440, 874, -2339, -931, 2808, 1046, -1543, 748, 570, -1768, 1261, 2705, -1504, -2015, 1095, 64, -1398, 1426, 489, -2843, -1052, 2178, -693, -834, 1190, -818, -1974, 2125, 2471, -1393, -32, 1613, -723, 74, 3298, 550, -2010, 864, 1852, -529, 599, 1807, -1538, -1533, 2163, 773, -1434, 646, 603, -2082, 258, 2567, -460, -1713, 1102, 611, -1037, 2017, 1768, -1657, -521, 2601, 347, -459, 1974, 222, -1850, 1408, 2202, -1337, -721]
2135g21K041k550Q0L511k001k814K496J173k238J436J355k886o38L563m9k837
2151a079K168Rk626J831K318k294j534K354q42j728K790K45l516O80K658j469
2167c5p55K364j616k234K833J659k593j13J948k033j4L119j244k669J714J008
2183A339k112P04K299k781j578K887J49k230J689N86l006O90L232j916j950K463
2199D65q43j460K380J428l263r5K865j375j078K470o94l245K189J732k191j50
2215h65J746k036j106L096o1k865J112J351k142R51K409k312k081K782R75k174
2231a220J457R54k989M02L283j276j956K054n89j847J980J391k509p65K251j302
2247f81p20K476o65k884J499K473j736k71J770j500j797L202P94k504N60J307
$$ y = [-721, 1320, -1230, -1150, 2361, 360, -2454, 42, 1215, -1023, 413, 1768, -1118, -1756, 1807, 1758, -1079, 1089, 1098, -1528, 303, 2621, 327, -1207, 1147, 305, -1423, 1367, 1612, -1904, -1224, 1434, -35, -790, 1574, -42, -2276, 557, 2216, -377, -490, 1458, -575, -589, 2530, 1286, -1383, 331, 1339, -773, -69, 2230, -551, -2129, 758, 907, -1323, 366, 952, -2054, -1364, 1868, -48, -1998, 465, -378, -1838, 542, 1970, -1293, -1388, 1477, 102, -976, 1494, 800, -2445, -256, 1476, -715, -865, 881, -1155, -2261, 835, 774, -2091, -979, 372, -1770, -819, 1590, -722, -2803, -21, 954, -1220, 237, 1191, -1798, -1396, 1887, 611, -1345, 709, 120, -1727, 253, 1644, -865, -1630, 621, -681, -1401, 1075, 410, -2474, -975, 1498, -238, -509, 1261, -239, -2036, 1166, 1960, -544, 16, 1323]
2263A323k005N20K738j582k849K309L59j544J594Q05l107k81L120o75j835J853
2279G43l54j999J712K342k575r74J903o99q89K802L18l546Q12K313j739k54K194
2296B110k212j805K472J220k845N38J460k215K83L042j308k713J387J045j627
2311a168J404J829l251n30K534L58j605J410j34k866J416K358j635j816K124q78
2327d50j572K748O04l542M27K317j185j44J966j479k423K661J605k355K47Q93
2343C18j915K94L279r34k862J188J053j949J440J819k783j426K631R2j472J252
2359B5L55k816J149L257j713j813J611n54j255K873J010l209l03K648j209k78
2375b22J921r16k654J792K123k081j66J302k058l11L247j83k966N32J640j856
$$ y = [1323, -682, -162, 2576, 994, -1855, 454, 813, -731, 863, 1668, -1439, -1720, 1400, 725, -1110, 743, 389, -1610, 102, 2444, -131, -1105, 798, 99, -790, 2012, 2330, -1216, -404, 1909, 170, -84, 2110, -102, -1907, 565, 1785, -1060, -522, 938, -1277, -994, 2048, 740, -1973, -586, 459, -1168, 236, 2065, -1186, -1716, 818, 1176, -429, 981, 847, -2019, -603, 1755, 120, -1696, 428, -450, -2022, 726, 1330, -2212, -1785, 532, -653, -797, 1169, -310, -2733, -72, 1533, -822, -575, 318, -1597, -1303, 1976, 1042, -1820, -632, 421, -1528, -88, 1731, -1052, -2478, 153, 245, -1227, 25, 380, -2436, -1287, 1970, 257, -1556, 55, -499, -1754, 1119, 2129, -1080, -1383, 1265, 56, -222, 1699, 783, -1871, -79, 2044, -37, -203, 1099, -959, -1270, 1977, 1794, -1172, -640, 1000, -856]
2391h56J460J983k288j773K475O34j288J247L82l063N39L176n42k119J044n72
2407D39j544K356J456k740r83K101n85n79K111r63k886J044K441j056k09R79k139
2424g57n82K932P21k910J04J085j206P45K408k157k623K158P37j128P67O09l045
2441b142K16L175n29k205Q09lj720K138K099k759j286J991m02m16K115m40l646
2458c005J186K740j230n09J145j645j594K895J313k501o21J366j400O95K740j556
2474A9k972K052J147j389J432M58k480o17L308J98j916Q38m02j775K027K475k249
2491A54j699J489r8l50K264k58l526M91K662m73o30J147j251j867K949J546k418
2508A32m27J001q92K75K626o46l259J061J601j000P99O06k591p00L114M76j917
$$ y = [-856, 604, 2587, 299, -1474, 1001, 1635, 347, 1594, 1976, -1087, -548, 2628, 2086, -33, 1011, 439, -1105, 1251, 2707, -33, -1016, 1085, 500, -79, 2032, 1069, -1817, -773, 1668, 612, 403, 1382, -757, -1339, 1593, 2314, -596, -492, 593, -613, 132, 2540, 383, -2240, -82, 655, -473, 294, 903, -2142, -1926, 1249, 720, -1485, -676, -679, -2399, -261, 1838, -921, -2207, -216, -618, -1034, 1081, 641, -3005, -1819, 921, -309, -818, 327, -1318, -2912, -17, 1296, -1205, -1826, -460, -1860, -1165, 1575, 19, -2953, -901, 246, -1143, 289, 747, -1733, -2350, 958, 1156, -760, 78, -324, -2099, -72, 2403, 154, -1545, -56, -154, -504, 1760, 1502, -2024, -1533, 1129, 656, 26, 1173, -78, -1945, 1004, 2550, 132, -295, 706, -186, 89, 2715, 2069, -1190, -129, 1472, 472, 1271, 1877, -714, -1414, 1700, 2176, 259]
2525B59N80j1k098J821K652k070k057J347J93p59K423J78l256k28K623m64m70
2542F63J224j684k390K669K095k556o09Q85j256L37K829r18l104L13K090q74Q84
2559E98J093k682j602K917J437j862J56j10k047J318L082j679k556J299L65o76
2575i49K055J72k937r48K502M75q51J312j345k802K486K853j893j067O90j127
2591a374o2L003m4l181J95J666o96Q54J390k714k096K642J755j833P43m51k128
2608b331R63L298j102k445O85J98o29K301Q00l020j142K583K35n77J267j481k375
2625b772J812K804j598j236M07o24o66L340j31k929n51J607p7O90J354k199k481
2642c250K755J643j442J50L39j985K45L262m87k340J54M47j107K096J469k561
$$ y = [259, 839, 828, -1270, 551, 3203, 1133, -924, 423, 616, -143, 2280, 2458, -798, -1026, 1597, 1133, 663, 1887, 203, -2187, 482, 2577, 21, -588, 297, -959, -622, 2207, 1289, -1815, -1502, 588, -286, 598, 1691, -991, -2593, 324, 1761, -101, 55, -55, -2102, -784, 2298, 619, -1937, -638, -273, -949, 1106, 1278, -1659, -2607, -105, 370, -481, 831, -514, -3316, -830, 2023, 130, -937, -247, -1374, -1436, 1567, 1523, -1658, -1463, 203, -493, 361, 1751, -963, -3059, -417, 1338, -495, 248, -203, -2331, -1368, 1930, 828, -1617, -932, -734, -1363, 938, 1738, -1282, -2424, 159, 394, -183, 1084, -397, -2772, -960, 1844, 246, -990, -583, -1207, -1873, 1467, 1336, -1593, -2144, -537, -614, 76, 1430, -769, -3250, -495, 1148, -294, -144, 195, -1790, -1545, 1717, 1230, -1110, -956, -509, -1616, 480, 1949, -612]
2658f12j749K085J056m42R64r98k603R48K913k32j419M28q53n80L023Q52l105
2675c24o63J588k02M92J602j816k660K000J749o78j41K49k163K6L347L36k710
2692C2j09K45o17J791J944k618k318K114R26l92O80k93l233J053K998l61j911
2709f9O29j109p05K667J128k572j413J138K35J75J676j476k784J389K216n77k94
2726B54J97j950o37L504L99k587k95N77o93J236J907k260k226K065N65l97J077
2743G36k93k935M11L052J4j302j4p56p83K270J916k418j414J095K70M23J774q87
2761A159k839J021K345p22k38L25k354m27K872J407k350m68j54q20J599K166j716
2778H06k410J073J327l09J106K3l168r7L268K37j353l57o18j215K097K046k190
$$ y = [-612, -2361, -276, 780, 338, 1302, 304, -2299, -1351, 1562, 1330, -89, 339, -514, -1094, 1929, 2781, -324, -987, 601, 399, 891, 2493, 677, -1983, 17, 1766, 1088, 947, 1196, -967, -941, 2406, 2742, 32, -77, 168, -449, 1342, 3286, 668, -1650, 464, 1390, 998, 1678, 1385, -1848, -795, 2203, 1842, -69, 560, -549, -1254, 1413, 2541, -31, -1444, -306, -71, 104, 1780, 304, -2480, -1091, 1125, 548, 254, 451, -1499, -2136, 1368, 1767, -820, -1115, -538, -1231, 5, 1912, -348, -2574, -509, 56, -341, 736, 443, -2492, -2081, 971, 985, -317, -331, -1087, -1870, 400, 2316, -102, -1516, -421, -151, 272, 2046, 1159, -1680, -659, 1686, 964, 726, 1051, -1303, -1730, 1142, 2549, 199, -269, -423, -1243, 356, 2522, 806, -1604, -531, 796, 487, 1593, 1616, -1552, -1649, 1619, 1856, 503, 146, -472, -1687, 410, 2456, 266]
2795B66j784J288J04K15J924j074k986PK605K81p32M51j811j499L021J706k117
2812a35q32K49q08J137K140j095k945Q64J429k44P19M85l042o07L093O16j311
2829b87J33q96j373J873K321j593j966Q83J9K44K135n53k950K1K267K52k46O15
2847H99j783j445K266K521j985j190L36p18P62K189n27k719L32J274j28R25R40
2864A949k978j434L060J009j111R3q77j490J629K574j386k178M93M18j12J890
2880A549K79l033o67K065K11RO76j513k093K513J971j576q80k7r76N46L096r74
2898A176k697K35J045p3R26J167k793j776K733J279j228J08l07j931J290K709
2914A863j033j943M9L37j40K160L57l154n72J777M21J58Q54j612j956J874K434
$$ y = [266, -1518, -230, -126, 89, 2013, 939, -2047, -2040, 565, 846, 114, 565, -1246, -2745, 276, 1982, -135, -967, -718, -1526, -389, 1751, 656, -2289, -1425, 4, -240, 479, 964, -2078, -2685, 408, 1024, -287, -154, -1050, -2423, -550, 1771, 178, -1788, -905, -886, -642, 1493, 940, -2010, -1989, 278, 530, 284, 899, -884, -2329, -63, 2458, 473, -717, -381, -1099, -337, 1852, 1325, -1394, -1062, 212, 84, 1009, 1949, -1029, -2463, 597, 1606, 495, 588, -289, -1779, -150, 2424, 1038, -1140, -647, -229, -341, 1549, 1828, -1205, -1872, 193, 404, 413, 1089, -424, -2517, -4, 1967, 391, -489, -516, -1492, -946, 2150, 1176, -1521, -1286, -241, -314, 612, 1779, -1014, -2790, -57, 1222, -6, 102, -205, -2136, -846, 1863, 830, -1113, -1064, -727, -867, 1293, 1650, -1504, -2076, -299, 122, 280, 1134, -478, -2434, -560, 1874]
2931A874j135j512P08j099J87K983k62k694n16J226J6J172R29k363j864K194J841
2948A685j098k57k4j792Q02K986m16k492J80L64l09J988R70k871j579K058O25
2965H20M2P07j463j882J210K599m14j409J61q48n66L322J42k725o34J069L06O97
2983A134J059j982k238J834J713n66l20k65j939N64K971l27j840j1l7n46J746
3000I50J017k385j511J454R24j5O43p36k538J119K398j46j281k71r64k54K631
3017A035P55k228j159R36K13O57J589j731k565J485K000l80m12l38j899R8L040
3034A096J78j788n43J60p19K044J386j930k197J268J150o3N28k49k884R40K476
3051H53L35j464J74r81o37K453J454k158j381Q02K4R61J131r71k325Q47J848k3
$$ y = [1874, 739, -773, -65, -1164, -977, 2006, 1744, -950, -1466, -240, -224, 948, 1877, -486, -2350, -156, 1685, 587, 330, 306, -1486, -684, 2302, 1886, -606, -426, -62, -371, 1617, 2587, -284, -1863, 195, 820, 862, 1569, 106, -1776, -566, 2033, 1619, 210, 371, -477, -1043, 2279, 2421, -304, -938, 131, 437, 1134, 2193, 211, -2027, -193, 1520, 954, 634, 369, -1570, -1006, 1965, 1638, -202, -213, -250, -796, 950, 1967, -418, -1929, -475, 449, 434, 1077, 341, -2197, -1078, 1320, 1174, -107, -378, -1342, -1596, 1035, 1790, -438, -1597, -661, -448, 209, 1798, 67, -2498, -1013, 987, 607, 195, -143, -2042, -1944, 1096, 1274, -514, -1057, -897, -1616, 428, 1814, -116, -2313, -1045, 105, 42, 570, 321, -2563, -1623, 853, 1188, -276, -102, -1083, -1720, 733, 2187, 29, -1352, -550, -526, 435, 1566, 595, -1730, -883, 965, 942]
3069I42l67O9j873o30L077P18j643r05J53n9J189J462j559k174J072R38r4J167
3087A483l47k569q6K782L06j193l70p80p08K382J623k223j092M35J22M27J465
3104A657p15k819P78J921j8p8L6j958o54K542J394k029q35L47o57J410J688j140
3122H70k859Q14J337j47J037l31k347n33K914O72j205k13j029q40J797J915j867
3139a5j494O82rL89J859n76k655K45J868l9R6L84k138p06K116J897j826r35M45
3158d12j087J488J834m99k751N06J172j70N83N61k434p40K510P53o93r2o51j041
3176a163J077K353j421j753M02L18L30J598l24k591J38J476N02j00M05j704j238
3193a695K113J425r73j067j12n32N42K250k08k522j96R57J90R18N92k506r33K000
$$ y = [942, 575, 644, -1229, -1859, 1218, 1936, 293, -612, -459, -518, 671, 2133, 574, -1600, -528, 410, 316, 1483, 1136, -1433, -1519, 1263, 1569, 376, 6, -774, -1482, 900, 2523, 300, -792, -357, -235, 192, 1657, 942, -1877, -1099, 822, 804, 726, 762, -1196, -1850, 692, 2086, 57, -778, -431, -1088, 322, 2010, 870, -1989, -1175, 162, 15, 1052, 721, -1626, -2159, 755, 1427, 222, 9, -1020, -1860, -63, 1852, -15, -1509, -827, -836, -447, 1412, 836, -1819, -1574, 294, 255, 351, 735, -1403, -2109, 7, 1904, 78, -857, -412, -1499, -11, 1823, 1324, -1427, -921, 251, 81, 664, 1225, -1209, -1949, 561, 1314, 621, 529, -122, -1163, -86, 2267, 846, -907, -505, -187, 143, 1741, 1417, -1174, -1036, 440, 942, 842, 1247, -457, -1695, 418, 1843, 870, -197, -309, -841, -299, 1951, 1743, -779, -975, -18, 172, 1090, 1682, -824, -1757, 243]
3211B43J212j063O8r57j121J090K166q74j426J36j82N8K092l77k239o12J766L86
3229C66P7J95j321j490J443J987j033r66p9m73M74J992n8k629J3J034k18R30L62
3248F06j695j242J684J311m91k29m67j306R57K286q31j569K48N0P0J448P01k403
3266h72q83J649Q04q7L55j060j532J058K501p84j131p5o24K32K003M64k284m72
3284g38Q70L17Q63N89j452j670J530J281m41j96m01j421N61J979K54j692k70J65
3302A28k02J448O99j678j642J512O62N9O1o06j419N70K026n37r80J76r09k65K226
3321A329K49k010m38M03L32N40R84j337j916J187J631m35m36j78j308L2K199M94
3339A322j691m79J3l5J390J156j943j573J162P93N1P77j147j475O13J952p2q00
$$ y = [243, 1455, 392, 460, -497, -1618, -528, 1638, 764, -662, -526, -708, -650, 1442, 1065, -1174, -1786, -20, 366, 443, 638, -683, -2173, -730, 1257, 224, -742, -821, -1294, -820, 1172, 1114, -1515, -1502, -468, -686, 244, 606, -1089, -2331, -647, 664, 173, -56, -523, -1829, -872, 1414, 583, -986, -738, -688, -618, 830, 1531, -872, -1755, -106, 698, 611, 966, -94, -1626, -568, 1933, 1149, 18, -57, -681, -449, 1554, 2018, -266, -738, 132, 449, 1312, 1901, 449, -1221, 309, 1590, 1149, 953, 552, -869, -308, 1671, 1925, 233, -37, 128, -74, 1374, 2073, 395, -1247, 265, 927, 986, 1047, 441, -978, -408, 1618, 1081, 101, 277, -632, -897, 1329, 1578, -432, -870, -467, -135, 405, 1389, 52, -1864, -677, 954, 519, 83, -95, -1403, -1371, 828, 1322, -369, -848, -835, -870, 520, 1676, -267, -1840, -678, 115, 166, 943, -204, -1679, -1066, 886, 814, 14]
3357A4l72n41k17J859R02k486n26J050J91N92R37j374j767J015J429k06P1n50
3375B1j228J91K132L04j900J4k14n2J108J357j860j506J303O05p3N62m62j938
3393a636K38K180J83q62k5j187j22K063M55j489p96Q4K57R65Q79r86k029P04J442
3412C18m13L72j07j532k58J981P91j541n60K81l89J287J473j559j566P16P28j8
3430DQ16k75j675l49K458l68q21K15m09p49J837R24j247j216N57r4P57J078o44
3449G99k131P43J326j8p0J76j636k92K223O11j669k54L97q95P41J827j259j647
3467a028L30R74L87J89M3j906j54J983K10q01N4j065m17J693R46j363p09j02J26
3486f10M40J302q18j408l8J328L42n7j27j184o92J557R62j132o21j07k4M88J705
$$ y = [14, -358, -899, -1116, 743, 1645, -841, -1367, -317, -126, 466, 1403, 29, -1738, -723, 706, 500, 571, 21, -1207, -1016, 1116, 1420, -480, -466, -680, -732, 376, 1733, -127, -1633, -330, 275, 202, 764, 302, -1636, -1398, 782, 965, 103, 78, -1109, -1231, 832, 1287, -202, -998, -914, -657, 308, 1187, 201, -1828, -1124, 318, -95, 277, 170, -1362, -1620, 361, 1152, -389, -949, -668, -1057, 230, 1703, 144, -1422, -706, 22, 4, 820, 545, -1130, -1479, 979, 611, -210, 5, -404, -1153, 684, 1608, 361, -855, -298, -392, 365, 1443, 799, -1332, -589, 737, 719, 649, 825, -811, -1103, 1120, 1731, 62, -192, 205, -690, 51, 1878, 619, -1028, -698, 276, 663, 852, 895, -1011, -1165, 818, 1028, 227, 281, -784, -1201, 492, 1438, 75, -634, -736, -610, -170, 1132, 314, -1094, -1132, 196, 538, 481, 354, -830, -1522, 35, 997, -135, -756, -863, -887, -399, 1306]
3505A306q99j795K77J102o1P37j14j184r47J635R40n27j65p40p73J268J344r29
3523D75r97L38j64L68J199k54k008K6J620lq0L58q16j374J702J233q94q80m7k52
3543d50M25J579l16j766J09P37L1P69j97j446n94J466Q49m31k93k40j079R67J677
3562A797p00j547K99k39K84J245o4j838m07J409J31L14K20j336j070J506J033
3579A037l15j032J17n17K28J602j37j859qR98J5P38o0j346q90J329P87m34j69
3598H4l73j360J076J648n93j183nJ29L00Q70J38j786j99J343J0j08N83p87j302
3617a515J152J464l39j209K41p38O04J329Jj677l61O20L29O76N70j687r18J184
3635b74J002j08l48l93j183O60J696n4j521q9K52m54J686L89j702m42N39M58j4
$$ y = [1306, 407, -1388, -1111, -9, -70, 667, 553, -631, -1578, 57, 997, 470, 305, -435, -1208, 60, 1404, 475, -522, -184, -348, 20, 1219, 965, -1043, -1017, 603, 600, 520, 878, 62, -1312, 390, 1623, 729, -151, -198, -450, -25, 1554, 1238, -528, -419, 318, 349, 1118, 921, -525, -1119, 347, 1196, 765, 472, 232, -847, 120, 1797, 1097, -450, -151, -390, -106, 1139, 1075, -763, -1170, 239, 370, 684, 904, -432, -1502, 4, 1037, 722, -310, -193, -710, -482, 1120, 983, -876, -884, 114, 129, 867, 807, -539, -1429, -100, 687, 253, 84, -289, -1649, -573, 1075, 482, -701, -706, -577, -277, 593, 731, -1055, -1254, 89, 99, -9, 574, -213, -1515, -363, 1101, 762, -447, -206, -944, -340, 989, 990, -687, -1048, -428, -99, 577, 1147, -540, -1458, -274, 728, 620, 272, -121, -1304, -644, 1052, 998, -523, -612, -360, -814, 872, 1261, -441, -883, -344, 114, 100]
3654A00N46l91j543P93J643l34q10O4q48J11J436L45j536k20M91n5Q30O91j454
3673a41j043Q78J184p95M3Q7j583P67J553p3j374k22M15k43J265M01j341r73P36
3692d59P34r8K65m79j279O25J509m93l69j99n20j58J225O71j138n20K87R5N05
3711B04O94j031j393Q25J137l74K65K5j564O5J814J66j428P5k02j16J185R22j252
3730A7j067O29O68J4N56l79j538K40J743o3m49k91n08k12J222R21j427p20N50
3749i4j47K79J399r59j471Q02J024L0j61J7j487K34J767L15j365k30J88n87J024
3768E78Q61j018r39O05N67l68N02p3j546K2J604K8n87J13o50m78J484O00j176
3787A29n77L15J30L21N68m95j601L89J001L13k63K63j024l50J209M28r87j49l50
$$ y = [100, 646, 255, -1288, -495, 1148, 814, 4, 68, -780, -669, 767, 1112, -424, -644, -153, -208, 622, 1313, -141, -1184, -306, 878, 83, 126, 213, -1370, -603, 950, 877, -497, -719, -304, -547, 718, 1119, -222, -1195, -459, 275, 177, 442, -37, -1316, -691, 818, 325, -44, -243, -763, -921, 304, 975, -163, -683, -396, -301, 204, 898, -133, -1526, -701, 436, 62, 327, 352, -1212, -1147, 667, 833, -595, -520, -722, -838, 347, 1269, 17, -1050, -421, 247, 261, 817, 438, -1100, -860, 883, 820, 371, 80, -428, -640, 582, 1503, 76, -644, -94, -241, 38, 1437, 478, -993, -191, 833, 863, 702, 719, -768, -534, 1233, 1548, 183, -47, 141, -446, 578, 1439, 421, -518, 87, 654, 286, 788, 715, -831, -809, 795, 823, 236, 349, -301, -779, 705, 1305, 129, -448, -133, -3, 318, 886, 391, -1210, -821, 180, 493, 230, 493, -531, -881, 328, 756, -231, -380, -730]
3806g30k67J095Q00p25j162L06M98N9N85k65j244k06J564J4n26O8n34l91R91R71
3826I01j111p30M96l9L6J208m20j374j86J291m7J37j40r03o74J562J99m60k28
3845d82Q2m93R16P72l45j455L89Q52l63N79O5r22o16J118N75k81j35l47p08J107
3865C08R53q94o94L31m9L22J037l93j322n0R45L79k91J21q43n13J088R56r76n02
3885h7L61m95K27J419m75j379Q1O28j7K36N94j103r62J366P12o18n0o03m20N99
3905A4J102o51q21O3K10K13O61J09j891K8Q71M24k85M45o72r44P56J184o29m41
3925b54m03L6L12O14J12j042k75R26l31O81J93j140l15N91Q10p62K63l52o60O22
3945c74R55l04q85R0K73l8P07M74j567m09J248j36OL60m38p70P02P25k57l98q9
$$ y = [-730, -997, 98, 898, 173, -989, -683, -185, -126, 459, 194, -1050, -1256, 308, 322, -204, -136, -670, -1061, -70, 901, -210, -940, -444, -483, -447, 761, 341, -1033, -1219, 72, 25, 162, 22, -881, -1555, 7, 206, -254, -482, -400, -893, 23, 795, 450, -1005, -616, 236, -127, 452, 517, -405, -1021, 97, 672, 391, 256, -91, -799, 308, 1261, 367, -327, 4, -45, 277, 1314, 921, -401, -451, 494, 873, 582, 703, -140, -653, 435, 1391, 415, -87, 274, -221, 6, 1425, 950, -429, -348, 280, 263, 499, 1093, -10, -972, 394, 1106, 488, 438, -165, -585, 14, 1116, 465, -356, -293, -83, 130, 791, 900, -991, -963, -92, 332, 47, 492, -180, -1124, -368, 816, 187, -254, -657, -621, -309, 305, 417, -625, -900, 26, -305, 376, 569, -571, -886, -295, 515, -247, 16, -336, -996, -374, 581, 277, -608, -518, -245, -283, 424, 898, -669, -1078, 170, 34, 40, 400, -38, -808, -106, 619, 362, -36, -125]
3966a25n99L58J227m7j361P3P02k63L68K69n74j071J105N52k47k8l75p41J76J527
3986I26j19r13k57o0J70N47M13q24o18O61N4K09M15m37j547Q20J159L5n02q2q39
4007g89R4R78J96r85l46N10LP42K76r12r44R10L61qj90M0n09j83J314j47p89J48
4029b30k7o7R67L71j259j000J043L79k23M57j08j419P83J134j69n89r6l19k87
4048f59J265J20r28k16M19J80Q2J029r21r64M16O74k47J40j63q71K66J111K04
4067I37r93j82K08l57Q58J036j568n33O48L81k76l4M66j221K11J089k73m03M9
4086D3n52k00J217N12j306j11L03j63J40Q13n90q96K65Q21j38j4j7r42j15J224
4106B94L44j028M26j35k92N08O80p70q69P68L99m04O64j68j272L34R25L83p83
$$ y = [-125, -724, -366, 861, 814, -547, -474, 228, -35, 333, 602, 28, -1043, 62, 614, 367, 339, -36, -777, -601, 926, 807, -106, -363, -423, -253, 294, 707, -117, -735, -74, -20, 189, 604, 167, -1380, -560, 599, 634, 132, 50, -789, -695, 283, 479, -506, -852, -342, -339, 403, 679, -233, -1177, -267, 94, 86, -104, -64, -573, -756, 558, 411, -378, -230, -257, -324, 643, 1014, -245, -1245, -202, 177, -46, 411, 303, -1116, -333, 801, 632, 43, -53, -372, -659, 606, 726, -202, -418, 1, 181, 263, 1292, 371, -593, -177, 497, 250, 390, 227, -644, -378, 733, 937, -56, -238, -30, -387, 471, 1507, -61, -594, 54, 435, 159, 125, 591, -630, -419, 670, 397, -6, 43, -509, -709, 508, 1020, -286, -397, -94, -257, -117, 696, 106, -790, -525, 296, 158, 144, 127, -815, -930, 294, 638, -390, 36, -99, -391, 117, 797, 27, -842, -74, 325, -79, 585, 417, -855, -521, 404, 787, 4]
4125DNk9o55J083M95j084k51M23j54J30Q52l23j187N26N92n43K60L80j146J96
4145d26Q64K53r28J49J00n46R26Q77j376m88O41K47k95N31J2j143j91J381k78
4164C10j08P5o27n29J151M96q84l98K99J16j07J041m90r98J38J076l80J20K70
4183E71j104k26J035K88o00j82K65l16K23P02m08p39K12O39o15N03J35q70l28
4202h15J373k3n20K33k70p63O67R52j163l0M52m71M08Q01l27j180M19Q18m39o8
4222E4K84n41j58M34N40r18L29K3n37J29J078m68n11q6N43m64L96L98q48n85R50
4243D2M72j116P00j91p74O72Q98n20o63K84Ol04O67K31j254k2Q27j15j06L11r8
4264e3j137R47O05m84j31K80o05L18P70M7j335M72L66p9K26K72j094j70R25L09
$$ y = [4, 9, -20, -675, 408, 903, -181, -432, -9, -163, -33, 819, 496, -691, -165, 427, -116, 144, 524, -622, -426, 438, 691, -237, -88, 12, -534, 392, 1269, -107, -595, 46, 293, -2, 529, 541, -602, -793, 588, 310, 202, 277, -350, -879, 272, 768, -116, -514, -215, -99, -206, 835, 345, -653, -515, 561, 181, 301, 571, -533, -759, 276, 564, -36, -218, 47, -269, -46, 656, 248, -491, -279, 360, -255, 248, 383, -487, -815, 558, 535, 15, 248, -22, -785, -118, 834, -329, -359, 93, -378, 30, 831, 504, -676, -257, 561, 122, 54, 338, -203, -361, 73, 613, -305, 24, 47, -490, -361, 717, 249, -262, -348, 195, -269, 127, 525, -323, -908, 42, 514, -602, 98, -93, -867, -195, 703, 183, -480, -196, -190, -494, 173, 404, -850, -872, -45, -160, -266, 45, -53, -1190, -243, 362, -122, -253, 27, -578, -260, 510, 557, -778, -306, 60, -19, 207, 479, -615, -785, 140, 449]
4284D49l27K46k22j144P57P84L00j040O8K5k77Q02K49j081r5Q45j20j26M86l67
4304B12p49N69O77o55m7K31l00j23P23k2q61L80J50k26L80N11j107j60O50M50
4324F83m63QK33j011N30R61p28l83J77K58n03N64M55r03k21P13j64j43R98j143
4344h2n77P47N75l06k50J70n36J39R70j98j014L24K20k43K9O65n31n98N97N18
4364F19l38k17R4o34L92N07j53l59N2k50J59Q3Q88j042m35O79k5l84P88o47o87
4385i10N97Q33n85k48K30l33k50Q04L49j049q9N40k87K30L56m13m95K37N92m36
4405c27L37N1p20j66J191j83p79L35J74m42K88Q65q05n48Q88k82k19O46Mj273
4425i65O31O74l93q4J51M5k72L47J90l46k97L24l78M54N54j97p85N44J80j19Q7
$$ y = [449, 122, 368, 146, -998, -241, 543, 843, -197, -129, -104, -381, 421, 670, -411, -506, 339, 219, 93, 579, 212, -537, 32, 709, 54, 7, 238, -62, -185, 538, 516, -345, 35, 185, -41, 339, 850, -257, -417, 233, 683, 220, 228, 461, -550, -20, 941, 213, -170, 7, 265, -238, 326, 781, -122, -343, 370, 206, 63, 1061, -82, -659, 88, 663, 357, 107, 277, -259, -120, 850, 652, -362, -38, 182, -61, -32, 633, 102, -496, 101, 619, 281, 64, 158, -476, -84, 423, 270, -89, -37, -287, -128, -45, 843, -199, -634, 45, 20, -364, 424, -223, -910, -313, 520, -65, -313, -83, -416, -666, 138, 487, -562, -651, -111, -398, -168, 188, -225, -720, -483, 109, -327, 10, 61, -659, -825, 366, 183, -596, -261, -87, -529, -241, 624, -181, -729, 159, -123, -342, 304, 308, -965, -334, 340, -53, -137, 14, 59, -213, 134, 324, -22, -319, 5, -373, 81, 635, 438, -347, 197, 377, 258, 345]
4446C45n0o92J05N24M60j012P69j17n36L44O84n47p57P10R7k82K86O27j204n6
4466c02Q77K48o01J83m11m34N54O11o93p0K5J63l21R49l14p02M22L46m66j6N06
4487E54r19j62O98J67q41K69J55m61J19J276r57l23N46m67K3K41M95r63j51O78
4507b3K27o76L52k16k88M95O22j091P7N34n83j10J017j70j103M68O16l44n1M98
4527B51l79n33R82J23o41N0M11p46J07P87l19m55K92K72m93N24K26o48j29N26
4547B08o3k42M19L5p88M76O85n40n83P65j70m16Q98k41r15N08L60l41O4O18o31
4568A06o48N01O35p05K59K67n17l50Q77k50o27N00R4k65L26L70p21m45O86J76
4588B69m57L46J65q25rJ206m36n28K28Q3n02N89J37o32J9K93p7o1M60n65l29L65
$$ y = [345, 295, -397, -292, 232, 692, -320, 449, 332, -204, 140, 824, 277, -480, 230, 327, 45, 331, 958, -246, -302, 575, 823, 222, 405, -6, -440, 114, 725, 32, -38, -13, 150, -171, 778, 464, -238, 184, 530, 64, 48, 554, -365, -527, 171, 338, -503, -234, -79, -540, -421, 855, -102, -425, 121, -346, -323, -82, 413, -550, -701, -23, 204, -472, -120, -336, -624, -129, 493, -598, -521, 13, -570, -680, 337, 167, -936, -468, 148, -196, -247, 251, -128, -661, 321, 444, -197, -147, 264, -482, -375, 412, 93, -362, -70, 202, -291, 233, 459, -189, -318, 208, 145, -97, 322, 357, -431, 45, 730, 190, -393, 372, 202, -214, 684, 443, -472, 36, 396, 55, 119, 737, 106, -542, -41, 594, -111, 148, 415, -102, -452, 425, 175, -452, 48, 142, -123, 203, 573, -148, -593, 93, 269, -188, 158, 323, -502, -511, 695, 259, -269, -41, 42, -460, 129, 266, -366, -347, -54, -131, -192, 268, -297, -626, -261]
4610b61M92n29J08L0m87K27O79p4q10L26M68p40L44N20o82k22Q61k35l70K20J5
$$ y = [-261, 231, -298, -190, -160, -647, -420, 259, 185, -625, -299, 169, -571, -227, 293, -389, -611, 250, 15, -355, -135, -120]
$$ [...]
8191A63
##END NTUPLES=NMR FID
##END=
