##TITLE=1H_CA-8650-2
 CDCl3, 8 sc, 
 23.9.2019
##JCAMPDX= 6.0         $$ Bruker NMR JCAMP-DX V2.0
##DATA TYPE= NMR FID
##DATA CLASS= NTUPLES
##ORIGIN= UXNMR, Bruker Analytische Messtechnik GmbH
##OWNER= root
$$ XWIN-NMR		Version 3.5
$$ Mon Sep 23 13:54:57 2019 Russian Standard Time (UT+4h)  she@DPX200
##.OBSERVE FREQUENCY= 200.1315
##.OBSERVE NUCLEUS= ^1H
##.DELAY= (6, 6)
##.ACQUISITION MODE= SIMULTANEOUS
##.ACQUISITION SCHEME= undefined
##.AVERAGES= 8
##.DIGITISER RES= 18
##SPECTROMETER/DATA SYSTEM= spect
##.PULSE SEQUENCE= zg30
##.SOLVENT NAME= CDCl3
##.SHIFT REFERENCE= (INTERNAL, CDCl3, 0, 15.7039)
##AUDIT TRAIL= $$ (NUMBER, WHEN, WHO, WHERE, WHAT)
$$ ##TITLE= Audit trail, XWIN-NMR		Version 3.5
$$ ##JCAMPDX= 5.01
$$ ##ORIGIN= Bruker BioSpin GmbH
$$ ##OWNER= she
$$ F:/spectra/data/she/nmr/H-F/1/audita.txt
$$ ##AUDIT TRAIL=  $$ (NUMBER, WHEN, WHO, WHERE, WHAT)
(   1,<2019-09-23 13:53:50.67 +0400>,<she>,<DPX200>,
      <created by zg, POWCHK disabled, PULCHK disabled
       configuration hash MD5:
       00 E9 B6 7A A2 85 ED C7 34 08 36 98 17 FE 4E 26
       data hash MD5: 16K
       33 95 6D 58 EE 6B 86 96 E6 BA E8 8B 2C 13 20 5F>)
$$ ##END=
$$ 
$$ hash MD5
$$ 36 60 6D 1F 9A D7 00 B2 AE CD 54 89 8B BB 47 54
##$RELAX= 
##$RELAX= 
##$RELAX= 
##$RELAX= 
##$RELAX= 
##$RELAX= 
$$ Bruker specific parameters
$$ --------------------------
##$DU= <F:/spectra>
##$EXPNO= 1
##$NAME= <H-F>
##$PROCNO= 1
##$TYPE= <nmr>
##$USER= <she>
##$AMP= (0..31)
100 100 100 100 100 100 100 100 100 100 100 100 100 100 100 100 100 100 
100 100 100 100 100 100 100 100 100 100 100 100 100 100 
##$AQSEQ= 0
##$AQ_mod= 1
##$AUNM= <au_zg>
##$AUTOPOS= <>
##$BF1= 200.13
##$BF2= 200.13
##$BF3= 200.13
##$BF4= 200.13
##$BF5= 200.13
##$BF6= 200.13
##$BF7= 200.13
##$BF8= 200.13
##$BYTORDA= 1
##$CFDGTYP= 0
##$CFRGTYP= 5
##$CHEMSTR= <none>
##$CNST= (0..31)
1 1 145 1 1 1 1 1 1 1 1 1 1 1 1 1 1 1 1 1 1 1 1 1 1 1 1 1 1 1 1 1 
##$CPDPRG= <>
##$CPDPRG1= <>
##$CPDPRG2= <>
##$CPDPRG3= <>
##$CPDPRG4= <mlev>
##$CPDPRG5= <mlev>
##$CPDPRG6= <mlev>
##$CPDPRG7= <mlev>
##$CPDPRG8= <mlev>
##$CPDPRGB= <>
##$CPDPRGT= <>
##$D= (0..31)
0 1.2 0 0 0 0 0 0 0 0.06 0 0.03 0 0 0 0 0.0002 0 0 0 0 0 0 0 0 0 0 0 0 
0 0 0 
##$DATE= 1569232430
##$DBL= (0..7)
120 120 120 120 120 120 120 120 
##$DBP= (0..7)
150 150 150 150 150 150 150 150 
##$DBP07= 0
##$DBPNAM0= <>
##$DBPNAM1= <>
##$DBPNAM2= <>
##$DBPNAM3= <>
##$DBPNAM4= <>
##$DBPNAM5= <>
##$DBPNAM6= <>
##$DBPNAM7= <>
##$DBPOAL= (0..7)
0.5 0.5 0.5 0.5 0.5 0.5 0.5 0.5 
##$DBPOFFS= (0..7)
0 0 0 0 0 0 0 0 
##$DE= 6
##$DECBNUC= <off>
##$DECIM= 24
##$DECNUC= <off>
##$DECSTAT= 4
##$DIGMOD= 1
##$DIGTYP= 9
##$DL= (0..7)
0 120 120 120 120 120 120 120 
##$DP= (0..7)
150 150 150 150 150 150 150 150 
##$DP07= 0
##$DPNAME0= <>
##$DPNAME1= <>
##$DPNAME2= <>
##$DPNAME3= <>
##$DPNAME4= <>
##$DPNAME5= <>
##$DPNAME6= <>
##$DPNAME7= <>
##$DPOAL= (0..7)
0.5 0.5 0.5 0.5 0.5 0.5 0.5 0.5 
##$DPOFFS= (0..7)
0 0 0 0 0 0 0 0 
##$DQDMODE= 0
##$DR= 18
##$DS= 0
##$DSLIST= <SSSSSSSSSSSSSSS>
$$ [...]
##$SUBNAM2= <"">
##$SUBNAM3= <"">
##$SUBNAM4= <"">
##$SUBNAM5= <"">
##$SUBNAM6= <"">
##$SUBNAM7= <"">
##$SUBNAM8= <"">
##$SUBNAM9= <"">
##$SW= 24.0689530833862
##$SWIBOX= (0..15)
0 0 2 0 0 0 0 0 0 0 0 0 0 0 0 0 
##$SW_h= 4816.95568400771
##$TD= 16384
##$TD0= 1
##$TE= 0
##$TE2= 300
##$TE3= 300
##$TEG= 300
##$TL= (0..7)
0 120 120 120 120 120 120 120 
##$TP= (0..7)
150 150 150 150 150 150 150 150 
##$TP07= 0
##$TPNAME0= <>
##$TPNAME1= <>
##$TPNAME2= <>
##$TPNAME3= <>
##$TPNAME4= <>
##$TPNAME5= <>
##$TPNAME6= <>
##$TPNAME7= <>
##$TPOAL= (0..7)
0.5 0.5 0.5 0.5 0.5 0.5 0.5 0.5 
##$TPOFFS= (0..7)
0 0 0 0 0 0 0 0 
##$TUNHIN= 0
##$TUNHOUT= 0
##$TUNXOUT= 0
##$USERA1= <user>
##$USERA2= <user>
##$USERA3= <user>
##$USERA4= <user>
##$USERA5= <user>
##$V9= 5
##$VALIST= <valist>
##$VCLIST= <CCCCCCCCCCCCCCC>
##$VD= 0
##$VDLIST= <DDDDDDDDDDDDDDD>
##$VPLIST= <PPPPPPPPPPPPPPP>
##$VTLIST= <TTTTTTTTTTTTTTT>
##$WBST= 1024
##$WBSW= 4
##$XGAIN= (0..3)
0 0 0 0 
##$XL= 0
##$YL= 0
##$YMAX_a= 920605
##$YMIN_a= -1063611
##$ZGOPTNS= <>
##$ZL1= 120
##$ZL2= 120
##$ZL3= 120
##$ZL4= 120
##$ABSF1= 10
##$ABSF2= 0
##$ABSG= 5
##$ABSL= 3
##$ALPHA= 0
##$AQORDER= 0
##$ASSFAC= 0
##$ASSFACI= 0
##$ASSFACX= 0
##$ASSWID= 0
##$AUNMP= <proc_1d>
##$AZFE= 0.1
##$AZFW= 0.1
##$BCFW= 1
##$BC_mod= 2
##$BYTORDP= 1
##$COROFFS= 0
##$CY= 11.3945322036743
##$DATMOD= 1
##$DC= 2
##$DFILT= <>
##$DTYPP= 0
##$F1P= 20.1720416913024
##$F2P= 0.152960286110954
##$FCOR= 0.5
##$FTSIZE= 0
##$FT_mod= 4
##$GAMMA= 1
##$GB= 0.15
##$INTBC= 1
##$INTSCL= 1
##$ISEN= 128
##$LB= 0.24
##$LEV0= 0
##$LPBIN= 0
##$MAXI= 10000
##$MC2= 0
##$MEAN= 0
##$ME_mod= 0
##$MI= 1.114404
##$NCOEF= 0
##$NC_proc= 0
##$NLEV= 6
##$NOISF1= 3.799351
##$NOISF2= 2.8
##$NSP= 1
##$NTH_PI= 0
##$NZP= 0
##$OFFSET= 15.70392
##$PC= 1
##$PHC0= -9571.382
##$PHC1= 24.40096
##$PH_mod= 1
##$PKNL= yes
##$PPARMOD= 0
##$PSCAL= 0
##$PSIGN= 0
##$REVERSE= no
##$SF= 200.130013532006
##$SI= 16384
##$SIGF1= 3
##$SIGF2= 2
##$SINO= 400
##$SIOLD= 16384
##$SREGLST= <1H.CDCl3>
##$SSB= 0
##$STSI= 0
##$STSR= 0
##$SW_p= 3612.71676300578
##$SYMM= 0
##$S_DEV= 0
##$TDeff= 0
##$TDoff= 0
##$TI= <>
##$TILT= no
##$TM1= 0
##$TM2= 0
##$TOPLEV= 0
##$USERP1= <user>
##$USERP2= <user>
##$USERP3= <user>
##$USERP4= <user>
##$USERP5= <user>
##$WDW= 1
##$XDIM= 8192
##$YMAX_p= 0
##$YMIN_p= 0
$$ End of Bruker specific parameters
$$ ---------------------------------
##NTUPLES= NMR FID
##VAR_NAME=  TIME,          FID/REAL,        FID/IMAG
##SYMBOL=    X,             R,               I
##VAR_TYPE=  INDEPENDENT,   DEPENDENT,       DEPENDENT
##VAR_FORM=  AFFN,          ASDF,            ASDF
##VAR_DIM=   8192,          8192,            8192
##UNITS=     SECONDS,       ARBITRARY UNITS, ARBITRARY UNITS
##FACTOR=    0.0002076,     1,               1
##FIRST=     0,             0,               0
##LAST=      1.7004516,     0,               0
##MIN=       0,             -1063611,        0
##MAX=       1.7004516,     920605,          0
$$ Real data points
##PAGE= N=1
##DATA TABLE= (X++(R..R)), XYDATA
0@%%%qK4l2L2m0O4q9J05j28J68k16K58l07L72m50N36o27P34q61J004j160J333
25G12j528J749j995K263k558K887l253L651m083M563n093N672o302O992p756Q600
41D521r522J0534j1664J2926j4328J5899j7682J9726k2084K4834k8103L2073l7003
54a9873M3303n1697O3520q1508J12449j79762N53022m67363j032431J439806M89735
65H69201j304428m09200J345047Q8419j144416N5804J051850k50177p95348L33859
75a59389O27622m19595l77292L97648J83291l84509P464K52211j57820j28311
85a58680K89062k9650l11908K01331L11825l67741k38116M87864J23874n89318
95b81457J2628O19985j67479o19718L20300N69472m58200m83736N87963L76894
$$ plain form
0 0 0 0 0 -8 16 -16 16 -24 40 -49 56 -72 96 -120 138 -169 203 -247 289 -338 396 -465 539 -621 712
25 712 -816 933 -1062 1201 -1357 1530 -1723 1928 -2155 2408 -2685 2987 -3315 3677 -4079 4521
41 4521 -5001 5533 -6131 6795 -7533 8366 -9316 10410 -11674 13160 -14943 17130 -19873
54 -19873 23430 -28267 35253 -46255 66194 -113568 439454 -27909 -1060340 379466 869201
65 869201 -435227 -844427 500620 589039 -555377 -499573 552277 302100 -493248 -159389
75 -159389 468233 48638 -328654 68994 252285 -132224 -124760 127451 -30369 -158680
85 -158680 130382 100732 -211176 -9845 301980 -65761 -303877 183987 307861 -281457
95 -281457 -268829 351156 183677 -436041 -115741 453731 -4469 -488205 99758 476652
105D76652o75889k36583P36910P8614p58103Q7250P36226k45156o66391L78324
115h8146N46721m86802l98629N52994K37365n70777p2457N45201q0449m86714
125c01693K08052L96734l14362k92460L89005J77743m33451n8625M45245n8743
135A57445m20015J76196L74846k64009k93724L24449J89477l56503q4219L43939
145A47882k3274l05014J09486K38738j69501j52158K11924O6643k21315K6124
155g0465K17766j08525j95678J77249J46406k45492q9553K91969J4876l18418
165a79865P0027L20639j53734k85606K41551K35547l04856j60897L47130P2992
175B02928l70725Q757L62916r3574l45230J62674L09952k20600k64660K68523
$$ plain form
105 476652 -199237 -435820 301090 379704 -378399 -291149 445077 199921 -466470 -88146
115 -88146 458575 -28227 -426856 126138 363503 -207274 -279731 265470 185021 -301693
125 -301693 -93641 303093 -11269 -303729 85276 263019 -170432 -229057 216188 157445
135 157445 -262570 -86374 288472 24463 -269261 55188 244665 -111838 -196057 147882
145 147882 124608 -180406 -70920 167818 -1683 -153841 58083 124726 -96589 -70465
155 -70465 147301 38776 -156902 20347 166753 -78739 -168292 123677 138553 -179865
165 -179865 -109838 210801 57067 -228539 13012 248559 -56297 -217194 129936 202928
175 202928 -167797 -159040 203876 110302 -234928 -72254 237698 17098 -247562 20961
185B0961K14813k95511j46638L17018Q0397l16487j5879K87660n1418k47544R8673
196e3955J87428j28237j18818J39529N6126j25270M619R9226m8484o2286Q0578
207C0456J9469j04686J7110J09946o0842j10279J04314J02596j41075p7023J76667
218F6653M2797j99381M572K07333n8380k01351J06221J73941j50518j38892J78903
229C1898R6132j92461n2127J96910J5028j89083J9180J76630m7648j57758P3838
240b9461J30885r9192j01937J12048O0308j19072j5961J14948k3760r2306O2871
251f29O6312q4769l1556R5255l465r6918K8467Q4722n2268p3887O5652O0507p3015
264a5592m0118Q4105K6056q5343k948Q3127k2890p6937M3921N3741o9433k9907
$$ plain form
185 20961 235774 -59737 -206375 110643 191040 -125447 -141326 146334 94916 -152628 -53955
196 -53955 133473 5236 -113582 25947 82073 -43197 -38578 60648 12164 -50122 30456
207 30456 49925 -54761 -37651 72295 11453 -98826 5488 108084 -32991 -110014 66653
218 66653 109450 -89931 -85359 121974 63594 -137757 -31536 142405 -8113 -147005 31898
229 31898 128030 -64431 -116558 80352 95380 -93703 -74523 102107 54459 -103299 -29461
240 -29461 101424 2232 -99705 12343 72651 -46421 -62382 52566 28806 -63500 -629
251 -629 65683 -19086 -50642 44613 41148 -55770 -27303 57419 5151 -68736 -3084 57423 -15592
264 -15592 -55710 28395 54451 -30892 -33840 49287 26397 -50540 -6619 47122 -22311 -52218
276e2218Q1908N06q1816L4298Q1223n4003o5266P0322M9491q0735m0058P8659
288B2311K6662p8599j9341P5133J0872p0555J020O5390j0410m9856K3702L2320
300B8649l2198j3239L0085j0846k4116K9354J4741l5589L070M0233j3620l7472
312b0948J7833K8954k2140k5449K0923K1309k1893k0128K2029J5060k5989o507
324a6946L0418j761k6827J8174K3046k9301j2809L7247j17m0437Q704L5310j7196
337G505l4032J2966K5871j0416k4236P269K9019J261k6649J695K8603k754k6539
350a0437J221J5733l544r902l706J287J1817L492j6773J571K6295k671k3769P200
364b186J8073j2441j6068N861O859k424n630k337Q354P786r008m498J4218K929
$$ plain form
276 -52218 29690 30196 -51620 -17322 63901 9898 -55368 14954 64445 -16290 -56348 22311
288 22311 48973 -29626 -48967 26166 37038 -33517 -32497 32893 22483 -27373 -3671 28649
300 28649 -3549 -16788 13297 2451 -21665 7689 22430 -13159 -10089 30144 16524 -20948
312 -20948 -3115 25839 3699 -21750 -827 20482 -1411 -21539 490 15550 -10439 -16946
324 -16946 13472 11711 -15116 3058 26104 -3197 -16006 21241 21124 -19313 -10609 24701 7505
337 7505 -26527 -13561 12310 1894 -22342 -15073 13946 15207 -11442 -9747 18856 16102 -10437
350 -10437 -9216 6517 2973 -6929 -10635 -9348 2469 5961 -10812 -9241 17054 14383 -9386 -2186
364 -2186 15887 3446 -12622 -6761 98 -2326 -7956 -10293 -1939 5847 -3161 -7659 6559 9488
378I488j0899L031N335p891j686L740q387k063J1359j426p477O391M284m836P47
393b90j600n156Q513N478j4232k387J7501k099j7059M239J4110J32p059j810P549
408E830O843j1539j3964J1677J0340j7184n942J9498J587j4259O199R952o616
421B422k45P380l715k645M574n548p683K952M51m889R49L899K904L034k872p26
437B42R623r26j1920O916R476j5173p007J5581m669j7783J2590J4603j7525o361
451a2333K2023K469k0354l62J8491P03j7431k929J8143M044k1777l829K3702q10
465I750k2007Q070J8054j3665q955J5230k071j3480J1855Q339j7098j103J7533
478A0452o126j8648P394J5964r024j4486R860J8103j0647k0225J6311K2391k2601
$$ plain form
378 9488 -1411 1620 6955 -936 -2622 1118 -7269 -9332 2027 601 -6876 -485 3799 -1037 -290
393 -290 -1890 -7046 1467 6945 -7287 -9674 7827 5728 -11331 -7092 7018 7150 91 -1719 5830
408 5830 12673 1134 -12830 -1153 9187 -7997 -13939 5559 7146 -7113 -914 9038 2422
421 2422 2177 9557 5842 3197 7771 2223 -5460 -2508 -2057 -6946 -5997 -2098 806 3840 968 242
437 242 9865 8939 -2981 3935 13411 -1762 -8769 6812 2143 -15640 -3050 11553 -5972 -12333
451 -12333 9690 12159 -8195 -8557 9934 10637 -6794 -9723 8420 12464 -9313 -13142 10560 9750
465 9750 -12257 -4187 13867 202 -8753 6477 4406 -9074 2781 11120 -5978 -7081 10452
478 10452 4326 -14322 -6928 9036 12 -14474 -4614 13489 2842 -17383 -1072 21319 -1282
491a282j9241K9979J1919l6680m071L4533q746l0421J8340K3356k2563j3532K5227
504F818N340k5239l27K5345k195k5489O113K7277j1490k7963J8738K6565k4986
517a493j7418L2628N102l5779P540K9068k3826k0889L4309R080l8775N392L9403
530B4342j6454l6816K6520L4472l1408k8416L9428K3232m8479j8072N3626N542
542B7517o0580R824O2090k6305n6241M3269M3471n5879k4484O3263N565o1731
554c0221J4193N4159l1895m5650M2357L3661n1032k0933N8866J0252o1964N004
566b3203O5083k1056o1950L8434N1211n7185l6383O8166J1483p4088J5131P1054
578D6697l9026n6738O1630L9348p4806j5721Q1516q725q4197K8925P7403n3579
$$ plain form
491 -1282 -20523 9456 21375 -15305 -19376 15157 6411 -24010 -5670 17686 -4877 -18409 6818
504 6818 12158 -13081 -13408 11937 9742 -15747 -9634 17643 6153 -21810 -3072 23493 -1493
517 -1493 -18911 13717 18819 -16960 -9420 19648 -4178 -25067 9242 18322 -20453 -15061 24342
530 24342 7888 -28928 -2408 32064 656 -27760 11668 34900 -13579 -31651 21975 27517
542 27517 -33063 -23239 38851 12546 -43695 -426 43045 -12834 -37318 25945 31510 -30221
554 -30221 -16028 38131 6236 -39414 2943 36604 -14428 -35361 23505 33757 -28207 -23203
566 -23203 41880 20824 -41126 -2692 48519 -8666 -45049 23117 34600 -39488 -24357 46697
578 46697 7671 -49067 12563 51911 -22895 -38616 42900 34175 -50022 -21097 56306 2727
590B727p0697P5149N8242r3419l6717J12365J2520j22795J8265J23942n2599j14910
602h7927Q2727R2226j08601o4314J22968K9034j26584Q240J22963l7601j08006
613g4875O5976Q7533q9848o5435J05194L7172j16458n778J19393k7498j13322
624g7946O1242R7460q8865o8266J11806L4272j21312K372J15029m1635r9723P1189
636d377P3288r1934m0100J03849N271j06162L0985J00915o3428q5526R6062O3779
648H2622j25020l5807J43209l449j54371M6231J52197q7953j33254J28249J02174
659A14828j57583o0057J75104J4444j76968L2544J66301p6871j46940J11355J16686
670A12843j40027p9731J61748M0864j71460L361J71872m9197j59802R1510J34600
$$ plain form
590 2727 -67970 7179 65421 -27998 -64715 47650 60170 -62625 -44360 79582 26983 -87927
602 -87927 -5200 87026 -21575 -85889 37079 66113 -60471 -52231 70732 33131 -74875
613 -74875 -8899 78634 -11214 -76649 28545 65717 -50741 -56519 62874 35376 -77946
624 -77946 -16704 80756 -8109 -76375 35431 69703 -51609 -49237 65792 24157 -75566 -4377
636 -4377 68911 -23023 -63123 40726 45997 -60165 -29180 71735 8307 -77219 18843 82622
648 82622 -42398 -78205 65004 61555 -92816 -46585 105612 17659 -115595 12654 114828
659 114828 -42755 -102812 72292 86736 -90232 -57688 108613 31742 -115198 -3843 112843
670 112843 -27184 -106915 54833 95697 -75763 -72402 99470 50273 -109529 -18019 116581
681A16581j28320r8469J52513N2916j64038n586J59510l7306j38810P6695J10450
692I6136j02611p4049J18003L3839j24727L843J18570m3710j07320P7771Q3557
703G9302j07442n1417J31554J3761j40694L2770J39418p8003j22765J18397R1738
714A06619j51240n2796J69593P998j76555L6599J70742p7109j53203J14094J29320
725A24062j43607r7928J64779N9002j79801j8492J82319k6583j72897P0969J51473
736A13296j07696j16005J36403P4337j49478k7406J48760j8666j36783N6186J10676
747H3624q8848q1315J10056M6098j21427p848J26125k7027j18667O4036J03288
758H8095r6449p7383J21133M0738j38020m71J39976m3171j29246Q3323J07113
$$ plain form
681 116581 -11739 -110208 42305 95221 -68817 -74403 85107 47801 -91009 -14314 96136
692 96136 -6475 -80524 37479 71318 -53409 -49566 69004 25294 -82026 -4255 79302
703 79302 -28140 -79557 51997 65758 -74936 -42166 97252 19249 -103516 14881 106619
714 106619 -44621 -97417 72176 80174 -96381 -59782 110960 33851 -119352 -5258 124062
725 124062 -19545 -117473 47306 106308 -73493 -91985 90334 63751 -109146 -38177 113296
736 113296 5600 -110405 25998 100335 -49143 -76549 72211 53545 -83238 -27052 83624
747 83624 -5224 -86539 23517 69615 -51812 -59660 66465 39438 -79229 -15193 88095
758 88095 -8354 -85737 35396 76134 -61886 -62357 77619 34448 -94798 -11475 95638
769I5638j14469p3461J36760L7735j46071J27J44589l7507j35374O9525J16838
780I4330r7726r1822J22027O3026j37408k5612J46633j3764j43872N2752J28685
791I7249q9760j04764J15436O9650j33059l3614J37595l204j30408L6954J17348
802G9423o1757r5241Q4047P1922r7604m4092J04834J4267j05987J5863R7338m7457
814A5556q1534P2557N5662r3178k4693J03121q667j00934M1096R1007o7153p2252
826f9412Q5264M9362r5661k4276R9122R2r5149K4121Q6807m5840p2356O6449N2331
839F0854q3502k8460R3239k173r8027L0997R0155n9509p5161Q2880N4369r5912
851c0250k8976J02192N299r9964J6804R1904l5480q0261M9318O4981o0800m7162
$$ plain form
769 95638 -18831 -92292 44468 82203 -63868 -63741 80848 43341 -92033 -22508 94330
780 94330 -3396 -95218 26809 89835 -47573 -73185 73448 59684 -84188 -31436 97249
791 97249 7489 -97275 18161 87811 -45248 -78862 58733 55529 -74879 -37925 79423
802 79423 17666 -77575 6472 78394 -19210 -63302 41532 55799 -50188 -34325 63013 15556
814 15556 -65978 6579 62241 -30937 -55630 47491 38824 -62110 -21014 69993 2840 -69412
826 -69412 15852 65214 -30447 -54723 44399 44491 -50658 -26537 60270 14430 -57926 8523 60854
839 60854 -22648 -51108 42131 39958 -58069 -27072 63083 3574 -71587 11293 65662 -30250
851 -30250 -59226 42966 48265 -51699 -34895 57009 21529 -58732 -9414 55567 -5233 -52395
863e2395O9367K7060p2493l537P1480k1006o3747M2618M8265o1815k9041P1850
875B6606O889p5327J3866P0982l0262o0078M3224M9194m9360l4687N3191K0262
887C4500n4304o328N1789r704m6986K5123L8468m0194k4665N2179P545n7936J1493
900a9020N8172k9637n2559M3013M0385n2625k8576N5882J6684n3662n050N1496
912B4503l047m5043J1279L8658j9287l0423K6027J9035l2688n522L5756r700l4098
925b4550K4798K9137l6648j9160M3630Q126m5778R12M2319q868l7557J3770L1298
938B1429j5706k4425J9355J9314k0926j2448K3597L673k5886N607K4267j6657
950A194k0294K4869J2605l1012m152L2584m465k9900J1452K5499j3749j9606J4495
$$ plain form
863 -52395 16972 44032 -28461 -31998 39482 18476 -45271 -2653 45612 -16203 -45244 26606
875 26606 33495 -41832 -27966 43016 12754 -47324 -4100 45094 -4266 -38953 14238 34500
887 34500 -19804 -26132 25657 15953 -31033 -5910 32558 -7636 -32301 19878 27423 -30513 -19020
900 -19020 39152 9515 -43044 -31 40354 -12271 -40847 15035 31719 -21943 -26993 24503
912 24503 21456 -23587 -12308 26350 7063 -23360 2667 21702 -10986 -16508 19248 9548 -24550
925 -24550 248 29385 -7263 -26423 17207 25333 -20445 -19533 22786 13918 -23639 -9869 21429
938 21429 5723 -18702 653 19967 -959 -13407 10190 13863 -12023 -6416 17851 1194
950 1194 -19100 5769 18374 -12638 -16790 15794 11329 -18571 -7119 18380 4631 -14975 -480
963d80J5308j3092j2183J1711Q238j2037n744J0514k78r977O820P381j2595k66
977f680J8898n909k0189J3723J8710j9949j5538K1439R640k1916n753J8859L775
990I110j4631j689J3105J172j2014p61R937l606j0365O884P463r971j705J3419
1004F348j812j1734P774Q978r973m808Q384n95o976J288J257j817K384P84k478
1019b996K898M186k508l896J442K799k40o022k302Q949K489j2250j02J6109j980
1034F576j4498O743J2842p899p833O612K635n135j041L4j440J852j12l236J400
1049b500K563q04P87J143j120K674K967l645j420L853j323k959Q39k855j881N745
1065B064k450r189P186J1765r974q872J4977P414j4862n095J2790L019j1848m989
$$ plain form
963 -480 14828 1736 -10447 1264 9502 -2535 -8279 2235 1957 -8020 -1200 6181 -6414 -6680
977 -6680 12218 6309 -13880 -157 18553 -1396 -16934 4505 14145 -7771 -13524 5335 9110
990 9110 -5521 -7210 5895 7067 -4947 -5708 4229 623 -9742 -2858 4605 -5366 -7071 6348
1004 6348 4536 -7198 576 9554 -419 -5227 3157 2562 -4414 -3126 -1869 -3686 -1302 -518 -2996
1019 -2996 -98 4088 1580 -2316 -874 1925 1685 -4337 -6639 2310 4799 -7451 -7553 8556 6576
1034 6576 -7922 -1179 11663 3764 -4069 2543 5178 43 -998 -964 -2404 -552 -664 -3900 -2500
1049 -2500 63 -741 46 1189 69 2743 5710 2065 645 4498 3175 216 1055 -1800 -3681 2064
1065 2064 -386 -9575 -2389 9376 -598 -9470 5507 12921 -1941 -7036 5754 8773 -3075 -8064
1079h064Q952N894q613p192J0116P733r548m502R664J881o643O99K93l630M502
1094A542J278r900J487J3267l900j2554P284J1386p101r141N601O500m891o585
1108e727K042O179l108n784N714L768o906J570R637o790q575J2825N573j8311
1122g893k868J8919k545j9253M338J7413m306j4327M663J5017j869j4039K380
1135d370J4119l860j4336M518R873p828n662P314o55m523Q084J818r977N232J2634
1150A2381q885j2324J0612Q959j2686r307R762P733r484p732R527Q162q946m415
1164f643J1099J986r796N135P669j1278l278J5389m542j9083J0150J7259j6610
1177b543j4907J9608J1531j9903p616K0670O517j8549l196J8797Q59j8855K725
$$ plain form
1079 -8064 888 6782 -1831 -9023 1093 8826 -722 -5224 4440 6321 -322 377 670 -2960 1542
1094 1542 2820 -7080 -5593 7674 3774 -8780 -1496 9890 2789 -6352 -751 5749 858 -5727
1108 -5727 -3685 2494 -614 -6398 -684 3084 -3822 -2252 7385 595 -7980 4845 10418 -7893
1122 -7893 -10761 8158 5613 -13640 -9302 8111 3805 -10522 -5859 9158 7289 -6750 -4370
1135 -4370 9749 5889 -8447 -3929 5944 -1884 -7546 -232 -887 -5410 2674 4492 -5485 -253 12381
1150 12381 3496 -8828 1784 10743 -1943 -11250 -1488 6245 -3239 -10971 -1444 6718 -2228 -6643
1164 -6643 4456 6442 -3354 1781 9450 -1828 -5106 10283 5741 -13342 -3192 14067 -2543
1177 -2543 -17450 2158 13689 -6214 -13830 6840 13357 -5192 -8388 10409 11268 -7587 -4862
1190d862J6382r809j3942J5208O884k0124L185K3764j2283k1290K2993J6710l0386
1203g570j1632L2721K847l4901J945L3110o831k9357J2290K7797j4596k2087K0227
1216C963J6138k5728q895K7209l826k9808J4428K5842k5078j7578L4305J0210
1228B1182l6150J504L5841j1328l2292J6692K3727k2847j6988K4558R435k5421
1240a2087L51K7253q364k5353J9937K2111l0775j6336L9773N125m8092O329N0069
1253B9941j9590m7718L1332M1646l8544l1510M2688K1347m1681j1072L8396K080
1265A7315l3078O108K5801j4531j8035K0141O995k6368N101K9553j8444k6964
1277b6406L4152K1973m3933j1091N1874l091n4579J5724M9447k9595m2390L9006
$$ plain form
1190 -4862 11520 1711 -12231 2977 9861 -10263 -7078 16686 4403 -16887 6106 22816 -7570
1203 -7570 -19202 13519 16366 -18535 -16590 16520 9689 -19668 -7378 20419 5823 -16264 3963
1216 3963 20101 -5627 -14522 12687 8861 -20947 -6519 19323 -5755 -23333 10972 21182
1228 21182 -14968 -13464 22377 11049 -21243 -4551 19176 -3671 -20659 3899 13334 -12087
1240 -12087 -11736 15517 7153 -18200 1737 23848 -6927 -23263 16510 21635 -26457 -20128 29941
1253 29941 10351 -37367 -6035 35611 -2933 -34443 8245 29592 -12089 -23161 15235 17315
1265 17315 -15763 -9655 16146 1615 -16420 3721 10716 -15652 -10551 19002 558 -26406
1277 -26406 7746 29719 -14214 -25305 26569 23478 -31101 -15377 34070 4475 -37915 1091
1289A091L2327m4834j9235N0040Q634n0458M209M9857j7173m8622K8833M1078
1301C5747m2277l1822N1732J9557n6140k162N7845j1301n1110K4791L9878l5061
1313c23k8307L7543J2308l9474N43L6515j2783l0391K5350K5625l3861j5466M3848
1326B1127N064n0611P107N1697k2839n1747L5677M2593m7576k9974N5557J6026
1338C2101n6023J686N3836j4911m6044K7302L5520l7512k5336M1731J1994m7068
1350b2724n21M8423j2723m5944K7404M2042l8826l0760M9579J7066n5095j756
1362b3835N3527j6103m8478L0194L6142m0702k1635M6770P555m8374Q041M7393
1374C0495k1541m3473L3933L7012m5498k8944N4282J6913o1087k429O3326j2855
$$ plain form
1289 1091 33418 -11416 -30651 19389 28023 -22435 -18226 31631 14458 -34164 -5331 35747
1301 35747 -6530 -38352 13380 32937 -23203 -25365 32480 21179 -29931 -5140 34738 -323
1313 -323 -28630 8913 21221 -18253 -17710 18805 6022 -24369 981 26606 -7255 -22721 21127
1326 21127 26191 -24420 -17313 34384 11545 -40202 -4525 38068 -9508 -39482 16075 32101
1338 32101 -23922 -22236 31600 16689 -29355 -2053 33467 -4045 -29381 12350 24344 -22724
1350 -22724 -23245 25178 12455 -33489 -6085 35957 -2869 -33629 15950 33016 -22079 -23835
1362 -23835 29692 13589 -34889 -4695 31447 -9255 -30890 15880 23435 -24939 -16898 30495
1374 30495 8954 -34519 -586 36426 -9072 -38016 16266 33179 -27908 -30337 32989 20134
1386B0134n9346K8971N0992m1676l7108N0246K0442n3331l416N1383j2257m5664
1398c0630K4379L7181l4866k7102M2017J6309m6661l943M9539r319m8703K3074
1410h725M3068l6248l3545M6469K0463n2193l381N3589j1807m7752K6766L8473
1422C5177l8042k7657M3283J3176m8188k860M7519r167m5435K1754M3219k9906
1434B873l3867M1505K5319m7291j1937M9387n105m9720J8079M0923l2703k9892
1446c2429M2018J6757m4835j906M6009j0008m2098K0665L6136k9713k9829L5735
1458F502K0626m1526j0436M4792l85m4118J3968M1440k6709l2978L6192K1114
1470B8482m3517p638M4795o544m2199J8293L5475k8448k7645L3974J8421l7555
$$ plain form
1386 20134 -39212 -10241 40751 -925 -38033 12213 32655 -20676 -24092 27291 15034 -30630
1398 -30630 -6251 30930 -3936 -31038 10979 27288 -19373 -23316 26223 16904 -31799 -8725
1410 -8725 34343 -1905 -35450 11019 31482 -20711 -24092 29497 17690 -30062 -3296 35177
1422 35177 -2865 -30522 12761 25937 -22251 -25111 22408 13241 -32194 -10440 32779 2873
1434 2873 -30994 10511 35830 -11461 -23398 25989 20884 -28836 -10757 30166 -2537 -32429
1446 -32429 9589 26346 -18489 -20395 25614 15606 -26492 -5827 30309 596 -29233 6502
1458 6502 27128 -14398 -24834 19958 19573 -24545 -10577 30863 4154 -28824 7368 28482
1470 28482 -15035 -22673 22122 15578 -26621 -8328 27147 -1301 -28946 5028 23449 -14106
1482a4106r478L9578J584l8561Q714L7784j6970l2556K6371K3981l4403j4460
1494b2522L7549M42l8729J2539L4560k3886k6610L2914J7484l6966p409L8524
1506A7890k049l7980R697L4524j7054l0697K4204K6547k9445j8314L5427R159
1518B1909l8607J012L6723j3282l3533K2797K5247k9611j4451L3106N106l1312
1530a4896N133K9090j1816k4484J6433J7948k1514j3984K3116P336k5315M36K6687
1543A4170p218k3486J6734K0007k3827j1963K9326K163l1900O540K9573j6048
1555D071k5743K2023J9785k5494j3035K7338P589k6844j631K6422l496k5306Q960
1568e361K2027j5798j8607K1058J1627k5366k180K7457o252k4603J5132K0137
$$ plain form
1482 -14106 -23584 15994 17578 -20983 -12269 25515 8545 -24011 2360 26341 -8062 -22522
1494 -22522 15027 15469 -23260 -10721 23839 -47 -26657 6257 23741 -13225 -20634 17890
1506 17890 15841 -22139 -12442 22082 5028 -25669 -1465 25082 -4363 -22677 12750 21909
1518 21909 -16698 -15686 21037 7755 -25778 -2981 22266 -7345 -21796 11310 16416 -14896
1530 -14896 -9763 19327 7511 -16973 -540 17408 -4106 -18090 5026 12362 -12953 -12517 14170
1543 14170 6952 -16534 200 20207 -3620 -15583 13743 15906 -15994 -9454 20119 4071
1555 4071 -21672 351 20136 -5358 -18393 8945 16534 -10310 -11941 14481 10985 -14321 -5361
1568 -5361 16666 868 -17739 3319 14946 -10420 -12600 14857 8605 -15998 -866 19271
1580A9271k1097j3517K4357O163k5413q88K3356m722k2300Q057K0120j0863j7149
1593a4625J4555J4215j7507r256J9566K757k0002M567J7406j1356j2205J6326
1605D441N696j8537J984J8459p978j5187J2178J1269j5098q317J5558M956j7195
1618g771k646J7516p70j8289M648J8859q912j6334J4310J2783j7477p079J8522
1631G360J73j7486N319J3293r301q785J1232M543j0754l06J0800j431r572L354
1645a561Q754n950r814P250P375j0830n491J3821K149j3986M129J4313p857j0315
1659h013J1454O355j3022k319J1107j533r605K908P406l446n259L840N244m258
1673H59m689N032K834p134j765P630j663p268N251N905o961p38Q525k218o803
$$ plain form
1580 19271 -1826 -15343 9014 15177 -10236 -11124 12232 7510 -14790 -6733 13387 2524 -14625
1593 -14625 -70 14145 -3362 -12618 6948 9705 -10297 -5730 11676 320 -11885 4441
1605 4441 10137 -8400 -6416 12043 4065 -11122 1056 12325 -2773 -11090 4468 9424 -7771
1618 -7771 -10417 7099 6329 -11960 -7312 11547 2635 -13699 611 13394 -4083 -11162 7360
1631 7360 7533 -9953 -4634 8659 -642 -9427 1805 6348 -4406 -4712 6088 4657 -4915 -1561
1645 -1561 7193 1243 -8571 -1321 6054 -4776 -10267 3554 5703 -8283 -4154 10159 2302 -8013
1659 -8013 3441 9796 -3226 -5545 5562 4029 -5576 -2668 4738 1292 -3967 -127 5117 859
1673 859 -3830 1202 4036 -3098 -4863 2767 1104 -6164 -913 4992 -1969 -2707 5818 3600 -3203
1688c203N661M351p920k380P248n51o866M93N584p22m921J09N588N64o142J378
1704a729O907k668o204M619L883n681r31M548k020k633L069n70k993L008J456
1719B061l766J010L944k313k473K116J125k076j704J74J645L20l278J008N016
1734B809j755l908M439L194n620q86N515k335n314K453K386l621j210K341P45
1749g67L69o95m49K866J671l883m97M170r87m357J449K080j522n34K81m66J868
1766E97N59l490J290L867k867l427L709J187l271l9J665o92P56M01j544J618K682
1783C001l005j853M442m6m402Q82K444k057r07P53j77O13O86j436Q28K470j481
1800G55r20K571p65l126K695N71m067O71L884k668k297L483J123j851N88Q34j79
$$ plain form
1688 -3203 2458 6809 -1111 -3491 3757 3206 -3660 -3167 2417 1695 -3226 -3117 2471 3035 -3107 -1729
1704 -1729 5178 2510 -3694 925 4808 -873 -1804 2744 724 -1909 1160 590 -2403 605 2061
1719 2061 -1705 -695 3249 936 -1537 579 1704 -372 -2076 -1902 -257 63 -3215 -2207 2809
1734 2809 1054 -2854 1585 4779 -841 -1727 3788 1453 -3861 -1408 978 -2643 -3853 -1512 -767
1749 -767 -398 -1093 -1542 1324 2995 -888 -1385 2785 1798 -2559 -1110 970 -552 -1086 -805 -1271 597
1766 597 1156 -2334 -1044 2823 -44 -3471 238 1425 -1846 -1885 -220 -912 -156 245 -1299 319 3001
1783 3001 -4 -1857 2585 2539 -1863 -981 1463 -594 -1501 -748 -925 -312 374 -1062 -234 2236 755
1800 755 -165 2406 1641 -1485 1210 1781 -2286 -1615 2269 -399 -2696 787 1910 59 647 1481 1302
1817A302Q17q75k052J842J137l711m79L269j503k306L175Q21j703R97J508j855
1833C84K16J201j479j62n2j509Q73J085l140K05N068j630m748M540M893n968k957
1850c180O233J113n533j529K973J431k959l150K439M697k545m222M496M284m257
1865B91k232L514P72k162p95n33N01K013k915k968N231K295o223K55P041j846
1881B239o221L195M272m302l515L511K363l240k436L741L398l973k715O231K254
1896D802p311Q4P350l172o932M885L608o422o16N639k531k981N025P43n122K783
1912a68N690m473n102N265M670p027n679P906N873r424n975J2153M898j3879j670
1927f942J4839j680j3455N388J0392q163p026Q497K000p924J667O580l800m064
$$ plain form
1817 1302 2119 1244 -808 1034 2171 -1540 -2019 1250 -253 -2559 616 1437 -266 731 2239 384
1833 384 600 1801 322 160 108 -1401 -528 557 -2583 -2378 2690 1060 -3688 852 5745 -223 -3180
1850 -3180 3053 4166 -1367 -2896 77 1508 -1451 -4601 -2162 2535 -10 -4232 264 4548 291
1865 291 -1941 1573 2345 183 -612 -1145 -644 1369 -1546 -4514 717 3012 -3211 -2956 4085 2239
1881 2239 -3982 -787 3485 -817 -4332 -821 1542 -1698 -4134 -393 3005 -968 -3683 2548 4802
1896 4802 -2509 -2425 4925 1753 -5179 -294 3314 -3108 -3724 1915 -616 -3597 1428 2171 -2951 -168
1912 -168 5522 1049 -4053 1212 5882 -1145 -6824 1082 6955 -2469 -8444 3709 8607 -5272 -6942
1927 -6942 7897 6217 -7238 -1850 8542 379 -6647 1850 3850 -4074 -2407 4173 373 -3691
1941c691O132K355o666r71P584l57r279J876J0222n183j0896Q182R554j1583o158
1956h879J4684K065j5029L718J3324p812j0265J0799O037j2665k811J2518r36
1969D748j2427L011J1941m667j1197P630J0040r460p682J1671M198j3254O27J2460
1983G639o343j0489J0772N672j4064j26J5802m895j4668J0009J2216j3448r683
1996a1606J4987O569j6125m670J7274J660j7480J808J7671n036j6180J0315J3066
2009A2253j4221q596J6343J674j7070M318J4898r891j1169J3755O791j4794k633
2022h342J5609n73j4639L418J3525o236j2406Q719J0177j1721o864J4288K455
2035G410j5682L916J5362j0046j2902J5647Q622j9313l254K0148k566k0100O852
$$ plain form
1941 -3691 2441 4796 -1870 -2841 4743 4386 -4893 -3017 7205 2022 -8874 -692 8862 -2721 -8879
1956 -8879 5805 7870 -7159 -3441 9883 2071 -8194 2605 8642 -4023 -6834 5684 4748
1969 4748 -7679 -4668 7273 2606 -8591 -961 9079 -381 -8063 3608 7806 -5448 -4821 7639
1983 7639 1296 -9193 1579 7251 -6813 -6939 8863 3968 -10700 -691 11525 -1923 -11606
1996 -11606 3381 9950 -6175 -10845 6429 8089 -9391 -7583 10088 5052 -11128 -813 12253
2009 12253 -1968 -10564 5779 7453 -9617 -5299 9599 -292 -11461 2294 9085 -5709 -8342
2022 -8342 7267 6694 -7945 -4527 8998 2762 -9644 -925 9252 -2469 -9333 4955 7410
2035 7410 -8272 -4356 11006 960 -11942 3705 12327 -6986 -10240 9908 7342 -12758 -5906
2048e906J8183r665j5491J2489J3419j4000j0022J5265P098j6240l082J6111j868
2061F291j5318O304J1984j0961p141J3942J610j4012M817J2862r633r604J2733
2074C874N480j4624j785J4408j925j4349M940J3211q383j1561J1961J0008j5358
2087d103o128J9077J440k1071M641K1236j0805j9722J5854J4493j8977j0276J9882
2100E541N065j9264o59J7482k133j4952N060J2457p124r466R343O230j1639j819
2114e878J2367l216j2208R031J0148j3731n853J6413N27j7949M247J6582q814
2127A666j3820J1529J0565j3069o957J3879M215j3919o50J3685k704j3560O683
2140b457J2117j1045q993J5124N614j7376j62J7619m963j6242Q332J2020j1915
$$ plain form
2048 -5906 12277 2612 -12879 -390 13029 -971 -10993 4272 11370 -4870 -7952 8159 6291
2061 6291 -9027 -2723 9261 -1700 -8841 5101 6711 -7301 -2484 10378 745 -8859 3874
2074 3874 9354 -5270 -7055 7353 5428 -8921 -3981 9230 847 -10714 1247 11255 -4103
2087 -4103 -10231 8846 10286 -10785 -6144 15092 4287 -15435 419 14912 -4065 -14341 5541
2100 5541 10606 -8658 -9317 8165 6032 -8920 -3860 8597 1473 -7993 1350 7580 -4059 -5878
2114 -5878 6489 3273 -8935 96 10244 -3487 -9340 7073 7600 -10349 -6102 10480 1666
2127 1666 -12154 -625 9940 -3129 -10086 3793 8008 -5911 -6561 7124 4420 -9140 -2457
2140 -2457 9660 -1385 -10378 4746 10360 -7016 -7178 10441 5478 -10764 -2432 9588 -2327
2153b327q453J2115M231j1485pJ0792k318p366N354O660p271m852R476K022j2289
2168e718Q79J3535n365j4093R842J2191j3560q941J5928M907j6414o28J4885k636
2182D812j2502N028R842n910p027P464N438q491l196R370J94j0680K444J0943
2196G729o632r758R689P783j2090m005J2536J40j1330K915Q950n012n713N902
2210A104K940n797m73N682j199n657K910N796n300o055P604N296j0341l778J2620
2225E352J267j3814K324J3191n678j0981P202P501p965m277P296K363o032L3N437
2240C219j129m505K423L952m628m053O621J885r162J78J0256k928j0034O374Q902
2255G371q107n808Q954K899q632M7O567k464m729L270L517m302k226N631J562
$$ plain form
2153 -2327 -10780 1335 5566 -5919 -5926 4866 2548 -4818 536 7196 -75 -4927 4549 6571 -5718
2168 -5718 -4839 8696 3331 -10762 -920 11271 -2289 -11230 4698 9605 -6809 -7437 7448 4812
2182 4812 -7690 -2662 7180 1270 -5757 1707 7145 -1346 -4542 4828 5022 -5658 -3214 7729
2196 7729 1097 -8661 1028 8811 -3279 -7284 5252 5392 -5938 -3023 5927 915 -4798 1104
2210 1104 4044 -1753 -2226 3456 2257 -3400 -490 5306 6 -6049 1555 6851 -3490 -7268 5352
2225 5352 6619 -7195 -4871 8320 2642 -8339 -1137 6364 -1601 -5878 1418 3781 -2251 -2218 3219
2240 3219 2090 -2415 8 3960 -668 -4721 1900 3785 -5377 -5199 5057 2129 -7905 -1531 7371
2255 7371 -736 -6544 2410 5309 -3323 -3276 3291 827 -3902 -632 2885 -1417 -3643 1988 3550
2270C550o710l05Q714j664r682L646J0135o980r113R031O472j0220l618R963Q23
2285D042p839J303N788k223k993K239J185k104J42K081j397k326K586K985m441
2300i72k917O765K237q354m85R527k297r322M317P381o781n092P462J923o566
2315c174J098N383j899m098L318L627l810l202M538L024n634k842O686J291q188
2330c882J5Q068k386o971M204N171m570j830L786K21k208J193j16j583J126P41
2346I79k273p45K053P51j913q40K948K242k752k460M166J996o045j382N874j325
2362A274n945K778M388l659j782M043P50l119P41K006j238j696M5J234L17k082
2378a945l90L785L6l070J535L362k478k421K550K7k633O18P95j448P37J207p29
$$ plain form
2270 3550 -3160 -3465 5249 3585 -6097 -2451 7684 704 -8409 622 7094 -3126 -6744 3219 4042
2285 4042 -3797 -2494 3294 1071 -1922 317 1502 -602 -460 1621 224 -2102 484 3469 -972
2300 -972 -3889 2876 5113 -3241 -3726 5801 3504 -5818 -1501 5880 -901 -5993 1469 3392 -3174
2315 -3174 -2076 3307 1408 -2690 628 4255 445 -2757 1781 4805 -829 -3671 3015 4306 -3882
2330 -3882 -3867 4201 1815 -5156 -952 4219 -351 -2181 1605 1826 -382 811 695 -888 238 979
2346 979 -1294 -2039 14 765 -1148 -1988 960 3202 450 -2010 2156 4152 -1893 -3275 2599 1274
2362 1274 -4671 -1893 2495 -1164 -2946 1097 1847 -1272 -531 1475 237 -1459 -1414 -180 137 -1945
2378 -1945 -2335 1450 1486 -1584 -49 3313 835 -1586 964 991 -1642 -1024 -229 -1677 -940 267 -462
2395d62j36J671n10p72j16l01O5L26j952j23L505p30l654L053L907l513k236M665
2413B687M92l918O14K234j453j591N65K98p96l77K29M74q40q33K349P56k656R95
2431g71M442j835l131L724K407m693j117L580j875l309K146R61k955J270K822
2446A666j730j284L066J399k925j334K425J584m047k360M426K123o096q55P592
2461C650n46o723L394N515m240l410M253N80m546R62K352k453q79K763J03k603
2477a828P04K631m75k820N63L544j032m023K231L852l580k871M902O02n023K030
2493e93L362m033j717M869q60n285K765M394l653l048M137K681l386k376L233
2508D90K906l240l212L363K856m405k100M273Q6l492R08J988j259M25J112j794
$$ plain form
2395 -462 -598 1073 563 -209 -325 -626 -561 -235 -2187 -2310 1195 465 -3189 -136 3771 258 -1978 2687
2413 2687 3179 -739 -125 2109 656 -935 -370 -72 -868 -1245 -1016 -542 -1382 -2215 134 890 -1766 -771
2431 -771 3671 1836 -1295 2429 4836 143 -974 2606 731 -2578 -432 529 -2426 -1156 1666
2446 1666 -64 -1348 1718 3117 192 -1142 1283 2867 -1180 -3540 886 3009 -3087 -3942 3650
2461 3650 3104 -3619 -225 5290 1050 -2360 1893 2473 -2073 -1111 1241 -1212 -2091 672 775 -1828
2477 -1828 -1124 1507 1032 -1788 -1225 2319 1287 -2736 -505 3347 -233 -3104 1798 2400 -2623 -593
2493 -593 2769 -1264 -2981 1888 1028 -4257 -1492 2902 -751 -3799 338 3019 -367 -2743 490
2508 490 3396 156 -3056 307 3163 -1242 -3342 931 1017 -2475 -1567 421 -838 -413 699 -1095
2524a095Q91L422k388l157L285K209m759j325M100l72l131K90K322K36j735K51
2540i56K193K65k226R32K811k273k426L478P80m750N55M042k587l218L655J473
2556A748l128K27K480n43n95R12m17j72J075j005j631Q31O69r69o51K57J814P73
2574A675k063l73L831k08m764J039M366l236l924L735J831l863J99K807p66o55
2590c69J259J05p08R68j91j376n7M09k29n64m55J134J782j776j439L298N15m548
2608b242N84M413k923l718M188K042m658J12M506j204l242K203K200j881j975
2623a595J420J646j735k471K266K362l202j690M476N75m954J165M225k701l074
2638c287M115J009l364R66K569k069j195K224j38k242J67J300n89j310K02K764
$$ plain form
2524 -1095 -204 3218 830 -2327 958 3167 -1592 -2917 1183 811 -2320 -2030 292 528 -1207 -956
2540 -956 1237 1502 -724 208 3019 746 -1680 1798 2578 -2172 -1617 2425 -162 -3380 275 1748
2556 1748 -1380 -1153 1327 784 189 1101 684 512 1587 582 -1049 -218 451 -518 -1169 -912 902 1675
2574 1675 -388 -761 3070 2862 -1902 -863 3503 267 -3657 78 1909 -1954 -1755 1052 286 -369
2590 -369 890 995 287 1255 1064 -312 -369 40 -189 -753 -1208 -74 1708 -68 -1507 1791 2306 -2242
2608 -2242 -1658 2755 -168 -3886 302 2344 -2314 -2202 2304 1100 -2142 61 2261 380 -1595
2623 -1595 -175 1471 -264 -2735 -469 1893 -1309 -2999 1477 2052 -2902 -1737 2488 -213 -3287
2638 -3287 828 1837 -1527 -561 2008 -61 -1256 968 830 -1412 -1245 55 -534 -1844 -1642 1122
2654A122R2k835J529L941l266l626M694J558o203m24O403j824n743L859M451m041
2670c13k185M225J158l529o87K232L04k756q00L329K20k714J546L264k420k317
2686a443L894l4m815J766L878m446k445N502j24n240K334N153l197l455M283K469
2702D080m257k258L824J555m733j682N308J050o423R81P036k686o304M833M924
2717E248o225k629O426k7n746J765L612k461k712L094O75k458L55K327m32k297
2733a485J369K738k103l138L355K752n690j757O867o28p263L017O639n274m927
2748e528O889K692o636m35O035q07m971J413L892j701l851K060L582k562l768
2763c696L807K683n168q77N604j117m850L170L756m506q91M846j600m050K985
$$ plain form
2654 1122 1214 -1621 -92 3849 583 -3043 1651 3209 -2994 -3418 2985 1161 -4582 -723 3728 -313
2670 -313 -2498 1727 2885 -644 -1331 901 1205 -1551 -2351 978 1198 -1516 30 3294 874 -1443
2686 -1443 2451 2417 -2398 -632 3246 -1200 -3645 1857 1733 -3507 -1173 3980 783 -2672 1611 4080
2702 4080 -177 -2435 1389 2944 -1789 -3471 1837 2887 -3536 -2555 4481 1795 -4509 324 5248
2717 5248 -977 -3606 2820 2793 -2953 -1188 2424 -37 -2749 345 1020 -1438 -1083 1244 812 -1485
2733 -1485 -116 2622 519 -2619 736 3488 -2202 -3959 2908 2280 -4983 -1966 4673 -601 -5528
2748 -5528 1361 4053 -2583 -3018 3017 2210 -2761 -1348 2544 843 -3008 -948 2634 72 -3696
2763 -3696 111 2794 -2374 -3251 2353 1236 -3614 -444 3312 -1194 -2085 2761 1161 -2889 96
2778I6K531m002j465L873L29l955L75L890j70m289M96N667j480n643L097N857
2794E207m475m716N891K620o766l20N480k054m315K909K364l632n19L396J67k434
2810a197P17L392o98l446Q92L869k571m877L781L936n197k696O614O52n846J733
2826i42M810l219k633L492M04l471J151J843j951j654K372J557k608j351L829
2841A629J940m821j332O155K43p374J289P542l776o622N000M435o038k574N754
2856A450K26m523J200L404j094k346J784J968j622j874K091J655l472j304M273
2871A816n32m646K012M283l704k692M671R28n086J349L493k911j957L409M88k950
2887b029R55L005q73k237J634K275j765l159J630K812l575l341M493K156n058
$$ plain form
2778 96 2627 -1375 -2840 1033 1362 -2593 -2218 1672 1502 -2787 -2291 3376 1896 -3747 -650 5207
2794 5207 732 -3984 1907 4527 -2239 -2559 2921 867 -3448 -539 1825 -1807 -2326 1070 1237 -1197
2810 -1197 -480 2912 2214 -1232 -340 3529 958 -3919 -138 3798 -1399 -4095 2519 3171 -2675 -942
2826 -942 3868 649 -1984 1508 1912 -1559 -408 1435 -516 -2170 202 1759 -849 -2200 1629
2841 1629 3569 -1252 -2584 3571 3814 -3560 -2271 5271 1495 -5127 -127 4308 -1730 -4304 1450
2856 1450 1676 -2847 -1647 1757 663 -1683 101 2069 447 -1427 664 2319 -1153 -2457 1816
2871 1816 1284 -3362 -1350 2933 -771 -3463 1208 2136 -2950 -1601 1892 -1019 -2976 433 921 -2029
2887 -2029 -1074 1931 1058 -1179 455 2730 965 -2194 -564 2248 -1327 -4668 -175 1981 -3077
2902c077O7O114j675m252L867K609m633o46L876j596l401J945J904k260r74K271
2918A39J824j908r35K748J498l853j284M132n71n405J637M599l315l019M416J611
2934B314l727M56L146o36j371R54K86n75k29n91o19Q83o98o52J115J47l33Q80
2952G50n05n74J908j99k497J470K496l098k026L600K73l877N97L368j223j597
2968a134J417R75m14n69l16O08M46j425o28J340k45j596J279O39j615J394J786
2985A942k298p93K959l73l063J012J915j478j189N69L08R31q46j401J433K616
3001B244k290k022L017J018k820l31J350q0o42n06p39K043P82k470j01L447m55
3018A445k615J023K225j682j331N13r7N2k25r20O22J529j177m55J846J39j688
$$ plain form
2902 -3077 -3010 3104 1429 -2823 1044 3653 -980 -1626 2250 654 -2747 -802 1102 -1158 -2132 139
2918 139 1963 55 -880 1868 3366 -487 -1771 2361 1790 -3615 -1978 2621 -694 -3713 703 2314
2934 2314 -1413 -957 2189 1553 182 1136 1422 847 618 27 -592 291 -407 -1059 56 203 -130 750
2952 750 245 -329 1579 1380 -1117 353 2849 -249 -2275 1325 1598 -2279 -1682 1686 463 -1134
2968 -1134 283 1258 844 275 -41 567 1013 -412 -1040 300 55 -1541 -262 377 -1238 156 1942
2985 1942 -356 -1149 1810 1437 -1626 -614 1301 -177 -1366 -797 -489 442 -404 -1805 -372 2244
3001 2244 -46 -2068 949 1967 -853 -1184 166 86 -556 -1062 -1801 242 1024 -1446 -1547 1900 1445
3018 1445 -1170 -147 2078 396 -935 -422 -519 -467 -692 -1612 -990 539 -638 -1093 753 892 -796
3035g96J778N23k270K07K309j803j745J861J279j659q04J018J349J55k161l82
3051a141L115K07m316j14M264j126l429J163K696l44j157p72J231K644j427l535
3067b041K259M021l336l596K937K689l000k311J654K051o17k561K82L091L06l768
3083a940N84L913j136k990J481J377j117r4j13p62J507P03k281P8K669o55k060
3100h36P58J225j136o62L6k25N25j1j009R61Q36o66Q8J387j392Q2J925j144k716
3119a974K206J909l320j296K849N76k510j38J449R97l10j695N32K899r35l437
3135b198J313L035k184k199J660J140o85o72n01J048J895j620j963K461J669k835
3151f36j236K456K21j977j09Q45P44K45j294o7K315P5k347P48K096k016j438J641
$$ plain form
3035 -796 982 1505 -765 -558 1751 -52 -1797 64 1343 -316 -1120 -102 1247 1402 -759 -1141
3051 -1141 1974 2181 -2135 -2249 2015 889 -2540 -1377 1319 975 -182 -954 277 2921 1494 -2041
3067 -2041 218 4239 903 -2693 244 2933 -67 -2378 -724 1327 710 -1851 -1569 1522 1828 -1940
3083 -1940 -1356 2557 1421 -1569 -88 1289 172 78 -35 -797 710 1413 -868 -790 1879 1224 -836
3100 -836 -78 1147 11 -651 -615 -840 -315 -326 -1335 -374 462 -204 -116 1271 -121 -39 1886 742 -1974
3119 -1974 232 2141 -1179 -2475 374 950 -1560 -1698 -249 748 438 -1257 -725 2174 1239 -2198
3135 -2198 -885 2150 -34 -2233 -573 567 -118 -790 -1291 -243 1652 32 -1931 530 2199 -636
3151 -636 -1872 584 805 -1172 -1281 -436 308 553 -741 -808 1507 1582 -765 -17 2079 63 -1375 266
3169B66o8j335N98L77j073R29O00o10N28J125p81o5R68j107o86J154m57j470J355
3188B48N15j398K40R17n11K91P94j351O2J736j399j738K056O47k488J81K201m78
3206E25j158Q61O14K54m16n13L87J005j853j003K100N0k599Q56K374j784r94J812
3224E18N40j236J98L23p9N49j307q06K059J47k942P99K916j322k346J997J585
3241A593j385q36J33P25O45j347j052J857J139k717n69K800k26k017Q62R18n05
3258A8K0j21o24R31M08k110K14K373j291j374J670P87j358J50R15m16k66L63m73
3277a84K91L0q26L30R58j744j81K546q68k410J915K423k533j375K198R26j817
3294c21l32M87P16L76j702o69K768L75l156L23K866m61k404K47J239Q55j000k089
$$ plain form
3169 266 198 -1137 -539 -162 -1235 -306 294 -316 212 1337 556 491 1459 352 -334 820 363 -1107 248
3188 248 763 -635 -395 522 11 302 1096 -255 -193 1543 144 -1594 462 1109 -1379 -1198 1003 525
3206 525 -633 228 842 1096 680 167 554 1559 -294 -1297 803 853 -1746 -890 1484 -300 -1294 518
3224 518 1058 -178 20 343 264 813 -494 -1300 759 906 -2036 -1237 1679 357 -1989 8 1593
3241 1593 208 -628 -495 230 875 -472 -1524 333 1472 -1245 -1814 986 760 -1257 -395 523 18
3258 18 38 -83 -707 224 632 -1478 -1264 1109 -182 -1556 114 901 -457 -307 608 192 -74 289 -184
3277 -184 107 137 -689 -359 599 -1145 -1326 1220 352 -2058 -143 2280 -253 -1628 570 1496 -321
3294 -321 -653 -166 550 926 -776 -1445 1323 1698 -1458 -1135 1731 1270 -1134 -887 352 1207 207 -1882
3312a882J574K983k255l188L412K719l787k018L967O43l115lK026k41q90k11M63
3329A97L73l65q73P86L81j181P89R18j456J3K165q87k290J953J383k703j82J655
3347F76o11j083J115l93m52J288K28j561Q50J768j241j575N36J172k58j702n26
3364a769K596P26l370N6M108o00m262J729L461k455k537K173Q08j404j40L68K57
3381b55O34m15n52O61Q00j103o8M03k27K10L21j406N46J518j482j232K139J09
3399F01k118M70K011j609p10K267l35j616J410R25j391l47Q16J82m61p69m0J171
3417D57q0k037J080J886j310j387K100M37j885P09R18j210r8J390r08q85J479
3434F56M12j435K10P85k7k70j161N21J623j035k322J935K372k752j276L278N01
$$ plain form
3312 -1882 -308 2675 420 -2768 644 3363 -424 -2442 1525 2168 -947 -950 1076 835 -55 -266 197
3329 197 570 205 -668 118 499 -682 107 1025 -431 -418 1747 860 -1430 523 1906 -797 -979 676
3347 676 65 -1018 97 -296 -748 540 768 -793 57 1825 584 -991 -455 717 459 -1243 -1769
3364 -1769 827 1553 -1817 -1761 2347 1747 -2515 -786 2675 220 -2317 -144 664 -740 -880 -512 -255
3381 -255 379 -36 -588 73 873 -230 -298 105 -122 88 409 -997 -451 1067 -415 -1647 492 601
3399 601 -1517 -1047 964 -645 -1355 912 577 -1039 371 1296 -95 -442 374 556 95 -674 -714 457
3417 457 377 -1660 -580 1306 -4 -1391 709 1146 -739 -30 888 -322 -420 970 62 -823 656
3434 656 1068 -367 -157 628 601 331 -830 -309 1314 279 -2043 -108 2264 -488 -1764 1514 2015
3451B015k747L36J975j164q28O89m92L2K50l82j12M24P4L85L99r77K23J754j330
3470E24j991K023J033l052m22L077p30k332J426J544j379n1J175p83j5Q76p20
3487B03r14K52N23j88p68l05J659N34k178j4L078p05l445J846K767k829j871L186
3505H31M89l166P01K231j408r38J162N20j042k89R22N01j226n70J974P04k380
3522i84J97L220j393k883J941J601k657r59K119n80j422J409L05j211J523J090
3538A316j675j20K233j79k232O6J667l1j866p74K602N39l114l69M239p19m315
3555b732J993L552k724k324K940J033k514J12J508j99o36K77p5L33j85q97P83
3572B45K93l33L6Q45q99k52J354j064j230J196O80k044O63J632j220o93J950m08
$$ plain form
3451 2015 -732 -396 1579 415 -413 276 -216 -184 66 -316 -428 -4 70 455 854 -123 100 1854 524
3470 524 -1467 556 1589 -1463 -1885 1192 462 -1870 -444 1100 -279 -330 845 62 47 923 203
3487 203 -711 -459 64 -124 -892 -1197 462 996 -1182 -1196 1882 1177 -2268 -422 2345 -484 -2355 831
3505 831 1320 -1846 -1145 1086 -322 -1260 -98 422 -620 -909 13 514 -712 -1282 692 1396 -984
3522 -984 -787 2433 1040 -1843 98 1699 -958 -1917 202 -378 -1800 -391 -86 -1297 226 1316
3538 1316 -359 -479 1754 1575 -657 -591 1076 1045 -821 -1595 1007 1546 -1568 -1937 2302 1583 -2732
3555 -2732 -739 2813 89 -2235 705 1738 -776 -664 844 645 9 286 211 544 359 -538 245
3572 245 538 205 241 1086 187 -65 1289 225 -1005 191 871 -1173 -510 1122 -98 -791 1159 751
3590G51j481J392Q22j545l41J164n66q05L50M35J30k46l52Q86N86j748n37J990
3608H85n00k321J231J878j581o10J838M2r89P33J07p00L19k96j262O44M52q07
3626i37n0R32N0P2j1k29M63J046j492j258K229K9k548M84K230q25j705J323Q24
3645F27r10l1q4J39P03o07r14J088P35j370J67J319p47o54J209o09n50J058l29
3664B40j184Q56Q23j213j53J290o04n33Q86k64o90J008j1j126K95J119p65n15
3682e41N25M01L78n33j009J395J388k419j385L055M59k987k7K730n43j662P76
3699AP10o4k89q10K66J289l39j993P50J491r29j205P85Q95K59l79j087J294J577
3718B222k367j593K904Q29l547r8K712o84k183J226J457o38m89O76K70J57p96
$$ plain form
3590 751 -730 662 1484 -61 -402 762 196 -609 -259 176 306 60 -292 594 1180 -568 -1105 885
3608 885 385 -1936 -705 1173 -408 -1018 820 862 -127 606 713 13 332 36 -1226 -582 -130 -937
3626 -937 -987 -55 -5 67 56 -173 290 1336 -156 -1414 815 844 -1704 -1220 1010 185 -1520 -197 627
3645 627 -283 -314 -398 -259 444 -163 -1077 11 746 -624 -457 862 115 -539 670 61 -489 569 240
3664 240 -944 -88 735 -478 -631 659 55 -478 408 144 -546 462 451 -675 -380 739 -26 -541
3682 -541 -16 385 763 230 -779 616 2004 -415 -1800 1255 1714 -1273 -1300 1430 887 -775 1
3699 1 711 647 358 -452 -186 1103 764 -1229 -479 1012 83 -1122 -337 558 817 438 -649 645 2222
3718 2222 -145 -1738 1166 1995 -1552 -1650 1062 378 -1805 -579 878 240 -249 427 697 854 58
3735E8m35P22m02j149Q01Q93j204q6J697l49j487J074O30j080K8L40l81L91L44
3754D05j673L22K057j219j809J976J617k497r80K087O75j474q98J147J960r44
3770G52k158J418K698k779k407K625J223k803p91K209J89j358M78N35O49M61r14
3787B7o7J474n70j519L08Q71n81k64M99n34L91O34r74n14J541o14j495R31Q60
3806D04j066L04P81l04J90J111r33l27J382n51j589M35P78r15m24M91K39M16K45
3825F67r23L62J231q84j481J281O01j577k66Q21l04K96L35m90O18J628j495q10
3843c90J718Q2j717k34P91k3m37k08l88O95P57k050J6K026R8k048O56J780m37
3862F87r42J79M10Q72n95j683Q58J653j638j928J872R32j507n33J477K3l3k36
$$ plain form
3735 58 -377 345 -57 -1206 -405 488 -716 -802 895 546 -941 133 763 -317 -289 51 -330 61 405
3754 405 -1268 -946 1111 -108 -1917 59 1676 -821 -1801 286 961 -513 -1411 -264 1696 752
3770 752 -1406 12 2710 -69 -2476 149 1372 -1431 -2222 -13 176 -1182 -704 -169 480 941 27
3787 27 -40 1434 864 -655 -347 524 -57 -321 178 -356 35 669 -305 -819 722 108 -1387 -456 404
3806 404 -662 -358 423 119 309 1420 487 160 1542 991 -598 -163 615 -300 -724 -233 6 422 667
3825 667 -256 106 1337 453 -1028 253 854 -723 -989 -168 -472 -176 159 -331 287 1915 420 -390
3843 -390 1328 1410 -307 -541 250 227 -210 -418 -806 -111 646 -1404 -1388 638 736 -1312 -656 1124 687
3862 687 -255 -76 334 1206 611 -1072 -214 1439 -199 -2127 -255 677 -830 -1363 114 137 104 -132
3880a32l34M59Q17j227n63J411Oj401K51J040o48p5N20q64N63P34q38m32J073
3899C60J08q61M69J39j85M20R4j594M86J717j726j581K259R89j802o45J516J081
3917A244q26j202L62J961k51k835O17K897j605k472J564K018j272j065P70P89
3933F94M97r83j124J265J397k212r82J983O07j966J5J336j42l16j09%O08L21j194
3952c05K40J293q44j017J112K10j460M62R49j119N8J025j06r48N58L56m35K5l72
3971c18j70J141k13j794J288J524j461q28J569O46j295l75K18R1J77j053n85J779
3989C41N71k018J77K489r25j774J096R18q85o14J66K52M59p96q28J320P55j525
4007h21k3J981r30j445J267K94j281J39J312m40m97Q15P9l47Q6p02K03M93o51
$$ plain form
3880 -132 -466 -7 810 -417 -980 431 437 -964 -713 327 -321 -396 124 -740 -177 557 -281 -713 360
3899 360 468 -393 76 215 30 450 544 -1050 -564 1153 -573 -2154 105 1094 -708 -1353 163 1244
3917 1244 418 -784 -422 1539 1288 -1547 -930 1967 362 -2110 -546 1472 200 -865 -95 694
3933 694 1191 208 -916 349 1746 -466 -1448 535 1142 -824 -809 527 385 69 -40 -40 568 889 -305
3952 -305 -65 1228 384 -633 479 689 -771 -309 640 -479 -421 604 498 -450 108 464 29 54 -318
3971 -318 -488 653 440 -1354 -66 1458 -3 -831 738 1384 89 -286 -68 23 200 -853 -1438 341
3989 341 912 -1106 -929 1560 635 -1139 -43 875 -10 -624 -458 -206 253 -543 -1371 -51 704 -821
4007 -821 -844 1137 207 -1238 29 323 -958 -819 493 53 -444 371 450 103 189 -513 -310 183 -468
4026d68r69J435M48j652M89J549m98q28J193l01l37J64o34j98Q59m42r15J254
4044A49P38j473M93J191r06p12J034m10p96P31J84j154K53J102l12qO06k82J39
4063E67J50p64k01Q88p48p77J180J40j265Q65R40j302K9J527j090r00J276K14
4081G29r88k8N74l31j50Q4qP39L73j116j94J580o23j248P82M16r22K88N0p31R08
4102A84K08j381K99J734p74j269J513R73j326n74R21m95K05k41m25N26Pr54j22
4121i91J096n66l46J134k9j222J440O08j973J19J880r52j764J750L55j068j24
4138f53N62P9J56l73l07Q59K06r77lP22n75j95O81o46p2J445n78j918J682J739
4158A834k271j154K642J02k320P1J775k28r93l10J088Q46j259n31J649M17j981
$$ plain form
4026 -468 -1437 -2 446 -1206 -717 832 334 -494 699 398 61 225 -409 -607 252 -190 -1105 149
4044 149 887 -586 -93 1098 192 -520 514 104 -692 39 223 -931 -678 424 112 104 710 428 567
4063 567 717 -47 -248 640 -108 -885 295 435 -830 35 975 -327 -298 1229 139 -761 515 729
4081 729 -259 -287 287 -44 -194 -110 -118 621 994 -122 -316 1264 641 -607 175 591 -331 -43 7 -724 184
4102 184 392 -989 -690 1044 270 -999 514 1487 161 -413 508 13 218 -23 -448 78 85 -869 -991
4121 -991 105 -461 -807 327 298 -924 516 1124 -849 -730 1150 198 -1566 184 539 -529 -653
4138 -653 -91 -12 144 -229 -536 323 529 -448 -451 271 -304 -499 182 -464 -536 909 331 -1587 95 1834
4158 1834 -437 -1591 1051 1153 -1167 -1096 679 451 -542 -852 236 1082 -177 -708 941 1358 -623
4175f23L94J357j107j154J631r9j766R32J437j507k61J664k7j127P24K04m36q3
4193A53L8n24N95j96p40Q28J29k68K65N64j081R31Q06j533j016K340l43k721P70
4212a003K375j515j858K210P37j146k05Q25N40m15m35K39L49o63p26J140l11j401
4230a263J046J016j749l41K458l51k298J318J800j609j146J492L86j168J75K9
4246b05j15M50j68l50M65K0nJ30n31l34J211k00k183P55K532k031j874K680J555
4265A802k728m59K401p4j381J76L66L10k93p73Q9O78k05o28M55K87l37O91k96
4284H1q50J128P98k290j46K523p51k020J365J378j477n57J463k54o26N56P2m39
4302d6K25j93j82M3m33K90R02n52j198J792P75k377J32K278p06j688J212J219
$$ plain form
4175 -623 -229 1128 21 -1133 498 399 -1367 -435 1002 -505 -766 898 871 -256 468 672 236 153
4193 153 191 -333 262 66 -674 154 283 15 280 844 -237 694 1500 -33 -1049 1291 948 -1773 -1003
4212 -1003 1372 -143 -2001 209 946 -200 -405 420 960 545 110 349 698 35 -691 449 138 -1263
4230 -1263 -217 799 -950 -1291 1167 816 -1482 -164 1636 27 -1119 373 759 -409 -234 -205
4246 -205 -320 130 -38 -388 77 97 92 222 -309 -643 568 368 -1815 -1060 1472 -559 -2433 247 1802
4265 1802 -926 -1385 1016 942 -439 -263 103 413 120 -653 -564 114 -91 -719 -264 23 -314 377 81
4284 81 -769 359 1157 -1133 -1279 1244 493 -1527 -162 1216 -261 -818 645 391 -235 321 393 -46
4302 -46 179 -14 -196 -153 -586 -296 606 54 -1144 648 1423 -954 -822 1456 750 -938 274 1493
4320A493j226k49K41o25L99M58j323P9J712k58j368J80J209l5n54o25P50J312
4338A570j391j877J804J478k306j138K877O99k718M75J480m31n28J6K00J56R7
4355D63r58k53J338q12q80J046K32n18Q04Rq60N79M97j043l39J109k98p65M80
4374a69k44l88J066k29r62J206R98j415n25J509k16j159n4J45K9R6n52o1J633
4393G08j32j893R77J792j343j137J465M41j412j39M44N3M5m32l67J245L42j169
4411e12M22J279q43r25J111N7j027J51L85p40K83L35n68M64O86n97q2J124n20
4430D83r04P86K69j154J41M71n50J49M22l17J97Q55p47j36J025m2j277P42O07
4449A020j430n3P24o47l05P85R1m08L84J88l36N29n85q4Q38L0j253P23J091j409
$$ plain form
4320 1493 267 18 259 -366 33 491 -832 -753 959 701 -667 -487 722 687 133 -492 258 1570
4338 1570 179 -1698 106 1584 -722 -1860 1017 1716 -1002 -527 953 522 -6 10 210 366 463
4355 463 -495 -748 590 -222 -1102 -56 176 -342 462 471 -389 190 687 -356 -695 414 116 -649 -169
4374 -169 -413 -801 265 36 -926 280 1278 -137 -662 847 631 -528 -582 -437 -408 -312 -864 -925 708
4393 708 576 -1317 -340 1452 109 -1028 437 878 -534 -673 -229 -176 -131 -563 -930 315 657 -512
4411 -512 -90 1189 346 -579 532 589 -438 -287 98 -642 -359 -24 -592 -128 558 -39 -121 1003 483
4430 483 -421 365 634 -520 -379 92 -458 -309 113 -204 -7 848 101 -35 990 948 -329 413 1020
4449 1020 -410 -463 261 -386 -691 94 185 -223 161 349 13 542 -43 -127 711 741 -512 211 1302 -107
4469a07p18J286J58j477O61Q50q57K56L16o33L0O50p37j87J011n15o88M85K97
4488H1m69P23%q17Q89Q45j343p74J978p07j287O02L04m37R7m87j12J053J52j247
4508i56J81J747o77j401J093N94n23n40J17M48O59q14r63J358Q47j795j47J620
4526H48n68j512Q52L83p68J11O19n02P5R06n02k45P20J68k58J19o14M8Q99r35
4546a56j166J436J023k075l28K086j78j310K4R45Q4N6q49r2J519k21j695L20J842
4565A265o86j224P26O45l54m61m06K72R87l93j373J195J090j430r43J617m5j168
4583f86L49N64q1L34N9p62O72N20j078K64Q71q61m43P58m27r23Q73K81r40P13
4603E7O05q30l12P14m24K84K59n35k92J378m67j461J188R65j355p49J351L45o62
$$ plain form
4469 -107 -825 461 619 -858 -197 653 -204 52 368 -265 -235 415 -322 -509 502 -13 -701 -216 81
4488 81 -388 335 335 -482 407 1252 -91 -865 1113 406 -881 -279 25 -412 -315 -802 -914 139 291 -956
4508 -956 -775 972 295 -1106 -13 581 58 -482 -365 83 742 -72 -1035 323 1170 -625 -772 848
4526 848 280 -1232 -380 3 -765 -654 -35 -537 -462 444 -58 -303 417 585 327 446 -168 -120 779 -156
4546 -156 -1322 114 1137 -938 -1266 820 642 -668 -644 301 385 441 -408 -500 1019 798 -897 -577 1265
4565 1265 579 -645 81 726 372 -89 -495 -223 764 371 -1002 193 1283 -147 -1090 527 482 -686
4583 -686 -337 227 146 480 539 -223 449 969 -109 155 1026 165 -278 480 53 -870 3 284 -656 57
4603 57 662 -168 -480 234 -190 94 353 -182 -474 904 437 -1024 164 1129 -226 -975 376 721 59
4622E9m48K41M90L8j509P7K196o78j990J185J609j607r52J412M25r26K2L62r1
4641h5J92n07l09Q99Jq25N36P37p87k98J254n95r42J052J16j306M45M02m18M8
4661c90K69l50K16P05p91k24J486l01j335O36Q81j085l47Q93O2l72r4pK59P33
4681H44j165k48J196l7j468O58P84q11n0P19k07k72O95p04k74J074l79j055Q06
4700A06J002j175l76J120j24o65K1J5L88L07q03m61J493l46j252P81J064j201
4718a06m18J264n06o61L52J2l90N38Q5p96R37Q22j458K3J173n79j043P35K17o39
4738d38P9j00J37O18k31m95J033L53j316K1J059j030q71J165J26r66K72P20l54
4757b18j25P85o19K44M53n44l60P28l84o96P04J34n65K63J60J1K25k63p97P87
$$ plain form
4622 59 -389 -148 342 380 -1129 -1052 1144 466 -1524 -339 1270 -337 -1289 123 548 -378 -356 6 -85
4641 -85 107 -400 -709 190 191 -634 -98 639 -148 -446 808 213 -729 323 439 -867 -422 -20 -438 -390
4661 -390 -121 -471 -255 450 -341 -565 921 620 -715 -79 802 -283 -630 263 325 -47 -141 -148 111 844
4681 844 -321 -569 627 590 -878 -220 564 -247 -297 422 215 -57 638 -66 -340 734 355 -700 106
4700 106 1108 -67 -443 677 553 -112 -91 -76 312 619 -184 -645 848 502 -750 31 1095 -106
4718 -106 -524 740 234 -427 -75 -63 -453 85 170 -626 311 1133 -325 -302 871 292 -751 -16 201 -438
4738 -438 -359 -459 -322 296 65 -430 603 956 -360 -339 720 -310 -1181 -16 110 -856 -584 136 -218
4757 -218 -343 442 -177 67 520 -24 -384 344 -40 -736 -32 102 -463 -200 -40 -29 196 -67 -864 -77
4777g7Q53j317r66K239j98j762M92J965o69j392Q96Q13m97q02k8Q28L02j450j97
4796i67J697j48j809Q67J297j159n88J177J9o42O02j84m38R37k29j041P10R65
4814A066j386l73J098j45o22J19M63M9n5m06L39R25q67r54J093O24j729N0J613
4833I02q73j100J131Q54j189J2J201k48m40J39k41R9J3o35q0N00l09m16P92j50
4853c8m83O63K72p91P27N65j173j88J487o46j390Q84P50j299j86J233k07q28M89
4872a59L26m7k82k12P41K12q60n19J433l61j615Q90J288j229l07J041j5r42M83
4891a34K63n94K13L21l27K83N37m36k36M02j26l42L91l60k4M33m45p94J125n7
4911I3j197O43J208q91k77J090k35r17O16L27o03J05L84j45m96K10k37K40L77
$$ plain form
4777 -77 776 -541 -1507 732 534 -1228 -736 1229 560 -832 64 877 380 -422 -450 378 680 -770 -967
4796 -967 730 582 -1227 -360 937 -222 -810 367 386 -256 346 162 -276 661 432 -609 101 1066
4814 1066 -320 -693 405 260 -362 -243 220 269 214 -192 147 1072 205 -749 344 968 -761 -711 902
4833 902 29 -1071 60 914 -275 -263 938 690 250 389 148 247 260 -375 -455 45 -264 -680 112 -38
4853 -38 -521 142 414 -377 350 915 -258 -446 1041 395 -995 -111 639 -660 -846 387 180 -648 -159
4872 -159 167 120 -162 -374 367 579 -281 -800 633 272 -1343 -453 835 -394 -701 340 325 -617 -134
4891 -134 129 -465 -252 69 -258 25 562 126 -110 292 166 -176 215 -145 -169 264 -181 -975 150 93
4911 93 -1104 -461 747 -144 -421 669 434 -483 133 460 -143 -38 346 201 -295 -85 -322 -82 295
4930B95p64J09J036p13n51J014J18r68N39O46p15l20Q30p25m43P77k08p04P65
4949A8P80p02m2L66L1J01l20l32M55m1j200J13J330r29p20J296R91j381n0J541
4969A305q12p80O43o3o06J43K83k58Q8K2j5M54j98n27K21M42o22k41R17n34m69
4990f07R59J2o65O86K78j046K71Q34r75n65J021J66r89K96O50m07K35j91k0L14
5010B57j09j002P14O03r54k38J125j73q73O93N79j145J87P19r38j06N26N7n36
5029f14M28J87l41N71j57l48N93J08r79K25M90n36k02O64l13J02N64m54n46J228
5049F70k3j393N64J003p43r40O12N70l70k41k2P28J92p66m82J544r3j499L42J540
5069A193r86j059J123L32r79L06M42k08j40J55l20K77N3n66M12N33o54K5Q07m80
$$ plain form
4930 295 -469 -360 676 -37 -588 426 544 -424 115 761 46 -274 556 -169 -612 165 -43 -747 18
4949 18 798 96 54 420 451 552 232 -100 355 314 -886 -773 557 -372 -1092 204 1195 -186 -236 1305
4969 1305 493 -287 356 293 -313 -170 113 -145 -57 -35 -50 404 206 -321 -100 342 -280 -521 396 -138 -607
4990 -607 352 364 -301 385 663 -383 -112 722 -253 -818 203 369 -620 -324 326 -81 154 -37 -57 257
5010 257 148 -854 -140 463 -491 -729 396 223 -650 43 622 -523 -336 383 -555 -661 -135 -78 -614
5029 -614 -186 1 -340 231 74 -274 319 427 -552 -327 163 -373 -575 89 -224 -122 442 -12 -558 670
5049 670 647 -746 -182 821 78 -862 -250 320 -50 -291 -313 415 607 -159 -641 903 810 -689 -347 1193
5069 1193 207 -852 271 603 -376 -70 372 164 24 179 -141 136 189 -377 35 568 -86 -61 746 266
5089B66q83R20O38j140k14Q66k98k46L92n39J51O11m35j125J077Q05j218k73J089
5108D44J39o63q9KO67o3j385L02J550n54j376O33J375j130k41M84J02K1l7n49
5128c68K13Q99n71j128P23R38j001m82L97O44m52l56j71P70L70q15PJ266k85r51
5148c53N91N19r71l15J038q61n60Q60l8r33L09J173p0m02k38J78Q53o43r63P69
5168e7R98j109r47J543K24j423O05M20Kk76%q6L17K24p76j32R58J2j026M09O01
5189D81k62k03j57k26N68J50r61J42J220n04p47Q43M67o79r2K57l96K20Q2q76
5209f73K66R21p14l61Q74J79m16K73K76o83L61N42q14l74M43k2l22L06j14r1M38
5230B95k55o85Q17L74j402K89J282l36r76O33N80j75k22j12j9N05n30j237R56
$$ plain form
5089 266 -617 303 941 -199 -413 453 155 -91 301 -238 -87 524 89 -1036 41 846 -372 -645 444
5108 444 583 -80 -169 -167 500 437 -948 -646 904 350 -1026 -393 982 -148 -389 95 197 218 181 -368
5128 -368 -155 744 173 -955 -232 706 -295 -777 -380 264 -188 -544 -715 55 425 -390 -383 883 598 -353
5148 -353 238 757 -214 -529 509 -352 -912 -52 -90 -1023 -714 459 389 -13 -251 -73 780 137 -826 -57
5168 -57 941 -168 -1115 428 652 -771 -166 254 256 -20 -20 -106 211 435 -341 -473 485 497 -529 -120 481
5189 481 219 16 -141 -367 201 351 -610 -468 752 248 -499 344 811 132 40 297 -99 121 203 -673
5209 -673 -407 514 -200 -561 313 492 76 349 625 -58 303 845 31 -343 100 78 -244 62 -52 -143 295
5230 295 40 -645 172 546 -856 -567 715 379 -597 36 616 441 219 107 88 593 63 -1174 -218
5249b18P86j069o32J417J58r16J66M56k72J6O1l38M18K32o87J41M80k93k70O95
5269C31l61k64O01m7q69M48M70n25q9M92k76j92O67m24o67O89M42r34J48N47j55
5290C2k45j43L39M56p1p78L06J094r08j217J153O56j300k62R43M20q42M3M12L52
5310D40m6n41M4R64k23r77K82M73o72j97O89k50j28L29K4m83L71K33k82J42j34
5331E8k20O74M1r82K03J123q46j025J241O13j054l99J018J6n28j59l37J223j31
5350E29j297J37J662n26j356P82Q09p67m69N57o2Q6Ln51K34Q28o06o85R38J73
5370D19q69M27L98l65p7J75l59L1L87k68l96O91p0o04N04o5n40M67M94p76k13
5391f09J122l58n53L98K21r2M1l71k86P94j89r74M80J009q91m93Q39M40m72k00
$$ plain form
5249 -218 568 -501 -1133 284 442 -474 -308 148 -124 -108 -47 -385 33 265 -422 -281 199 -94 -364 331
5269 331 -30 -294 307 260 -609 -161 309 -216 -305 187 -89 -281 386 -38 -705 -16 426 -508 -360 187 32
5290 32 -213 -356 -17 439 368 -410 -104 990 82 -1135 18 674 -626 -888 55 475 -367 -324 88 440
5310 440 394 -147 -103 861 638 -339 -57 416 -256 -453 236 -14 -142 187 211 -272 99 332 50 192 58
5331 58 -162 512 553 -429 -226 897 51 -974 267 880 -174 -573 445 461 -67 -226 -563 660 529
5350 529 -768 -631 1031 505 -851 -69 740 -27 -496 61 -1 85 88 -463 -229 599 -7 -692 246 419
5370 419 -450 -23 375 10 -67 108 -251 -220 167 -101 -497 194 124 -480 24 -41 -581 -114 380 -396 -609
5391 -609 513 155 -398 0 221 129 170 -201 -487 307 118 -856 -376 633 -258 -751 88 528 56 -144
5411a44lK59J11m02m36O97M63j028k19J124N0q38M13K27j47k1q0l19K33L69q15
5432e06m9R13j74m29N52J8m67N17q6m49L50L13p98j10P41l20m0J90j02n5M66l38
5454A37n74O73M00r47l4N91j17m01K82J45n1L87m83k74Q45J8r72J79R04m14n54
5475b60K31N2j32L37n54j01P50k31r91Q44Q09p02l81R18j6n14Q5k94j9J95M7n62
5497d89K38L78n09J37M88m31N6Q03o29m49P71q9j038L84L85l68j13M32p9PM76
5518C61o53l9P94k62q14N05K64l84j98J46o5J85N5n00M08Q49n77n33Q28L52j039
5539c17RO48j71n40K06j21L0M77l37l26Q81j22o37L75K64n13J28J17k68J43M16
5560C42l06n06J075m05l27J83L52o76M74J57p04J18O01l03n67P53ll72o8L15P2
$$ plain form
5411 -144 -147 112 223 -179 -615 82 545 -483 -702 422 472 -366 47 274 127 106 26 -293 -60 309 -506
5432 -506 -555 358 184 -245 307 325 -142 375 289 -160 190 503 -295 -405 336 16 -24 166 64 9 475 137
5454 137 -437 236 636 -311 -345 246 129 -272 10 155 104 491 8 -266 579 597 -375 -196 708 294 -260
5475 -260 -29 23 -109 228 -326 -427 323 92 -899 -55 754 52 -329 589 573 59 144 -150 -169 26 73 -489
5497 -489 -251 127 -382 -245 243 -188 -132 671 42 -407 364 275 -763 -379 6 -362 -475 -43 -122 -115 361
5518 361 -292 -331 463 201 -613 -108 156 -228 -426 -280 -345 -160 -105 -605 -197 652 75 -458 370 722 -317
5539 -317 -308 340 169 -371 -165 -286 -256 221 -116 -442 439 317 -320 55 319 -194 -66 51 -217 -74 342
5560 342 36 -470 605 200 -127 56 408 -268 206 363 -341 -223 378 75 -492 261 258 -114 -182 133 205
5581B05J73n70j20P29K49j168r3J131j60j136N82N36m80n5M41k80M01Q8q07M09
5601G5N54o33m04P81j97m08J87J33m85J91M77o36J61P01n00k99O02j32m32M84
5621B20k71l59O32Q0r11M22P14n44m09P25k64k54K82k91r4M73o6q87J67R44o35
5642c26j66O01j05k08K99p6j05M78k07n38M18L91p92l75Q95k79n05L89J35j44
5662b20M19k02l90M41L16q17K03P13o07l67Q01l05l43M27L31m88K54J59k61n5
5682IK56o11K36L33o83n2J042k97q16Q08P33j137k19Q01p6m23J83j76N45p6p43
5703c63J2R25j77j183R83O28r38k41O90j32k26J76j45k01N22n07qM19K40p61J08
5724a79N50n10k7N59k26k35K82j94k10J79J69n57M94K11n68j6P59m15o48P03K62
$$ plain form
5581 205 378 -192 -312 417 666 -502 -595 536 376 -760 -178 358 -122 -177 264 -16 385 473 -334 75
5601 75 629 -4 -408 373 176 -232 -45 88 -397 -206 271 -365 -204 497 -3 -302 300 168 -264 220
5621 220 -51 -410 222 302 -609 -187 527 -17 -426 299 35 -219 63 -228 -322 151 85 -802 -635 309 -326
5642 -326 -492 109 4 -204 95 19 -86 392 185 -353 65 456 -336 -711 184 -95 -600 -211 -76 -220
5662 -220 199 -3 -393 48 364 -453 -250 463 -144 -511 290 -15 -358 69 400 -88 166 325 64 9
5682 9 265 -346 -110 223 -460 -512 530 233 -583 225 958 -179 -398 403 327 -96 87 -89 456 380 -363
5703 -363 -351 574 397 -786 197 825 -113 -354 336 204 -22 154 9 -192 330 -177 -185 234 474 -287 -179
5724 -179 371 -139 -166 393 167 -68 214 20 -190 -11 158 -399 95 306 -262 -278 481 66 -582 121 383
5745C83p84L48J74j36M3k98j96O32K16j078J95J417p51r51P61O11p62l41N16O5
5765F4J3q2l97M64L37p86k66J030j4q61K76O01m91j81K47j61R9N4QQL93m02k35
5788b82N92j20q02L84N90q16J02N98l54k08M72r3k30L54q3k00J26L00m82O7M36
5809C51n67mM88m56J6L19j6l91N40L39q09K88O43o38m05O17j20l09J23K2K6K96
5831C53l67k46M90K66q19M13M93o43k44N18O2p19N54J05k46J07J30l19L69M4m98
5852a97J70O32o61l87Q75j35q83N02N34o21k32M62k63n9J80k68M08N02n92k86
5872c19J014j39j114M58M91o93j55M93j92l47L27j3mK03m3l80L84J64m21P9J33
5893g4q1P8L90l31k53Q57l31o26O21oo78j24N84n09lN67k81k77N49J91l39K75
$$ plain form
5745 383 -401 -53 121 -15 28 -270 -466 166 382 -696 -501 916 165 -786 -25 586 -176 -517 -1 64
5765 64 77 -5 -402 62 399 -387 -653 377 363 -498 -222 379 -112 -293 -46 -207 -108 -54 -46 -38 355 -47 -282
5788 -282 310 190 -612 -228 362 -454 -352 246 -108 -316 156 63 -167 187 104 -96 30 330 -152 -85 351
5809 351 -216 -220 268 -188 -172 147 131 -260 280 619 -190 98 741 103 -302 315 195 -114 9 31 57 353
5831 353 -14 -260 230 496 -323 90 583 -60 -304 214 276 -443 111 216 -30 77 207 -112 257 301 -197
5852 -197 -27 605 -56 -443 432 297 -586 -84 450 -171 -403 59 -204 -263 -83 -351 57 559 -33 -319
5872 -319 695 556 -558 -100 391 -302 -457 36 -156 -503 -176 -189 -193 10 -33 -413 -29 135 -286 -207 -74
5893 -74 -155 -77 313 -18 -271 586 255 -371 250 244 -434 -558 26 -483 -486 81 -200 -477 72 263 -76 199
5915A99J07k47J06K1m99K82K23p84J62P02j93m70N19M28n83j97K95p1O4O1p51
5936f26M40Q29p01n12R97k7o84K33L95j39k17K30j21K86N2n56M3Q14p55m05O61
5957B37J69r72M90M90m42j90O48k90j66O48m42j84K30j07l04L84k07n8J12J22
5977A68l85J34M74k61l60M85j9o62K65J26k85J89N00n25Q0O01m71m23N65K41n77
5998a40M0L77m29N8l64N0N18L59j019L49R01p09n39N69M69q41n3N87m88k9K20
6019a14j94Q1M38l08l74R14o7p09K60L82m10k9L32n58J13J80j91j98Q05m64m17
6040e28P26j30p3J09K94n52k09P44n80l61N23J2l30M22R2k62M84l01k93K66M83
6061E36q29j7J037n42p00N57K84m75J5K69l85N30K14o19Q7O47l31o05N21J64k75
$$ plain form
5915 199 306 59 165 186 -313 -31 192 -592 -430 272 79 -391 128 556 -27 -224 71 0 64 125 -626
5936 -626 -186 643 -58 -570 427 400 -284 -51 344 205 -12 218 97 383 435 -121 -78 736 -19 -424 237
5957 237 406 -566 -76 414 -28 -218 430 140 -26 622 180 -4 226 119 -185 199 -8 -66 46 168
5977 168 -217 -83 391 130 -230 255 236 -426 -161 -35 -320 -131 369 -156 -76 525 54 -369 196 437 -140
5998 -140 -100 277 -152 -94 -458 -408 110 469 -550 -201 700 -9 -548 21 490 -351 -404 183 -305 -334 -114
6019 -114 -308 -227 211 -97 -471 443 376 -333 -73 309 -101 -130 202 -356 -243 -63 -254 -452 353 -111 -528
6040 -528 198 68 -5 104 398 -154 -363 381 -199 -560 -37 -25 -355 67 159 -103 381 80 -213 53 536
6061 536 -293 -310 727 185 -515 42 326 -149 -134 135 -250 280 494 -125 -38 609 278 -327 194 358 83
6082H3m3k23J49O0J12p31N52P57r30p0Q85j09o84J75K5k7O4k65k11M64N18q83
6104c32M1R12l30m90M30J44m56k10k1L1L42j10k99L02M98m53k41P15j93l75L84
6125B89l88l99M01J66q36M9R62j03m86L84K35k17O1j30k85P39k13q89M50N16n76
6146b70p6M47J6l48J59j85k93N42J7p44P25O05o85l47N97K94o27J65O6q8K17m32
6168b45k52O80J81o76J61O63o91k20M77r0m06N15j64m60N52M35n97n2N91j87j59
6189E6K58k45j11L71k34k71J73K60m20K88K50k36J45n0l73Q9N85q44m73Q30L11
6210C59j072L90R13m72k26O26K13j99k53j14j33K0l05r6N63l50l42L59M06q67
6230e80L00P71m52m74P90K2n27J29J72k76O6J51m31J10N23n58k08M57J61l32J96
$$ plain form
6082 83 40 -183 -34 26 138 -593 -41 716 -214 -284 601 492 -192 -17 8 -19 45 -220 -431 33 551 -332
6104 -332 -291 621 291 -199 231 375 -81 -291 -312 -281 61 -49 -348 -46 452 -1 -242 473 280 -95 289
6125 289 -99 -498 -97 69 -767 -718 244 141 -345 39 274 57 118 -12 -297 442 229 -660 -210 306 -270
6146 -270 -346 101 117 -231 -72 -257 -550 -8 9 -735 -10 595 -90 -437 160 454 -173 -8 58 -30 187 -245
6168 -245 -497 183 364 -312 -151 512 -179 -399 78 -12 -418 97 -67 -527 25 460 -137 -189 402 215 56
6189 56 314 69 -42 329 95 -176 -3 257 -163 125 375 139 284 234 -139 -50 535 -309 -782 48 359
6210 359 -713 -323 590 118 -108 518 731 532 279 165 32 52 -253 -349 214 -136 -478 -119 287 -580
6230 -580 -280 491 39 -435 355 377 -150 -21 151 -125 -59 92 -339 -229 294 -264 -472 -15 146 -186 10
6251A0K00l05L44j90m21M71K47o73j94R02n30m60L94L46m47L54K34m19L4M27m84
6272a60k63O27m0l73J36L0k37J27k24N8O75q3m24k2M49m47l64O17l00l4L47pm44
6295c56N54m1m51N6N85M5o04K01K7M00l42m37q3J213n30j067Q48Q45p73m44N09
6316A55K83l11l03J33j8J54k55l24M09O94n76m3Q31l94k45m8K3k82L15m08k82
6337d92N09Ln16J01P84k52k63N83j34j98K37j25n63N71j5l50J38L39m54Q5M00
6358C88p01N1Q31n28o87O90M68p68k12L79L85l13N8l35M41L07p92m13J032K16
6378D97q44j09R27k30m24J97J01K5j87l60M5Q84o77o42O92P35q12j96O30j69l71
6399b88m3J40J63r2j48l9J29N4p5L82j89l07O09J67q87J29N59k02n38L33M37j89
$$ plain form
6251 10 210 -95 249 59 -362 109 356 -317 -511 391 -139 -599 -205 141 -306 48 282 -137 -103 324 -160
6272 -160 -423 204 164 -209 -73 -43 -280 -153 -377 -319 356 273 -151 -173 276 -171 -535 82 -218 -252 95 88 -356
6295 -356 198 157 -294 -238 347 392 -212 -11 16 416 74 -363 -446 767 237 -830 18 863 90 -354 155
6316 155 438 127 -176 -43 -61 93 -162 -486 -77 617 41 -2 829 435 190 142 165 -117 198 -210 -492
6337 -492 17 20 -496 -395 389 137 -126 457 323 125 362 237 -326 245 230 -120 18 357 -97 -12 388
6358 388 -313 -262 569 41 -646 44 512 -256 -468 -89 296 -17 41 -294 147 454 -338 -751 281 497
6378 497 -347 -456 471 241 -183 14 115 140 -47 -407 -362 522 -155 -797 -105 630 -182 -378 252 83 -288
6399 -288 -331 -191 -28 -120 -268 -307 -178 -124 -199 183 -6 -313 296 463 -424 -295 264 62 -476 -143 294 105
6421A05l02N41k48o2J04l28K19L60k84k61J31n9k30L05q5k79R40k4j039M49Q67
6442H20o55o75N61N45p48j4K93J52j31l46p4L51L27n11k27P66k20l97P6L18j58
6463E3L4K55l61J96L17o63m9N62j20m46K20K99l89k8L56n23M70J70l09l14N13
6484B43N1k45P4k18j33M33j53m89M96L02p36jO87j84m11J92L78l94M6J81l56L88
6506A51J48m92j62M98Q1m89J67N7J06J7l79j05P89l76q61N23R08n37o42P67N1
6527B20l09k78L01q7P7R3l35M2L86j40k22L06K9j16M39m48k00M86j74n59M79N22
6549E12n25k27L36n0lj6j40J63N41m15o42O11J09o15J28N09p8m20J6K58j72L00
6571A80l67j81P45l3k40K41P4m13n4K85k41l46O03l87n45P49K41o18K03P30k19
$$ plain form
6421 105 -197 344 96 34 138 -190 29 389 105 -156 -25 -84 -314 -9 -94 -373 567 543 -496 -47 820
6442 820 165 -510 51 596 -152 -166 127 279 148 -198 -272 79 406 -105 -332 434 214 -183 -107 211 53
6463 53 87 342 -19 177 494 -169 -218 344 224 -222 -2 297 -92 -120 236 -287 183 353 44 -270 243
6484 243 294 49 123 -95 -228 205 52 -437 59 361 -375 -376 311 127 -284 -92 286 -108 -62 119 -237 151
6506 151 299 -193 -355 143 224 -265 -98 -41 65 82 -297 -402 387 11 -850 -327 581 44 -598 169 220
6527 220 -89 -367 -66 -153 -76 17 -318 -276 110 -30 -252 54 83 -33 406 -42 -242 244 70 -489 -10 512
6549 512 -13 -240 96 46 43 27 -113 50 591 176 -466 145 254 -361 -233 276 198 -222 -206 52 -120 180
6571 180 -187 -368 377 344 104 345 419 6 -48 237 -4 -350 253 -134 -679 70 311 -307 -104 626 407
6592D07l35K88k02K1n8lk02J51J9k86M19kn42K97J98l38r8M60k25m26P10Q8n91
6615b50L24L52l33k16L62j80l7J39l52J13K95m07L1J75J27l62M38n1l60j39L68
6636C7l02l40N65j7j05K19Q2m55M34L01o45J89N41l43n62N31j55Rj26M8L4J30
6658G0k71j32O80J24j045K10P60l81n38O49J54o44J40L89k5j66L09k50j34L58
6678B57l58j18K11k31K69J08J5o87Q54N6n71J59N43l00l58L18p3k29Q0J13l39
6699b81M34K13n15j21O13j1m27j04L88K49k14m63J83O49m33p70P19P08j128j14
6719d25O88L81q92L02K4K17N2j85n06N48K7o17J34M72N2n58L30j1J52J03n70O2
6741b20Q27l29q10K26P85n76k36N45n9m08M62p2l99K10L56m60k0M44j29k73o0
$$ plain form
6592 407 72 360 158 179 121 118 -84 67 86 -200 219 217 -325 -28 170 -168 -266 194 -31 -457 253 341 -250
6615 -250 74 426 93 -123 239 59 22 161 -191 -78 217 -190 -159 16 143 -219 219 168 -192 -331 37
6636 37 -265 -605 -40 -57 -162 57 139 -316 118 419 -226 -37 504 161 -401 130 -25 -16 -142 -94 -60 70
6658 70 -201 -333 347 471 -574 -364 396 15 -523 126 280 -364 -224 165 140 -26 283 33 -101 257
6678 257 -101 -219 -8 -239 30 138 153 -534 320 376 -195 -36 507 207 -151 167 94 -135 -55 58 -281
6699 -281 153 366 -149 -270 343 332 -95 -199 189 438 224 -239 -56 593 160 -610 109 817 -311 -425
6719 -425 263 644 -248 54 78 295 347 162 -344 204 231 -386 -252 220 272 -286 44 33 185 288 -282 -220
6741 -220 607 278 -532 -306 479 -97 -333 212 153 -255 207 135 -264 -54 302 -158 -178 266 137 -136 -196
6762a96j61M28Q8q61L73P81j51r17O22L43m54k98O19k1j00O2k62K2K21N4p09L63
6784a54O12m06m42L22K56j46k35l49Q85K55q75k51J053j13j053K39J087l79n96
6803b90L31j8J54j61k64m6O16j85l30Q7L13k52j11K97j54J34o3j35J49M91m76
6824H7m49O39r1n13K66L68l48l01N88k02l68M71M5n03L51J28r3j82J85J36K01
6845D15P0q55L93L89m77m77Q25no13K43J61m13P2J71m2J81K92l01k15L69k3l18
6867a58m6M39q5J12l45n8K64j59j71R3O76m52o82P24K00q61K19L82j81j54K40
6888cO1p8J82j17l12M16Ol15J80J22l53Q3J03j78J29J45l27j58N87j82l30L01
6910c8K71k88J12K28o14N0N86k60m75N30J22l76o5M71k91j83J5R3M32k49n95O05
$$ plain form
6762 -196 -357 71 159 -702 -329 452 301 -616 6 349 -105 -403 216 195 95 157 -105 -83 138 192 -517 -154
6784 -154 458 52 -390 -68 188 42 -193 -542 343 598 -277 -528 525 412 -641 -402 685 306 -290
6803 -290 41 23 177 16 -248 -294 322 137 -193 -106 207 -45 -156 141 -13 121 58 -77 72 563 87
6824 87 -362 277 186 -327 -61 307 -41 -342 246 44 -324 147 192 -311 40 168 75 -107 78 214 415
6845 415 485 -370 23 412 -65 -542 283 278 -335 -92 69 -344 -272 -101 -143 38 330 29 -186 183 160 -158
6867 -158 -204 235 150 262 -83 -141 123 -36 -207 -114 562 110 -572 152 352 -509 -290 92 -89 -243 -3
6888 -3 58 -20 162 45 -267 149 155 -160 20 142 -211 -128 -25 -203 -74 71 -256 -414 173 -9 -339 -38
6910 -38 233 -55 57 285 -329 -279 307 47 -428 102 224 -152 -217 254 -37 -220 -205 -112 320 71 -524 81
6932H1M89o76m54P54J80o03j87O88j7l05j53j2M15J6l44j14P14j46m82J73K78
6953B95k34l2j44J12J43K93n25kN17k08o49O78K96o65P7J96j0L4J2k49J37L24
6975C96l69j81M79o7k90K59p0l12P3K23k43m8L94k16k67OK40Q5j4o1l70N04K13
6998C64o64j7P85l60n12L61M57m06l7%J35L9k59j98L86K6o09R5P59n22m43N23
7020i7K86k80L4P8jR8l4k72Q6J48k01r1K15P4m47K06K51k47P0M18l17q1M38m17
7044h3k71J60K73k84J59K34k62Q4J67J4k03L17m67K23m5l58k9M66pn41M57L09
7066C13k73l29Q92m44n63N78P6m50J25J86q6K14k82PK22L13p38L42L88n01k84
7087b94L53J08n20L35K22k82K24J24l24J13L93k89m75O21k17k66K88L8k31j00
$$ plain form
6932 81 570 -106 -560 194 374 -229 -416 272 255 -50 -203 -215 200 216 -128 -242 472 326 -156 17 295
6953 295 61 29 -115 -3 140 433 -92 -94 423 215 -434 244 540 -125 -48 148 138 172 184 -65 72 396
6975 396 27 -154 325 258 -32 227 157 -155 -82 141 -102 -150 244 28 -239 -233 7 92 78 17 -353 151 364
6998 364 -300 -317 468 108 -404 -43 414 8 -29 -29 106 145 -114 -312 74 100 -509 -414 345 -177 -620 -97
7020 -97 189 -91 -57 21 20 118 84 -188 -102 46 -155 -246 -31 43 -404 -198 53 -194 -124 294 -23 -104 334 -83
7044 -83 -354 -194 79 -205 -46 188 -74 10 177 191 -12 305 -162 61 16 -342 -371 95 88 -453 4 313
7066 313 40 -289 603 159 -404 174 250 -200 -75 111 25 239 -43 -36 186 499 -239 103 491 -10 -294
7087 -294 59 167 -353 -18 204 -78 146 270 -54 59 452 163 -312 309 92 -174 114 152 -79 -179
7107a79K32p0L3J08k04Q9L06n79m2N98k20l18L82Q8k57jM70n45j52L86j53k79
7129c07M76q1j82j54L07j83K17j02j72K52P8m31p9L75r2m28P14R6o30L78L57o93
7151b84M7N83k82l63K03J03n5J15k64J26J91j17l04N14p4n44L22N09n05m30N84
7172G5L03o25K44J08k31K24l5k19K31Q6j42k76N03j95k37L00J5k65K46J62n55
7193b83M02J18m39K95K30j84j47L29k82l55K87K81m90J89M27l15j84L98j55k15
7213i3L29l93O6L97k05m39M82q9l79J85J86o3m2L66m47K29K24m4n70M46J36m85
7235b03P7K50k02l06J19K11j12K41m3k03L04P0l10K47Kl90K96K99l44j88M55J9
7257B89o81L37J48m42M27k4j83J99R0n03r0P35k27n79M21L76l42j53K11M18k08
$$ plain form
7107 -179 53 -17 16 124 -80 9 315 -264 -306 292 72 -246 136 224 -33 -34 436 -109 -261 125 -28 -307
7129 -307 169 88 -94 -248 59 -124 93 -9 -181 71 149 -282 -361 14 -78 -506 208 304 -326 52 409 -284
7151 -284 -237 346 64 -299 -96 7 -48 67 -197 -71 120 3 -301 213 139 -405 -83 426 -79 -509 75
7172 75 378 -247 -3 105 -126 98 63 -156 75 161 19 -257 246 51 -186 114 129 -136 110 272 -283
7193 -283 119 237 -202 93 323 139 -8 321 39 -316 -29 252 -238 -49 378 63 -121 277 122 -93
7213 -93 236 -157 -91 306 101 -338 144 55 -324 -139 47 -16 -58 308 -139 90 314 270 -300 146 282 -203
7235 -203 -126 124 -78 -384 -265 -54 -166 75 32 -171 133 203 -107 140 142 -248 48 347 3 -185 270 289
7257 289 -392 -55 93 -349 78 54 -129 70 160 -343 -433 302 75 -504 -83 293 -49 -202 9 427 219
7278B19j23l62L12J22p60j7P39J64q11N28L04l57P9J24k29j88O38m97l03N30k9
7299H3o21L05L82J0j52nQ8P7k9l04Q1N21m32n27N99J74o68L44M79o58P0N69k66
7322A20l76N75J35m89n8N32j92j62k91J13M96m82o32N67P92q05j62P38m8l25K76
7343C22n4j91J62q7m22J67L26j04p14Q85K97o32q5L58J26j69k53k55N68j59o07
7364e21L09N76p50l0R40k29o58N31K63m42n5K91m66j90N16qn0k22K17J48o8k16
7386a14r5N25k77n99M57M11o36j06O37k04k92M93q0o76O51K05o79p3O14P4o65
7407d29L80K45k51k31J93J36K49l79l07N58K85p23J59N75m50n38O54J09l97J26
7427c6P2k25k6L77l31K9M72j1o10M14k5j22O6o1q6K43j92k21M66j9n57J79O44
$$ plain form
7278 219 96 -266 46 168 -592 -609 130 294 -517 11 315 -42 37 161 -68 -256 382 -115 -418 112 83
7299 83 -538 -233 149 159 7 2 90 167 138 -166 -85 436 4 -523 76 250 -418 -74 405 -253 -183 386 120
7322 120 -256 319 454 -35 -93 439 247 85 -206 -93 403 -79 -711 -144 648 -157 -319 419 371 46 322
7343 322 268 77 239 152 -270 -103 223 119 -595 290 587 -45 -130 228 354 185 -68 -323 245 86 -521
7364 -521 -212 364 -386 -416 524 295 -363 168 431 -11 -66 225 -241 -431 85 77 27 -195 22 170 102 -114
7386 -114 -209 316 39 -560 -103 308 -328 -434 203 -1 -293 200 120 -556 95 300 -379 -452 162 236 -429
7407 -429 -49 196 -55 -286 -93 43 292 -87 -394 164 449 -274 -115 460 10 -528 126 235 -162 -36
7427 -36 36 -189 -215 162 -169 -140 332 321 -289 125 100 -22 44 -17 -103 140 -52 -273 193 174 -383 -204 440
7450D40m13o16Q47M6n76J19O30m36j71J10K7j3j73Q9K26k03J00o5L67l56nM37
7472D11J39r34M23M23o72k67O98n1n83L30N20n26J23J95q9k48K00j45j48N8Q7
7493e6m0J90k60K6N30k92m34P39J50q37j51P19m45n85N37K29k11O5Q5j91L11l4
7515D5k20K65J91j39l78L91o8q1J1l39K80K33j84o65O06L07n17j8L77Q4o01L53
7537f7M30l92k6J4k48K34J83j59l89O22q9j72J25P1q5K53n88l2P65k26n30j20
7559d26Q04k98l41J93L96p7jl90J87Q3n1m14L10M08k96j86L47j48R2Q7m51L2L19
7582A79J4q33M75N38n59k80N62K38l11Rn9K58L9m0l21K77J72o65k3M79l0m05L06
7605B0q6O2R3Nn10M91K77n35q1M37M4l3j55j93J37K24l19j91K02L25k95k14N47
$$ plain form
7450 440 27 -589 258 304 -272 -153 477 41 -130 -20 7 -6 -179 -90 136 -67 33 -32 335 -21 -26 411
7472 411 550 -384 39 462 -210 -477 221 170 -413 -83 437 -89 34 229 140 -108 92 -53 -201 -143 -56
7493 -56 -96 94 -166 -140 390 98 -336 403 553 -284 -435 284 -161 -746 -209 20 -191 -126 -41 -232 79 45
7515 45 -175 90 281 142 -236 155 87 6 17 -322 -42 191 7 -658 -52 255 -262 -280 97 181 -420 -67
7537 -67 363 -29 -55 -41 -289 -55 128 -31 -420 202 113 -59 66 137 52 305 -283 -315 450 224 -306 -426
7559 -426 378 80 -261 -68 328 251 250 -140 47 130 79 -335 -25 383 87 -99 248 100 192 279 -172 -140 179
7582 179 193 -640 -165 373 -186 -466 96 334 23 32 -27 231 270 230 -91 186 358 -307 -330 149 119 -286 20
7605 20 -66 -4 89 94 -416 75 352 -183 -264 173 217 184 29 -164 -27 197 -122 -313 -111 214 -81 -295 252
7628B52j5m8k86n8J78Q3m48j9M99j44m91L9R06n35l10N69j8M6n8k10J3L35l33
7651e3k72Q7M33m95O3J35j31K39M5l05J96L47j47n52O43K00q56J77N32k30j98
7672a42J99k5J1P2k50R3K29j22j56K37J41l95K57J44n50rM84j03m04L73K93n63
7694a86R9L66l86J32J27m50N40K3l76J87M69m50l03L18K73n55k5L69l19O3J46
7715F2k28J16K68l42m8L79J1m57J94L65k98k78M45j13j38J52j25J69n8j2j97J54
7737B1Q1m02L77J21l77J9L61j60k11M14qn76Q5M73m33j23L38P1j75J83n0Q7N8
7760A74k62J00J43j72n03N09L04p10P5L57q9j48K00K90l35Q0K85m27J3J32N2l06
7782b38K14j56J49K25l61K38M03m06l88M94n6l83P9M17p4l85L42j30J09J97k21
$$ plain form
7628 252 237 189 -97 -155 23 106 -342 -361 138 -6 -497 -458 448 -87 -397 172 154 200 142 -68 -55 280 -53
7651 -53 -325 -238 195 -300 -237 -102 -233 6 51 -254 -58 289 142 -410 233 433 -423 -246 286 56 -142
7672 -142 57 32 43 115 -135 -42 187 65 -91 146 287 -108 149 293 -257 -266 218 115 -289 84 377 -186
7694 -186 -87 279 -107 25 152 -298 242 265 -111 76 545 95 -208 110 383 -172 -197 172 -147 -84 62
7715 62 -166 -50 218 -124 -172 207 218 -239 -45 320 22 -256 189 76 -62 90 -35 134 76 64 -133 21
7737 21 102 -300 77 198 -179 -160 201 41 -170 244 236 -340 -255 218 -215 -338 0 71 -104 79 29 116 174
7760 174 -88 12 155 -17 -520 -11 293 -417 -342 15 -74 -222 -22 268 -67 13 298 -129 -116 16 68 -238
7782 -238 -24 -180 -31 194 -167 71 474 68 -320 174 118 -265 -186 231 157 -228 114 -16 93 290 69
7803F9j39J58J73m96J26K57j80LJ44k31J60Q9k75K3K42L8l76K94M14q21J88L58
7825B18p6k00L77m53k06N18j34k34LL52k68m3K28L3p4J06m6p2K74k04l81M68K6
7848B12l65K44J33k47J32J89n86o7P41k88l60K27L47m80J83l2J15O2j59k41M32
7869A92m7l32j85M56J33o58K16L42j16q3K36k9j43K03n34K19L93l89m37M52K35
7890A24k18N7J73j59o0J8q6O2J86k25q7L72j76q2K06r7m21M18Q7k53q7N57j60
7913A49k97J21J66l49J47J88k67J90M9m08R7M76k18k34L10O4n06N06k50q1K43
7934I6l6l19J55M24m95j05O89j30o13M30J64l36M6J71j35pq6J19O8K74l76J8K74
7957B90k57l7R2J53n21K70K26n10J05L70j16q7P0m2k41L43R6l04R6J08P0l56J99
$$ plain form
7803 69 -70 88 261 -235 -109 148 -32 -29 115 -116 44 133 -142 -119 123 161 -215 79 493 -328 -140 218
7825 218 142 -58 319 -134 -340 178 44 -190 -187 165 -103 -146 82 115 41 147 101 29 303 99 -282 186 212
7848 212 -153 91 224 -23 109 298 -288 -355 386 98 -262 -35 312 -168 15 -17 98 160 1 -240 192
7869 192 145 -187 -372 84 217 -441 -225 117 1 -82 154 125 -18 185 -349 -130 263 -126 -563 -111 124
7890 124 -94 -37 136 -23 -83 -65 -151 -89 97 -128 -215 157 -19 -101 105 8 -413 5 92 -161 -248 309 149
7913 149 -148 -27 139 -210 -63 125 -142 48 97 -311 -214 262 44 -190 120 184 -322 184 -66 -147 96
7934 96 60 -259 -104 320 -175 -280 409 279 -334 96 260 -76 -30 141 6 -1 -87 32 100 374 -2 16 290
7957 290 33 -4 88 241 -280 -10 216 -294 -189 181 65 -22 48 6 -235 108 204 -100 -4 104 174 -182 17
7980A7Q5j3J4j49J06J34l01q7L49N6p07N82L43n22mL29k16k81J75M50n14r2L44
8003I8j88j52L61J07j26k73N1K19pk60l7L44k92k35M97J33m45qP26n40l48N93
8025B18j99k66J56K13k69k76N07p2j97j2k1K42Ok70J41K75l82j12M76J07o88M41
8047A8L13n23QL41pl66L67l2k96K80K13n18M7K07J81k51j78J98R3n6k01k7P49
8070E60n01n32O59J86m77j07N83k46m27N92O2m70n1K11n0n7K63k13N8j5M1J60
8092B29k01k95M58J77m89j05L81L1n84K63M57l09k33O02q2m38K63J6o1k73K50
8113E7k7n8PO4J38k40J5L68j3o04J41N21m58m38N30L65o45n8M56k2j69K49k8m3
8137A08j02Q5l35K21J00k61O7N8J01k4j1l00L43J45n92K39L71J27o58K67N28n95
$$ plain form
7980 17 102 89 103 -46 60 194 -107 -194 155 211 -496 86 429 -93 -97 232 16 -265 -90 360 -154 -246 98
8003 98 -90 -242 119 226 100 -173 -122 97 90 -170 -207 137 -155 -390 107 240 -205 -213 513 -27 -375 218
8025 218 19 -247 -91 122 -147 -423 84 12 -185 -197 -218 24 30 -240 -99 176 -206 -318 158 265 -423 18
8047 18 331 -192 -184 157 150 -216 151 119 -177 103 316 -202 -155 52 233 -18 -196 2 95 39 -162 -189 560
8070 560 59 -473 186 372 -105 -212 371 125 -302 290 352 -118 -169 42 -8 -65 198 -15 43 28 69 229
8092 229 28 -267 191 368 -121 -226 155 186 -398 -135 322 13 -220 382 300 -138 125 141 80 -193 57
8113 57 30 -28 -21 43 181 -59 -44 324 311 -293 -152 369 -89 -527 3 368 -277 -335 121 99 -70 179 151 108
8137 108 6 91 -244 -23 77 -184 -117 -59 42 18 7 -293 50 195 -397 -158 213 340 -318 -51 477 -118
8159a18k83N61m1l79K90J74n27L27Q3j87J12j88J95l1l59O0K79L36p07J57N80
8180C34k57l98L00L41l49k43M50j02l79J93L8
$$ plain form
8159 -118 -401 160 119 -260 30 204 -323 4 87 -100 12 -176 19 -12 -371 -311 -32 304 -403 -246 334
8180 334 77 -321 -21 320 -29 -272 178 76 -303 -110 -72
8191g2
$$ Imaginary data points
##PAGE= N=2
##DATA TABLE= (X++(I..I)), XYDATA
0@%%%Qj6Q%Rk5K4j6L0m6M8n1O6q6R8j06J24j51J75j98K26k60K96l35L74m19M74
30B51n33N95o61P35q21R14j009J114j237J373j515J670j850K056k282K530k817
47a487L160l556M018m581N284o174P330q907J1191j4736K0816l3085O6393l04947
61b59281q04330J270428P13788j352039m60523J353333K44572j236080j2735J113377
71E70510j60855r22251K93251P13179l90160n04143M08143K76303m02057q2659
81b00739L25495q1421j90284K36320N2249l07695J12519L16747k91212k83748
91c11769M29581J84339n45383n7617O11098q7779o23789K47028O01587l89040
101E8256n28639N27751M33606o36054l10621P09948J58185p53635L461P52183
$$ plain form
0 0 0 0 0 8 -8 0 0 9 -16 8 -8 22 -24 24 -27 39 -47 51 -55 69 -82 93 -105 121 -139 157 -178 196 -223 251
30 251 -282 313 -348 387 -434 480 -529 585 -652 721 -794 876 -974 1082 -1200 1330 -1487
47 -1487 1673 -1883 2135 -2446 2838 -3336 3994 -4913 6278 -8458 12358 -20727 45666 -259281
61 -259281 -1063611 206817 920605 -431434 -891957 461376 705948 -530132 -542867 570510
71 570510 409655 -512596 -219345 493834 103674 -400469 7674 283977 -118080 -200739
81 -200739 124756 43335 -146949 89371 141620 -166075 -53556 263191 -28021 -311769
91 -311769 117812 302151 -243232 -300849 310249 222470 -401319 -154291 447296 58256
101 58256 -470383 57368 490974 -145080 -455701 254247 412432 -341203 -337742 414441
111D14441j68875p07861L14876O11518m36705m74991N26005L18600n68218j54420
121c25630N62631o558n19945J47888M44633k64169l45587L55911K37191m14664
131a28299j17671M44936R10m35673J19630M00138k24793l39487K96305K42244
141B58240l46015j37274L55352L0385l27131P0478K76468j41833j96079J94356
151C6947J09209k19746k1151K20310o9842k10769J42951J72704k12495j19322
161a71204K72050N5185l06842K8348L24504j11105l06356J98247K61773k77511
171c2911k02247L27154J16283l62939l2395L69770n1719l54850J30723L30144
181B37013j92189k87213K47544K41606k83454j82224L06919J12325l21285m9256
$$ plain form
111 414441 245566 -462295 -147419 464099 27394 -447597 78408 397008 -171210 -325630
121 -325630 237001 230443 -289502 -141614 303019 38850 -306737 49174 286365 -128299
131 -128299 -245970 198966 199876 -235797 -116167 283971 59178 -280309 15996 258240
141 258240 -87775 -225049 130303 160688 -166443 -95965 180503 38670 -157409 36947
151 36947 146156 -73590 -94741 125569 55727 -155042 -12091 160613 -51882 -171204
161 -171204 100846 156031 -150811 -122463 202041 90936 -215420 -17173 244600 -32911
171 -32911 -235158 91996 208279 -154660 -187055 182715 130996 -223854 -93131 237013
181 237013 44824 -242389 5155 246761 -36693 -218917 88002 200327 -120958 -170214
191a70214L03861j8750k69480P8376K20391j15170j52395J37369Q6621j34467
201c3858k5084J12767k9359q2280O4900M0086r4234j593J09282l7787j10137Q3785
213c512J08576j22981r1720J59776O1209j90523k0921K04379l1931k06935Q2846
224e1737J89676j29451j56802J67078J18727j86531p3162J96196L2610j94209
234h7605K412J83440l4358j68479O0522J44669q7225j17234J07027Q2912j15718
245b9637l7220J19735l675j04598M4367P9757p6335n0364R0553J2580r7797J6471
257c6163R1347m0022p8571O0870O8739o8821n0254P8805L2934q6204j6242Q3947
269D0365j0851q1926L3201O6255n6478m1384P8385J7044q2164J8126Q2701m5809
$$ plain form
191 -170214 133647 114897 -154583 -76207 144184 29014 -123381 13988 100609 -33858
201 -33858 -58942 53825 24466 -57814 7086 47172 -47062 -48655 60627 22840 -87297 -3512
213 -3512 105064 -17917 -109637 50139 111348 -79175 -100096 104283 72352 -134583 -51737
224 -51737 137939 8488 -148314 18764 137491 -49040 -122202 73994 106604 -87605
234 -87605 -85193 98247 63889 -104590 -44068 100601 13376 -103858 3169 86081 -29637
245 -29637 -66857 52878 49203 -55395 -11028 68729 -7606 -57970 32583 45163 -52634 -36163
257 -36163 55184 15162 -63409 -2539 66200 -2621 -52875 25930 58864 -27340 -43582 40365
269 40365 29514 -52412 -19211 47044 -9434 -50818 27567 44611 -37553 -19427 63274 17465
281A7465p5176O1835N5786p7458m5190Q0026L3393p8157k2187P7896J6065p2442
293b8144m219O8642n756n8679J6531M1031k9438k3043L2094J388k6932K1748K0173
306B5396l3561n985L7862j0122m0526J5518L2742k0646k6960K1737K2984k0835
318b396k0494K2125J8812k2888j0722K9166L332k9284R366K4762k5051j9323L3116
331A0521N779m0647M155L8032j3906l4868J6234L0805j0456k3111J0015K7784
343B0337k006k8479j059K6867l381k9425J513K0957k650j2196J273O245Q845K711
357I552j3785r40K1981k710k7088L710K0009j1242j7598R911J1720l623m415J216
371c302P512O321q235o265J1525L325j3792r11P320o604m086O126l313k116J1456
$$ plain form
281 17465 -57711 4124 59910 -17548 -62738 17288 50681 -27476 -49663 28233 44298 -28144
293 -28144 -32363 36279 30523 -28156 -11625 29406 -32 -23075 9019 10407 -16525 5223 25396
306 25396 -8165 -14150 23712 13590 -26936 -11418 21324 678 -26282 -4545 18439 -2396
318 -2396 -22890 -765 18047 -4841 -15563 13603 16935 -12349 -2983 21779 -3272 -22595 10521
331 10521 16300 -24347 -20192 17840 3934 -30934 -14700 16105 5649 -17462 -7447 20337
343 20337 18331 -10148 -11207 15660 12279 -17146 -15633 5324 2674 -9522 -8249 -2004 6841 9552
357 9552 -4233 -5173 16808 14098 -12990 -9280 10729 -513 -18111 -8200 3520 -103 -4518 -3302
371 -3302 4210 10531 2296 -3969 7556 10881 -2911 -3822 3498 -3106 -7192 -1066 -4379 -6495 4961
386D961R19r522M345O174o655j869K033l430N212O268j1704l960J6595J35j7420
401g918L942J6238k154j0743j303O007K959j0059j1105J1398J2977j3336p599
414a0696J9785M505j6908K772J2177p188n625O796l373o388K976k455p159M825
428e956N324l018J755O254J300J13k355k602N462p10j2032K617J0359j2150r093
443a4732J5744J843j6669R835J7509j4785r813J9993M220k2042j308J9227l70
456H652j7399k009J7125L829j9867m159K3178K071k3270M440K0286j1197j4132
469a2452J4677L934j5320P393J0999j5302n131J7697l260j8186P839J7492p912
482B468j4086R629J6346r961j8957J2850K1469j9522k2067K6110J5466l4232q191
$$ plain form
386 4961 5880 -3642 703 6877 222 -1647 386 -3044 2168 8436 -3268 -7228 9367 9502 -7918
401 -7918 -3976 12262 10108 -635 -1938 4069 7028 -3031 -14136 -2738 10239 -3097 -10696
414 -10696 9089 13594 -3314 -542 11635 4447 -1178 5618 2245 -4143 -1167 -3622 -10781 -5956
428 -5956 -632 -3650 -1895 4359 5659 5772 3417 815 6277 5567 -6465 -3848 6511 -5639 -14732
443 -14732 1012 2855 -13814 -3979 13530 -1255 -11068 8925 13145 -8897 -10205 9022 8652
456 8652 -8747 -10756 6369 10198 -9669 -13828 9350 11421 -11849 -7409 12877 1680 -12452
469 -12452 2225 6159 -9161 -1768 9231 -6071 -11202 6495 3235 -14951 -7112 10380 2468
482 2468 -11618 -1989 14357 4396 -14561 -1711 19758 236 -21831 4279 19745 -14487 -22678
495b2678L6504k038l2581J4619K7631k0537j8385K4148R176k4951k402K4969m82
508A2993k5464M343K6184q431k7900J4946K8194k2293k2992K8737J0961l5505
520a6227P12L3280j5610k5053L0135J5680l6828j499L9670j0866l8300K1809L5984
533C2887k9218l2118L4771K5258m4778k1417N1306J2607n7258K262O2353j7751
545A8904n9919L5027N1161n0567l4455O0495J5136o3742M305N8065k3738n0286
557c9614L7711M0264m6417k7025N5431J6038o0761l208O3410j3360o4992K9237
569a3286N6981m8372m4538O3137K5187p1399K142P4373k7416o4580N1182M8069
581E1480o9590k8422P7903L016q4104J8800Q1633m0916p4257O5553O5895q4066
$$ plain form
495 -22678 13826 11788 -20793 -6174 21457 920 -17465 6683 15859 -9092 -11494 13475 12993
508 12993 -12471 -8128 18056 9625 -18275 -3329 24865 2572 -20420 8317 19278 -16227
520 -16227 -15515 17765 2155 -22898 7237 22917 -13911 -15410 24260 13394 -24906 -3097 32887
533 32887 3669 -28449 6322 31580 -13198 -34615 16691 29298 -27960 -25698 36655 18904
545 18904 -41015 -5988 45173 -5394 -39849 20646 35782 -27960 -23655 34410 10672 -39614
557 -39614 -1903 38361 -8056 -35081 20350 36388 -24373 -27581 35829 22469 -42523 -13286
569 -13286 43695 -4677 -49215 13922 39109 -32290 -30148 44225 16809 -47771 3411 51480
581 51480 -18110 -46532 31371 34387 -49717 -30917 50716 9800 -64457 1096 66991 -17075
593a7075m8066J03241K5550j19652J893J24549l5846j21091O7930J05050r6578
604a0095p8986J18252M7450j25448r712J26024k3833j16750N2087R7617p8984
615b378p7000R8366N1753j11278k1343J19216j0180j17481M5066J06865p5765
626E841q4426J01555N1353j19110j6481J19326k2671j08338N8091Q7899q2331
637i292n6889R9418K3057j05940J3020J04656m7595r4432P9520P4920j11533n1239
649h2329J35426J7437j49753K5251J55564o7044j44513J09055J18890j44178q2162
660a08356J68139L7171j77981Q977J72415n5616j57746R5226J33110j26208r8738
671a09607J52232O1111j68080j9481J72785k6728j67656P0653J48466j11109j17943
$$ plain form
593 -17075 -65141 38100 63650 -56002 -54109 70440 34594 -86497 -18567 86483 -10095
604 -10095 -89081 29171 76621 -48827 -58539 67485 43652 -73098 -21011 76606 -2378
615 -2378 -79378 18988 70741 -40537 -61880 57336 47156 -70325 -25259 81606 5841
626 5841 -78585 22970 74323 -44787 -61268 58058 35387 -72951 -14860 73039 -9292
637 -9292 -66181 33237 56294 -49646 -36626 68030 20435 -73997 5523 80443 -31090 -82329
649 -82329 53097 70534 -79219 -53968 101596 34552 -109961 -906 117984 -26194 -108356
660 -108356 59783 96954 -81027 -72050 100365 44749 -112997 -17771 115339 -10869 -109607
671 -109607 42625 103736 -64344 -83825 88960 62232 -105424 -34771 113695 2586 -115357
682a15357J42358P6453j59505k9092J64126j6147j50594N7988J24920r1598r3401
693h9849J10944N3350j22890j5138J22937k3963j13721O1833R7365r2695o8223
704h0050J21123L3916j37600Q719J41387n6040j33268R8692J08400j36515p3415
715a04651J62330L1096j74931J5086J75248n7165j63151R6465J41747j30265j14767
726a22958J54909P9051j73413l8956J82753l523j78420M9451J64038r0119j35085
737a12272J23618R5517j45250n1658J50530L463j44758L8271J24878p3547r5887
748h7095J01098O4809j15809k6883J25006r165j23908M5315J11763q1323r1769
759h7961J09418N9852j31156k0876J40953k0791j36216O4599J19811r9684r1330
$$ plain form
682 -115357 27001 103454 -56051 -85143 78983 62836 -87758 -29770 95150 3552 -89849
693 -89849 21095 74445 -48445 -63583 59354 35391 -78330 -16497 80868 -11827 -80050
704 -80050 41073 74989 -62611 -53892 87495 31455 -101813 -3121 105279 -31236 -104651
715 -104651 57679 88775 -86156 -71070 104178 47013 -116138 -19673 122074 -8191 -122958
726 -122958 31951 111002 -62411 -101367 81386 77863 -100557 -51106 112932 22813 -112272
737 -112272 11346 106863 -38387 -90045 60485 63948 -80810 -42539 82339 8792 -87095
748 -87095 14003 78812 -36997 -63880 61126 51961 -71947 -26632 85131 3808 -87961
759 -87961 21457 81309 -49847 -70723 70230 49439 -86777 -22178 97633 -2051 -93381
770i3381J27104N5642j43266j9055J46334j9251j40805N3951J27251q3510j04833
781i3819J10681P8311j30969m5189J43000N575j47155L3001J36997p2195j18084
792i9846J03731Q8387j25429n1021J36926J5775j34247K0850J25102m9984j07029
803g6785P3402Q3309r1740n8827J01288K8960j06659L48J02402l1848r0746O0632
815f264O9995q3744m0195R9799Q715j03580K5594R7261n5128q2523P7090O1365
827F8385r1548l6641R8193J1825r7654J1893R1323l5376q0589N5947O2827p6159
839a7574m1322Q8838J3407r6640J7099R5614m5172q3409P2572O6112r0402m1732
851f2609J00144J6438j01875O120R6232k6718q6489M2800P2992n5278n6174O5713
$$ plain form
770 -93381 33723 89365 -53901 -72956 73378 54127 -86678 -32727 94524 11014 -93819
781 -93819 16862 95173 -35796 -80985 62015 67590 -79565 -46564 90433 18238 -99846
792 -99846 3885 92272 -33157 -84178 52748 68523 -65724 -44874 80228 30244 -76785
803 -76785 -3383 79926 -11814 -70641 30647 59607 -47052 -46704 55698 23850 -66896 -6264
815 -6264 63731 -20013 -60208 39591 48306 -55274 -29680 67581 12453 -70070 7020 68385
827 68385 -23163 -59804 38389 50214 -47440 -35547 55776 20400 -60189 -4242 58585 -17574
839 -17574 -58896 29942 43349 -53291 -36192 59422 14250 -69159 3413 69525 -20877 -62609
851 -62609 37535 53973 -47902 -41782 54450 27732 -58757 -15957 57035 1757 -54417 11296
863A1296L7544p1781j5683P2734r356o8438L1748N6770n3121l8823O8018J8322
875C9230p4039M088P4638k2459o5789L7689N4866m7226m1968N1035K6899n4096
887a7132j3459N3554j563m9923J7579M3304l2971l1827M6653J6502n5981J678
899b3586N8647k0915n5891L6782M6859m7963l4665N5452K2989n4919j0334N2842
911B5298P43m8787P077M1829j5381l5352K2772K4936k9795j2327L4814j922l5543
924b1638J7596L2089l1465k4550M0317J3512m5334l478M4617n368l9610J1763
936a1549L5069j4805k7773J7643K1626k0496j6551K2030P976k5135M75K5517j1182
949B845k2725K0995J7064k8411q390L2806l30l1460Q429K8138j2979k2879J4259
$$ plain form
863 11296 48840 -22941 -38624 34110 24754 -43684 -11936 44834 -8287 -47110 20908 39230
875 39230 -34809 -30721 43917 21458 -44331 -6642 48224 998 -40970 10065 36964 -17132
887 -17132 -30591 22963 21400 -28523 -10944 32360 -611 -32438 14215 30717 -25264 -23586
899 -23586 35061 14146 -41745 -4963 41896 -6067 -40732 14720 37709 -17210 -27544 25298
911 25298 26041 -22746 -15669 26160 10779 -24573 -1801 23135 -6660 -18987 15827 13905 -21638
924 -21638 -4042 28047 -3418 -27968 12349 25861 -19473 -22951 21666 16298 -23312 -11549
936 -11549 23520 8715 -19058 -1415 20211 -285 -16836 5194 13170 -11965 -11490 14027 2845
949 2845 -19880 1115 18179 -10232 -18622 14184 13854 -17606 -9177 18961 5982 -16897 -2638
962b638J6976j4087j3722J2168R785j1698p148J1262L386r958L866R224r517l677
976e778J5912k877k0429R519J9713j7731j7477K1153J2529k1806p484K1113M650
989A1007j6422k712J3399J301j2734j447J0819j123j0073N883R751q029m504J2267
1003G383L6j3162M615R961r386p533R213J538p791J289M730j117J091J747k209
1018D05J256L266l076m485J710K774q12m252r05Q055L033j0456j025J4665p59
1033I394j5823M348J3429p941j1041P076M681o547j959K613j27J251J243k214
1047a617J308L667j140n69J560j181M53J851l845k837L305o72m042J005m4j448
1063d246M963M14p047N368J1234q370j0523J2668Q016j5965o739J3821L290j2665
$$ plain form
962 -2638 14338 251 -13471 -1303 8482 -3216 -10364 898 4284 -5674 -1808 7416 -2101 -5778
976 -5778 10134 7257 -13172 -3653 16060 -1671 -19148 2005 14534 -7272 -14756 6357 11007
989 11007 -5415 -8127 5272 6573 -6161 -7608 3211 2088 -7985 -2102 7649 -380 -4884 7383
1003 7383 7419 -5743 -1128 8833 -553 -8086 1127 2665 -5126 -3837 893 -224 867 2614 405
1018 405 1661 4927 1851 -2634 -924 1850 1038 -3214 -4119 3936 6969 -3487 -4512 10153 9394
1033 9394 -6429 -2081 11348 3407 -7634 -558 4123 -2424 -4383 -1770 -1897 -646 597 -1617
1047 -1617 -309 3358 2218 1649 3209 2028 2481 4332 487 -2350 955 283 -3759 -2754 -2798 -4246
1063 -4246 717 1131 -5916 -548 10686 2316 -8207 4461 12477 -3488 -10227 3594 6884 -5781
1077e781l895J0726N673q300o379R616P649r797o192R342K928q810q30L440k513
1092c123J795L126o963K12J2266k411j2891N449J2004p888j0581O362P248n067
1106d62o654L384O855k194n561M566N352o146j315Q310m418r765R511P025j6096
1121g608m495J8966L42j8875M214J8924m044j5596M999J4601l522j4829J409J3627
1135H113l280j4745L837J2503o050p791Q601L097n739M889L488r208J448J1192
1149A0355p825j3589R378J0316j1971r222J1655Q939q851p237J0023Q342q653
1162A660o344J0079L375j0983J077Q484q777o398J3175n24j7552P224J8600j3324
1176b28j5772J8832J3498j9447r044K0516O934j9860n039J8242J658j9532M75
$$ plain form
1077 -5781 -9676 1050 6723 -1577 -7956 1660 9309 -488 -6680 2662 5590 -3220 -4050 -610 -3123
1092 -3123 -1328 1798 -5165 -4953 7313 4902 -7989 -2540 9464 1576 -9005 -2643 4605 -462
1106 -462 -7116 -3732 3123 929 -4632 -66 5286 -860 -2175 6135 1717 -8048 1463 8488 -7608
1121 -7608 -12103 6863 7205 -11670 -7456 11468 7424 -8172 -3173 11428 7906 -6923 -5514 8113
1135 8113 4833 -9912 -6075 6428 378 -7413 1188 4285 -1454 3435 6923 -2285 -837 10355
1149 10355 2530 -11059 -1681 8635 -3336 -12558 -903 8036 -815 -8052 1971 10313 1660
1162 1660 -4684 5395 8770 -2213 -1136 7348 -1429 -7827 5348 4824 -12728 -5504 13096 -228
1176 -228 -16000 2832 16330 -3117 -12161 8355 15289 -4571 -9610 8632 10290 -9242 -8767
1189h767J7511o141j5329J2721J1061j7385j804K2371p731k3345J7276J9351k7693
1202g904j5015L1799P356l3998ML4856l825l0722R775K9071j3864k5301J6678
1215a090J8563k3570j3318K6605K579k8477R553K8984j9234k1825L0479J4494
1227B3743l6393m648L6145p344l4882J4012K8140j9632k0103K4424J3680k4726
1239g584m243K6722m602k6431J3758K3272k5486k0181L5365J0979m4216M61N0156
1252B7970j2649m9339K5987M5550l5498l6540M1133K6130m2671j6043M0433O040
1264B0503l6389J850K9488j0305k2135J7176J3266k3057o64K8828j1453k8498
1276b1390K6512K5034l9657j7693M8278L559n4150R477N2513k2956m5815L5081
$$ plain form
1189 -8767 8744 2603 -12726 -5 11056 -6329 -8133 14238 6507 -16838 438 19789 -7904
1202 -7904 -22919 8880 16236 -17762 -17758 17098 13273 -17449 -7674 21397 7533 -17768 -1090
1215 -1090 17473 -6097 -19415 7190 9769 -18708 -9155 19829 595 -21230 9249 23743
1227 23743 -12650 -17298 18847 11503 -23379 -9367 18773 -859 -20962 3462 17142 -7584
1239 -7584 -11827 14895 10293 -16138 -2380 20892 -4594 -24775 10590 21569 -22647 -22186 27970
1252 27970 15321 -34018 -8031 37519 2021 -34519 6614 32744 -9927 -25970 14463 20503
1264 20503 -15886 -14036 15452 5147 -16988 188 13454 -9603 -10267 18561 7108 -21390
1276 -21390 5122 30156 -9501 -27194 21084 24643 -29507 -20030 32483 9527 -36288 -1207
1288a207L7939m2000k5358M7679J3974n0891k906N0048j1256m9807K2945M5387
1300C4547l5216l6559M7914K6571n4234j0772N7398n038n5720J7792M5411l1229
$$ plain form
1288 -1207 36732 -5268 -30626 17053 31027 -19864 -22770 27278 16022 -33785 -10840 34547
1300 34547 -669 -37228 10686 37257 -16977 -27749 29649 24611 -31109 -13317 32094 865
$$ [...]
8191C7
##END NTUPLES=NMR FID
##END=
