##TITLE=1H_CA-8650-1
 CDCl3, 8 sc, 
 23.9.2019
##JCAMPDX= 6.0         $$ Bruker NMR JCAMP-DX V2.0
##DATA TYPE= NMR FID
##DATA CLASS= NTUPLES
##ORIGIN= UXNMR, Bruker Analytische Messtechnik GmbH
##OWNER= root
$$ XWIN-NMR		Version 3.5
$$ Mon Sep 23 14:01:51 2019 Russian Standard Time (UT+4h)  she@DPX200
##.OBSERVE FREQUENCY= 200.1315
##.OBSERVE NUCLEUS= ^1H
##.DELAY= (6, 6)
##.ACQUISITION MODE= SIMULTANEOUS
##.ACQUISITION SCHEME= undefined
##.AVERAGES= 8
##.DIGITISER RES= 18
##SPECTROMETER/DATA SYSTEM= spect
##.PULSE SEQUENCE= zg30
##.SOLVENT NAME= CDCl3
##.SHIFT REFERENCE= (INTERNAL, CDCl3, 0, 15.7039)
##AUDIT TRAIL= $$ (NUMBER, WHEN, WHO, WHERE, WHAT)
$$ ##TITLE= Audit trail, XWIN-NMR		Version 3.5
$$ ##JCAMPDX= 5.01
$$ ##ORIGIN= Bruker BioSpin GmbH
$$ ##OWNER= she
$$ F:/spectra/data/she/nmr/H-F/1/audita.txt
$$ ##AUDIT TRAIL=  $$ (NUMBER, WHEN, WHO, WHERE, WHAT)
(   1,<2019-09-23 14:00:34.54 +0400>,<she>,<DPX200>,
      <created by zg, POWCHK disabled, PULCHK disabled
       configuration hash MD5:
       00 E9 B6 7A A2 85 ED C7 34 08 36 98 17 FE 4E 26
       data hash MD5: 16K
       E9 37 5C 2D 71 D3 34 C0 8F 7C 42 FB 64 39 09 EF>)
$$ ##END=
$$ 
$$ hash MD5
$$ D8 81 35 55 29 59 DB C2 DC E5 92 8D 89 66 3F 18
##$RELAX= 
##$RELAX= 
##$RELAX= 
##$RELAX= 
##$RELAX= 
##$RELAX= 
$$ Bruker specific parameters
$$ --------------------------
##$DU= <F:/spectra>
##$EXPNO= 1
##$NAME= <H-F>
##$PROCNO= 1
##$TYPE= <nmr>
##$USER= <she>
##$AMP= (0..31)
100 100 100 100 100 100 100 100 100 100 100 100 100 100 100 100 100 100 
100 100 100 100 100 100 100 100 100 100 100 100 100 100 
##$AQSEQ= 0
##$AQ_mod= 1
##$AUNM= <au_zg>
##$AUTOPOS= <>
##$BF1= 200.13
##$BF2= 200.13
##$BF3= 200.13
##$BF4= 200.13
##$BF5= 200.13
##$BF6= 200.13
##$BF7= 200.13
##$BF8= 200.13
##$BYTORDA= 1
##$CFDGTYP= 0
##$CFRGTYP= 5
##$CHEMSTR= <none>
##$CNST= (0..31)
1 1 145 1 1 1 1 1 1 1 1 1 1 1 1 1 1 1 1 1 1 1 1 1 1 1 1 1 1 1 1 1 
##$CPDPRG= <>
##$CPDPRG1= <>
##$CPDPRG2= <>
##$CPDPRG3= <>
##$CPDPRG4= <mlev>
##$CPDPRG5= <mlev>
##$CPDPRG6= <mlev>
##$CPDPRG7= <mlev>
##$CPDPRG8= <mlev>
##$CPDPRGB= <>
##$CPDPRGT= <>
##$D= (0..31)
0 1.2 0 0 0 0 0 0 0 0.06 0 0.03 0 0 0 0 0.0002 0 0 0 0 0 0 0 0 0 0 0 0 
0 0 0 
##$DATE= 1569232834
##$DBL= (0..7)
120 120 120 120 120 120 120 120 
##$DBP= (0..7)
150 150 150 150 150 150 150 150 
##$DBP07= 0
##$DBPNAM0= <>
##$DBPNAM1= <>
##$DBPNAM2= <>
##$DBPNAM3= <>
##$DBPNAM4= <>
##$DBPNAM5= <>
##$DBPNAM6= <>
##$DBPNAM7= <>
##$DBPOAL= (0..7)
0.5 0.5 0.5 0.5 0.5 0.5 0.5 0.5 
##$DBPOFFS= (0..7)
0 0 0 0 0 0 0 0 
##$DE= 6
##$DECBNUC= <off>
##$DECIM= 24
##$DECNUC= <off>
##$DECSTAT= 4
##$DIGMOD= 1
##$DIGTYP= 9
##$DL= (0..7)
0 120 120 120 120 120 120 120 
##$DP= (0..7)
150 150 150 150 150 150 150 150 
##$DP07= 0
##$DPNAME0= <>
##$DPNAME1= <>
##$DPNAME2= <>
##$DPNAME3= <>
##$DPNAME4= <>
##$DPNAME5= <>
##$DPNAME6= <>
##$DPNAME7= <>
##$DPOAL= (0..7)
0.5 0.5 0.5 0.5 0.5 0.5 0.5 0.5 
##$DPOFFS= (0..7)
0 0 0 0 0 0 0 0 
##$DQDMODE= 0
##$DR= 18
##$DS= 0
##$DSLIST= <SSSSSSSSSSSSSSS>
$$ [...]
##$SUBNAM2= <"">
##$SUBNAM3= <"">
##$SUBNAM4= <"">
##$SUBNAM5= <"">
##$SUBNAM6= <"">
##$SUBNAM7= <"">
##$SUBNAM8= <"">
##$SUBNAM9= <"">
##$SW= 24.0689530833862
##$SWIBOX= (0..15)
0 0 2 0 0 0 0 0 0 0 0 0 0 0 0 0 
##$SW_h= 4816.95568400771
##$TD= 16384
##$TD0= 1
##$TE= 0
##$TE2= 300
##$TE3= 300
##$TEG= 300
##$TL= (0..7)
0 120 120 120 120 120 120 120 
##$TP= (0..7)
150 150 150 150 150 150 150 150 
##$TP07= 0
##$TPNAME0= <>
##$TPNAME1= <>
##$TPNAME2= <>
##$TPNAME3= <>
##$TPNAME4= <>
##$TPNAME5= <>
##$TPNAME6= <>
##$TPNAME7= <>
##$TPOAL= (0..7)
0.5 0.5 0.5 0.5 0.5 0.5 0.5 0.5 
##$TPOFFS= (0..7)
0 0 0 0 0 0 0 0 
##$TUNHIN= 0
##$TUNHOUT= 0
##$TUNXOUT= 0
##$USERA1= <user>
##$USERA2= <user>
##$USERA3= <user>
##$USERA4= <user>
##$USERA5= <user>
##$V9= 5
##$VALIST= <valist>
##$VCLIST= <CCCCCCCCCCCCCCC>
##$VD= 0
##$VDLIST= <DDDDDDDDDDDDDDD>
##$VPLIST= <PPPPPPPPPPPPPPP>
##$VTLIST= <TTTTTTTTTTTTTTT>
##$WBST= 1024
##$WBSW= 4
##$XGAIN= (0..3)
0 0 0 0 
##$XL= 0
##$YL= 0
##$YMAX_a= 869264
##$YMIN_a= -1044237
##$ZGOPTNS= <>
##$ZL1= 120
##$ZL2= 120
##$ZL3= 120
##$ZL4= 120
##$ABSF1= 10
##$ABSF2= 0
##$ABSG= 5
##$ABSL= 3
##$ALPHA= 0
##$AQORDER= 0
##$ASSFAC= 0
##$ASSFACI= 0
##$ASSFACX= 0
##$ASSWID= 0
##$AUNMP= <proc_1d>
##$AZFE= 0.1
##$AZFW= 0.1
##$BCFW= 1
##$BC_mod= 2
##$BYTORDP= 1
##$COROFFS= 0
##$CY= 11.3945322036743
##$DATMOD= 1
##$DC= 2
##$DFILT= <>
##$DTYPP= 0
##$F1P= 20.1720416913024
##$F2P= 0.152960286110954
##$FCOR= 0.5
##$FTSIZE= 0
##$FT_mod= 4
##$GAMMA= 1
##$GB= 0.15
##$INTBC= 1
##$INTSCL= 1
##$ISEN= 128
##$LB= 0.24
##$LEV0= 0
##$LPBIN= 0
##$MAXI= 10000
##$MC2= 0
##$MEAN= 0
##$ME_mod= 0
##$MI= 1.114404
##$NCOEF= 0
##$NC_proc= 0
##$NLEV= 6
##$NOISF1= 3.799351
##$NOISF2= 2.8
##$NSP= 1
##$NTH_PI= 0
##$NZP= 0
##$OFFSET= 15.70392
##$PC= 1
##$PHC0= -9577.767
##$PHC1= 31.40096
##$PH_mod= 1
##$PKNL= yes
##$PPARMOD= 0
##$PSCAL= 0
##$PSIGN= 0
##$REVERSE= no
##$SF= 200.130013532006
##$SI= 16384
##$SIGF1= 3
##$SIGF2= 2
##$SINO= 400
##$SIOLD= 16384
##$SREGLST= <1H.CDCl3>
##$SSB= 0
##$STSI= 0
##$STSR= 0
##$SW_p= 3612.71676300578
##$SYMM= 0
##$S_DEV= 0
##$TDeff= 0
##$TDoff= 0
##$TI= <>
##$TILT= no
##$TM1= 0
##$TM2= 0
##$TOPLEV= 0
##$USERP1= <user>
##$USERP2= <user>
##$USERP3= <user>
##$USERP4= <user>
##$USERP5= <user>
##$WDW= 1
##$XDIM= 8192
##$YMAX_p= 0
##$YMIN_p= 0
$$ End of Bruker specific parameters
$$ ---------------------------------
##NTUPLES= NMR FID
##VAR_NAME=  TIME,          FID/REAL,        FID/IMAG
##SYMBOL=    X,             R,               I
##VAR_TYPE=  INDEPENDENT,   DEPENDENT,       DEPENDENT
##VAR_FORM=  AFFN,          ASDF,            ASDF
##VAR_DIM=   8192,          8192,            8192
##UNITS=     SECONDS,       ARBITRARY UNITS, ARBITRARY UNITS
##FACTOR=    0.0002076,     1,               1
##FIRST=     0,             0,               0
##LAST=      1.7004516,     0,               0
##MIN=       0,             -1044237,        0
##MAX=       1.7004516,     869264,          0
$$ Real data points
##PAGE= N=1
##DATA TABLE= (X++(R..R)), XYDATA
0@%%%qK4l2L2m0O4q8J04j28J67k09K50k97L62m42N22o09P15q39R76j126J294j486
$$ 0 0 0 0 -8 16 -16 16 -24 40 -48 56 -72 95 -114 136 -161 201 -241 281 -328 387 -452 524 -602 692 -794
26g94J701j938K197k484K806l160L546l970M435m948N512o125O795p538Q357r252
$$ -794 907 -1031 1166 -1318 1488 -1672 1874 -2096 2339 -2609 2903 -3222 3573 -3965 4392 -4860
42d860J0237j1334J2560j3924J5449j7182J9171k1462K4132k7307L1164l5953
$$ -4860 5377 -5957 6603 -7321 8128 -9054 10117 -11345 12787 -14520 16644 -19309
54a9309M2072n0223O1701p9159J09188j74538N40334m58380r88227J381372M55917
$$ -19309 22763 -27460 34241 -44918 64270 -110268 430066 -28314 -1016541 364831 820748
65H20748j243582l83212J279150P9352j079899O0250R94831k41502p48723L17750
$$ 820748 -422834 -806046 473104 552456 -527443 -467193 527638 286136 -462587 -144837
75a44837N87150m04577l53647L84213J75889l69050M129K38774j47609j19707
$$ -144837 442313 37736 -315911 68302 244191 -124859 -120730 118044 -29565 -149272
85a49272K74756k9245k93210J92833K89115l53168k17502M65262J04485n64054
$$ -149272 125484 96239 -196971 -4138 284977 -68191 -285693 179569 284054 -280000
95b80000K3459N91610j64158n81506L11779N31557m41327m50101N57900L44586
$$ -280000 -256541 335069 170911 -410595 -98816 432741 -8586 -458687 99213 443799
105D43799o37882k11842O90600O0741p05814R8019O84681k43850o16502L64774
$$ 443799 -194083 -405925 284675 345416 -360398 -262379 422302 178452 -438050 -73276
115g3276N00004m61863l56079N20540K02054n35238n2001N05682q8827m45606
$$ -73276 426728 -35135 -391214 129326 331380 -203858 -255859 249823 160996 -284610
125b84610K05563L59597k99144k60500L67295J55025m05435m6247M10861o3990
$$ -284610 -79047 280550 -18594 -279094 88201 243226 -162209 -208456 202405 138415
135A38415l84848J74584L41759k55129k65802L09492J66422l37723o6404L24312
$$ 138415 -246433 -71849 269910 14781 -251021 58471 224893 -112830 -179234 145078
145A45078l5196k86018J15134K23445j68533j39933K04294N8404k10966K9801
$$ 145078 109882 -176136 -61002 162443 -6090 -146023 58271 116675 -94291 -64490
155f4490K06764j05625j83998J67545J34535k31132p9496K73738Q079k97076P3306
$$ -64490 142274 36649 -147349 20196 154731 -76401 -155897 117841 125920 -171156 -97850
166i7850K97056j50891k60349K33609K09422k93811j37712L31632N4635l50565
$$ -97850 199206 48315 -212034 21575 230997 -62814 -200526 131106 185741 -164824
176a64824K2598L39562j02046l20571J65050K86810k17085k43481K58754J95839
$$ -164824 -142226 197336 95290 -225281 -60231 226579 9494 -233987 24767 220606
186B20606k80487j31709K99087O9239k97531j0205K69628n1493k29634R5267J71436
$$ 220606 -59881 -191590 107497 176736 -120795 -131000 138628 87135 -142499 -47232 124204
197A24204j22217j06171J31252M6825j15500R140Q9197n0755n2461Q0198J2722
$$ 124204 1987 -104184 27068 73893 -41607 -32467 56730 5975 -46486 33712 46434
208D6434j02578K1898J07182o3184j06402J04255R9394j39018p5794J72328M2211
$$ 46434 -56144 -34246 72936 9752 -96650 7605 106999 -32019 -107813 64515 106726
219A06726j93612L240J99849n5411j92884J01880J66166j43426j30857J69478
$$ 106726 -86886 -83646 116203 60792 -132092 -30212 135954 -7472 -138329 31149
229C1149Q8885j81396m6234J83760J0389j76154K1683J63514m8280j44414P3533
$$ 31149 120034 -61362 -107596 76164 86553 -89601 -67918 95596 47316 -97098 -23565
240b3565J18946r7374r1274J09529N1588j16401j0235J12461k7566r0708O4504
$$ -23565 95381 -1993 -93267 16262 67850 -48551 -58786 53675 26109 -64599 -95
251i5O5779q4325l2679R3148k75r2860K3962Q0162m6326o9505N8825N5773o5497
$$ -95 65684 -18641 -51320 41828 41553 -51307 -27345 52817 6491 -63014 -4189 51584 -13913
264a3913l7027P6420K3223p7145j137P6201k3613p0724M3645M8728o8743k6018
$$ -13913 -50940 25480 48703 -28442 -29579 46622 23009 -47715 -4070 44658 -24085 -50103
276e0103Q1174k567q1496L6019Q0798n4240o5430P0321N0387p9580m1752P6618
$$ -50103 31071 28504 -52992 -16973 63825 9585 -55845 14476 64863 -14717 -56469 20149
288B0149K9232p6492k2465P2964J4336o7991l372O3426o078m9140J9073L2068
$$ 20149 49381 -27111 -49576 23388 37724 -30267 -33639 29787 23709 -25431 -6358 25710
300B5710k7941j3445K6884r776k1178K8304J2885l3893M210L9171j4590l6748
$$ 25710 -2231 -15676 11208 1432 -19746 8558 21443 -12450 -8240 30931 16341 -20407
312b0407J8509K8055k3579k5247K1532K1437k2257k0967K2922J7825k6410r749
$$ -20407 -1898 26157 2578 -22669 -1137 20300 -1957 -22924 -2 17823 -8587 -18336
324a8336L1094K110k8097J3090K4379k4467j4224L2138J840l5524P437L0420j5960
$$ -18336 12758 14868 -13229 -139 24240 -227 -14451 17687 19527 -15997 -8560 21860 5900
337E900k9028J2417K1008j0350j9622O814K4110O65k2116K501K4725l614k2179
$$ 5900 -23128 -10711 10297 -53 -19675 -12861 11249 11914 -10202 -7701 17024 13410 -8769
350h769L328J2398o477p054l86j620P481N758j2458j84K1366o98j9342O473J3631
$$ -8769 -5441 6957 480 -6574 -6960 -8580 -1099 4659 -7799 -7983 13383 12685 -6657 -184 13447
365A3447j2229j1198O430L029m262j959p41M605N794o609j855J2031K43r429O047
$$ 13447 1218 -9980 -3550 -521 -4783 -6742 -7483 -2878 2916 -3693 -5548 6483 6726 -2703 3344
380C344N083j0851j619P548p660o548J0093K841o800J976K790n47K658n412p350
$$ 3344 8427 -2424 -4043 3505 -4155 -10703 -610 2231 -4569 -2593 197 -350 2308 -3104 -10454
395a0454J1810Q538j8078n280K1349J593k0036M09J7155K619r972m768R102J0542
$$ -10454 1356 9894 -8184 -13464 7885 9478 -10558 -10149 7006 9625 -347 -5115 3987 14529
409A4529j2407j7056J2245J4395j7847j0282J9795O141j4969J906J1027k286j480
$$ 14529 2122 -14934 -2689 11706 -6141 -16423 3372 9513 -5456 -3550 7477 5191 3711
422C711K912k851J007M362q881p186O734Q32q990Q73O890K809o1l192J703J0666
$$ 3711 6623 3772 4779 9141 260 -6926 -192 640 -8350 -7477 -587 2222 2161 -1031 672 11338
438A1338k522j3354P508J2215j5594r977J6241n57j8628Q185J5168j3300p703
$$ 11338 8816 -4538 2970 15185 -409 -10386 5855 5298 -13330 -5145 10023 -3277 -10980
451a0980J7604L470j6450q99J4618J380j3260l172J4169M633j7885l925K0081
$$ -10980 6624 10094 -6356 -7255 7363 8743 -4517 -7689 6480 11113 -6772 -10697 9384
464I384r20j9489Q494J5916j4674q274J7630k135j6383J1511J1947j6465n574
$$ 9384 8464 -11025 -2531 13385 -1289 -9563 8067 5932 -10451 1060 13007 -3458 -9032
477i032J7514j983j7876K974J4467m517j3919N762J6983o266j8439J2409K0915
$$ -9032 8482 6499 -11377 -8403 6064 1547 -12372 -6610 10373 4107 -14332 -1923 18992
490A8992j8687j8555K6460J1536l4164l406L3190r543l0147J9216K3710k4628
$$ 18992 305 -18250 8210 19746 -14418 -17824 15366 5823 -24324 -5108 18602 -6026
502f026j4165K7184P118k7704k418K8266k24k9045M013L0818q312l1790J5853
$$ -6026 -20191 6993 14111 -13593 -16011 12255 12031 -17014 -13001 17817 9505 -22285 -6432
515f432L1201k2364k2230K9441J0687l3869J794K8077j8194k0678K9101R614l4329
$$ -6432 24769 2405 -19825 9616 20303 -13566 -11772 16305 -1889 -22567 6534 16148 -18181
528a8181L755L6489j4730l4117K4404L2504k9977k7318L7545K3810m6640j9298
$$ -18181 -14426 22063 7333 -26784 -2380 30124 147 -27171 10374 34184 -12456 -31754
540c1754N2496Q128n9951N406O3144k1714n8736L8066M7932n1590l0595N9755
$$ -31754 20742 28870 -31081 -25675 37469 15755 -42981 -4915 43017 -8573 -39168 20587
552B0587J2420n9525P333N3714k4267m6384L5621L5190m5051k4225N3738J4039
$$ 20587 33007 -26518 -19185 34529 10262 -36122 -501 34689 -10362 -34587 19151 33190
564C3190n8081N04O2523j5571o1604L3283N3750n2443m0608O4634J8074p3314
$$ 33190 -24891 -24387 38136 22565 -39039 -5756 47994 -4449 -45057 19577 37651 -35663
576c5663O869P2710l0604o1356N3409M6372o6966k4788P5447K391p9890J7023
$$ -35663 -28794 43916 13312 -48044 5365 51737 -15229 -40017 35430 37821 -42069 -25046
588b5046P5757m1295p1439O2271O1506q1384m3633J01934K2225j14792O216J19537
$$ -25046 50711 9416 -62023 248 61754 -19630 -63263 38671 60896 -53896 -47680 71857
600G1857l8591j14933O8993R6728r6046p2716J12766M0657j19498o344J19514
$$ 71857 33266 -81667 -12674 84054 -11992 -84708 28058 68715 -50783 -57127 62387
611F2387k2470j08232N0178R2128p4192p3832R1235M8589j04607k0768J11513
$$ 62387 39917 -68315 -18137 73991 -201 -74033 17202 65791 -38816 -59584 51929
622E1929j1034j09108M4130R7840p3296p3595R8697M3461j11824q996J10957k8483
$$ 51929 40895 -68213 -24083 73757 461 -73134 25563 69024 -42800 -51796 59161 30678
634C0678j01237N8376P9378q0932n1369R5813K0498j02099J2654J01366m3429
$$ 30678 -70559 -12183 67195 -13737 -65106 30707 51205 -50894 -38240 63126 19697
645A9697r0796P5041P4590j04211n2007J25490J7568j40545K1174J43545o1351
$$ 19697 -71099 3942 78532 -25679 -77686 47804 65372 -75173 -53999 89546 28195
656B8195j31138J01448J06845j33259p0924J54828L0487j62233J2931J58251n4677
$$ 28195 -102943 -1495 105350 -27909 -98833 55995 86482 -75751 -62820 95431 40754
667D0754j45939Q9500J22435j19248r2677J43073N9821j57315k0118J63766k2174
$$ 40754 -105185 -15685 106750 -12498 -105175 37898 97719 -59596 -79714 84052 61878
678F1878j58610O2799J40832j00387j11758J28476P2328j44806k9639J46608j1722
$$ 61878 -96732 -33933 106899 6512 -105246 23230 95558 -49248 -78887 67721 55999
689E5999j32738N0450J11488p8545q1116R8040M6611j09890j2463J09404k4488
$$ 55999 -76739 -26289 85199 6654 -74462 23578 70189 -39701 -52164 57240 32752
700C2752j04679N7304Q8412q8209o3170J14387L1295j28217J0072J33192n1978
$$ 32752 -71927 -14623 73789 -14420 -77590 36797 68092 -60125 -50053 83139 31161
711C1161j23390R2098J00073j25711o8341J47528K9270j59247J0491J59281m8340
$$ 31161 -92229 -131 99942 -25769 -94110 53418 82688 -76559 -66068 93213 44873
722D4873j49000Q3665J31686j13091j07410J36462P6014j55491m1060J63781N63
$$ 44873 -104127 -20462 111224 -1867 -109277 27185 103199 -52292 -93352 70429 70992
733G0992j61154M0373J48183p6985j21353J07907Q7179j25294m6505J30328N058
$$ 70992 -90162 -49789 98394 21409 -99944 7963 95142 -30152 -76657 53671 58729
744E8729j24788L0454J06483o3741q4128Q6117N5286j01219k3253J10662p720
$$ 58729 -66059 -35605 70878 7137 -76991 9126 64412 -36807 -60060 50602 42882
755D2882j08825M1980J00819p3006q2458R9743N3476j20398j9326J28516j9790
$$ 42882 -65943 -23963 76856 3850 -78608 21135 74611 -45787 -65113 63403 43613
766D3613j25838N7643J10666q8877q4935J13397N5464j26753k2614J30233j0583
$$ 43613 -82225 -24582 86084 -2793 -87728 25669 81133 -45620 -68234 61999 51416
777E1416j26868M0038J15201o8184r6944R4062P4858j12033m4081J26016J0488
$$ 51416 -75452 -35414 79787 11603 -85341 8721 83579 -28454 -72535 53481 63969
788F3969j29671K5418J22103o1049j05795Q7487P8212j07893m8340J16265J6088
$$ 63969 -65702 -40284 81819 20770 -85025 2462 80674 -27219 -75559 40706 56794
799E6794j15544J4503J08092l8205r2496O0892P4763p5273n2524Q6361K7921r1867
$$ 56794 -58750 -44247 63845 25640 -66856 -5964 68799 -6474 -58998 27363 55284 -36583
811c6583j136Q8760k7448p9249N2604N9774p5248l5087Q8347O510r1413K2969
$$ -36583 -37719 51041 23593 -55656 -3052 56722 -18526 -53613 34734 41244 -50169 -27200
823b7200Q6631m7593p3212O6452N4953p8207l4687Q4228J3782q3636P777Q0318
$$ -27200 59431 11838 -61374 5078 60031 -18176 -52863 31365 45147 -38489 -30712 49606
835D9606k7995p0643M7743N6366o5580l7422P7829J1692q6002J3423Q3578m0194
$$ 49606 21611 -49032 -1289 55077 -10503 -47925 29904 41596 -44406 -30983 52595 12401
847A2401p3805O2225N7733p6932l6526Q5365J6585q6448L253Q1863k0462p4058
$$ 12401 -61404 821 58554 -18378 -54904 30461 47046 -39402 -36149 45714 25252 -48806
859d8806L3979O2826m6203m9323N6276L3739o1917j3525O3988q153o1092K8576
$$ -48806 -14827 47999 1796 -47527 8749 42488 -19429 -32954 31034 22881 -38211 -9635
871i635N0424m6927l5891N8553J6988o4363J227O2913j6522n5592K8915M7166
$$ -9635 40789 -6138 -42029 16524 33512 -30851 -29624 33289 16767 -38825 -9910 37256
883C7256l5734l4843M1117K3091m4440j1534M4483k297m2886J6591L7646l1156
$$ 37256 1522 -33321 7796 30887 -13553 -25087 19396 17099 -25787 -9196 28450 -2706
895b706k8158M3834J5359n1678O01N4131j6780n0904K9429M2725l9928l3163M3721
$$ -2706 -30864 12970 28329 -23349 -22748 31383 14603 -36301 -6872 35853 -4075 -37238 6483
908F483K2238m3046j1968M2442M513l8347L813L4145j1097k8479J8423J9430k6184
$$ 6483 28721 -14325 -26293 16149 20662 -17685 -13872 20273 9176 -19303 -880 18550 -7634
921g634q716L1322l590l2352J7567K9290k8077k2348L5668J3141l8688n161L6579
$$ -7634 -16350 14972 11382 -20970 -3403 25887 -2190 -24538 11130 24271 -14417 -19578 17001
934A7001k661l2469P235K7548r717k1942J3470J8260j5154j2681J8387N770k1973
$$ 17001 14340 -18129 -10894 16654 6937 -15005 -1535 16725 1571 -11110 7277 13047 -8926
947h926J698K2373j1695k0607J9904J4977k6143p753K8359J36k7089N865K3702
$$ -8926 -7228 15145 3450 -17157 2747 17724 -8419 -16172 12187 12323 -14766 -8901 14801
960A4801q317j8285R483J4430q218j1597P285Q907p658p506O767K336p771L168
$$ 14801 6484 -11801 -2318 12112 3894 -7703 -418 8489 831 -6675 92 2428 -5343 -2175
974b175O247q881j501J5333k614j7172R846J7107j5260j4859J7456R351j8229
$$ -2175 4072 -4809 -6310 9023 6409 -10763 -917 16190 930 -13929 3527 12878 -5351
987e351n866J5377L426j1966j603J0616J905r837j809Q847j976j0309M552Q582
$$ -5351 -11217 4160 7586 -4380 -5983 4633 6538 -3299 -5108 3739 1763 -8546 -3994 4588
1001D588q000m904J2034K020j0651L298R389n830n735N280L52m272N65p88j828
$$ 4588 -3412 -8316 3718 5738 -4913 -1615 7774 1944 -3791 1489 1841 -2431 -1866 -2654 -4482
1016d482L543J149l883K259N623k179m338Q98L595n86n388l278P733L515j0238
$$ -4482 -939 210 -3673 -1414 4209 2030 -2308 -1410 2185 1599 -3789 -7067 666 4181 -6057
1031f057k208J3863J108j3037L585J2174n015p672N066K617m029p64k7j952J618
$$ -6057 -8265 5598 6706 -6331 -2746 9428 4413 -3259 1807 4424 395 -369 -396 -2348 -730
1046g30J87l040N58K319r20J015J307j445J974L711k523k307L505J81k519L85
$$ -730 -543 -3583 -3025 -706 -1626 -611 696 -749 1225 4936 2413 106 3611 3792 1273 1658
1062A658k307k332M778j169r517M488J1982p230r973J2037R472j1805o818J0851
$$ 1658 -649 -2981 1797 628 -8889 -4401 7581 351 -9622 2415 11887 82 -6736 4115
1076D115N050r931o112O987O608o899q022P439Q835p403o333Q634L662o404l34
$$ 4115 9165 -766 -6878 109 6717 -182 -8204 -765 8070 667 -5666 2968 6630 226 -108
1091a08J789k985K427K080p935n64J1195j387j1212M531J0423n014q275M261N823
$$ -108 1681 -1304 1123 3203 -4732 -5296 5899 4512 -6700 -2169 8254 3240 -5035 -774 5049
1106E049l347o056J247N712k778n568N079M802p195o97J0559l616j1070R468R401
$$ 5049 1702 -4354 -3107 2605 -173 -5741 -662 4140 -3055 -3752 6807 3191 -7879 1589 10990
1121A0990j4561p309J5429K801j6721o78J4663K90j2064N67J2247J848j1204j505
$$ 10990 -3571 -10880 4549 7350 -9371 -10049 4614 4904 -7160 -6593 5654 7502 -3702 -5207
1135e207J1793%j2348J237R079n037o322O120J62n180O520L885r081J804J2711
$$ -5207 6586 6586 -5762 -4525 4554 -483 -6805 -685 -523 -5703 817 4702 -4379 -2575 10136
1150A0136m555j2560O106J0103q162j0437N659Q605n549q933N466R199n595o460
$$ 10136 5581 -6979 -873 9230 1068 -9369 -3710 4895 -654 -9587 -4121 5078 -517 -6977
1164f977Q448M353q357J990Q744q204n926J3555K36j8008M517J7528j0439j6553
$$ -6977 1471 5824 -2533 -543 8201 -3 -5929 7626 7862 -10146 -5629 11899 1460 -15093
1178a5093J2894J4008j4202j1254J5477J0318j4473p027J5498N850j6103k476
$$ -15093 -2199 11809 -2393 -13647 1830 12148 -2325 -9352 6146 11996 -4107 -6583
1190f583J5753l942j5197R374J0236j5910k750K0989m767k1046J4886J9561k2222
$$ -6583 9170 5228 -9969 -595 9641 -6269 -9019 11970 7203 -13843 1043 20604 -1618
1203a618j5830K5568R169k9505n031K8817J61k7254M720K7213p267k3551J3887
$$ -1618 -17448 8120 17289 -12216 -17247 11570 11731 -15523 -10803 16410 9143 -14408 -521
1216e21K0370k0017j5000K3750M745k8733L968K8158j4665k3986K4796J8643k8623
$$ -521 19849 -168 -15168 8582 13327 -15406 -11438 16720 2055 -21931 2865 21508 -7115
1229g115q544L0775j55k9729O019K3959j3030j9927J6854J3656j9548n944K3605
$$ -7115 -15659 15116 14961 -14768 -8749 15210 2180 -17747 -893 12763 -6785 -12729 10876
1242A0876m61k4608J1117K4191k0998k1842L0183J4352l9804n797M4339n680m5158
$$ 10876 10415 -14193 -3076 21115 117 -21725 8458 22810 -16994 -22791 21548 15868 -29290
1255b9290J6727M1980k4949l4615L0656K6451l2431j7334L1758Q945k8940r18
$$ -29290 -12563 29417 4468 -30147 509 26960 -5471 -22805 8953 17898 -11042 -11960
1267a1960K5315p527k0535J4513J2648k2605m158K8005p618k8918K1059K8078
$$ -11960 13355 5828 -14707 -194 12454 -10151 -14309 13696 6078 -22840 -1781 26297
1279B6297l1489k0075M0819R946m5901J272M4348j4178m1281K3838L3995l0984
$$ 26297 -5192 -25267 15552 25498 -20403 -19131 25217 11039 -30242 -6404 27591 -3393
1291c393k4804L7767J6904m0780o199M3456m711m4729J5201M1528k8136l6819
$$ -3393 -28197 9570 26474 -14306 -20505 22951 18240 -26489 -11288 30240 2104 -34715
1303c4715L8627K7410m5080j3961N0165J895m7082J1272M0308k1883l1704K6673
$$ -34715 3912 31322 -13758 -27719 22446 24341 -22741 -11469 28839 6956 -24748 1925
1315A925J8603l0936q344L0622k493k7993J3726K6282k2282j9682L2631J3257
$$ 1925 20528 -10408 -18752 11870 9377 -18616 -4890 21392 -890 -20572 12059 25316
1327B5316m0089m283M4345q875m7148K0110M2161l2269l4089M1404K3685m5171
$$ 25316 -14773 -19056 25289 16414 -30734 -10624 31537 -732 -34821 6583 30268 -14903
1339a4903q785M6493l031m2063J4285L5942k3743k9530K9753J9996l6600j1505
$$ -14903 -23688 22805 19774 -22289 -8004 27938 4195 -25335 4418 24414 -12186 -23691
1351b3691L9489P86m0509J1346M0133k2220l3520L3707K4432m1386j1525M3451
$$ -23691 15798 16584 -23925 -12579 27554 5334 -28186 5521 29953 -11433 -22958 20493
1363B0493l715m2048J6233L4670k7564k4773L5285J3813l9203j751M1259r635
$$ 20493 16778 -25270 -9037 25633 -1931 -26704 8581 22394 -16809 -18560 22699 13064
1375A3064m0161J9761L7945l0628l3256L9723K5276m7547j4886N2302K319n2836
$$ 13064 -27097 -7336 30609 -19 -33275 6448 31724 -15823 -30709 21593 23912 -28924
1387b8924J2263M8114k4807l8958L4617K7027m0557j2989M2198R9m0022J1290
$$ -28924 -16661 31453 6646 -32312 2305 29332 -11225 -24214 17984 18083 -21939 -10649
1399a0649L5057k1178k9507K8637K1907l4524j3437L9453L457m1715Q166M0399
$$ -10649 24408 3230 -26277 2360 24267 -10257 -23694 15759 19216 -22499 -14333 26066
1411B6066k0326l5298L1227K6083l8899j3217M3242P81m1328J3193L6480k3728
$$ 26066 5740 -29558 1669 27752 -11147 -24364 18878 19659 -21669 -8476 28004 4276
1423D276k9833L0266J9068l7076j1268L8293J402l9408Q306M0250j5879l4566
$$ 4276 -25557 4709 23777 -13299 -24567 13726 15128 -24280 -15974 24276 8397 -26169
1435b6169K7307L0401l4102k0256L9500O886m2910M461L8083j8468l1960K8110
$$ -26169 1138 31539 -2563 -22819 16681 23567 -19343 -14882 23201 4733 -27227 883
1447H83K2748l3276j0809L6749J012l5693Q201L3117j6701k9261K2532K3716k9343
$$ 883 23631 -9645 -20454 16295 17307 -18386 -10185 22932 6231 -23030 -498 23218 -6125
1460f125j6504L4569P772l6643L603L7212j4493l2935K4647K4885l3429j4484
$$ -6125 -22629 11940 19712 -16931 -13328 23884 9391 -23544 1103 25988 -7441 -21925
1472b1925L6838K974l7004P468L3437j6764k8768K2780K1802k7477j5404L0368
$$ -21925 14913 17887 -19117 -11649 21788 5024 -23744 -964 20838 -6639 -22043 8325
1484H325Q912l1314l26L2851o581k9928J5688K5003k3809j8268K8627O967l2450
$$ 8325 17237 -14077 -14403 18448 11867 -18061 -2373 22630 -1179 -19447 9180 16147 -16303
1497a6303L721L0981j4083k6687K3159J9835k7796j2029L0736M658l1255J462
$$ -16303 -12582 18399 4316 -22371 788 20623 -7173 -19202 11534 16192 -15063 -13601
1509a3601K9681q158k7816J4404K5608j9532k0035K5965J3775l0279n512L0696
$$ -13601 16080 7922 -19894 -5490 20118 586 -19449 6516 20291 -9988 -15500 15196
1521A5196n345l0248J3677K4614k0914j6866K5959R257k5731l00K5217n478k2292
$$ 15196 9851 -20397 -6720 17894 -3020 -19886 6073 15330 -10401 -10701 14516 9038 -13254
1534a3254R973J7576j4445j5455J6599J0315j9423n129K1975p45k1044R589J9373
$$ -13254 -3281 14295 -150 -15605 994 11309 -8114 -13243 8732 7987 -13057 -3468 15905
1547A5905j5831j3950K2054O578k5791P73K5256r243k2910J4793J8644j8225j3400
$$ 15905 74 -13876 8178 14756 -11035 -10262 14994 5751 -17159 -2366 16278 -1947 -15347
1560a5347K0191R291k0643m659K1071O83k0973M236J9475j0169j7761J5105J2628
$$ -15347 4844 14135 -6508 -11167 9904 10587 -10386 -6150 13325 3156 -14605 500 13128
1573A3128j9505o004K2512o80k1824Q807J9180j4473j3842J7828Q091j9111l687
$$ 13128 -6377 -12381 10131 9451 -12373 -3566 15614 1141 -12701 5127 13218 -5893 -9580
1586i580J8370r43j7926L551J6154n883j4754R492J3085j2102r778J4546M857
$$ -9580 8790 7847 -10079 -6528 9626 3743 -11011 -1519 11566 -536 -10314 4232 9089
1599I089j6150J089J5298p282j2132J2566P011j4951p54J5380l997j3808P751
$$ 9089 -7061 -5972 9326 2044 -10088 2478 9489 -5462 -6216 9164 5167 -8641 -890
1612h90J1051j0284q422J0887N740j2378m388J3017K044j4602R61J5378m238j4494
$$ -890 10161 -123 -8545 2342 8082 -4296 -8684 4333 6377 -8225 -7264 8114 3876 -10618
1626a0618R391J2212j2748p886J4471K349j4203K239J1364o175q235Q172M705
$$ -10618 -1227 10985 -1763 -9649 4822 7171 -7032 -4793 6571 396 -7839 333 5038
1639E038q115j477Q695j63p337J916O787l306q410M452O638p621n842J0431L241
$$ 5038 -3077 -4554 4141 3978 -3359 -1443 5344 2038 -6372 -1920 4718 -2903 -8745 1686 4927
1654D927j1736K054J2617n149j0096R015O947j0595l587R543R0q646J524O527
$$ 4927 -6809 -4755 7862 2713 -7383 1632 8579 -2016 -5603 3940 4030 -4616 -3092 3435
1668C435j630n079K334M595k121m739L065L769n204k992N430K83n947L087N230
$$ 3435 1805 -3274 -940 3655 1534 -3205 -140 3629 -1575 -4567 863 1146 -4801 -1714 3516
1683C516m809j141O971j384n791M529M062o647k478O279j97o136P49M585n15m446
$$ 3516 -1293 -2434 4537 3153 -2638 1891 5953 -694 -3172 3107 2910 -3226 -2477 2108 1593 -2853
1699b853j16M815R57n257K54O326j393n816L463M001m539j541M111j012k845K655
$$ -2853 -2969 1846 2803 -2454 -2200 4126 2733 -3083 380 4381 -158 -1699 2412 1400 -1445 1210
1715A210M2k763J962J534l434O80L670j600k571K043R08j560j474J06J494J6k865
$$ 1210 1252 -1511 451 1985 -1449 -769 2901 1301 -1270 773 1681 121 -1353 -1247 247 263 -2602
1732b602K74M827q94m226L692L814n064j456N237j078n232J391K676k995j722
$$ -2602 -2328 2499 1605 -2621 1071 4885 -179 -1635 3602 2524 -2708 -1317 1359 -1636 -3358
1747c358J753J034q2o59k85K600J682l337o11L897r16l764J475J759k006j14R80
$$ -3358 -1605 -571 -653 -1312 -1597 1003 2685 -652 -1263 2634 1718 -2046 -571 1188 -818 -932 48
1764D8j061Q70J436k405m20L082j143k901K053J254k224j36J074o39Q70M05j709
$$ 48 -1013 -143 1293 -1112 -1532 1550 407 -2494 -441 813 -1411 -1547 -473 -1112 -242 163 -1546
1781a546J521K533k833j544M040j43m049J050K353k498p22J808q50m30J504m80
$$ -1546 -25 2508 -325 -1869 2171 2028 -2021 -971 1382 -1116 -1838 -30 -880 -1310 194 -286
1797b86m88J471n5o10J196n50j287K022j03l473J025K990k597j691L128N61j724
$$ -286 -774 697 642 32 1228 678 -609 1413 1310 -2163 -1138 1852 -745 -2436 692 1253 -471
1814d71J296O31j268J487K26k832Q12K753l136j719L122n1k697J178J896j237
$$ -471 825 1456 188 1675 1901 -931 -119 2634 -502 -2221 901 850 -1847 -669 1227 -10
1830a0L76Q66m40L46l37p04R85p11k114J371J996l564r16N512n10n686L661N611
$$ -10 366 1232 792 1138 801 97 1082 371 -1743 -372 1624 -1940 -2856 2656 2146 -3540 121 5732
1848E732n027l923N774K071n517j958L607J353l201k825K601L503k540l135M012
$$ 5732 705 -3218 2556 4627 -890 -2848 759 2112 -1089 -3914 -1313 2190 -350 -3485 527
1863E27L351l889j412L374k42j843N26j124m23K564j504l849L742L340m998j532
$$ 527 3878 -11 -1423 1951 1709 -134 392 -732 -1155 1409 -95 -3944 -202 3138 -1860 -3392
1879c392O433j75o141J613M840k729m297K144L456k182l545K433M502k931m060
$$ -3392 3041 2866 -3275 -1662 3178 449 -3848 -1704 1752 -430 -3975 -1542 2960 29 -4031
1894d031N417L454o643j553P208j527o780L178M346n364j438N082j662l193L944
$$ -4031 1386 4840 -1803 -3356 3852 2325 -4455 -1277 3069 -2295 -3733 1349 -313 -3506 438
1909D38J703m870J490N416k786n131L727N028m834o290N624O753p355o930R750
$$ 438 2141 -2729 -1239 4177 1391 -3740 -13 5015 181 -6109 -485 6268 -1087 -8017 1733
1924A733O321j1604m024J3107Q81j2356K742J0191n761o964O724K895o767Q2N710
$$ 1733 8054 -3550 -7574 5533 6414 -5942 -3200 6991 1230 -5734 990 3885 -2882 -2800 2910
1939B910k070l557L806K801m582k116N819R89p232LQ567k622r865N529R180q816
$$ 2910 840 -2717 1089 3890 -692 -2808 3011 4000 -3232 -3229 5338 2716 -7149 -1620 7560 -1256
1955a256o553J1540L304j2109J117J2031n236r357Q005O135r951l627R874N65
$$ -1256 -7809 3731 7035 -5074 -3957 8074 2838 -6519 1486 7621 -2330 -5957 3917 4482
1969D482r847Q67R783k067r383M101R328n995p743Q595M940j0003j335J0267l613
$$ 4482 -5365 -4498 5285 3218 -6165 -2064 7264 1269 -6474 2121 7061 -2942 -4277 5990 2377
1984B377r345P518N711j0718j661J2621k457j1970O614J0410r422r015J0968O721
$$ 2377 -6968 550 6261 -4457 -6118 6503 4046 -7924 -1310 9100 -322 -9337 1631 8352
1998H352j2302m886J3154L034j4158k15J4648k602j4027P069J2239j0572q861
$$ 8352 -3950 -8836 4318 7352 -6806 -7021 7627 5025 -9002 -1933 10306 -266 -9127
2011i127J2926L362j4159J126J3083n923j0649R345P485j0804m016J1731J512
$$ -9127 3799 7161 -6998 -5872 7211 1288 -9361 -16 7469 -3335 -7351 4380 5892
2024E892j1022N49J0705l092j0090N048Q659p570o564J0416L151j2133J624J2705
$$ 5892 -5130 -4581 6124 3032 -7058 -2010 6649 -921 -7485 2931 6082 -6051 -4427 8278
2038H278o599j1431J1540Q265j4907m597J6522k29j6806L538J5616n822j3576
$$ 8278 1679 -9752 1788 10053 -4854 -9451 7071 6842 -9964 -6426 9190 3368 -10208
2051a0208Q307J2146r656r930J1041P853j2011n262J3152J042j3331K918J1073
$$ -10208 -1901 10245 589 -9341 1700 9553 -2458 -7720 5432 6474 -6857 -3939 7134
2064G134p332p613J0598L481j1472J964J1208o251q518Q807N620j0671k926J1018
$$ 7134 -198 -7811 2787 6268 -5204 -3240 7968 1717 -6801 2006 7626 -3045 -5971 5047
2078E047q4j1400K613J0676n093j0058Q406Q887j1241o501J4651L450j6861J691
$$ 5047 4963 -6437 -3824 6852 1759 -8299 107 8994 -2247 -8748 5903 9353 -7508 -5817
2092e817J7721o766j7070J1062J3557j4323j0388J5600O157j5422k807J4386j88
$$ -5817 11904 5138 -11932 -870 12687 -1636 -12024 3576 9733 -5689 -8496 5890 5702
2105E702j2497K582J1236m386r002O526O611q669l600J0254n24j0738N366R419
$$ 5702 -6795 -4213 7023 2637 -6365 161 6772 -1897 -5497 4757 4233 -6505 -1139 8280
2119H280r549o501J2648K282j4461J913J3119n098j2246P972R604r471o679J0261
$$ 8280 -1269 -7770 4878 7160 -7301 -5388 7731 2633 -9613 -1641 7963 -1508 -8187 2074
2133B074M570j0469k088J1028r82j1264L940J0941p341r367J1280O930j3332k945
$$ 2074 6644 -3825 -5913 5115 4133 -7131 -3191 7750 409 -8958 2322 9252 -4080 -7025
2147g025J4227j190j3877M419J0756p845q083Q072M468q028j260P970k34n907
$$ -7025 7202 6012 -7865 -3446 7310 -535 -8618 -546 3922 -4106 -5366 2604 2370 -3537
2161c537L151N577m506m742O917K631r376p69J0869k771j1582O056J0823r540
$$ -3537 -386 5191 685 -4057 2860 5491 -3885 -4654 6215 3444 -8138 -2082 8741 -799
2175g99q693J2039N432j2783k295J2269r20j0252K914Q589l641o672N180N410
$$ -799 -9492 2547 7979 -4804 -7099 5170 4250 -6002 -3088 5501 1860 -4812 368 5778
2189E778o013l860P110K020q910L39R160l527q917O305P887q797m937R675K053
$$ 5778 -235 -4095 3015 5035 -3875 -3536 5624 2097 -6820 -515 7372 -1425 -6362 3313 5366
2204E366r215O65P617k846n197L816L090l859j257M297l16m367J390N017k982
$$ 5366 -3849 -3184 4433 1587 -3610 206 3296 -563 -1820 2477 2161 -2206 -816 4201 1219
2219A219n886N184N349p625m396R782K288j0767N52J0801l245r616M993O648n832
$$ 1219 -4667 517 5866 -1759 -6155 3627 5915 -4852 -4300 6501 3256 -6360 -1367 5281 -551
2234e51m425N879K630m856o89M507j88m038J529L644l193m043M906K401p002j331
$$ -551 -4976 903 3533 -1323 -2012 2495 2307 -1731 -202 3442 249 -3794 1112 3513 -3489 -4820
2250d820Q285j005q596M066P837n682n075O636K668o582l33N346j805m382K871
$$ -4820 3465 2460 -6136 -2070 5767 85 -4990 1646 4314 -2268 -2601 2745 940 -3442 -571
2265e71K851l412k162M667J706n523q95P038k40q479K035R134m941q299O742O232
$$ -571 2280 -1132 -3294 1373 3079 -2444 -3339 3699 3459 -5020 -2985 6149 1208 -7091 -349 5883
2281E883q017l974Q103J424o614N97M862j321k471J385J041j442J19J231r67j735
$$ 5883 -2134 -6108 1995 3419 -3195 -2598 2264 943 -1528 -143 898 -544 -425 806 -161 -1896
2297a896J791K717l244k810N295K381o547j329Q030j380q075L383O553n421m397
$$ -1896 -105 2612 -632 -3442 1853 4234 -2313 -3642 4388 3008 -5067 -1684 4869 -552 -4949
2312d949N969J897n666M06N260j401l852K608L097k786k999L278L149m353l092
$$ -4949 1020 2917 -2749 -2343 2917 1516 -2336 272 3369 583 -2416 862 4011 -342 -3434
2327c434N476K130o703j060O930j259o173K879M549l214k090L292L60j726R00
$$ -3434 2042 4172 -2531 -3591 3339 2080 -4093 -1214 3335 121 -1969 1323 1683 -43 857
2342H57J49j449P93P19j900n29J397N03j397o62J810K180j862k203L371K048m647
$$ 857 1006 -443 350 1069 -831 -1360 37 540 -857 -1519 291 2471 609 -1594 1777 3825 -822
2359h22j838M872n22n284J958L769k386k219L457J015k745J85J738j93j787r13
$$ -822 -2660 2212 1690 -3594 -1636 2133 -253 -2472 985 2000 -745 -560 1178 985 -802 -1715
2375a715J495Q51k259r72L553Q27l277Q29L688j952k664K297N34k442J64R78j052
$$ -1715 -220 631 -1628 -2600 953 1780 -1497 -668 3020 1068 -1596 701 1235 -1207 -1043 -65 -1117
2392a117NJ470p79k21J317kp71j99l68R2L64k087m12L301l97l477K831L806l049
$$ -1117 -1112 358 -421 -642 675 673 -98 -297 -665 -573 -209 -2296 -2708 593 196 -3281 -450 3356 307
2411C07k376M059J017l631J28K367j249j611Q37L84j078n11L67M18n70q80J737
$$ 307 -2069 1990 3007 -624 -496 1871 622 -989 -152 232 -846 -1357 -990 -572 -1142 -2022 -285
2428b85R23k306L96L926j055l050L241K317m131q13L340j806k987K023Q67l069
$$ -285 638 -1668 -1272 2654 1599 -1451 1790 4107 -24 -837 2503 697 -2290 -267 600 -2469
2444b469J032K822j676j147K409J797k373j421J945J527k996k498L654K031n011
$$ -2469 -1437 1385 -291 -1438 971 2768 395 -1026 919 2446 -550 -3048 606 2637 -2374
2459b374r64O103p2n685K707N056l649l120L973M40m136J251K042k500r75K715
$$ -2374 -3338 2765 2693 -2992 -285 4771 1122 -1998 1975 2415 -1721 -470 1572 -928 -1903 812
2475H12J64k059L20J947J20k572J16K817l65l141J150L627k648k320L651O03l944
$$ 812 976 -1083 -763 1184 1304 -1268 -1152 1665 1300 -1841 -691 2936 288 -2032 1619 2222 -1722
2492a722J405L113l781j693M337o40m689K213M015l036k904L511K669k708k254
$$ -1722 -317 2796 -985 -2678 1659 1019 -3670 -1457 2558 -478 -3382 129 2798 90 -2164
2507b164K160K823k348k809K409K702l506k534L657O87k960L14J677j061M27J114
$$ -2164 -4 2819 471 -2338 71 2773 -733 -3267 390 1077 -1883 -1569 108 -953 -526 588
2523E88j713O29L113j796k958L072J956m036j376L256r9k660K24K015j96j372
$$ 588 -1125 -496 2617 821 -2137 935 2891 -1145 -2521 735 636 -2024 -1800 215 19 -1353
2539a353L73J684L30k187R88K666j963k310L104J072m273K6M073k215l225K909
$$ -1353 -980 704 1034 -1153 -165 2501 538 -1772 1332 2404 -1869 -1843 2230 15 -3210 -301
2555c01J366k350J5K050m96j40P47n53j13J139r27j374R37M38q36m71J07J000
$$ -301 1065 -1285 -1270 780 284 144 891 338 225 1364 437 -937 0 438 -398 -869 -762 238
2573B38J081j451o93L125N44m195O36L786k272l897L078J686k842m61K585k97
$$ 238 1319 -132 -825 2300 2844 -1351 -715 3071 799 -3098 -20 1666 -1176 -1637 948 651
2589F51q78J261l16l24R82o84r78M51K2n48N7m47M07J778j132j220K455O21l774
$$ 651 -227 1034 718 394 1376 692 -286 165 187 -361 -304 -751 -344 1434 302 -918 1537 2158 -1616
2608a616K07L823k189l466L271K302m051k70L901n59k900J547K209j478j935P07
$$ -1616 -1409 2414 225 -3241 30 2332 -1719 -1989 1912 1353 -1547 0 2209 731 -1204 -497
2624d97K021j249k618J261K995k143k468L338J876m441m8M148j701l003K352J697
$$ -497 1524 275 -2343 -1082 1913 -230 -2698 640 2516 -1925 -1973 2175 474 -2529 -177 1520
2640A520k700M19K170j000j029J059J16j702K18O44p3j311k63K022Q45k200O38
$$ 1520 -1180 -761 1409 409 -620 439 555 -1147 -929 -285 -358 -1669 -1932 90 935 -1265 -627
2657f27L598k003l719L535K416n431j160N549q59n173K267M683k949k737L319
$$ -627 2971 968 -2751 784 3200 -2231 -3391 2158 1299 -3874 -1607 3076 127 -2610 709
2672G09J880k859j300J815R99k244j383K730J190l060M63L844j571k675L069R22
$$ 709 2589 -270 -1570 245 1244 -1000 -2383 347 1537 -1523 -1060 2784 1213 -1462 1607 2529
2688B529m061J67L715k970k782M108Q72m440J598M261k065l158L209K512l199
$$ 2529 -1532 -1365 2350 -620 -3402 706 1578 -2862 -1264 2997 932 -2226 983 3495 296
2703B96k575L202J731l730k307M652J673n447n51O723j200o168L274N395m806
$$ 296 -2279 923 2654 -1076 -3383 1269 2942 -2505 -3056 3667 2467 -3701 -427 4968 162
2718A62l431N312J113n233N77L649j416k548J790J150j810l86J776M09j796L38
$$ 162 -3269 2043 3156 -2077 -1500 2149 733 -1815 -25 1125 -685 -1071 705 1114 -682 -344
2734c44K322n86l332K395K928m227k132N171L39o430J785O017l779m441N031K892
$$ -344 1978 1392 -1940 455 3383 -844 -2976 2195 2534 -3896 -2111 3906 127 -4314 717 3609
2750C609n531j086N232N6m089R2L982m96l886O99L507j357l869K538L139l754
$$ 3609 -1922 -3008 2224 2280 -1809 -1717 2265 1769 -2117 -1418 2089 732 -3137 -599 2540 -1214
2766a214k000M697M8m266J867L531k997j571L822m96l388J775K222k976j330K816
$$ -1214 -3214 1483 1531 -2735 -868 2663 -334 -1905 1917 1421 -1967 -192 2030 -946 -2276 540
2782E40M73l013l81L385M24l563m53M732m9n324J932N527k981m794M453L162n504
$$ 540 1013 -2000 -2381 1004 1428 -2135 -2588 2144 2095 -3229 -1297 4230 1249 -3545 908 4070 -1434
2799a434j482N031j007m288K079K326k352j279K389J047k015j7K792L48l010L6
$$ -1434 -2916 2115 1108 -3180 -1101 1225 -1127 -2406 -17 1030 -985 -1002 1790 2138 -872 -836
2815h36L789j426m569K175L846l795k809N080J476m841P58M348k154k789K759
$$ -836 2953 1527 -3042 -867 2979 -816 -3625 1455 2931 -1910 -1152 3196 1042 -1747 1012
2830A012O36k926O76J889j524j593K010J622k066j626K829K208l729j904M978
$$ 1012 1648 -1278 -602 1287 -237 -1830 180 1802 -264 -1890 939 3147 -582 -2486 2492
2845B492J414o420J53O458k034n882L531M333m809k890M732R17m027O0L290o23
$$ 2492 3906 -2514 -2361 4097 2063 -3819 -288 4045 -764 -3654 1078 1995 -2032 -1972 1318 695
2861F95j720O83K065p80j898J426J766k582j401L271K36m174J193L697k832k483
$$ 695 -1025 -342 1723 943 -955 471 2237 -345 -1746 1525 1761 -2413 -1220 2477 -355 -2838
2877b838L631J297m088N44L115k151j957K660N63k390O24K527o64j802J017K141
$$ -2838 793 2090 -1998 -1454 1661 -490 -2447 213 776 -1614 -990 1537 873 -929 88 2229
2893B229o96k795Q15K742k767l506L376K436m381m36M891m61l754K646K534l190
$$ 2229 1533 -1262 -447 2295 -472 -3978 -602 1834 -2547 -2983 1908 1447 -2307 339 2873 -317
2909c17j266K965p08k845J126J515j527j006J692J428r11j105J899J919l104j195
$$ -317 -1583 1382 674 -2171 -1045 470 -1057 -2063 -371 1057 146 -959 940 2859 -245 -1440
2925a440L067j17m517R78M022k426k994L460J873l338J82K904n23j502Q90O56
$$ -1440 1627 1510 -3007 -2029 1993 -433 -3427 33 1906 -1432 -1250 1654 1131 -371 519 1175
2941A175j76q73n03P8O23q54n75J183K01j048J012Q2m64R18O04k029Q56J839k133
$$ 1175 999 126 -377 -299 324 -530 -1105 78 279 -769 243 325 -139 779 1383 -646 210 2049 -84
2960h4j542K524M63l127P16K377p55j478J051O97j79m80k55M62P85j434n17J305
$$ -84 -1626 898 1361 -1766 -1050 1327 572 -906 145 842 663 183 -72 390 1175 -259 -776 529
2978E29k52j546J204P54j514N50K084j613j135K337L23k645K97J635o54j013K4
$$ 529 277 -1269 -65 689 -825 -275 1809 196 -939 1398 1721 -924 -627 1008 354 -659 -635
2995f35J99Q81l52j642J259K299j933j879K891Q01k430n20J599m05m39n58l57
$$ -635 -436 445 93 -1549 -290 2009 76 -1803 1088 1889 -541 -1061 538 133 -306 -864 -1221
3012a221J296P37j979L8K406R8k259P69J516j210n19K15l59RN7j062K15J472j008
$$ -1221 75 812 -1167 -1129 1277 1375 -884 -115 1401 191 -328 -113 -472 -463 -406 -1468 -1253 219 -789
3031g89m74J769O4j553J423J007k432M7K371r02k255J296J447j089j113P10J399
$$ -789 -1263 506 570 -983 440 1447 -985 -938 1433 531 -1724 -428 1019 -70 -1183 -473 926
3048I26L56k054o69K880L79l831k6L597q32l195J149K071k74r02l47Q13K113j056
$$ 926 1282 -772 -1441 1439 1818 -2013 -2039 1558 726 -2469 -1320 751 477 -425 -772 41 2154 1098
3066A098k821J656L243k472l095K588K141k266j853J162J696m64k077J42K571
$$ 1098 -1723 -67 3176 704 -2391 197 2338 72 -1781 -619 1077 613 -1464 -1322 1249
3081A249M53l142L10L141q30k491J433R28j017Q7J10p22Q77J034j629l47K104
$$ 1249 1702 -1440 -1130 2011 1181 -1310 123 1051 34 121 231 -491 386 1420 -209 -556 1548
3098A548n09j638J070M60j068k14J93n63L98L90r00L25Q15l37L68P22q60m06K142
$$ 1548 1039 -599 471 931 -137 -351 -158 -721 -323 67 -833 -508 307 -30 338 1060 200 -206 1936
3117A936q76k437J576J733k476j409K250P26k047j65J035P24K13j849K08K500
$$ 1936 1060 -1377 199 1932 -544 -1953 297 1023 -1024 -1189 -154 570 783 -1066 -858 1642
3133A642l61k934Q59K605j560k090J435J199j001l60j52N44J290j224j553J882
$$ 1642 1281 -1653 -794 1811 251 -1839 -404 795 -206 -566 -718 -174 1116 -108 -1661 221
3149B21J594k433j076K022r1j293K9P09J13K55n80j52J653J70j984Q34J442j386
$$ 221 1815 -618 -1694 328 237 -1056 -1027 -318 -205 50 -530 -682 971 1141 -843 -9 1433 47
3167D7j089J369j43j540R41L09j079L68Q19n63M19P21l60J19N97r99l94J381o06
$$ 47 -1042 327 184 -1356 -415 -106 -1185 -817 2 -561 -142 579 219 338 935 -64 -458 923 317
3186C17j454J197O37j396K16P72m74M58M41j094J30J640j214j678K087N63k422
$$ 317 -1137 60 697 -699 -483 289 -185 273 714 -380 -250 1390 176 -1502 585 1148 -1274
3203a274K50J918n74j262J301M59j50k45l45M38Q12j238j012J752j73j958N17
$$ -1274 -1024 894 320 -942 359 818 668 423 78 516 1328 90 -922 830 657 -1301 -784
3220g84J939j261j046J861L06q68r0K07J18N52r83j011J570N72k532J73K820q84
$$ -784 1155 -106 -1152 709 1015 147 57 264 382 934 -49 -1060 510 1082 -1450 -1277 1543 659
3238F59k046J370J421j096q68L31P57L40j093j053J567Q44k175j49K196j52j911
$$ 659 -1387 -17 1404 308 -560 -229 528 868 -225 -1278 289 1133 -1042 -1191 1005 853 -1058
3255a058Q25P87o96L10k1o90O55M74j585J19J454n91j382J351Q40j398M33N16
$$ -1058 -233 554 -142 168 147 -543 112 586 -999 -880 574 -17 -1399 -48 792 -606 -173 343
3273C43l60j70M40l53p8J96p95N58N76j559l58K287k77k511J668K223j966j433
$$ 343 -17 -187 253 -100 -178 18 -777 -219 357 -1202 -1560 727 450 -2061 -393 1830 -136 -1569
3291a569J929R37j606n53L71R89J24j640n6K131K51k725M37K387o47j954N92R20
$$ -1569 360 1297 -309 -862 -491 498 622 -1018 -1074 1057 1308 -1417 -980 1407 760 -1194 -602 318
3309C18L69p09j261O70K545j546k759K701K295l052j816L339N32k535nJ743j05
$$ 318 687 -22 -1283 -613 1932 386 -2373 328 2623 -429 -2245 1094 1626 -909 -914 829 724
3326G24r03m4K03P43n15q96J056J2j091M72J320j237o10K257l96k116J252J420
$$ 724 -179 -223 -20 723 208 -688 368 380 -711 -239 1081 -156 -766 1491 1095 -1021 231 1651
3344A651j708p48J240lj012O86l58k30J104J32j268O25J406j130p58L38N74n2
$$ 1651 -57 -805 435 432 -580 106 -252 -482 622 754 -514 111 1517 387 -371 -33 541 489
3362D89j075p33J835R10k536m96L334K43l650Q26L031j686k100J610Q66j356o7
$$ 489 -586 -1319 516 1426 -1110 -1606 1728 1971 -1679 -853 2178 492 -1608 2 868 -488 -555
3379e55J46K22N18k50o18Q18M69j105K52O02o34J67M64j091J4J248q10r75J220
$$ -555 -409 -187 331 81 -537 281 750 -355 -103 499 -135 32 496 -595 -581 667 -143 -1118 102
3398A02L89j561L30J465j567l04J747m42j056J045R64j076j83M97k19j45n62k35
$$ 102 491 -1070 -740 725 -842 -1146 601 159 -897 148 1112 36 -147 350 131 -14 -576 -811
3416h11R86J48j536J14K093j062j485J794O67j469J94Q72q07o6Q35o42l74J020
$$ -811 175 323 -1213 -1099 994 -68 -1553 241 908 -561 -367 505 -302 -368 467 -175 -549 471
3434D71m6p10M54Q5o5J23p61l39J533l15k118J183K139j777j399K623N70k130
$$ 471 425 -285 169 254 189 312 -449 -788 745 430 -1688 -505 1634 -143 -1542 1081 1651 -479
3452d79l3J693o60j109O75k20l19M24j58l5M83k20R6Q13r23j46J667n32k011J392
$$ -479 -512 1181 521 -588 87 -133 -452 -28 -186 -221 262 42 138 951 28 -118 1549 1017 -994 398
3472C98J431k396r55K505j31k314J073J268q42k17O84q8K5K40l70m07K88o4k34
$$ 398 1829 -567 -1522 983 852 -1462 -389 879 37 -180 504 416 441 681 311 -96 192 128 -106
3491a06l56l75R67N97j305m07K466k58k539R79K445k207j746K551N77k464N04
$$ -106 -462 -837 130 727 -578 -985 1481 1223 -1316 -337 2108 -99 -1845 706 1283 -1181 -677
3508f77J717j228j021J183N96j147l20Q70M25q01o63J570P63j828k22K529m43
$$ -677 1040 -188 -1209 -26 570 -577 -897 -27 398 -403 -1066 504 1267 -561 -783 1746 1303
3525A303k801J122K052k302j050J441Pj285Q57M74j028J169R42j285l55K256l53
$$ 1303 -1498 -376 1676 -626 -1676 -235 -228 -1513 -656 -182 -1210 -41 901 -384 -739 1517 1164
3542A164j819p2J513r3j519n14J694Q88k669l08L252l72l466J356K981k086k172
$$ 1164 -655 -727 786 693 -826 -1340 354 1242 -1427 -1735 1517 1145 -2321 -965 2016 -70 -2242
3559b242K452R65j706k31J330j99k74J90k04L13j90o55L08N28n77J57Q21m78m49
$$ -2242 210 1175 -531 -762 568 369 95 285 81 394 204 -451 -143 385 -192 -35 786 308 -141
3578a41Q17k99j220J136J64j402L15J164j008m07J766l03j145J171O34j393p9
$$ -141 676 377 -843 293 457 -945 -630 534 -474 -881 885 582 -563 608 1242 -151 -230
3595b30R76n32l92J55J85L64k42l63M47O49j201o49J408j39j867P90J441j028
$$ -230 746 214 -178 -23 162 526 284 -79 368 1017 -184 -833 575 436 -1431 -641 800 -228
3613b28n30J590Lo62P43j84n27M34j09j301N05N80r19m04J011m5j16L73k16K50
$$ -228 -758 832 835 173 916 732 205 639 530 -771 -266 314 -605 -1009 2 -43 -159 214 -2 248
3633B48Q45j149r50J678K93k107K04J634o11j148J103K78m11j57oL3M55n35p93
$$ 248 1093 -56 -1006 672 965 -1142 -938 696 85 -1063 40 318 -93 -250 -256 -223 232 -303 -1096
3652a096J187L03r98j19J439n94o07P96j48n99M75J99j136P92N94r48R9N95n17
$$ -1096 91 394 -604 -723 716 122 -485 311 163 -436 39 238 -898 -106 488 -460 -361 234 -283
3671b83o9P61o23o91J147J92j394L80R19m69n11N00J93J77k57p54Q01J209j468
$$ -283 -352 409 -214 -905 242 434 -960 -580 339 -130 -641 -141 52 229 -28 -782 19 1228 -240
3690b40j120J939P85k410q9J941j84j019J45M94J24K2q41M2J365k55j729M72J482
$$ -240 -1360 579 1364 -1046 -1135 806 622 -397 -252 242 366 388 -453 -411 954 699 -1030 -558 924
3709I24r38q36O06O90L91n33o12Q76J319j557j576K092O56k440m23K485r11j514
$$ 924 -14 -850 -244 446 837 304 -308 568 1887 330 -1246 846 1502 -938 -1361 1124 213 -1301
3727a301J074R21n95l02P46rR0k44l49L52k17j198P16Q15j174k06J737k46j121
$$ -1301 -227 694 99 -203 543 534 624 380 31 383 166 -1032 -316 499 -675 -881 856 610 -511
3746e11O54P23q59K3J29n21O64J13j357L41J749j000j575J617J149j690j187J660
$$ -511 143 866 7 30 159 -362 302 415 -942 -601 1148 148 -1427 190 1339 -351 -1538 122
3764A22P62j257p57P63J532j83j999R90K271j959k153J865J412k570q23K134k23
$$ 122 884 -373 -1130 -367 1165 982 -1017 -27 2244 285 -1868 -3 1409 -1161 -1984 150 -73
3781g3r50K09Q63J48L47m54l01J047p2j384L81Q80q18k65M29j49k2O88q48k49
$$ -73 -1023 -814 49 197 544 90 -211 836 764 -620 -239 641 -177 -442 -13 -162 -184 504 -344 -593
3801e93Q37o7j424O95P94q70J1P74k63M9R53n71m26J011j33j324J59M43l96l05
$$ -593 244 177 -1247 -552 242 -628 -617 157 -106 -57 896 325 -101 910 777 -547 -388 55 -341 -646
3821f46M14j27M98M32o44n6J330n71j459R47M71j159k86O79k00K15K88k74L77
$$ -646 -232 -359 139 571 -73 -129 1201 630 -829 118 589 -570 -856 -177 -377 -162 126 -148 229
3840B29J204p44q75J334N44j539l74N15O4l09j09n47O14Q09j424o73J666K56j468
$$ 229 1433 689 -186 1148 1692 153 -221 294 358 49 -60 -607 7 816 -608 -1281 385 641 -827
3859h27K40J368j78o74J00N15O05n24j016L52J321j216j411J310Q01j367n81J455
$$ -827 -587 781 603 -71 29 544 1149 625 -391 -39 1282 66 -1345 -35 766 -601 -1182 273
3877B73j38j47J20k08K54O75q85o72J116Q4r90J87O38m77k67M78n22K48O46n63
$$ 273 135 -12 108 -100 154 829 -56 -728 388 472 -518 -331 307 -170 -437 41 -481 -233 413 -150
3897a50m32Q89K36r70O02J41m44N84M8j384K33J532j138j399J229J009j290n73
$$ -150 -582 307 543 -427 175 316 -128 456 504 -880 -647 885 -253 -1652 -423 586 -704 -1277
3915a277J039P82oj197L4J750j56k012J04K066o76k309J183J551r03q96O42M75
$$ -1277 -238 544 538 -659 -625 1125 969 -1043 -939 1127 451 -1858 -675 876 -27 -923 -281 194
3933A94L72m24r45Q55J282j474r77J398M81j322l33J177k0n40j21L42L29K29p07
$$ 194 566 142 -803 52 1334 -140 -1117 281 762 -560 -893 284 264 -276 -397 -55 274 503 -204
3952b04l1J050n90o28R28J24j329M01R06q31m01J081p0p61L86L73k25l1m29j72
$$ -204 -235 815 225 -403 525 649 -680 -279 627 -204 -605 476 406 -355 31 404 179 148 -281 -453
3972d53Q49J51j498O62J427r22j081J502N05q81j91m4L47N7q53o54J213O97j542
$$ -453 396 547 -951 -289 1138 216 -865 637 1142 261 70 26 373 430 -423 -1077 136 833 -709
3991g09j02K275l56j945Q72J092p71n92J73R4K35m99o44J002O68j403j7J765o88
$$ -709 -811 1464 1108 -837 35 1127 356 -236 -63 31 266 -233 -877 125 793 -610 -627 1138 450
4010D50j476J132N03j269J66J066o09l28O92l2l12L46m86NM95n45q06P10N39j195
$$ 450 -1026 106 609 -660 -494 572 -37 -365 327 295 -17 329 -157 -152 343 -202 -1008 -298 241 -954
4030i54K90J023m21l14O94J7j70K6l35m70Q84k04j113R06O80q70J28Q91n40o54
$$ -954 -664 359 -62 -376 318 335 165 191 -144 -614 270 66 -1047 -141 539 -331 -203 688 148 -506
4050e06Q06q2j028P97J52q47J39Q07n47J91N52j76N8K04m30l61O69n52p86Q11
$$ -506 300 218 -810 -13 139 -708 -569 238 -309 -118 434 258 316 520 90 -271 398 -154 -940 -129
4070a29L10p56M62Q55q78l61J298m03r99P37M34q00k84N70q3L5O0l59Q33K44o68
$$ -129 181 -575 -113 742 -136 -497 801 398 -601 136 570 -230 -514 56 -27 8 68 -291 542 786 118
4091A18k96J186m50j151O14N22n73j91L18m16L21K35r33J62J360o21j043J356
$$ 118 -178 1008 558 -593 21 543 -30 -221 97 -319 2 237 -696 -534 826 205 -838 518
4109E18M56q87j30O58j96j75q6k82K35L21q79L2P15o06k48O92K04p84P18O29j128
$$ 518 974 87 -43 615 419 244 158 -124 111 432 -447 -415 300 -306 -554 138 342 -442 276 905 -223
4130b23k59J494o48j425R22P99j010l1K28K33n0m8m86O78N58j070j49N43Nm43
$$ -223 -482 1012 364 -1061 -139 660 -350 -381 -153 80 30 -18 -504 174 732 -338 -487 56 61 -382
4150c82M79m82j77J015j11j497Q97J442j384j150J692M42j573O8J018R7r57r1
$$ -382 97 -385 -562 453 342 -1155 -258 1184 -200 -1350 342 784 -789 -721 297 394 -563 -654
4168f54O09M66n15o02J061M05j200p4J256n50j067R45J03j433P97Q64p16n43J071
$$ -654 -45 421 -94 -696 365 770 -430 -504 752 202 -865 80 183 -1250 -453 411 -305 -848 223
4187B23J14n08L85J56k27J69m57m51M08K33m96J23N40l41K20J45l51L47Q24j101
$$ 223 337 -171 214 370 143 312 -145 -596 -188 45 -451 -328 212 -129 91 236 -115 232 1056 -45
4207d5q50J686m3k111M69J716q81j252J183P77p34j08N23L43o0k62k5K65p2q85
$$ -45 -895 791 748 -1363 -894 822 -59 -1311 -128 649 -85 -193 330 673 613 351 326 591 519 -366
4227c66N55K73j127K31J268j235p19J773j13j569N91J707j063p01R83M3p47L28
$$ -366 189 462 -665 -434 834 -401 -1120 653 540 -1029 -438 1269 206 -495 488 531 -216 112
4245A12M8k75L10p4m22N92p3m7K49k44m04Q58K7j836L59J894r51j663J408J558
$$ 112 160 -115 195 121 -301 291 218 171 420 176 -228 630 657 -1179 -820 1074 123 -1540 -132 1426
4265A426j986n03J724P3q95P9J83j14K64n32k76N61j23m65L84K80m24N78J0j087
$$ 1426 -560 -1063 661 734 -161 -82 101 -13 251 -281 -557 4 -119 -584 -200 80 -344 234 244 -843
4285h43R12P96j537n92J789j5j648R15J097q94p08J024k90m62N82Q9n39K24K11
$$ -843 69 865 -672 -1264 525 510 -1138 -223 874 -20 -728 296 6 -456 126 215 -324 -100 111
4304A11m12K31m99K41P61n88o74R72P66j726k02J730j14j439Q18Q82p90p4L25
$$ 111 -301 -70 -569 -328 433 -155 -829 143 909 -817 -1019 711 597 -842 -24 858 68 -6 319
4323C19p62N33K32p05l03J161j25q79J45Q82j10l94l49L13J033o28j527J170J142
$$ 319 -443 90 322 -383 -686 475 350 -529 -384 498 388 -6 -355 -42 991 363 -1164 6 1148
4342A148j575r20J904N12j773M04R82k63n07J68J53K03j71o60J55Q63o99m84R30
$$ 1148 -427 -1347 557 1069 -704 -300 682 419 -88 80 233 436 265 -395 -240 623 -76 -560 370
4361C70j27m35M32N36q75J49Q77r04l73Q12m13l15M15l97m8O46j12q14O80R83
$$ 370 243 -192 240 776 -99 50 927 23 -350 462 49 -266 149 -248 -296 350 238 -576 104 1087
4381A087r86l62Q34K6q77r0P6K20M1l13n39J352J6j554Q25J279q90q41J048L13
$$ 1087 101 -261 573 599 -278 -368 -292 -72 -31 -344 -883 469 485 -1069 -244 1035 145 -696 352 665
4401F65r70m9J47lK3j39k50N43L65q65K40J041n86o54Q21K6p72R2L39n58K56K64
$$ 665 -305 -354 -207 -210 -187 -326 -576 -33 332 -533 -293 748 162 -492 329 355 -417 -325 14 -544 -288 -24
4423b4m42J11O42m75k45J072l51q42P16J73q37J93K93k20k37L49j69L4O87o23
$$ -24 -466 -355 287 -188 -433 639 288 -554 162 335 -502 -309 -16 -236 -473 -124 -293 -259 428 -195
4443a95k89J151k02r31R31K56j124r9R46q25l75O21M3l01M71Ml20O20j12o74P01
$$ -195 -484 667 465 -466 465 721 -403 -502 444 -381 -756 -135 -92 -393 78 82 -238 382 270 -404 297
4464B97M79j144J38J102q93q08J306Q7r70M59N66p35K24J31l40J3M80n95J5N15
$$ 297 776 -368 -230 872 -21 -829 477 564 -406 53 619 -116 108 239 -101 -88 392 -203 -188 327
4484C27k58k65K36j2l23P19l3p85R09M31j108r4J012q8r40J27M93l70j39j20k51
$$ 327 69 -196 40 28 -295 424 391 -394 515 946 -162 -256 756 668 -272 -145 348 -22 -161 -281 -532
4505e32O41L57j010MJ343m04j219Q00O12n27m8j78L08L83o21o20R71N62j199k18
$$ -532 109 466 -544 -540 803 399 -820 -20 592 65 17 -161 147 530 -91 -711 260 822 -377 -595
4525e95J083l06j050O50L36p22Q1N12n37J6R05l66p8L84k84K3M25p08jO91n45
$$ -595 488 182 -868 -218 118 -604 -523 -11 -548 -532 373 7 -71 313 29 52 477 -231 -232 459 -86
4546h6j038R97J126j736l39J379P2r45J31L66J79m1m28l64J274P4j476M72J013
$$ -86 -1124 -127 999 -737 -1076 303 375 -570 -439 -73 106 65 -363 -727 547 621 -855 -383 630
4565F30m04r97Q00L15m04mj96j32R72k24r42O03Q54j177o09J162J06q46L84M16
$$ 630 226 -771 29 344 -60 -64 -260 -392 580 356 -586 17 871 -306 -915 247 353 -493 -109 307
4585C07l90L48q9m78O93L67r03K58L71j97m54N01k72m79N47M43j092L15P84n30
$$ 307 -83 265 176 -302 391 758 -145 113 484 287 -167 334 62 -417 130 573 -519 -204 580 50
4605E0k68L74j21J04K28m39m57J354k64j449R34Q11r71l47Q80J41k98m22o6O25
$$ 50 -218 156 35 139 367 -72 -529 825 561 -888 46 857 -114 -461 419 560 262 -160 -226 399
4625C99J91j217m6J557m96j333P31J103r41p20R92M35q24RK84k0Q7l55j13K15
$$ 399 590 -627 -673 884 388 -945 -214 889 -52 -772 220 655 -169 -160 124 104 191 -164 -277 -62
4645f2L10n70K26N95o15r2O35k74p19P45J44p31J67L00j93k43K40j12J54N40o58
$$ -62 248 -322 -96 499 -116 -208 427 153 -566 179 323 -408 -241 59 -134 -377 -137 -249 -95 445 -213
4666b13k21J020k1j231M43P50o43m91O18J67k97J04k20J80O52r84k30R13j46p81
$$ -213 -434 586 565 -666 -223 527 -116 -607 11 178 -119 -15 -235 -55 597 -387 -617 296 150 -631
4686f31K88Q60r08r2M65O8j69N22m78n9M93j58q36N37N78n62l12O40j42k42J23
$$ -631 -343 517 -391 -483 -18 50 -119 403 -75 -134 359 201 -635 -98 480 -82 -394 246 104 -138 -15
4707a5n6J12K09m50k61Q52Oj202Q27Q17p79n03R63r4p82Q5L40j17J81r2l75P57
$$ -15 -71 41 250 -200 -461 391 397 -805 22 839 60 -443 520 426 -356 -271 69 -48 133 41 -334 423
4729D23L08o48j64R47l07q30L03L72o45QO7J27J82nk22M47N51j161J30P78l78
$$ 423 731 83 -81 866 559 -271 32 404 -241 -233 -166 -39 143 138 -84 363 914 -247 -117 661 283
4750B83q01O10J98p13J51N44k49k10J45K02P2K01o47M1O30l37o21L66L63k78j34
$$ 283 -518 92 290 -423 -272 272 23 -187 -42 160 232 433 -214 -173 457 120 -501 -135 228 -50 -184
4771a84M04j90J8J05o42K58P62j048m42J208K57j254J46J445l70r74M93M62j09
$$ -184 220 30 48 153 -489 -231 531 -517 -959 249 506 -748 -602 843 473 -501 -8 454 345
4790C45o79K5N66J90q14n01J342j82j124L64J029o40p59Q64J17n04M44r1k05N12
$$ 345 -334 -309 257 447 -367 -868 474 292 -832 -468 561 -79 -838 26 143 -361 83 -8 -213 299
4810B99j85o05N13M62q41k51R70m87l85L54K63j6j5j70J32M09l79n68Q28K85j227
$$ 299 114 -491 22 484 -357 -608 362 -125 -510 -156 107 91 76 -94 38 447 68 -500 328 613 -614
4831f14o7J135l10j058R14P84q59k78R13o5l08K1k38J13L50o44pL81k40k38L38
$$ -614 -681 454 144 -914 0 784 -75 -353 560 495 187 208 -30 83 433 -211 -218 163 -77 -315 23
4852B3M9l50L82K49m86K41M99o84n1Q43l55p22N50M31r24k02R22l33m50J57O75
$$ 23 72 -278 104 353 -133 108 607 -77 -128 715 360 -362 188 619 -305 -507 415 82 -368 -211 464
4873D64j73j47l22N12L30p24j93P70R4j442O93R80j114n01J087m2o99K16L09m49
$$ 464 291 144 -178 334 664 -60 -253 517 611 -831 -138 842 -272 -773 314 272 -427 -211 98 -351
4893c51L60R0m39N29J14j53q1L18k60j91K79l28j4K03k63l82M06L13r01M53Q63
$$ -351 9 99 -340 189 303 150 69 387 127 -64 215 -113 -127 76 -187 -569 -163 150 -751 -298 565
4914E65q68j26Q48k24p41N00M94o12j87O48l77J79q2l96K42O1l96K01N42l15o38
$$ 565 -303 -429 419 195 -546 -46 448 -164 -351 297 -80 99 17 -379 -137 -76 -472 -271 271 -44 -682
4935f82P82L14q65L64N19n37j52O48p65j96M62J0m42N26K34j75j77M60J5J73l60
$$ -682 100 414 -451 -87 432 -105 -257 391 -374 -570 -108 -98 -540 -14 220 45 -132 328 343 516 156
4956A56j93K61j69p66J85R16o33n38R14N21j103M72R82n45q14N97K35o30l2J95
$$ 156 -37 224 55 -711 -526 390 -243 -781 133 654 -449 23 1005 460 -354 243 478 -152 -184 11
4976A1k40L07r2j40L15P2n48M76L54q77K9N65l10l79P72J8l80L76J38o15J37N05
$$ 11 -229 78 -14 -154 161 233 -315 161 515 -362 -333 232 -78 -457 315 333 -47 329 467 -148 -11 494
4998D94m93m34P27k2p89M20M19j59N2l07KM54m0q31J42N67o06pR15k87o99N84
$$ 494 1 -433 294 272 -517 -97 322 163 215 -92 -90 364 324 -507 -365 202 -404 -411 504 217 -482 102
5020A02L26n91K02M46n64m42N47n8m16L97O6k27M67J9n99N60K30p64P3L44m05
$$ 102 428 -163 39 485 -79 -521 26 -32 -448 -51 15 -212 255 274 -325 235 465 -299 -226 118 -287
5041b87j04K25m4J1L57l34l00P40K19j189M54O83l26q45M76N31l35j74q4L94L44
$$ -287 -391 -166 -210 -199 158 -176 -476 264 483 -706 -252 431 105 -740 -264 267 -68 -242 -326 68 412
5062D12o07l24R38m4r05K21R90o31o38Q91p4m61rL11j94J48J30k21J04J02k55
$$ 412 -195 -519 419 375 -530 -309 681 50 -588 303 229 -232 -241 70 -124 24 154 -67 37 139 -116
5083a16k5K72k53p0P79l68q08N70O93p30o8M79l21kK29l87P8N44o32m55O76N72
$$ -116 -141 131 -122 -192 587 219 -589 -19 674 -56 -124 355 34 32 261 -126 -48 496 -136 -591 85 657
5105F57p92j55O06J10k78k62J6L42J86q65j58J302l85q77L70O93l49m25L32J98
$$ 657 -135 -290 316 426 148 -114 -98 244 430 -435 -593 709 324 -553 -183 510 161 -264 68 266
5125B66k12K18m04j26P61m63m60N00M57o51l80N46L1ol02r1K06L03m96j04J045
$$ 266 54 272 -132 -258 503 40 -420 80 537 -114 -494 52 83 77 -225 -316 -110 193 -303 -407 638
5146F38k92m86M07L62j032K82N70o92m55O65l3p57L42O40k2q6j98K03M22j60r12
$$ 638 346 -140 267 629 -403 -121 449 -243 -698 -33 -66 -823 -481 159 137 51 -147 56 478 318 -594
5167e94K91P14p85m03R27L67q02L6M55j86j07Mk49K34K27o16q1O01R2l96m7M95
$$ -594 -303 411 -374 -777 150 517 -285 -249 206 20 -87 -83 -332 -98 129 -487 -568 33 125 -271 -318 177
5189A77m4k45n8n6M62po16j35R88m09l93N18K51k61j91K02m06K65p3n88L32M73
$$ 177 133 -112 -170 -226 236 229 -387 -522 466 57 -336 182 433 172 -19 183 -223 42 -31 -619 -287 186
5211A86l56m9M83j82k29N95P6o51K24M10o52j6J78l6k27L11j38j34L08q8j58L61
$$ 186 -170 -219 264 82 -147 448 524 -127 97 507 -145 -161 17 -19 -246 65 -73 -207 101 13 -145 216
5233B16m0n41r7Q91k33n60K84K67K53n0j80j16M11k87p76L86N57p03m19J026n5
$$ 216 176 -365 -462 429 196 -364 -80 187 440 390 210 94 505 218 -558 -172 385 -318 -737 289 234
5254B34m91J75K65Q0j27qm7J34r0k58K23J9l39K38L69k25l61N23o6m88M06nl75
$$ 234 -257 -82 183 263 136 128 81 215 125 -133 90 109 -230 8 377 152 -209 314 248 -240 166 161 -214
5277b14j09K91J20m03O12l38k87L13J14m28n0K92N1k7k1JL85n2n22K45P19p53
$$ -214 -323 -32 88 -315 297 -41 -328 -15 99 -329 -379 -87 -36 -63 -84 -83 302 250 -272 -27 692 -61
5299f1q03R08K87p17l11Q08k2m99J9L30P1J55k71N6K40J34o26J98M78o73J3M37
$$ -61 -864 44 331 -386 -697 111 89 -410 -391 -61 10 165 -106 -50 190 324 -302 -104 374 -299 -286 151
5321A51j14k75L58n1l30J61J81j65K53j10k94M37N8o78P1R70n64p36O87P65q96
$$ 151 37 -238 120 69 -261 -100 81 -84 169 59 -235 202 260 -418 -347 623 59 -677 10 775 -121
5342a21k39M91J72k99k34L4M56m5n27J71Q30m39o38N07L36l85l01L78n9o5M0j87
$$ -121 -360 131 303 4 -230 -196 260 215 -312 -141 689 250 -388 119 455 70 -231 147 88 23 63 -124
5364a24M4M05k85k61L40L37l64j39M40k97o4J67q9k02L07l69j54M31J81l41K69
$$ -124 -80 325 40 -221 119 456 92 -47 393 96 32 199 110 -92 215 -154 -308 123 304 -37 232
5385B32j12n20L74M33n98j69N86J12m80K33J12l65K72k73o6L98L0o69K09O33n29
$$ 232 120 -400 -26 407 -191 -360 226 338 -142 91 203 -162 110 -163 -229 169 199 -470 -261 372 -157
5406a57l97O86L24n35k0L13k28Q7j90m70N89L42p03l5N15K57o82M57J85m29MM1
$$ -157 -554 132 456 -79 -99 214 -14 73 -117 -587 2 344 -359 -394 121 378 -304 153 338 -91 -87 -46
5428d6j84M9K88o17J84M77j60k06K44l7k8K49q4n80M82K50n45J36J63J0k30L26
$$ -46 -230 -181 107 -510 -326 151 -9 -215 29 -8 -36 213 129 -451 31 281 -264 -128 35 45 -185 141
5450A41o2j17M56l07n40K77O25o71j78N13k92l6N5P5J39L6k20J0L44J51p33L60
$$ 141 79 -38 418 111 -429 -152 473 -198 -376 137 -155 -191 -136 -61 78 114 -106 -96 248 399 -334 26
5472B6K32l87k41J44J93j4O8j33kJ98J43o57L95M97m17k93O35J26n23K42q4j84
$$ 26 258 -129 -370 -226 -33 -47 21 -112 -114 84 227 -430 -35 462 45 -248 387 513 -10 232 148 -36
5494c6J42J63m87J00J54k57J08N45m46j26M85k01m87O39M1o34P9N36m74Q7J83
$$ -36 106 269 -218 -118 36 -221 -113 432 -14 -140 345 144 -343 296 337 -297 -218 318 -156 -69 114
5515A14j60q6M75m01o8O17k31o88L18L25l19r8nR9J28K3o31M76N42l58m21N66
$$ 114 -46 -132 343 -58 -126 491 260 -428 -110 215 -104 -202 -207 -108 20 43 -588 -112 430 72 -349 217
5537B17L03q35M5N39l42k48K62p7O5L05m60j21M02J09m94K68K32l15K16oj91p2
$$ 217 520 -315 -270 269 -73 -321 -59 -136 -71 234 -226 -347 55 164 -330 -62 170 -145 71 65 -126 -198
5559a98L61k72k57N58p2l90K97J68k97L71jn76rP06m98k72L36K44k87j18n1K58
$$ -198 163 -109 -366 192 120 -270 27 195 -102 269 268 -308 -317 389 -109 -381 -45 199 -88 -206 -257 1
5581AM22m00j39K41Q5m43j88P68j98o45M30L94k91o7J40MK9K9j95MN43m61k13
$$ 1 423 23 -116 125 210 -233 -421 347 149 -496 -66 328 37 -30 110 114 143 172 -23 -19 524 63 -150
5604a50M17j45l59J61J39k60J75K86l73q2N27l78o6K41p5k56L61j09k50L19J88
$$ -150 267 122 -237 -76 63 -197 -22 264 -109 -191 336 -42 -108 133 58 -198 163 54 -196 123 311
5625C11m29p0O88l89k21K35K25n10L98j96j89J11K27k46j85O63n71o3K48Oo4J56
$$ 311 -118 -188 500 111 -110 125 350 -160 238 42 -147 -36 191 -55 -240 423 -148 -211 37 43 -21 135
5647A35q6p3L86k1n22j38O07m59k20M94j85j10K43j81j64L30J46o44O12%l82R2
$$ 135 49 -24 362 341 -181 -319 288 -171 -391 103 -82 -192 51 -130 -294 36 182 -462 150 150 -232 -140
5669a40M34n35l8M18l64kL30M3l46J66K74l01J41R0k67M4K18m46j88R04m71l47
$$ -140 294 -241 -279 139 -225 -227 103 146 -200 -34 240 -61 80 170 -97 -53 165 -281 -469 435 -36 -383
5691c83N06L75p43k04N59j31J4k79L8K47P0k58oN94k06o34K83M54l65k92L61O8
$$ -383 123 498 -245 -449 110 -21 -7 -286 -248 -1 69 -189 -195 399 193 -441 -158 296 -69 -361 0 68
5713F8j35J35n8j37K94j70j99L92p8k96R9L59m48j10M20j50j37L35j7l32K58Q0
$$ 68 -67 68 10 -127 167 -3 -202 190 112 -184 -85 274 -174 -284 136 -14 -151 184 167 -165 93 173
5735A73r0M3J08l65J80L84l09k78K57Q6k46K2J76lj10k22J13L14Jm26j10P05j42
$$ 173 83 126 234 -131 49 433 124 -154 103 189 -57 -35 141 138 28 -194 -81 233 234 -192 -302 403 261
5758B61n92K95M53m99j2N2j14J10q5n4M36m8m47KO92l01n21M04M51o00n1K01m4
$$ 261 -331 -36 417 -82 -94 -42 -156 -46 -131 -185 251 203 -244 -242 450 149 -372 32 483 -117 -168 33 -11
5781a1k4J73k99J80J87j50k70M93p5o80M91L11n61r9M04k4m73L07M1lJ79k4j01
$$ -11 -35 138 -161 19 206 56 -214 279 204 -476 15 326 -235 -334 70 46 -427 -120 -79 -82 97 73 -28
5804b8J62j27k36Q2L07m72L33m1l30J10K83Q6l46L11J78o48K72M45m06j87J63
$$ -28 134 7 -229 -147 160 -312 21 -20 -350 -240 43 129 -217 94 272 -376 -104 341 -65 -252 -89
5825h9J29j91N0j8J78p8k98K18L02l0m85L51L18n47k25L69K54o06N69q6k61J66
$$ -89 40 -151 -101 -119 59 -19 -317 -99 203 173 -312 39 357 -190 -415 -46 208 -398 171 85 -176 -10
5847a0J25j84O7J90m36K91L65o24j00L86P2l92K07K88k20j74J28L0k68K62j77
$$ -10 115 -69 -2 188 -248 43 408 -216 -316 70 142 -250 -43 245 25 -149 -21 9 -259 3 -174
5868a74J13L20j09l39O99j18o36K75M91m58l04M66j03k82K03Oj66J34Q3l64K72
$$ -174 -61 259 150 -189 510 392 -244 31 522 64 -240 226 123 -159 44 50 -116 18 101 -263 9
5889IK09m22K28J34m34J96L91k60j61L92m4m60L35N9k84j5L10m48j39M32j35k4
$$ 9 218 -204 24 158 -276 -80 311 51 -110 282 238 -222 113 172 -112 -127 183 -265 -404 28 -107 -131
5911a31M6K94kj06K17l47J59j17k78J59K50m97K71K51r2l39K69P7l99J68J10p
$$ -131 -85 209 207 101 318 -29 130 13 -265 -106 144 -353 -82 169 77 -262 7 84 -315 -147 -37 -44
5933d4M0j13l46L81K24m99r6N97j33l09J70K51j7j2o8p1K0J09l41J85M78m88j45
$$ -44 -4 -117 -463 -82 142 -357 -453 144 11 -298 -128 123 106 94 26 -45 -25 84 -257 -72 406 -82 -227
5956b27M21n0o11K50K96k59q0L44J33k87K12k8l38L03J16l85J75N5m63M29J01
$$ -227 194 144 -467 -217 79 -180 -260 84 217 -70 142 114 -224 79 195 -190 -15 40 -423 6 107
5977A07l00O7K96j64k43K19K89l39J72N7l39J24K91l56K3M71k27l09N18o3n60
$$ 107 -193 -126 170 6 -237 -18 271 -68 104 161 -178 -54 237 -119 -96 375 148 -161 357 294 -266
5998b66j0K56O0m0J29m63O15m9l57J75L36l08m31P14M1m27l3J34J21k56J32j48
$$ -266 -276 -20 40 0 129 -334 281 232 -125 50 386 78 -353 361 402 -25 -58 76 197 -59 73 -75
6020g5r8N51o09J36M74k89l03K87K20l15q5l6p6J71o1J1k87N05k93j57N62n8m34
$$ -75 -173 378 -231 -95 379 90 -213 74 294 -21 -106 -142 -218 -47 -108 -97 -384 121 -172 -329 233 175 -259
6043b59L84ll50P6M54l87j77J61O1j31j3m4K35K40k39M2R2J52m33j43O18l93j81
$$ -259 125 122 -228 -152 302 -85 -262 -101 -40 -171 -184 -228 7 247 8 50 142 294 -139 -282 336 -57 -238
6066b38L39m2j53M4J62l73J49L08m67J36M16l64k99K33L46m30J94o6L1K71k62
$$ -238 101 59 -94 -50 112 -261 -112 196 -271 -135 281 -83 -382 -149 197 -233 -39 -105 -74 197 -65
6087f5j33L18K61l98k15M22J00m41J11O6N0R3Ok72J60K15m93n6P04j51m31K28
$$ -65 -198 120 381 -17 -232 190 290 -151 -40 26 76 169 175 -97 63 278 -215 -271 433 282 -149 79
6109G9K27l07Kr8k6K53k53k25j07O66p5q8J91K0l53J96J01n28K14M11n44J12O2
$$ 79 306 -1 1 -97 -123 130 -123 -348 -455 211 136 48 239 259 -94 102 203 -325 -111 300 -244 -132 -70
6132g0J91j29K6j9R5M0l64K04K73j2o17K84M55n04J49J97j40p8K03j05l40L39
$$ -70 121 -8 18 -1 94 134 -230 -26 247 235 -382 -98 357 -147 2 199 59 -19 184 79 -261 78
6154G8J3m11K43K76j20m63K65M52m22J22j75L98j43j77j37N01j33l02J58K81l10
$$ 78 91 -320 -77 199 79 -384 -119 333 -89 33 -142 256 113 -64 -201 300 167 -135 23 304 -6
6175fj86M83k74j59N4J12k41L21n7k31r9M41j65R8O1j15q2K94l76p0J36J30Oj96
$$ -6 -192 291 17 -142 -88 24 -217 104 47 -184 -283 158 -7 91 152 37 -45 249 -127 -197 -61 69 75 -121
6199a21K65J16k24J96k90j00L03l27k62O01j54l85J02M22j10k9M2L20j51j13j13
$$ -121 144 260 36 232 -58 -158 145 -182 -444 157 3 -382 -280 142 32 3 45 365 214 101 -12
6220a2J72j43q4J12n5n8k14L17o6j64j00P16m64p0L76M5l52K82K6k74P8O6l75
$$ -12 160 17 -67 45 -10 -68 -282 35 -31 -195 -295 421 -43 -113 263 308 -44 238 264 -10 68 134 -241
6243b41J55J69j47l3K56N7k01N9P2j67L93l40j81K45J92m08Q1Q2M3l03J14J08
$$ -241 -86 83 -64 -97 159 216 15 74 146 -21 372 32 -149 96 288 -120 -39 43 86 -217 -103 5
6265Ej77K72J14l35N5L17m33K45j7jm8KJ13l61M10j84l05K48K49l72K58J44l77
$$ 5 -172 100 214 -121 -66 251 -182 63 46 45 -3 -1 112 -249 161 -23 -328 -80 169 -203 55 199 -178
6288a78n9L10l6m54L62Q1l36L73J29k51k00K41Rj64K35J12n1j01k19k5M28Q2q08
$$ -178 -237 73 37 -417 -55 26 -310 63 192 -59 -259 -18 -9 -173 62 174 123 22 -197 -222 206 288 -520
6311e20L71N02m38k43M03R9l96Q1rk8J62j57j70K01L74m17J43M33k53k64K95j72
$$ -520 -149 353 -85 -328 75 174 -222 -141 -150 -178 -16 -173 -343 -142 232 -185 -42 391 138 -126 169 -3
6333cj3P2j44l30K92K93l58l4N03k87m2M55m1l55L4J31k62J54j20l4L04k9n2j52
$$ -3 -16 56 -88 -418 -126 167 -191 -225 278 -9 -51 404 363 8 42 173 -89 65 -55 -89 215 186 134 -18
6357a8K4j71j35O82j84o23M36L59l85k31K60M0J70k67p2M06M9m86j74O25k0m96
$$ -18 6 -165 -300 382 198 -425 11 370 -15 -246 14 54 224 -43 -115 291 340 -146 -320 305 285 -211
6379b11Q2M05j14p1l9L4l4r5o0k8L18k53m25M17L08k98p4O15l66j24P6k4j54O7
$$ -211 -129 276 162 91 52 86 52 -43 -103 -131 187 -66 -491 -74 234 -64 -138 477 111 -13 63 39 -115 -48
6403d8q1o8J49J54j49O5j5k51L66Q8m66J43K48k3n63M37R5Ok04J48J41k40J93
$$ -48 -129 -197 -48 106 -43 22 7 -244 122 210 -256 -113 135 112 -451 -14 81 87 -117 31 172 -68 125
6426A25k13j67M90k41k47J58P3j88J21M9k38M12P3n43k0O82l17l67M05J88k76
$$ 125 -88 -255 235 -6 -253 -95 -22 -210 -89 -40 -278 134 207 -336 -356 326 9 -358 47 235 -41
6447d1k6J09j16J83l04l7L17O0m16P8L28r9l81L03J83j90R2O2j82J17K21m79j61
$$ -41 -67 42 -74 109 -195 -232 85 145 -271 -193 135 36 -345 -42 141 -49 43 105 -77 40 261 -218 -379
6470c79P63l19j48J68M3k70J67M8r4j42M10l6l39L25Nj46j4O9l07M69j13l29J03
$$ -379 384 65 -83 85 128 -142 25 73 -21 -163 247 211 -128 197 202 56 42 111 -196 273 160 -169 -66
6493f6K80m24k8M29r4j11Ql3M0L7J35k17J01L08n82J71J03O2l23o1J95L7J08n1
$$ -66 214 -210 -238 191 97 -14 -6 -39 1 38 173 -44 57 365 -217 -46 57 119 -204 -265 -70 -33 75 24
6517B4j61M59j2o22L82K84l71k16M42j58j67K16L0j72M3k9j04J58L6j87j49N24
$$ 24 -137 322 310 -312 70 354 -17 -233 209 51 -116 100 130 -42 1 -28 -132 26 62 -125 -274 250
6539B50k74J49n8k4j64M13j54m42M26J94n45RK23J04q5qk22L07J73l57k47L25
$$ 250 -24 125 67 43 -121 292 138 -304 122 316 -229 -220 3 107 22 14 -208 99 272 -85 -332 -7
6561gK38m98k7K42j34o6J56j07OK67o8k00K11K75m06K23J75l78J09K29l54j49
$$ -7 231 -267 -294 -52 -186 -252 -96 -203 -197 70 2 -198 13 288 -118 105 280 -98 11 240 -114 -263
6583b63K25N6l43L65J65n49R1L69M0j64J22m7M6O7k33o0J33o6o7L12K6k85Q9K23
$$ -263 -38 18 -325 40 205 -344 -253 116 156 -8 114 67 113 180 -53 -113 20 -46 -113 199 225 -60 29 252
6607B52m63L7L06j48j60K61J52l84J57J01o4J02m3j02J83M0j36j38J30p3j87K18
$$ 252 -211 -174 132 -16 -176 85 237 -147 10 111 47 149 106 4 187 227 91 -47 83 10 -177 41
6629D1J69k14K31Q8l42o1K08p8l51RM29l58L36q3o8J93L9k29n7L87j68j14K55
$$ 41 210 -4 227 315 -27 -88 120 42 -309 -300 129 -229 107 24 -44 149 188 -41 -98 289 121 7 262
6652B62j67K6k05l9Q3J4j00KK42M5l04J44O4j18k95N27k7m17K29L10m33j3K90
$$ 262 95 121 -84 -123 -40 -26 -126 -124 118 163 -141 3 67 -51 -346 181 154 -263 -34 276 -157 -170 120
6675A20p3j05R9j43j13K74k33j13L78k07J52K01j54j36r6M52l78k1J85p6j32L34
$$ 120 47 -58 41 -102 -215 59 -174 -287 91 -116 36 237 83 -53 -149 303 -75 -96 89 13 -119 215
6697B15l02R7p4L60n90J02L16lj96j47L52j10N5l41M4N04k26l84K81L28l58n9
$$ 215 -87 10 -64 296 -294 -192 124 121 -75 -222 130 20 75 -266 -222 282 56 -328 -47 281 -77 -136
6719a36J86J40m27L50O7m4J62l66J03k03K11k43N2J52J95k45q3N3K35j18j10j37
$$ -136 50 190 -237 113 180 136 298 -68 35 -168 43 -200 -148 4 199 -46 -129 -76 159 41 -69 -206
6741b06K49O9k65K18K41o22K16L37j43j09n8L00l62J38J55L3m78K62K33Om08K45
$$ -206 43 112 -153 65 306 -316 -100 237 94 -15 -73 227 -135 3 158 191 -287 -25 208 214 -194 51
6763E1O6J33m69J42L11pl10J57J93j95j52K40k0Rj35N0j26J57j5k40K29R2j97
$$ 51 117 250 -219 -77 234 227 -83 74 267 72 -80 160 140 149 14 64 -62 95 80 -160 69 161 -36
6786c6M6k90K21L36m08M3K53J79n37J0K56J01n86J86L83o9l61J58l0J21J4j70
$$ -36 10 -280 -59 277 -131 -88 165 344 -193 -183 73 174 -412 -226 157 88 -273 -115 -145 -24 -10 -180
6808a80K3J93M7l01J99Lj61QL73j13k7N7l55L18j05J8k48L50K6m24K03J65k09
$$ -180 -157 36 83 -218 -19 -16 -177 -169 204 91 64 121 -234 84 -21 -3 -251 99 125 -299 -96 69 -140
6831a40j10L06k50j1L98j04l32K71M5k11N1J06o5K90j05l46K48K09k92j35K38
$$ -140 -250 56 -194 -205 193 89 -243 28 73 -138 -87 19 -46 244 139 -207 41 250 -42 -177 61
6852F1J36n38L52J30j34m0kl4K20J51k46j5J25j89J5q1K91k66j3O2nJ60k1k11
$$ 61 197 -341 11 141 7 -33 -35 -69 151 302 56 41 166 -23 -8 -89 202 -64 -77 -15 -20 140 119 -92
6876i2q5M99k20k81L60q6l23J81L29m97J92R0n9j54P7Q1j92L92L8l48J93j45q4
$$ -92 -177 322 102 -179 181 95 -228 -47 282 -215 -23 67 8 -146 -69 12 -180 212 250 -98 95 -50 -134
6899a34J33Q8l36K90J08k94K7O9J28p7M9Rp8JJ81k31MK05j11k45M37j59l45J77
$$ -134 -1 87 -249 41 149 -145 -118 -49 79 2 51 60 -18 -17 164 -67 -63 142 31 -214 223 64 -281 -104
6923a04N2q0K62j45n5J14k3k76K21L43l82l62O05J5l56K28m0n6n5K9j36J36R4
$$ -104 -52 -132 130 -15 -70 44 21 -255 -34 309 -73 -435 170 185 -171 57 17 -39 -94 -65 -201 -65 29
6946B9M3j76K52j92j17K25n9j89J48Q5k49j46M86k49m6K90j10k10J37J05k5j57
$$ 29 72 -104 148 -44 -161 64 5 -184 -36 49 -200 -346 140 -109 -155 135 25 -185 -48 57 32 -125
6968a25J92m5J6j80L2M2K38o4l63K93q1P1o5K51l04K21q2l1m4K28j45k48L51j33
$$ -125 67 22 38 -142 -110 -68 170 106 -257 36 -45 26 -39 212 -92 129 47 16 -28 200 55 -193 158 25
6992B5j10J16k7k04K76L0j94J60J53k51j29K13K22m80J75R9J29k75o4%O0K11l14
$$ 25 -85 31 4 -200 76 106 -88 72 225 -26 -155 58 280 -200 -25 74 203 -72 -136 -136 -76 135 -179
7015a79N7M16k16l18K01L01l51Q0K02q2q6j62J30P6j54J5q3K95l3m15K87P6Qj06
$$ -179 -122 294 78 -240 -39 262 -89 -9 193 111 25 -137 -7 69 -85 -70 -153 142 109 -306 -19 57 65 -41
7039d1J86q4l8R0N2k53L6j4k38M65r6j10R0j00j92L21nqk44L02p6l02R6P1k40
$$ -41 145 61 23 113 165 -88 -52 -66 -304 161 65 -45 45 -55 -247 74 69 61 -183 119 43 -259 -163 -92 -332
7064c32L21k1k90L82K87j75l33jK17j10%Po9J15N2q2j37K73k26LN39l96k28L28
$$ -332 -11 -32 -322 60 347 172 -161 -162 55 -55 -55 -48 -117 -2 50 -32 -169 104 -122 -119 420 24 -204 124
7088A24n1k61k1K85l0j51K49j88J41n4j34J9J34J38k02l8k38M30k29J54j04n9
$$ 124 73 -188 -209 76 46 -105 144 -44 97 43 -91 -72 62 200 -2 -40 -278 152 -77 77 -27 -86
7110h6K67l29L31j01n1o5JJ96k92L71j43J42j34K07k09l35L97J4k68R2J82k06
$$ -86 181 -148 183 82 31 -34 -33 163 -129 242 99 241 107 314 105 -230 167 181 -87 5 187 -19
7132a9Q3j14j0K86o6j82k3K0k12O4K76k92K0M32qm07J10J32k18J6J97j98j19L40
$$ -19 64 -50 -60 226 160 -22 -45 -25 -237 -173 103 -189 -169 263 255 -152 -42 90 -128 -112 85 -113 -232 108
7156A08k31O5J16j30M5K72o3k73K34j03l48J26L94j61l70M23j85r6K45l8j8r0
$$ 108 -123 -58 58 -72 -27 245 182 -91 143 40 -308 -182 212 51 -319 104 -81 -177 68 30 12 -78
7178g8j04J37m7L36l75l8K09o8j68L49l5k68J65Q1j73J23j98K66n4j3j99m6M69
$$ -78 -182 -45 -92 244 -131 -169 40 -28 -196 153 118 -150 15 96 -77 46 -152 114 60 47 -152 -198 271
7201B71l15k12K43J70k82j4L14j85k44K87j11L7P4k04J49J64j70Q4k33J52j31
$$ 271 -44 -256 -13 157 -125 -139 175 -10 -254 33 -78 -41 33 -171 -22 142 -28 56 -177 -25 -156
7222a56J36N6mn1J16k29L7J79Kj58J57O7j29o8J63k86m7k9K64k2J63j52n0R4J31
$$ -156 -20 36 32 -19 97 -132 -95 84 86 -72 85 152 23 -45 118 -168 -215 -244 20 -2 161 9 -41 53 184
7247A84k66L16q3j83O0K07k18j02N4J5J20n7J31m7J84k03j03K06L6l89J8pK46
$$ 184 -82 234 151 -32 28 235 17 -85 -31 -16 104 47 178 131 315 112 9 215 251 -138 -120 -127 119
7270A19j67J65J59l66J34m1K19m9j67k6K31q8j88j58N21k53k18K77R8k59j17K16
$$ 119 -48 117 276 -90 44 3 222 173 6 -20 211 123 -65 -223 298 45 -173 104 202 -57 -174 42
7292D2k62L68pj62o3J64j5k72R0J75n9K6J0L2m3J12k57J18o2N3k2pnj54J34n8
$$ 42 -220 148 141 -21 -84 80 65 -207 -117 58 -1 25 35 67 24 136 -121 -3 -65 -12 -34 -41 -46 -200 -66 -124
7318a24r2K86J51k86j99K44J04j94R4J41Q5l6l72J91P3j92k49K33J93j10l00O09
$$ -124 -216 70 221 -65 -264 -20 84 -110 -16 125 210 174 -198 -7 66 -126 -375 -142 51 -59 -359 250
7340B50j40p0K8q7p9O5P0j84Q9K50k98j19L54Kj61r5L73k04R7k95L22k1j15j63
$$ 250 110 40 68 -19 -98 -33 37 -147 -58 192 -106 -225 129 131 -30 -125 248 44 141 -154 168 147 32 -131
7364a31R3J62j64j89N31k6l62J55J81k87M2N5j55%J59n5M3KN4l0j05J1K4O0k16
$$ -131 -38 124 -40 -229 302 276 -86 69 250 -37 5 60 -95 -95 64 9 52 54 108 78 -27 -16 8 68 -148
7389a48l7J29N0q1P9R2o0m5L76k24k51K22M9l20o7M06r9j21m3R2k7j45J66j42
$$ -148 -185 -56 -6 -87 -8 84 24 -21 355 131 -120 102 151 -169 -236 170 71 -50 -93 -1 -28 -173 -7 -149
7413a49M44n53K95J74j55j81j00M89l67p4K88k46n0J75P3l31L54j07M4J57o7J4
$$ -149 295 -258 37 211 56 -125 -225 264 -103 -177 111 -135 -185 -10 63 -268 86 -21 23 180 113 127
7435A27k72J0K42j07K7M5J4j26K1k61K87Q7l49J46L22j75j92L78j48j60J16L16
$$ 127 -145 -135 107 0 27 72 86 -40 -19 -280 7 94 -255 -109 213 38 -154 224 76 -84 32 348
7457C48l37j84L61k37kj36L38k49k9L1O6j34J79k08N43j75m13K42j9j80J7K63
$$ 348 11 -173 188 -49 -51 -187 151 -98 -127 -96 -30 -164 15 -193 350 175 -238 4 -15 -195 -178 85
7479H5j10j65M7K40r9K2J14j21j91J76l8QJ03r8J16j6j13lK98k08n9L6J30j66
$$ 85 -25 -190 -143 97 -2 20 134 13 -178 -2 -40 -32 71 -27 89 73 -40 -43 255 47 -12 24 154 -12
7503a2j39L02q1k21N4L01j67R0n4l4K8J02j25q1K07j30n6J23j5p5R0n4j57K53
$$ -12 -151 151 70 -151 -97 204 37 127 73 39 67 169 44 -37 170 40 -16 107 92 17 107 53 -104 149
7527A49j47p5j7L10j86m0nL6j17L27L0l88K15m7k01J70r8R6j20j0M8R8L0k9J1
$$ 149 2 -73 -90 220 34 -6 -11 25 -92 235 265 -123 92 45 -156 14 -84 12 -108 -118 -70 28 58 29 40
7552D0o5J43k93K82J00n89N9L26R8k57J30O6o7O9j28RN4J26k16J09J9R8k04J55
$$ 40 -25 118 -175 107 207 -382 -323 3 101 -156 -26 40 -27 42 -86 -77 -23 103 -113 -4 15 113 -91 64
7576F4lM2o7k14K96o3r2j58Q1J34J8j76J8J4K3J64o8K17j47k23m7J52j3J9o1J63
$$ 64 61 103 36 -178 118 55 -37 -195 -114 20 38 -138 -120 -106 -83 81 13 230 83 -140 -187 -35 -48 -29 -90 73
7602G3M9l38N12k33k19J56M4l52M94j67L2O5k48J34j02J48n5J05P3k15j86L60
$$ 73 122 -216 296 63 -156 0 44 -308 186 19 51 116 -132 2 -100 48 -7 98 171 -44 -230 130
7624A30n9k23R2N9R5l16L40j04NK53k16r1J92r7k41O6L54n8l6n3M7Mj02j16K58
$$ 130 71 -152 -60 -1 94 -222 118 14 19 272 56 -35 157 60 -181 -115 239 181 145 92 139 143 41 -75 183
7649A83l5n8p3J66l20L8K5J26j22O0K06l73K60K44j52l72J85j30L4N9Q3P0j93
$$ 183 148 90 17 183 -137 -99 -74 52 -70 -10 196 -177 83 327 175 -197 -12 -142 -108 -49 34 104 -89
7672h9J73r4o7J75%j60L7J06j98J36J79j82Q5q6p5M6J2k59J96K42nj37j3j39K37
$$ -89 84 -10 -77 98 98 -62 -25 81 -117 19 198 16 101 15 -60 -14 -2 -261 -65 177 172 35 22 -117 120
7697A20l02J73Lr8K08j81j75L23N9j94K09J5k47K6J69k7k47L00l3j1j10Qp0K10
$$ 120 -182 -9 -6 -104 104 -77 -252 71 130 -64 145 160 -87 -61 108 81 -166 134 101 90 -20 -12 -82 128
7721A28pj86o7K11l94L65J4j23N9J6J66j74J30p3j64J46O3j30n5J14j19l7K62
$$ 128 121 -65 -132 79 -315 50 64 -59 0 16 182 8 138 65 -99 47 110 -20 -75 39 -80 -117 145
7744A45l0k05J17J38j73jJ95k57j62K87k17K02K8J09k6J10j08j84L21m70l2K54
$$ 145 115 -90 27 165 -8 -9 186 -71 -233 54 -163 39 67 176 150 260 152 -32 289 -181 -213 41
7766D1n0j6j7J62J6j9j03J0j5K14j52k76K31P1q4j2nj58J68j35m3K72j17m6j71
$$ 41 -9 -25 -42 120 136 117 14 24 9 223 71 -205 26 97 13 1 -4 -162 6 -129 -172 100 -17 -63 -234
7791b34L10j22p0J86j08R8r0j54R6J6L32l92p4K23L1j30p1J07j2N2m4o1K77k18
$$ -234 76 -46 -116 70 -38 60 -30 -184 -88 -72 260 -132 -206 17 48 -82 -153 -46 -58 -6 -50 -111 166 -52
7815e2j5J33j13j44K30O3q4q5J37K00k79K9l7J97k88P8J48l29J57Q6O0n8K8N7
$$ -52 -67 66 -47 -191 39 102 18 -67 70 270 -9 20 -17 180 -108 -30 118 -211 -54 32 92 34 62 119
7839A19j88K1o2J11P2k4r4q4K77j68o4J22j33R3J23l60J85K83k89l6J28N0k31
$$ 119 -69 -48 -110 1 73 49 -45 -129 148 -20 -84 38 -95 -2 121 -239 -54 229 -60 -96 32 82 -149
7862a49J14L21l71J12%j85O9K45j17k07M20l17J5O0J05O6Q1lk54l5J98k11N7l
$$ -149 -35 286 -85 27 27 -158 -89 156 39 -168 252 -65 -50 10 115 181 262 259 5 -30 168 -43 14 11
7886A1Q1r4K4L1l79M94m9K2l6L1R7l36J95j99j2K58r6l4N6j85J86q3J32J9n6L3
$$ 11 92 -2 22 53 -326 168 119 141 105 136 233 -103 92 -107 -119 139 43 9 65 -120 66 -17 115 134 78 111
7912A11j58k4J01O7k50L04j35q2KK67l22n4J65j09Q7J34j53Q1O5Jk88L64o2k46
$$ 111 -47 -71 30 97 -153 151 16 -66 -64 203 -119 -173 -8 -117 -30 104 -49 32 97 98 -190 174 112 -134
7936a34R2J3j38M8J40P1j28J68N2k78J56o8L6N7m0j22N1l8J12k6Mp4o9R7J5n9
$$ -134 -42 -29 -167 -119 21 92 -36 132 184 -94 62 -6 30 87 47 -75 -24 -62 50 24 28 -46 -115 -18 -3 -62
7962f2j29J24p7n2J96J99l62J11j07M7J28J4N7R7k26r3O1n2J1K13k88K03J67k43
$$ -62 -191 -67 -144 -196 0 199 -163 -52 -159 -112 16 30 87 184 -42 -135 -74 -126 -115 98 -190 13 180 -63
7986f3j71K8L45j24k06P8J56j08m0K77j66M0k0j86N6mJ82k9k0n8K63k23n6j62
$$ -63 -234 -206 139 15 -191 -113 43 -65 -105 172 6 46 26 -160 -104 -108 74 45 25 -33 230 7 -49 -211
8010b11J96j46o8J28J50n9n2J39p2K19n6k5q1p6J10j93J02K32J02k21j62K8j52
$$ -211 -15 -161 -229 -101 49 -10 -62 77 5 224 168 143 62 -14 96 -97 5 237 339 118 -44 -16 -168
8033a68J15nM7J41j88r2J19O5j09K8M0K1j68jQ0q6R7K33j05k61K94o5k15J38R4
$$ -168 -53 -58 -11 130 -58 -150 -31 34 -75 -47 -7 14 -154 -155 -75 -161 -64 169 64 -197 97 32 -183 -45 49
8058D9q3n5J8j8R2l14K30J69k21J6K35j07Lp2J97L0l19K13l9l5q8M50k52j25K
$$ 49 -34 -89 -71 -89 3 -311 -81 88 -133 -117 118 11 14 -58 139 169 -150 63 24 -11 -99 351 99 -26 -24
8083b4R9j00r9J29J2j42J89j49J61M9r2J69j6m4k34m3J96r5R9K52m77J61n9r6
$$ -24 75 -25 -124 5 17 -125 64 -85 76 125 33 202 186 142 -92 -135 61 -34 65 317 -160 1 -58 -154
8107a54Q9K67j47q7O9O3n6q3J73m4J62k30p8J87j27j14R5K41j54l7J12Q1k68K3
$$ -154 -65 202 55 -32 37 100 44 -39 134 90 252 22 -56 131 4 -110 -15 226 72 35 147 228 -40 -17
8131a7l6nL1N6r8P8Q2j94J52J39k99J94L4J06k21K13k18n5P6P3k33R8K60k09J31
$$ -17 -53 -58 -27 29 -69 9 91 -103 49 188 -111 83 117 223 2 215 -3 -58 18 91 -142 -44 216 7 138
8156A38j58J28k98K06l9K5J7N1j65j65K46K21m8j60l9o9N1J03j46J74M7k72J17
$$ 138 -20 108 -190 16 -23 2 19 70 -95 -260 -14 207 159 -1 -40 -109 -58 45 -101 73 120 -152 -35
8179c5J68j89p3J37J31j23k4l8J48k77J29j62
$$ -35 133 -56 -129 8 139 16 -8 -46 102 -175 -46 -208
8191b08
$$ Imaginary data points
##PAGE= N=2
##DATA TABLE= (X++(I..I)), XYDATA
0@%%%Qj6Q%J0k6K4j8L4m8M8n5P1q8J03j17J36j61J87k13K44k79L18l62M07m57
$$ 0 0 0 0 8 -8 0 0 10 -16 8 -10 24 -24 24 -31 40 -48 55 -62 74 -87 100 -113 131 -148 170 -192 215 -242
29b42N16n81O49p21Q02q96R97j102J217j351J500j657J827k020K243k489K762
$$ -242 274 -307 342 -379 423 -473 524 -578 639 -712 788 -869 958 -1062 1181 -1308 1454
46A454l077L445l874M374m975N722o668P892r551J1937j5609K1853l4329O7809
$$ 1454 -1623 1822 -2052 2322 -2653 3069 -3599 4293 -5258 6679 -8930 12923 -21406 46403
60D6403l02690p87950J240706O72795j288299m30341J291702K26710j168941o455
$$ 46403 -256287 -1044237 196469 869264 -419035 -849376 442326 669036 -499905 -506360
70e06360J051778j59765q70483K78965O69299l74281m71063L94098K61989l87566
$$ -506360 545418 385653 -484830 -205865 463434 89153 -381910 12188 274177 -113389
80a13389q1250L10498p4147j78482K23410M7783k91516J07457K95041k79828k61484
$$ -113389 -194639 115859 41712 -136770 86640 134423 -157093 -49636 245405 -34423 -295907
91b95907M10739J64463n20449m0979N85973r0872n90905K40901N61458l77335
$$ -295907 114832 279295 -241154 -282133 303840 212968 -377937 -137036 424422 47087
101D7087m93518N03371M00750o01654k81452O68064J37367p03311J8271O99930
$$ 47087 -446431 56940 457690 -143964 -425416 242648 380015 -323296 -305025 394905
111C94905j73850o57426L07233N63243m17308m30473M96334K79179n34372j26193
$$ 394905 221055 -436371 -129138 434105 16797 -413676 82658 361837 -172535 -298728
121b98728N25217j9921m78822J50923M05708k55027l10694L37093K08153l89932
$$ -298728 226489 206568 -272254 -121331 284377 29350 -281344 55749 263902 -126030
131a26030j00069M13260q022m00143J21452L65982k19661l08946K84364K16744
$$ -126030 -226099 187161 179139 -221004 -99552 266430 46769 -262177 22187 238931
141B38931l28439j16586L35729J5337l07061P9317K58926j44114j82522J89413
$$ 238931 -89508 -206094 129635 144972 -162089 -82772 176154 32040 -150482 38931
151C8931R9326k10464j4862K09600p0754j99324J36242J60827k00308j08023K55856
$$ 38931 138257 -72207 -87069 122531 51777 -147547 -11305 149522 -50786 -158809 97047
162I7047M6702k87029L3239L01998j11413k82019J92527K36021k67971j77012
$$ 97047 143749 -143280 -110041 191957 80544 -201475 -8948 227073 -40898 -217910
172b17910L13934R5395l44749j5933L47289o2751l31010J36172L06191j91530
$$ -217910 96024 191419 -153330 -169263 178026 115275 -215735 -79563 226628 35098
182C5098k64978K40507K21393k70657j65002K90099R8904l02280m0876K85438
$$ 35098 -229880 10627 232020 -38637 -203639 86460 185364 -116916 -157792 127646
192A27646k1581k51072P6165K02790j10020j38131J29922P6013j25674j8143J02747
$$ 127646 106065 -145007 -68842 133948 23928 -114203 15719 91732 -33942 -52085 50662
203E0662l2223p2252O6069L1916r3488N173J06171m1458j06954Q4845J04644j22235
$$ 50662 18439 -53813 12256 44172 -49316 -44143 62028 20570 -86384 -1539 103105 -19130
215a9130q9305J56716N9837j84865k1345J97894k9699j98925P9292J81364j23340
$$ -19130 -108435 48281 108118 -76747 -98092 99802 70103 -128822 -49530 131834 8494
226H494j49019J58978J10543j76419o7012J83957K7647j81156O213J70753l5921
$$ 8494 -140525 18453 128996 -47423 -114435 69522 97169 -83987 -77774 92979 57058
237E7058j55026O0890J31737q6283j06092J04914P3179j13509k9732J17229q388
$$ 57058 -97968 -37078 94659 8376 -97716 7198 80377 -33132 -62864 54365 45977
248D5977j02485M7125P8589p6791n0769Q9560J4904r5000J2627Q7391l5412p4118
$$ 45977 -56508 -9383 69206 -7585 -58354 31206 46110 -48890 -36263 51128 15716 -58402
260e8402N4485O3785o1535m6039P1213L0026p8189j3623P6284j2062p5569L3235
$$ -58402 -3917 59868 -1667 -47706 23507 53533 -24656 -38279 38005 25943 -49626 -16391
272a6391O1185n6381l6974P7502J3359q1094K0490Q2134m6690p4734O1803N6251
$$ -16391 44794 -11587 -48561 28941 42300 -38794 -18304 63830 17140 -57594 4209 60460
284F0460p7038m6389P8578L5441p6222k4999P5692J9472p0151q507O6434j182
$$ 60460 -16578 -62967 15611 51052 -25170 -50169 25523 44995 -25156 -33663 32771 31589
296C1589n7169J2123M0852k4796k3504K8729K073k3876K0569J7904l1828m837
$$ 31589 -25580 -13457 27395 2599 -20905 7824 9897 -13979 6590 24494 -7334 -12171
308a2171L6018j1241l9670J6201L1710k1890k6244K2966K3303k1450k0573K2930
$$ -12171 23847 12606 -27064 -10863 20847 -1043 -27287 -4321 18982 -2468 -23041 -111
320a11K0352k3646j3677K9413O738l0604N048K6212j9691k1013K8327P376l5374
$$ -111 20241 -3405 -17082 12331 19069 -11535 -6487 19725 34 -20979 7348 14724 -20650
333b0650K803L2790j2600l0136J5362K5641j0191j8431R925K2656k049k3539R
$$ -20650 -17847 14943 2343 -27793 -12431 13210 3019 -15412 -5487 17169 15120 -8419 -8410
346h410K2841m238k5152K876J7134n235r527M347L315M923N325r353k877J7131
$$ -8410 14431 10193 -14959 -12083 5051 -184 -9711 -5364 -2049 2874 8199 -1154 -4031 13100
360A3100q62k2048K478J5360j0478j3181R923P574m774r64K646M027M437m981
$$ 13100 12238 -9810 -7332 8028 -2450 -15631 -5708 1866 -2908 -3872 -1226 2801 7238 2257
374B257l885R344J111j2257J905O682r639m444R910l073o708J0476N089q540J14
$$ 2257 -1628 7716 8827 -3430 -1525 5157 -4482 -8926 984 -2089 -8797 1679 6768 -1772 -1658
389a658N128k034J28k144n217Q677Q814j5171o724J9940L547k0817K8J9337P27
$$ -1658 3470 1436 1564 -580 -5797 2880 11694 -3477 -10201 9739 13286 -7531 -7503 11834 12561
404A2561j3560m060Q205O802j1376j4539J2094J6972j4556j1529J9963R116j7460
$$ 12561 -999 -5059 3146 9948 -1428 -15967 -3873 13099 -1457 -12986 6977 16093 -1367
417a367j736J3412l143o747K445k529k200L048o052o659Q274M700o901J491R206
$$ -1367 -3103 10309 7166 419 2864 335 -1865 1183 -4869 -11528 -3254 1446 -5455 -3964 5242
432E242J886k750k828N4O576k380j3270L645J2136j2253j2135J6298N208j7405
$$ 5242 7128 4378 1550 1604 8180 5800 -7470 -3825 8311 -3942 -16077 221 5429 -11976
446a1976N491J7850j0576j0888J5943N414j7400j841J5074K99j3339k305J3194
$$ -11976 -6485 11365 789 -10099 5844 11258 -6142 -7983 7091 7390 -5949 -8254 4940
459D940L692j5885m411J9048K068k0228M392J8385j2004j2378J6175L212j7342
$$ 4940 8632 -7253 -11664 7384 9452 -10776 -6384 12001 -3 -12381 3794 7006 -10336
472a0336P157J4238j5041q981J7018J016j7692L075J6636l287j3370N689J5720
$$ -10336 -3179 11059 -3982 -12963 4055 5071 -12621 -9546 7090 3803 -9567 -3878 11842
485A1842n823j7673Q655J9963j5675k0759K2155J4746l0861p794L4233k659l1512
$$ 11842 6019 -11654 -2999 16964 1289 -19470 2685 17431 -13430 -21224 13009 10350 -21162
498b1162J5245K7556k1950j8560K6213J0381k7582m204K8210Q76k8207J946L0192
$$ -21162 -5917 21639 -311 -18871 7342 17723 -9859 -14063 14147 15023 -13184 -11238 18954
511A8954n806l1677J1867L1986j9063k7672K5527J6265l2981m798L1670j0129
$$ 18954 13148 -18529 -6662 25324 6261 -21411 4116 20381 -12600 -17398 14272 4143
523D143k4276K4738J6160l2078k567L5984r289l5624J9970L3611k7368l0613L3228
$$ 4143 -20133 4605 20765 -11313 -13880 22104 12815 -22809 -2839 30772 3404 -27209 6019
536F019K4832m2441k2215M9234J4654n6477j199O2475j3299o1671L0346N4238
$$ 6019 30851 -11590 -33805 15429 30083 -26394 -27593 34882 21583 -40088 -9742 44496
548D4496m5296l9827N6626K1516o0440k656N6554j6569m9950L0271M1286m0425
$$ 44496 -800 -40627 15999 37515 -22925 -25581 30973 14404 -35546 -5275 36011 -4414
560d414k9117M9936J9457n6361p131O0443q532o3387K3864N7992m3591m7990N9468
$$ -4414 -33531 16405 35862 -20499 -27630 32813 24281 -39106 -15242 42750 -841 -48831 10637
573A0637L0302o9575n480P4766j8728o7598M2711N4221o1785l6422P1174J3193
$$ 10637 40939 -28636 -34116 40650 21922 -45676 -2965 51256 -10529 -46951 24223 37416
585C7416p9108P098P8450k8768p3394N2048O8057p1436n3054R2247L3261j09705
$$ 37416 -41692 -34594 43856 15088 -58306 -6258 61799 -9637 -62691 29556 62817 -46888
597d6888q879J17993k2483j19089N4197J06909q3241q5318J06047N7858j16783
$$ -46888 -55767 62226 39743 -79346 -25149 81760 -1481 -86799 19248 77106 -39677
608c9677k3225J21053q534j15117L6312J00551o3459q3500Q3245O1772r8278l4729
$$ -39677 -62902 58151 49617 -65500 -29188 71363 7904 -75596 7649 69421 -28857 -63586
620f3586J09494M960j11063K8163J05172n9504q7148Q6920N8950j07469k7288
$$ -63586 45908 50868 -60195 -32032 73140 13636 -73512 13408 72358 -35111 -62399
631f2399J12891j0066j07063M4253R1686p0155o5803Q9688L6364r9679l779J02562
$$ -62399 50492 40426 -66637 -22384 69302 -853 -66656 23032 59396 -40283 -44062 58500
643E8500k7824r7440N8778Q3394r0404o4420J15406L6102j33707J571J44167m0803
$$ 58500 30676 -66764 -7986 75408 -14996 -79416 35990 72092 -61615 -60044 84123 43320
655D3320j39141Q2241J20644j18640q9957J45603N0884j60473r028J61382l4650
$$ 43320 -95821 -13580 107064 -11576 -101533 44070 94954 -65519 -74547 86835 52185
666E2185j53213P2726J35297j04670j07803J32411P6760j51811m0451J61716j028
$$ 52185 -101028 -28302 106995 2325 -105478 26933 103693 -48118 -88569 73147 72119
677G2119j63091M3097J50873q2690j27668J15807R3016j37998n0743J47771Q796
$$ 72119 -90972 -47875 102998 20308 -107360 8447 101463 -36535 -87278 60493 69289
688F9289j41172L1872J22959o6436r7503Q8973O3534j05601k9824J10516n937
$$ 69289 -71883 -40011 82948 16512 -80991 7982 71516 -34085 -63909 46607 40670
699D0670j07890M1909R7952p2607p6048J02282M8630j22098j1561J31666l1191
$$ 40670 -67220 -25311 72641 34 -76014 26268 74898 -47200 -58761 72905 41714
710D1714j30545P2275J13106j10330q5610J38355M9186j54809r004J60850k9694
$$ 41714 -88831 -16556 96550 -13780 -99390 38965 88151 -66658 -75662 85188 55494
721E5494j55298O6657J40829r9106j20681J25440R2255j47184n8775J61009K1755
$$ 55494 -99804 -33147 107682 8576 -112105 13335 105590 -41594 -100369 60640 82395
732H2395j63826K0295J56828n9344j35909R3392J04894j18700o7486J28865K5015
$$ 82395 -81431 -61136 95692 36348 -99561 -6169 98725 -19975 -87461 41404 66419
743F6419j29236J3119J16783m7958r5400P6323P0952r3950l9098J07511P963j10931
$$ 66419 -62817 -49698 67085 19127 -76273 50 71002 -22948 -62046 45465 53428 -57503
755e7503K4920J05761n8548r3294Q6975O8682j11302l7207J26431K4j28502L9613
$$ -57503 -32583 73178 14630 -78664 8311 76993 -34309 -71516 54915 54939 -73563 -33950
767c3950J19913p4047r8417J02290P0451j21839l9150J29582N529j29451K5856
$$ -33950 85963 11916 -86501 15789 86240 -35599 -74749 54833 60362 -69089 -43233
778d3233J22321n4212j06393Q1964Q6820j03849o0133J19331K7212j29709P367
$$ -43233 79088 24876 -81517 447 87267 -16582 -76715 42616 69828 -59881 -52514
789e2514J26149m3952j15358P4794R3341r8750o3275J14220L2466j16715L89J13402
$$ -52514 73635 29683 -85675 -10881 82460 -16290 -79565 34655 67121 -49594 -49205 64197
801F4197k6711j00876M9981Q3549o8762o4611Q0973M0466r0321j5376R0654j3147
$$ 64197 37486 -63390 -13409 70140 1378 -63233 17740 58206 -32115 -47491 43163 30016
813C0016q5119M0369P0688o4700m7564Q3126K1332r0750Q829Q9953l6123q0498
$$ 30016 -55103 -14734 55954 -8746 -56310 26816 48148 -42602 -33773 56180 20057 -60441
825f0441N7942O4393p3095m5105Q2004K4371q4665k992Q2206j8016p6368L7413
$$ -60441 -2499 61894 -11201 -56306 25698 50069 -34596 -37588 44618 26602 -49766 -12353
837a2353O3748n7438m8010P2309K4711q2973J099Q6111k6863p8974N2120O6877
$$ -12353 51395 -6043 -54053 18256 42967 -40006 -38907 47204 20341 -58633 -6513 60364
849F0364p0143m7506Q2052K6603q6970o555Q4473j2061p8446K7444O8955m0279
$$ 60364 -9779 -57285 24767 51370 -35600 -42155 42318 30257 -48189 -20745 48210 7931
861G931n6315N1693M2064n9650k3979O3159K622o3447J8375N6369l8419m3483
$$ 7931 -48384 3309 45373 -14277 -38256 24903 27525 -35922 -17547 38822 403 -43080
873d3080N3731K6563o1712p585O4792q872n9593K3583N1728l2758m1426L8443
$$ -43080 10651 37214 -24498 -32083 32709 23837 -35756 -12173 39555 6797 -34629 3814
885C814K8529m3004j7627M4418N012m4031R493M0912k4039l3457L7899K2257m8334
$$ 3814 32343 -10661 -28288 16130 21142 -22889 -13396 27516 3477 -29980 7919 30176 -18158
898a8158p685N3551r086n3266K3701M6952l5257l7524M2641K8309m3817j6580
$$ -18158 -25843 27708 18622 -34644 -10943 36009 752 -36772 5869 34178 -9639 -26219
910b6219M3191Q181m0560m87L5840p154l2002J4591K4109k2219j4184K8797K920
$$ -26219 16972 25153 -15407 -15894 19946 12792 -19210 -4619 19490 -2729 -16913 11884 14804
923A4804l2022J0544L1427k3467k6462L2411J7585l7892r209L8280R76l4524N287
$$ 14804 -17218 -6674 24753 1286 -25176 7235 24820 -13072 -22281 15999 16975 -17549 -12262
936a2262L0581q427k4680J2018J9711j4677j5907J6505R043k0566k260K2302o808
$$ -12262 18319 9892 -14788 -2770 16941 2264 -13643 2862 11905 -8661 -10921 11381 4573
949D573k1752J5972J8252k3208j1471K7744L882k7716L279K5986p650k1135R254
$$ 4573 -17179 -1207 17045 -6163 -17634 10110 13992 -13724 -10445 15541 7891 -13244 -3990
962c990J5899r263j3241P437J0132p609q491P419N082o943O41P695n403m023J2287
$$ -3990 11909 2646 -10595 -3158 6974 -635 -9126 -1707 3375 -3568 -2927 4768 -635 -4658 7629
977G629j43j7044O073J7144j3251j6545J6511J1831j7718p512J6934M849j3332
$$ 7629 7486 -9558 -3485 13659 408 -16137 374 12205 -5513 -13025 3909 8758 -4574
990d574k322J0876J424j0376k171R113Jr563L787J0072n836o386J0737L547j1843
$$ -4574 -6896 3980 5404 -4972 -7143 1970 1971 -7592 -3805 6267 431 -5955 4782 8329 -3514
1005c514N66R947n478p920N459K604n217K91K365j135K834K075l701Q90N123k635
$$ -3514 -2948 6999 1521 -6399 -940 1664 -3553 -3262 -897 -2032 802 2877 -824 66 5189 2554
1021B554n737J711L460j022m316j038O407M510q367l061J2511K248j3973J255
$$ 2554 -3183 -1472 1988 966 -3350 -4388 2019 6529 -1838 -4899 7612 9860 -4113 -2858
1035b858J2524n056j0595M787M827n001j981J876o48J161J576k354O69L420k73
$$ -2858 9666 4610 -5985 -1198 3629 -1372 -3353 -1477 -2125 -964 612 -1742 -1073 2347 2074
1050B074o34J719j174kK777k599l981K925P79l970k29J9j577L542J338o770L182
$$ 2074 1440 3159 1985 1983 4760 2161 -1820 1105 1884 -2086 -2315 -2296 -3873 -331 1007 -5763 -2581
1067b581J1489m998j1099R548J0067j2708q656J1089N421j0502n679Q243O600
$$ -2581 8908 3910 -7189 2359 12426 -282 -8938 2151 7572 -2930 -8609 -366 6234
1080F234o496p487P540Q899p395p912Q236M741q170k227M105j622l7K821m894
$$ 6234 -262 -7749 -209 8690 1295 -6617 1619 6360 -1810 -4037 68 -1554 -1591 1230 -3664
1095c664j271R856R1j1603L435J0636n233r767M591O784m061n732K469O029j644
$$ -3664 -4935 4921 5012 -6591 -3156 7480 2247 -7520 -2929 3855 -206 -5938 -3469 2560 916
1110I16n434L734N617n611l040Q980j563j1494O419J0026j2214q694J5126N213
$$ 916 -4518 -784 4833 -778 -3818 5162 3599 -7895 -1476 8550 -3664 -12358 2768 7981
1124G981j6145j005J6265O97j3077N90J2217M65j1997j972J1131N15j2868M44
$$ 7981 -8164 -9169 7096 7793 -5284 -4694 7523 7988 -4009 -5981 5150 5665 -7203 -6759
1138f759J1106l291p664O408L960n619L841N041q074j377J0915l657j3312M657
$$ -6759 4347 1056 -6608 -200 3760 -1859 1982 7023 -1051 -2428 8487 4830 -8482 -3825
1152c825J0871p768j0254P307R698n200p955N797R721m701q000O994N998r023
$$ -3825 7046 -722 -10976 -3669 6029 829 -7126 -1329 8392 3691 -4309 2685 8683 -340
1166c40j397Q324n551p896J0487K824j6079K101J7870p426j7051J2561J5698j3657
$$ -340 -1737 6587 1036 -6860 3627 6451 -9628 -7527 10343 2917 -14134 -1573 14125 468
1180D68j2043J5129J0859j4671q995J4598O215j5944m867J5627o84j5675O511
$$ 468 -11575 3554 14413 -258 -9253 5345 11560 -4384 -9251 6376 5692 -9983 -3472
1193c472J3565j2826o454J9157j096k1180R244K0324j9190j8060K3919J2233k7663
$$ -3472 10093 -2733 -9187 9970 8874 -12306 -3062 17262 -1928 -19988 3931 16164 -11499
1206a1499o556K9508L044k7478K440K7683o210k5708J0387K1403j7304j8684K1878
$$ -11499 -18055 11453 14497 -12981 -10541 17142 10932 -14776 -4389 17014 -290 -18974 2904
1219B904R946k6669j78K9612r142k5769K0673K1393k7340j4075K9974L539l1188
$$ 2904 12850 -13819 -13997 15615 6473 -19296 1377 22770 -4570 -18645 11329 14868 -16320
1232a6320K982K7317r984k1721J5608J7344j7911r687K1836K937k4050M789K4261
$$ -16320 -13338 13979 3995 -17726 -2118 15226 -2685 -12372 9464 12401 -11649 -6860 17401
1245A7401j5985k3981K5765J8307l5709j0186M3027L27m5055J1683M4148k0953
$$ 17401 1416 -22565 3200 21507 -14202 -24388 18639 18966 -26089 -14406 29742 8789
1257H789l8628K8220L0521l1902k1747L2142J2972l0678n144K7117l348k3220
$$ 8789 -29839 -1619 28902 -3000 -24747 7395 20367 -10311 -15455 11662 8314 -14906
1269a4906J1063J6814j8345q240K5827j025k8688J4719K9185k6906k4562L6077
$$ -14906 -3843 12971 -5374 -13614 12213 11188 -17500 -2781 26404 -502 -25064 11013
1281A1013J4976m4171m607M5514p957m3054J9692L8088k7157k9268L4708K0967
$$ 11013 25989 -18182 -22789 22725 14768 -28286 -8594 29494 2337 -26931 7777 28744
1293B8744l9726j1891M1954P35m4880R569M3583k1582l9282L4191L3170m2078
$$ 28744 -10982 -22873 19081 19816 -25064 -15495 28088 6506 -32776 1415 34585 -7493
1305g493k0936M8320P825m9697M243M3711j7585l6714K4468K5457k8946j2874
$$ -7493 -28429 19891 27716 -21981 -17738 25973 8388 -28326 -3858 21599 -7347 -20221
1317b0221L1469L511k9161Q566K7674j8324k3413K6965J6379l6839r722M2055
$$ -20221 11248 14759 -14402 -5836 21838 3514 -19899 7066 23445 -13394 -23116 18939
1329A8939k084m6254J4404M5525k5882l8248L7854K9401m3524j6118M6188K557
$$ 18939 16855 -29399 -14995 30530 4648 -33600 4254 33655 -9869 -25987 20201 22758
1341B2758m4832Q082L8904j9850l3247K6587K4956l3249j5533L8880O679m0258
$$ 22758 -22074 -13992 24912 5062 -28185 -1598 23358 -9891 -25424 13456 20135 -20123
1353b0123N648M1192j6889l7370K8065K8939l8596j8505M2788L952m3658J0342
$$ -20123 -14475 26717 9828 -27542 523 29462 -9134 -27639 15149 19101 -24557 -14215
1365a4215L9274k2260k9920L2153J9672l7708p646M0344l932m1068J4568L9335
$$ -14215 25059 2799 -27121 5032 24704 -13004 -20650 19694 15762 -25306 -10738 28597
1377B8597k5388l5684L5192K9839m3976k0280N0709Q855n3031M964N0918j8625
$$ 28597 3209 -32475 2717 32556 -11420 -31700 19009 27864 -25167 -20203 30715 12090
1389A2090m4545L0568L3453l8334j9995M1865O149m1530N688L7751j6495l2260
$$ 12090 -32455 -1887 31566 -6768 -26763 15102 21251 -20279 -14591 23160 6665 -25595
1401b5595K5008K5994l1641j7608L7277Q480m0784K243M1317j4145l8247K6306
$$ -25595 -587 25407 -6234 -23842 13435 21915 -18869 -16626 24691 10546 -27701 -1395
1413a395L1095l5094j9831M1606O851m3006N936L9147j9350l3752K6812K4382
$$ -1395 29700 -5394 -25225 16381 23232 -19774 -13838 25309 5959 -27793 -981 23401
1425B3401l4034j4921L8801O912l8402M259M0562j1621l7823K1688L2487l1842
$$ 23401 -10633 -25554 13247 20159 -18243 -13984 26578 14957 -22866 -1178 31309 -533
1437e33k6406L6422J3171m2254j628M1484j1402l5075K3946K8343l0952j6680
$$ -533 -26939 9483 22654 -19600 -21228 20256 8854 -26221 -2275 26068 -4884 -21564
1449b1564L5601N677l6724L520L4210j2731l1356J9709K6616k5997j9978L2335
$$ -21564 14037 19714 -17010 -13490 20720 7989 -23367 -3658 22958 -3039 -23017 9318
1461I318J2498l5758k404L7223r236l5989J9740K9110k9598k0122L5482R140l7794
$$ 9318 21816 -13942 -16346 20877 11641 -24348 -4608 24502 -5096 -25218 10264 19404 -18390
1474a8390K609L5641j2649l1185K0187K5478k5121j8297K9657J2354l0603m517
$$ -18390 -15781 19860 7211 -23974 -3787 21691 -3430 -21727 7930 20284 -10319 -14836
1486a4836L2025l150l1757J0383K7340j9998k2430K6365J2750l1019j444L2498
$$ -14836 17189 14039 -17718 -7335 20005 7 -22423 3942 16692 -14327 -15771 16727
1498A6727q734k8953J9196K3459k5605j6359K9615Q393l1469j442L0654m542k9075
$$ 16727 7993 -20960 -1764 21695 -3910 -20269 9346 17739 -13730 -15172 15482 10940 -18135
$$ [...]
8191i
##END NTUPLES=NMR FID
##END=
