##TITLE=1H_CA-8649
 CDCl3, 8 sc, 
 20.9.2019
##JCAMPDX= 6.0         $$ Bruker NMR JCAMP-DX V2.0
##DATA TYPE= NMR FID
##DATA CLASS= NTUPLES
##ORIGIN= UXNMR, Bruker Analytische Messtechnik GmbH
##OWNER= root
$$ XWIN-NMR		Version 3.5
$$ Fri Sep 20 15:14:32 2019 Russian Standard Time (UT+4h)  she@DPX200
##.OBSERVE FREQUENCY= 200.1315
##.OBSERVE NUCLEUS= ^1H
##.DELAY= (6, 6)
##.ACQUISITION MODE= SIMULTANEOUS
##.ACQUISITION SCHEME= undefined
##.AVERAGES= 8
##.DIGITISER RES= 18
##SPECTROMETER/DATA SYSTEM= spect
##.PULSE SEQUENCE= zg30
##.SOLVENT NAME= CDCl3
##.SHIFT REFERENCE= (INTERNAL, CDCl3, 0, 15.7039)
##AUDIT TRAIL= $$ (NUMBER, WHEN, WHO, WHERE, WHAT)
$$ ##TITLE= Audit trail, XWIN-NMR		Version 3.5
$$ ##JCAMPDX= 5.01
$$ ##ORIGIN= Bruker BioSpin GmbH
$$ ##OWNER= she
$$ F:/spectra/data/she/nmr/H-F/1/audita.txt
$$ ##AUDIT TRAIL=  $$ (NUMBER, WHEN, WHO, WHERE, WHAT)
(   1,<2019-09-20 15:13:12.03 +0400>,<she>,<DPX200>,
      <created by zg, POWCHK disabled, PULCHK disabled
       configuration hash MD5:
       00 E9 B6 7A A2 85 ED C7 34 08 36 98 17 FE 4E 26
       data hash MD5: 16K
       86 E2 1C 7E A5 AB A3 AD AF AD CD 0A 6E CB B7 E7>)
$$ ##END=
$$ 
$$ hash MD5
$$ A9 C7 3F 0F 77 4F 73 64 C0 AD B7 61 5E 76 A3 EB
##$RELAX= 
##$RELAX= 
##$RELAX= 
##$RELAX= 
##$RELAX= 
##$RELAX= 
$$ Bruker specific parameters
$$ --------------------------
##$DU= <F:/spectra>
##$EXPNO= 1
##$NAME= <H-F>
##$PROCNO= 1
##$TYPE= <nmr>
##$USER= <she>
##$AMP= (0..31)
100 100 100 100 100 100 100 100 100 100 100 100 100 100 100 100 100 100 
100 100 100 100 100 100 100 100 100 100 100 100 100 100 
##$AQSEQ= 0
##$AQ_mod= 1
##$AUNM= <au_zg>
##$AUTOPOS= <>
##$BF1= 200.13
##$BF2= 200.13
##$BF3= 200.13
##$BF4= 200.13
##$BF5= 200.13
##$BF6= 200.13
##$BF7= 200.13
##$BF8= 200.13
##$BYTORDA= 1
##$CFDGTYP= 0
##$CFRGTYP= 5
##$CHEMSTR= <none>
##$CNST= (0..31)
1 1 145 1 1 1 1 1 1 1 1 1 1 1 1 1 1 1 1 1 1 1 1 1 1 1 1 1 1 1 1 1 
##$CPDPRG= <>
##$CPDPRG1= <>
##$CPDPRG2= <>
##$CPDPRG3= <>
##$CPDPRG4= <mlev>
##$CPDPRG5= <mlev>
##$CPDPRG6= <mlev>
##$CPDPRG7= <mlev>
##$CPDPRG8= <mlev>
##$CPDPRGB= <>
##$CPDPRGT= <>
##$D= (0..31)
0 1.2 0 0 0 0 0 0 0 0.06 0 0.03 0 0 0 0 0.0002 0 0 0 0 0 0 0 0 0 0 0 0 
0 0 0 
##$DATE= 1568977991
##$DBL= (0..7)
120 120 120 120 120 120 120 120 
##$DBP= (0..7)
150 150 150 150 150 150 150 150 
##$DBP07= 0
##$DBPNAM0= <>
##$DBPNAM1= <>
##$DBPNAM2= <>
##$DBPNAM3= <>
##$DBPNAM4= <>
##$DBPNAM5= <>
##$DBPNAM6= <>
##$DBPNAM7= <>
##$DBPOAL= (0..7)
0.5 0.5 0.5 0.5 0.5 0.5 0.5 0.5 
##$DBPOFFS= (0..7)
0 0 0 0 0 0 0 0 
##$DE= 6
##$DECBNUC= <off>
##$DECIM= 24
##$DECNUC= <off>
##$DECSTAT= 4
##$DIGMOD= 1
##$DIGTYP= 9
##$DL= (0..7)
0 120 120 120 120 120 120 120 
##$DP= (0..7)
150 150 150 150 150 150 150 150 
##$DP07= 0
##$DPNAME0= <>
##$DPNAME1= <>
##$DPNAME2= <>
##$DPNAME3= <>
##$DPNAME4= <>
##$DPNAME5= <>
##$DPNAME6= <>
##$DPNAME7= <>
##$DPOAL= (0..7)
0.5 0.5 0.5 0.5 0.5 0.5 0.5 0.5 
##$DPOFFS= (0..7)
0 0 0 0 0 0 0 0 
##$DQDMODE= 0
##$DR= 18
##$DS= 0
##$DSLIST= <SSSSSSSSSSSSSSS>
$$ [...]
##$SUBNAM2= <"">
##$SUBNAM3= <"">
##$SUBNAM4= <"">
##$SUBNAM5= <"">
##$SUBNAM6= <"">
##$SUBNAM7= <"">
##$SUBNAM8= <"">
##$SUBNAM9= <"">
##$SW= 24.0689530833862
##$SWIBOX= (0..15)
0 0 2 0 0 0 0 0 0 0 0 0 0 0 0 0 
##$SW_h= 4816.95568400771
##$TD= 16384
##$TD0= 1
##$TE= 0
##$TE2= 300
##$TE3= 300
##$TEG= 300
##$TL= (0..7)
0 120 120 120 120 120 120 120 
##$TP= (0..7)
150 150 150 150 150 150 150 150 
##$TP07= 0
##$TPNAME0= <>
##$TPNAME1= <>
##$TPNAME2= <>
##$TPNAME3= <>
##$TPNAME4= <>
##$TPNAME5= <>
##$TPNAME6= <>
##$TPNAME7= <>
##$TPOAL= (0..7)
0.5 0.5 0.5 0.5 0.5 0.5 0.5 0.5 
##$TPOFFS= (0..7)
0 0 0 0 0 0 0 0 
##$TUNHIN= 0
##$TUNHOUT= 0
##$TUNXOUT= 0
##$USERA1= <user>
##$USERA2= <user>
##$USERA3= <user>
##$USERA4= <user>
##$USERA5= <user>
##$V9= 5
##$VALIST= <valist>
##$VCLIST= <CCCCCCCCCCCCCCC>
##$VD= 0
##$VDLIST= <DDDDDDDDDDDDDDD>
##$VPLIST= <PPPPPPPPPPPPPPP>
##$VTLIST= <TTTTTTTTTTTTTTT>
##$WBST= 1024
##$WBSW= 4
##$XGAIN= (0..3)
0 0 0 0 
##$XL= 0
##$YL= 0
##$YMAX_a= 720643
##$YMIN_a= -804675
##$ZGOPTNS= <>
##$ZL1= 120
##$ZL2= 120
##$ZL3= 120
##$ZL4= 120
##$ABSF1= 10
##$ABSF2= 0
##$ABSG= 5
##$ABSL= 3
##$ALPHA= 0
##$AQORDER= 0
##$ASSFAC= 0
##$ASSFACI= 0
##$ASSFACX= 0
##$ASSWID= 0
##$AUNMP= <proc_1d>
##$AZFE= 0.1
##$AZFW= 0.1
##$BCFW= 1
##$BC_mod= 2
##$BYTORDP= 1
##$COROFFS= 0
##$CY= 11.3945322036743
##$DATMOD= 1
##$DC= 2
##$DFILT= <>
##$DTYPP= 0
##$F1P= 20.1720416913024
##$F2P= 0.152960286110954
##$FCOR= 0.5
##$FTSIZE= 0
##$FT_mod= 4
##$GAMMA= 1
##$GB= 0.15
##$INTBC= 1
##$INTSCL= 1
##$ISEN= 128
##$LB= 0.24
##$LEV0= 0
##$LPBIN= 0
##$MAXI= 10000
##$MC2= 0
##$MEAN= 0
##$ME_mod= 0
##$MI= 1.114404
##$NCOEF= 0
##$NC_proc= 0
##$NLEV= 6
##$NOISF1= 3.799351
##$NOISF2= 2.8
##$NSP= 1
##$NTH_PI= 0
##$NZP= 0
##$OFFSET= 15.70392
##$PC= 1
##$PHC0= -9580.525
##$PHC1= 24.40096
##$PH_mod= 1
##$PKNL= yes
##$PPARMOD= 0
##$PSCAL= 0
##$PSIGN= 0
##$REVERSE= no
##$SF= 200.130013532006
##$SI= 16384
##$SIGF1= 3
##$SIGF2= 2
##$SINO= 400
##$SIOLD= 16384
##$SREGLST= <1H.CDCl3>
##$SSB= 0
##$STSI= 0
##$STSR= 0
##$SW_p= 3612.71676300578
##$SYMM= 0
##$S_DEV= 0
##$TDeff= 0
##$TDoff= 0
##$TI= <>
##$TILT= no
##$TM1= 0
##$TM2= 0
##$TOPLEV= 0
##$USERP1= <user>
##$USERP2= <user>
##$USERP3= <user>
##$USERP4= <user>
##$USERP5= <user>
##$WDW= 1
##$XDIM= 8192
##$YMAX_p= 0
##$YMIN_p= 0
$$ End of Bruker specific parameters
$$ ---------------------------------
##NTUPLES= NMR FID
##VAR_NAME=  TIME,          FID/REAL,        FID/IMAG
##SYMBOL=    X,             R,               I
##VAR_TYPE=  INDEPENDENT,   DEPENDENT,       DEPENDENT
##VAR_FORM=  AFFN,          ASDF,            ASDF
##VAR_DIM=   8192,          8192,            8192
##UNITS=     SECONDS,       ARBITRARY UNITS, ARBITRARY UNITS
##FACTOR=    0.0002076,     1,               1
##FIRST=     0,             0,               0
##LAST=      1.7004516,     0,               0
##MIN=       0,             -804675,         0
##MAX=       1.7004516,     720643,          0
$$ Real data points
##PAGE= N=1
##DATA TABLE= (X++(R..R)), XYDATA
0 0 0 0 0 -8 8 -16 8 -16 32 -33 40 -48 65 -81 97 -116 145 -172 201 -236 279 -327 377 -435 501 -574 655
27 655 -745 844 -956 1075 -1210 1358 -1517 1693 -1889 2104 -2335 2591 -2873 3184 -3524 3897
43 3897 -4317 4785 -5304 5889 -6557 7324 -8212 9253 -10501 12026 -13937 16408 -19754
56 -19754 24561 -32076 45535 -76900 290812 -180617 -804675 373288 669501 -363361
66 -363361 -631530 430046 518043 -408913 -447776 419474 345773 -375059 -274355 348903
76 348903 188570 -285129 -129490 231289 70131 -152845 -40782 84688 21328 -11483
86 -11483 -31619 -42115 50427 82218 -87359 -98108 120332 94943 -157121 -74281 179723
97 179723 38920 -199448 3205 203528 -57047 -203957 112022 186367 -176640 -161640
107 -161640 235892 114335 -296502 -58921 339349 -16651 -372088 91585 377767 -173796
117 -173796 -370841 241618 340114 -304635 -303648 347006 252842 -381357 -204151 396403 147026
128 147026 -403929 -94243 392340 37189 -370443 10348 329005 -52564 -278744 77101
138 77101 216425 -87293 -155242 77171 96435 -54030 -49095 19339 13547 19386 9658 -58790
150 -58790 -21597 97812 25615 -132534 -19535 165978 6679 -191882 18311 212366
160 212366 -47906 -217490 86592 212299 -121221 -187084 155533 153781 -174391 -106027 186242
171 186242 60399 -180101 -9350 169758 -31780 -145263 74576 121194 -106607 -85687
181 -85687 139905 51249 -160268 -5858 177745 -36835 -177672 84946 170378 -122652
191 -122652 -145875 156036 117926 -172213 -81564 180079 50343 -173108 -19379 161934
201 161934 -3531 -142122 23892 121491 -38150 -95946 50092 68146 -55528 -36998 53511
212 53511 5308 -43376 22955 23514 -45665 955 56588 -29918 -59088 54266 49550 -76000
224 -76000 -36974 87299 17706 -96166 -1787 95876 -18417 -96806 33758 88981 -55434
235 -55434 -82150 71746 63927 -91375 -45019 100839 15412 -108190 10243 101116 -39730
246 -39730 -91749 58466 71178 -75653 -54210 81182 32968 -86288 -18463 83655 704
257 704 -83696 11845 77188 -28321 -71115 40813 57230 -52917 -41830 57936 21963 -57916
269 -57916 -3621 49808 -11883 -37427 21048 23205 -24327 -9636 23905 -573 -20180 9486
281 9486 17444 -15013 -12947 22890 9937 -28011 -1845 35992 -5663 -37705 19619 39043 -29393
294 -29393 -30861 41647 23265 -45144 -8913 47960 783 -41794 9642 38833 -11503 -30840
306 -30840 15831 29614 -15093 -24506 20025 24022 -21016 -17079 26193 12256 -24855 -1712 24419
319 24419 -3996 -16037 10717 9270 -9653 205 8103 -4240 -2054 7356 -1720 -6108 4934
332 4934 5230 -4952 -4537 4939 5896 -5364 -8639 7518 10180 -12628 -10860 17013 6751 -22080
346 -22080 -2497 21505 -4759 -20921 7647 15087 -10802 -12143 7825 7457 -7302 -9448 3118
359 3118 8716 -5212 -13141 5097 11038 -10538 -11274 10288 5118 -12582 -3542 7380 -1146 -5638
373 -5638 -1252 -505 1849 -765 -7513 -205 7630 -5075 -9488 6417 4799 -9557 -2537 6546 -1775
388 -1775 -4846 1150 170 -629 937 -3059 -1017 4797 -1940 -5374 4817 3216 -6200 717 5386
403 5386 -3594 -1647 5488 -1613 -3406 5656 1020 -5416 3637 4868 -4092 -501 5252 1 -1351
418 -1351 2178 1055 1765 2090 -2580 1706 7138 -2876 -5038 9357 4729 -9868 2024 12238
432 12238 -4074 -7663 9388 6418 -7639 -1109 8743 1577 -5146 94 6939 3059 -6867 -1511
446 -1511 11539 894 -13281 4682 15491 -9386 -12591 15755 8718 -18039 -2361 18524 -2750
459 -2750 -15655 6241 12591 -7327 -10267 7127 8789 -7625 -9214 8314 8317 -11741 -7209 13633
473 13633 1906 -16256 2722 13087 -9831 -10065 12230 1377 -14330 3888 9614 -11273 -6435
486 -6435 12002 -1409 -14563 4259 11445 -10413 -12554 11847 9831 -17916 -11252 21621 6729
499 6729 -30615 -3623 35942 -7368 -42853 17204 42331 -32032 -40748 42408 32090 -53188
511 -53188 -24266 57851 13172 -62140 -5172 62520 -4307 -63818 11924 63073 -21546 -61420
523 -61420 31251 56685 -41089 -48023 48891 36259 -52517 -21564 52314 8585 -45597 3644
535 3644 36738 -10150 -24748 14764 15513 -13970 -4738 14219 -1846 -10356 11014 8476 -16480
548 -16480 -1320 25191 -5364 -28143 18489 30881 -29884 -24029 44572 15828 -52341 1015
560 1015 59233 -16028 -56655 35247 53109 -48795 -42202 64105 32654 -73723 -18161 85098
572 85098 4550 -91873 14557 98486 -33547 -98805 56796 95378 -77351 -84181 96752
583 96752 68646 -109845 -48966 117225 28870 -117873 -10226 113101 -5738 -105069 17729
594 17729 93903 -27608 -82075 33405 67149 -37619 -51872 35698 33433 -30917 -17713 17623
606 17623 2077 -2046 5397 -20257 -9084 39752 2167 -60285 6731 72701 -23241 -83515
618 -83515 37868 85495 -57040 -85898 72108 78829 -90490 -70495 104402 53355 -120044
629 -120044 -33870 128415 5732 -133752 23002 128242 -55545 -117097 83193 96121
639 96121 -108368 -72007 125294 43404 -137110 -16179 141982 -11591 -142709 37108
649 37108 138073 -61088 -128950 82120 114953 -98732 -95767 109781 73881 -111648 -49895
660 -49895 106450 29706 -90994 -12391 72102 4514 -47745 -1106 25539 7075 -2498 -15473
672 -15473 -15006 30402 32243 -45275 -42344 66478 51688 -86372 -51413 111149 47711 -131088
684 -131088 -33089 151168 14447 -161236 12484 166289 -38530 -159084 66841 147127
694 147127 -88606 -125861 108666 102917 -120768 -74785 130201 47303 -132484 -16559 131147
705 131147 -12573 -121930 42437 107264 -67352 -84946 86873 58728 -98459 -30053 100943
716 100943 2564 -95597 20844 82795 -39349 -66821 50445 47273 -57395 -28418 57300
727 57300 7607 -53871 10767 42861 -29808 -28725 43395 6137 -54494 17408 55401 -46102
739 -46102 -51686 70090 36653 -93258 -19104 107164 -5703 -117368 27868 117641 -52872
750 -52872 -115130 72677 104637 -93006 -92860 107522 73534 -120646 -53289 125637 26991
761 26991 -126756 -1968 117659 -23821 -102715 43425 80309 -58323 -55828 64731 29189
772 29189 -65271 -5019 58985 -16968 -49223 34964 36052 -49304 -20225 60179 2336 -65852
784 -65852 18201 66975 -37818 -60114 57707 48271 -71992 -29141 82311 8672 -83064
795 -83064 14489 79615 -33241 -67789 51342 54980 -62363 -36691 72422 20138 -75990
806 -75990 412 78727 -17940 -73811 38825 67016 -54899 -51909 70301 35640 -77299
817 -77299 -13220 80599 -6292 -73945 26660 64542 -40136 -48592 50957 33309 -55266 -15905
829 -15905 57235 190 -54217 16050 49273 -30474 -39612 43936 27046 -53901 -10791 59733
841 59733 -7740 -59564 25883 53284 -42364 -42511 53802 27398 -61019 -12646 62349 -3662
853 -3662 -61163 16305 55188 -29430 -49103 38646 38586 -48767 -28320 54010 13217 -58850 872
866 872 56465 -18128 -51870 30663 39917 -42604 -28546 46990 12708 -49901 -778 45954 -11783
879 -11783 -42384 19721 34715 -28427 -28801 33007 19264 -38603 -10855 39925 -909 -39938
891 -39938 11089 34503 -22033 -27155 28577 16005 -32327 -4692 31024 -5990 -27115 14158
903 14158 20471 -19910 -12921 23362 6164 -25040 1524 25951 -8480 -24819 17035 23535 -24300
916 -24300 -17657 32596 11264 -36842 -512 39898 -9075 -37456 19731 33723 -25889 -25434 32053
929 32053 19248 -32356 -10949 34535 6303 -32617 1031 33207 -5433 -30097 13135 28670
941 28670 -17740 -22083 24373 16495 -26202 -7404 27652 707 -24080 6619 20667 -9279
953 -9279 -14774 11116 11726 -10234 -8116 9793 6884 -8481 -5355 8135 3892 -6695 -1788 4701
967 4701 -532 -960 1046 -3818 -142 8360 -3589 -12808 8128 14182 -14631 -14765 18484 11735 -22964
982 -22964 -10194 23877 6753 -25725 -6381 25381 4337 -27920 -4137 28247 647 -30963
994 -30963 1536 29547 -7011 -29153 9314 24474 -12889 -21077 11995 15833 -12093 -13813 8660
1007 8660 11098 -7979 -11694 6373 10310 -7543 -10444 7148 7495 -8416 -5732 6762 2791 -5200
1021 -5200 -2067 2507 1981 -1252 -3691 1072 5201 -2754 -5779 5098 4861 -7358 -2439 8884 154
1036 154 -8557 2564 8409 -2903 -7048 3873 7855 -2649 -8216 3769 11274 -4058 -11964 7784
1050 7784 14037 -9727 -12134 13525 11507 -13367 -7972 14362 7463 -11662 -5935 11499 7820
1063 7820 -9744 -7660 11552 9420 -11479 -7930 13854 7547 -12505 -4686 12431 4388 -9280
1076 -9280 -3359 7823 5415 -6043 -6574 6897 8902 -7544 -8784 9828 8556 -11100 -6340 11474
1090 11474 4743 -10949 -3555 9843 3169 -9558 -4140 9735 3734 -11871 -3839 13362 1142
1103 1142 -15083 1519 14311 -5838 -13597 7439 9936 -9217 -8155 8093 5420 -8052 -5461
1116 -5461 6243 4332 -7125 -5788 6757 3568 -8678 -3266 7282 -115 -7029 885 3239 -2742
1130 -2742 -1250 302 -2548 1281 2908 -5080 -3177 7071 602 -9390 827 8846 -3279 -9191
1144 -9191 3851 8226 -5081 -8897 5903 9247 -8468 -9793 11613 8787 -15790 -6166 19644
1157 19644 1907 -21927 4218 22659 -9299 -20868 14628 18871 -17223 -15200 20340 13236
1169 13236 -20898 -10231 23622 9048 -24321 -5411 27017 2822 -26733 2636 26447 -5963
1181 -5963 -22245 10304 18597 -10297 -11864 10415 8312 -5888 -3878 3003 3293 2398 -1763 -4713
1195 -4713 2952 8930 -2069 -11268 3587 15925 -4087 -19345 7438 24294 -11290 -26558 18216
1208 18216 27453 -24533 -24748 31257 20002 -35887 -13249 38142 5871 -38241 1311 36430
1220 36430 -8201 -34060 13761 30323 -19879 -26553 25429 20587 -31618 -13818 35330 3944
1232 3944 -38356 5391 36758 -15787 -33994 22814 27098 -29028 -21207 30554 13407 -31413
1244 -31413 -8982 28577 3201 -27250 -649 22813 -3359 -19546 4489 12650 -6921 -6765
1256 -6765 4846 -2034 -2318 8934 -4930 -15976 12954 18554 -23803 -19511 33035 16104 -42137
1269 -42137 -11515 47918 4817 -52793 1776 55278 -9416 -56856 16901 56458 -25430 -54007
1281 -54007 34105 48735 -42243 -40016 49021 29202 -51854 -15729 52012 3539 -47358 8623
1293 8623 40508 -17186 -30813 24408 22211 -27548 -11707 30948 2990 -30518 7480 30258
1305 30258 -15704 -25481 25293 20368 -30917 -10600 35379 1152 -34494 10222 31437 -17980
1317 -17980 -23199 25365 14659 -27640 -3587 28719 -5111 -25827 15221 22760 -22766 -16725
1329 -16725 31164 10155 -37244 -730 42773 -9651 -44709 22006 43830 -33772 -38511 44482
1341 44482 30057 -51816 -19278 55473 7827 -55392 2767 52268 -12909 -47050 20605 39511
1353 39511 -27735 -31663 32161 20817 -35892 -10215 35842 -3149 -33818 14951 26387 -26891
1365 -26891 -17289 33833 3936 -38929 8202 37926 -21413 -35477 31023 28174 -39873 -21579
1377 -21579 44646 12184 -49069 -3933 49764 -6916 -49865 16293 45005 -27134 -38556 34828
1389 34828 27690 -41555 -15876 42784 2002 -41284 9826 34823 -20633 -26934 27860 17118
1401 17118 -32452 -6788 34487 -3054 -34604 12689 32444 -22358 -28173 31267 21630 -38203
1413 -38203 -11821 43244 877 -43884 11653 41284 -22379 -33873 31979 24994 -37370 -13250
1425 -13250 40383 2753 -39055 8568 37459 -17326 -31737 26994 26438 -33731 -17086 40867
1437 40867 7754 -43686 4810 45234 -16321 -41087 28759 35178 -36932 -25087 43741 14886
1449 14886 -44882 -3087 44677 -5638 -40339 14628 35700 -20662 -28977 26258 21857 -29709
1461 -29709 -13083 31755 3712 -30929 6571 27426 -15785 -20651 23063 11374 -27429 -1102
1473 -1102 28001 -8941 -26025 17624 20966 -24754 -15724 28875 8629 -32508 -2373 33052
1485 33052 -5543 -33980 12061 31249 -20446 -27781 26236 20090 -32448 -12251 33657 1230
1497 1230 -33798 7852 28743 -17378 -23108 23012 14361 -27999 -6788 29177 -2136 -30407
1509 -30407 9219 28719 -17733 -27531 24376 23121 -32106 -17887 36901 9813 -40631 -1852
1521 -1852 40548 -7314 -37996 13965 32482 -19364 -26038 21747 19105 -22120 -12566 20967 7110
1534 7110 -18520 -2193 15817 -2183 -11772 6892 7510 -9802 -891 12058 -5753 -11203 13090
1547 13090 8863 -18343 -3439 22892 -1582 -23501 8418 23349 -12851 -19920 17219 17295 -19127
1560 -19127 -12705 21741 9662 -22272 -4183 23728 -48 -22912 7169 21798 -12784 -17127
1572 -17127 18975 12333 -22423 -4667 24885 -1448 -23649 8541 22304 -12652 -19175 16702
1584 16702 16587 -18588 -13736 20660 11449 -21692 -8504 22601 5213 -22505 -1306 21180 -2026
1597 -2026 -17923 4694 13220 -5299 -8541 3543 4023 -1197 -1440 -2933 -578 5673 364 -9322
1611 -9322 -925 10709 18 -13236 -457 14692 -509 -17808 681 19197 -3876 -21860
1623 -21860 6076 21306 -10867 -20776 13092 16744 -16274 -13669 16045 9004 -16148 -6507 14145
1636 14145 3309 -13313 -1927 11381 -877 -11149 2227 9102 -5689 -7780 7959 4616
1648 4616 -9869 -1259 10191 -2728 -9479 5228 7343 -6928 -5235 6798 3756 -5937 -2921
1661 -2921 5007 3063 -3977 -3096 3996 3360 -3506 -2713 3292 2449 -1569 -1417 -172 2328 3227 -3063
1677 -3063 -4439 6238 6387 -8276 -5177 11562 4863 -11962 -2314 13319 1838 -12119 -235
1690 -235 12536 986 -11725 84 13014 168 -12629 1982 13611 -3233 -11937 5676
1702 5676 10197 -6049 -7501 6565 5280 -4928 -3176 3620 2710 -1952 -2506 1187 3090 -951 -3112
1717 -3112 1374 2637 -1692 -1993 822 952 -85 -849 -1344 1603 1883 -3235 -2066 4628 458 -6055
1733 -6055 1079 5641 -3846 -5368 4544 3465 -6125 -2596 5193 1139 -5838 -1439 5257 859 -6755
1748 -6755 -1292 6995 -723 -8735 1411 8117 -4340 -8229 5528 5718 -7284 -4260 6647 1429
1762 1429 -6220 -1406 4333 516 -3806 -1433 3217 1209 -3909 -1448 3821 294 -4087 -17 2746
1777 2746 -683 -1799 229 226 1385 300 -3149 457 5197 -1886 -6212 4267 6717 -6256 -5697
1792 -5697 8042 5091 -8589 -3662 9509 3855 -9620 -2924 11235 3251 -12176 -1342 14248
1805 14248 118 -14435 3272 15198 -5320 -12915 8567 11609 -8879 -7915 9540 6222 -8106
1818 -8106 -3813 7851 3452 -6224 -1774 6311 1436 -5216 441 4887 -1601 -2660 3425 1129 -3221
1833 -3221 2061 2762 -4061 -428 5433 -1829 -4974 4635 3732 -6064 -1382 6536 -645 -6538 2472
1848 2472 5926 -4331 -5727 5645 5114 -8329 -4995 10518 3134 -13785 -1103 15655 -3288
1861 -3288 -18002 6921 17193 -11957 -16350 15042 13073 -18082 -10650 18653 7377 -19815 -5408
1874 -5408 18886 2417 -19784 -919 18461 -2608 -18180 4636 15393 -7991 -12764 9127
1886 9127 8114 -9913 -4199 8274 -228 -6095 2473 2349 -4326 599 3975 -3900 -3815 5946 2458
1901 2458 -7740 -1560 9743 257 -11476 1769 12962 -4915 -13464 8734 12960 -12578 -10227
1914 -10227 16354 6427 -18312 -1158 19277 -3461 -17655 8202 16124 -11544 -12816 14932
1926 14932 10563 -16482 -6634 19136 3905 -19869 795 21283 -4820 -20065 10428 18698
1938 18698 -13842 -14192 17761 9939 -18375 -3902 18434 -394 -15967 4645 13625 -6903 -9606
1951 -9606 9346 6595 -10226 -2774 11367 -698 -11162 5706 10486 -9697 -7854 14275 4238
1964 4238 -16902 905 18266 -6441 -17385 11969 14597 -16026 -11022 18804 6427 -20327
1976 -20327 -2241 20255 -2216 -20208 5853 18481 -10318 -16753 13793 13060 -17648 -9056 19620
1989 19620 2817 -20882 2934 18706 -9355 -16196 13514 10430 -17025 -5625 17656 -625
2001 -625 -18005 4801 15952 -9925 -14415 13198 11140 -17419 -8230 19651 2859 -22337 1923
2014 1923 22008 -8551 -21161 13680 17315 -18799 -12547 21038 6434 -22049 -828 20660
2026 20660 -4578 -18579 8634 15554 -12100 -11617 14787 7632 -16998 -2682 18232 -2448 -17939
2039 -17939 8620 16665 -14120 -12647 19034 7939 -21446 -1263 22581 -4062 -20778 9874
2051 9874 18424 -13059 -14074 16532 10620 -17394 -5552 18622 1636 -17663 3924 17108 -8098
2064 -8098 -13884 13540 10072 -16655 -3708 19564 -2340 -19044 9539 17650 -14506 -13182 19284
2077 19284 9367 -21333 -3873 22864 -319 -22596 4970 21961 -9057 -19997 13338 17389
2089 17389 -16787 -12958 19805 7976 -21064 -1503 20620 -4883 -18069 10252 13577 -14642
2101 -14642 -8729 16867 3171 -17998 1745 17478 -6502 -16605 10300 14575 -14435 -12597
2113 -12597 17203 8826 -20280 -5384 20950 -260 -21225 4595 18374 -9658 -15163 11921
2125 11921 9353 -14067 -4541 12909 -980 -11552 4548 8195 -8575 -5334 10433 1210 -13184
2138 -13184 2145 13994 -7183 -14952 11638 13570 -16793 -11509 20861 7128 -24139 -2447
2150 -2447 24956 -3125 -24407 8081 22027 -11965 -18809 14970 15101 -16585 -11292 17636 7425
2163 7425 -17965 -3523 18067 -748 -16790 5414 14952 -9126 -11019 12509 7136 -13505 -1597
2176 -1597 13586 -2425 -11421 6339 8983 -7871 -5437 9519 3163 -9065 -139 9207 -1751
2189 -1751 -7761 4981 7074 -7026 -4375 9708 1951 -10794 2647 11819 -6949 -9930 11393
2202 11393 7737 -14085 -3514 16421 118 -16615 4170 16342 -6931 -15012 9956 13847
2214 13847 -11926 -12042 14337 9913 -16468 -7032 17705 3390 -18271 519 17395 -4546 -15469
2227 -15469 7319 12103 -9474 -8956 9888 5215 -9767 -2719 8155 238 -7397 656 5725 -2630
2241 -2630 -4837 3114 2513 -4776 -942 4615 -2250 -4779 4389 2549 -7301 -614 7712 -3062 -8338
2256 -8338 5416 6626 -8472 -5223 9148 2792 -10641 -1675 10544 -669 -10959 1962 10888
2269 10888 -4005 -11280 6004 10099 -8833 -8646 10661 6068 -12044 -3049 12068 -402 -11115
2282 -11115 2914 9165 -4987 -7065 5863 5175 -6020 -3541 6339 2322 -6437 -589 6746 -779
2296 -779 -6420 2798 5915 -4360 -4310 6013 2558 -5954 239 5617 -1564 -3656 3135 2296 -2779
2311 -2779 108 2919 -943 -1258 2279 1037 -2395 189 3667 -52 -3991 1382 5600 -2354 -5772
2326 -5772 4818 6706 -6613 -5343 8888 4202 -9820 -1698 10568 35 -9999 1588 9089
2339 9089 -2469 -8090 3081 7245 -3206 -6634 3644 6100 -4383 -5394 5105 3802 -5615
2352 -5615 -2195 5048 84 -4111 1231 1817 -2184 -527 1458 -1417 -1059 1752 -289 -2399 341
2367 341 1710 -1226 -2307 702 1933 -1301 -2821 1340 2536 -2686 -2782 3321 1129 -4553 -181 4052
2383 4052 -2323 -4133 3604 2117 -4807 -1003 4793 -1099 -4811 1745 4020 -2482 -4235 2933 3778
2398 3778 -3613 -4180 4313 3858 -5657 -3307 6828 2124 -7286 -126 7056 -1262 -6333 2312 4982
2413 4982 -2537 -3330 2204 2476 -1594 -1673 901 1764 -207 -1497 507 1560 -53 -416 -52 78 1666
2430 1666 670 -2182 -49 4093 -320 -4502 2272 5286 -3557 -4030 5315 3411 -5172 -1537 5671
2445 5671 1086 -4608 169 4922 -26 -4304 1158 4678 -1414 -4210 3256 4187 -4352 -2627 5593
2460 5593 1060 -5987 1164 5638 -2694 -4608 4088 3064 -4356 -1850 4276 936 -3852 -640 3312
2475 3312 190 -3725 162 3454 -916 -3050 1623 2137 -2864 -1029 2746 -1146 -2737 2386 970
2490 970 -3732 284 3686 -2277 -3699 3211 2404 -4262 -1826 4251 666 -4771 -596 4784 -298
2505 -298 -5554 713 5764 -2675 -6293 3911 5195 -6298 -4263 7172 1672 -8237 162 7344
2519 7344 -2490 -6528 3347 5068 -4332 -4058 4251 2942 -4661 -2532 4560 1480 -5012 -695 4776
2534 4776 -1043 -4347 2498 3020 -3690 -994 4401 -1177 -3566 3683 2520 -4750 -292 6041 -971
2549 -971 -5750 2759 6005 -3605 -5151 4993 5747 -5473 -4960 7349 4833 -8079 -3100 9950
2563 9950 1754 -9647 1162 9760 -3158 -7482 5451 6030 -5915 -3248 6170 1606 -5321 605
2577 605 5168 -1288 -4071 2926 3744 -3880 -2607 5494 1665 -6514 592 7137 -2680 -6585 5251
2592 5251 5391 -6996 -3268 7723 567 -7808 1665 6800 -3794 -5326 4835 3565 -5927 -2336
2606 -2336 6198 360 -7260 938 7504 -3353 -8040 5400 7154 -8411 -5925 10050 3231 -11847
2620 -11847 -688 11310 -2689 -11324 4542 9028 -6409 -7591 6603 5246 -7591 -4141 7188
2633 7188 1820 -7756 -777 7142 -1848 -7231 3636 4986 -6315 -3211 6881 -238 -7496 2561
2647 2561 6237 -5562 -4544 6917 2286 -7789 -74 7692 -1718 -7288 3378 6818 -4884 -5990
2661 -5990 6648 5040 -8362 -3113 9943 783 -10793 2595 11083 -5713 -9318 8683 7301
2674 7301 -10196 -4364 11396 1723 -10889 1066 10578 -2635 -8959 4696 8237 -5728 -6456
2687 -6456 7596 5126 -8469 -2343 9868 -5 -8852 3756 8354 -5903 -5638 8589 3277 -8715
2701 -8715 148 9145 -2419 -7848 4882 6835 -5571 -5055 7119 4089 -7573 -2466 8430 825
2715 825 -8714 1592 8515 -4044 -6935 6559 4605 -8344 -1432 8793 -2153 -8103 5049
2728 5049 6714 -7475 -4675 8920 2323 -10069 -621 10444 -1573 -11254 3353 11053 -5965
2741 -5965 -11147 8010 9590 -10985 -7823 11984 4598 -13308 -1838 12110 -1710 -10872 3357
2754 3357 7895 -5282 -5707 5408 2882 -5987 -1268 5090 -1048 -5189 2537 4160 -4786 -3285 6504
2769 6504 1121 -8344 937 8770 -4273 -8507 6656 6825 -8839 -4537 9816 1671 -9922 862
2783 862 9114 -2837 -8002 4441 6878 -5801 -5440 7312 4023 -8660 -1679 9928 -609 -10048
2797 -10048 3906 9845 -6435 -8233 9542 6170 -10761 -3156 11437 922 -10322 1533 10047
2810 10047 -2385 -8565 4188 7587 -4685 -5712 5776 4747 -6082 -2390 6659 497 -5724
2823 -5724 2428 4818 -4222 -2050 5690 -264 -5624 3670 5087 -5276 -3218 6847 1830 -7551
2837 -7551 -77 7971 -1032 -7895 2601 8251 -4009 -8032 6054 7292 -7800 -6080 9687 3785
2851 3785 -11069 -1188 11098 -1909 -10401 4055 8440 -6006 -6773 6542 4503 -7363 -3369
2864 -3369 6702 1737 -7267 -892 6439 -1209 -6941 2061 5562 -4305 -4324 5021 1742 -5708 186
2879 186 4697 -2596 -3648 3850 1062 -4609 307 4124 -2180 -4183 3231 2951 -4020 -2628 4714
2894 4714 1981 -5982 -1489 6643 -383 -7590 1901 7557 -4169 -6723 5943 4770 -7641 -2659
2908 -2659 7805 266 -7458 1776 6510 -2987 -5420 4144 4667 -4795 -3521 5512 2781 -6490 -1563
2923 -1563 7274 185 -7645 2068 7526 -3602 -6134 5391 4859 -5512 -2315 5734 1002 -4309
2937 -4309 208 3713 -503 -2248 1162 2042 -623 -920 1279 690 -1376 713 2021 -1596 -1066 3373
2953 3373 647 -4131 1165 5102 -2838 -4731 4533 3879 -5306 -2055 5859 1030 -5812 162 5431
2968 5431 -987 -4818 1628 4780 -2444 -4682 3409 4322 -4645 -3544 5695 1433 -6647 143 6182
2983 6182 -2087 -5802 3460 3804 -4661 -2997 4283 1516 -4331 -881 3476 112 -3474 -277 3348
2998 3348 -766 -3501 1131 2705 -2380 -2263 2567 468 -3184 560 2010 -2092 -1202 2551 -479
3013 -479 -2754 1343 1493 -2471 -1029 2265 12 -2473 125 2288 -444 -2644 661 2684 -1448
3028 -1448 -3243 2408 3033 -3656 -2392 4708 1111 -5489 524 5435 -1925 -4606 3222 3715 -3658
3043 -3658 -2451 3768 1883 -3412 -1295 3670 1215 -3550 -564 4284 -112 -3988 1466 4012 -2132
3058 -2132 -2669 3258 1494 -2953 329 2985 -1131 -1481 2084 1023 -1293 516 1555 -424 -838 1043
3074 1043 1051 -553 -791 1042 1343 -1373 -864 2401 586 -2767 671 3030 -1656 -2320 2908 1208 -3138
3091 -3138 136 3082 -1106 -2429 1791 1521 -1900 -788 1817 470 -1947 -586 2092 162 -2703
3106 -2703 408 2807 -1245 -3307 2255 2741 -3726 -1888 3783 209 -4192 548 3342 -1531 -2782
3121 -2782 1484 1541 -1682 -1549 923 852 -1360 -1169 901 398 -1570 -329 1428 -858 -1324 1516 93
3138 93 -2612 921 2336 -2527 -2103 3288 738 -4375 224 4105 -1157 -3967 1320 3376 -1589 -3299
3154 -3299 1687 3401 -1982 -3477 2621 3557 -3479 -2877 3995 2001 -3997 -709 3664 -327 -2421
3169 -2421 1285 1269 -923 -111 657 -424 322 1013 -418 -628 1189 1139 -610 -1117 1144 1940 -1077 -2236
3187 -2236 2453 2593 -3114 -1887 4868 1198 -4770 448 5197 -1440 -4241 2884 3675 -2931 -2274 3389
3203 3389 1923 -2870 -986 3252 842 -3156 18 3717 -808 -3455 2051 3325 -3309 -2401 4293
3218 4293 1252 -4559 559 4342 -1636 -3567 2223 2563 -2262 -1827 1838 1319 -1815 -1449 1588 907
3234 907 -1620 -1016 1459 -69 -1347 555 302 -1404 550 1147 -2528 -1013 3465 -346 -4562 1380
3250 1380 4205 -3231 -4582 3700 3384 -4474 -3299 4573 2594 -5043 -2658 5305 1910 -6447 -1683
3265 -1683 6547 112 -6842 991 6418 -2615 -5423 3316 3682 -4243 -2140 3698 350 -3339 344
3280 344 2389 -622 -1741 982 1261 -1616 -872 2195 401 -2684 520 3081 -1920 -3046 3322 2491
3296 2491 -4318 -1133 5046 -164 -4521 1545 3816 -1978 -2646 2519 1959 -2109 -919 2040 788
3311 788 -1486 93 1997 -415 -1415 1772 1454 -2509 96 4042 -1039 -3885 3227 4187 -4654 -2811
3327 -2811 6129 2113 -6389 -472 6942 -286 -6265 1256 6282 -1445 -5987 2253 5911 -2781 -5513
3342 -5513 3891 4733 -4656 -3491 5165 1744 -5033 -280 4093 -1565 -2610 2437 1016 -2794 528
3357 528 2332 -1631 -2082 2021 1737 -2959 -1729 3353 1479 -4429 -1391 5079 13 -5972 916 5339
3373 5339 -2503 -4857 3328 3241 -4109 -2070 3370 199 -3241 521 1826 -1889 -1345 1912 70 -2808
3389 -2808 345 2798 -1085 -3688 2013 3770 -3280 -3981 4628 3195 -6186 -2179 6925 489 -7186
3404 -7186 946 6471 -2209 -5562 2904 4166 -3247 -3276 3258 2576 -2954 -1689 3423 894 -3238 245
3420 245 3271 -1614 -2395 3222 1364 -4147 482 4711 -1837 -4304 3560 3709 -4477 -2322 5216 1630
3436 1630 -4696 -521 5074 138 -4491 526 4856 -628 -4141 2071 4139 -2587 -2790 3561 1807
3451 1807 -3368 379 3374 -1729 -2049 2970 893 -3076 724 3193 -1654 -2613 2497 2330 -3116 -1675
3467 -1675 3734 1575 -4095 -892 4882 208 -5213 1011 5480 -2456 -5104 3870 3901 -5167 -2611
3482 -2611 5601 615 -5451 512 4865 -1609 -4413 1970 3461 -2846 -3517 2993 2538 -3994 -2081
3497 -2081 4219 675 -5087 79 4355 -1996 -4002 2702 2185 -3471 -1052 3075 -458 -2978 1237
3512 1237 1576 -2217 -1128 1990 137 -2171 -156 2095 -808 -2620 1110 2485 -2262 -2537 2995
3527 2995 1541 -4275 -531 4579 -1183 -4221 2260 3512 -3348 -2454 4043 1043 -4118 41 3919
3542 3919 -673 -3593 1355 3565 -1693 -3480 2698 3377 -3679 -2838 4824 1795 -5263 -195 5612
3557 5612 -802 -4512 2317 3766 -2672 -2417 3047 1720 -2482 -605 2550 456 -2203 412 2348
3572 2348 -420 -1745 1397 1697 -1733 -676 2758 -147 -2341 1684 2216 -2398 -1021 3585 146
3587 146 -3103 1181 2804 -1725 -1870 2335 1391 -2439 -1185 2629 982 -2931 -529 3022 -377 -3478
3603 -3478 1153 3467 -2354 -3153 3183 1957 -4317 -858 4213 -564 -3989 1137 2943 -2172 -2329
3618 -2329 2067 1359 -2520 -1290 2201 585 -2769 -347 2588 -383 -3024 1116 2476 -2617 -2112
3633 -2112 2778 694 -3698 446 2963 -1373 -2740 1661 1493 -2204 -1136 1803 340 -1752 -284
3648 -284 1555 -124 -1782 336 1741 -957 -1537 1783 909 -2265 147 2635 -1127 -2504 2293 1737
3664 1737 -3086 -783 3378 -27 -3049 769 2819 -711 -2360 1008 2294 -920 -2218 1483 2488
3679 2488 -1377 -1811 2178 1259 -2173 -216 2168 -596 -1069 1563 261 -1413 994 1474 -1565 -639
3695 -639 2454 369 -2256 372 2387 -96 -2244 572 2788 -392 -2905 934 3364 -1462 -2948
3710 -2948 2451 2642 -2820 -1569 3274 865 -2934 333 2334 -672 -1364 912 824 -839 -528 877
3726 877 229 -857 -257 1175 -401 -1655 697 1509 -1729 -1639 2292 709 -2997 -123 2819 -603
3742 -603 -2706 1026 1660 -1445 -1355 943 520 -757 -1060 212 633 -593 -1018 127 286 -610 -255 215
3760 215 -675 -58 636 -1034 -1007 1692 240 -2632 68 2433 -1228 -2373 1593 1602 -2148 -1414 1791
3777 1791 751 -1651 -723 1638 598 -1954 -486 2241 -24 -2462 780 2364 -1575 -2055 2707
3792 2707 1341 -2935 -243 3045 -494 -2579 1127 2253 -1196 -1591 1288 1580 -1043 -1492 1372 1909
3808 1909 -1409 -1336 2030 1096 -2053 -314 2245 -126 -1098 873 872 -440 358 266 -569 543 955 -960
3826 -960 -265 1760 293 -1275 329 1596 -112 -1307 414 1651 131 -1898 333 2529 -823
3841 -823 -2548 1731 2804 -2497 -1746 3371 1218 -3527 -361 3503 -567 -3189 795 2602 -958
3856 -958 -2391 879 2321 -1332 -2648 1543 2573 -2100 -2251 2531 1513 -2883 -631 2541 -233
3871 -233 -2281 426 1073 -700 -576 129 128 204 -195 -789 -6 591 -446 -1207 136 452 -251 -634 -443
3890 -443 789 513 -1728 -607 1951 -278 -2569 428 2130 -1785 -1864 1906 1256 -2358 -352 2009
3906 2009 -252 -1497 579 1426 -584 -1300 796 1100 -1272 -1101 1959 1176 -2428 -349 3211 -282
3922 -282 -3453 1564 3104 -2259 -2257 3104 1791 -2901 -909 2756 1090 -2220 -481 2626 713 -2213
3938 -2213 -603 2753 356 -2227 460 2173 -753 -1303 1238 1030 -881 253 436 -490 407 1140
3954 1140 -886 -364 1200 536 -1200 143 1437 -53 -1053 112 1301 223 -1462 111 1871
3969 1871 -520 -1925 1288 1706 -1938 -968 2389 -137 -2319 1152 1752 -1807 -1383 2324 461 -2642
3985 -2642 99 2292 -389 -2606 401 2668 -674 -3068 1124 3105 -2070 -3240 2467 2827 -3580
4000 -3580 -2126 3601 1005 -3623 -448 2625 -608 -2385 438 1427 -588 -1248 12 757 -341 -967
4016 -967 200 611 -664 -238 721 -776 -733 1085 -139 -1729 674 1589 -1770 -1226 2170 418 -2247
4033 -2247 79 1903 -633 -1448 737 1063 -835 -935 869 894 -1002 -594 1463 513 -1823 310 2269
4050 2269 -1134 -1961 2154 1833 -2803 -530 3406 5 -3206 1249 2981 -1559 -2268 2058 1972 -1783
4066 -1783 -1613 2155 1797 -2076 -1086 3019 1071 -2950 58 3329 -534 -2593 1575 2233 -1931 -1062
4082 -1062 2184 249 -1490 800 1418 -598 -938 832 602 -408 -600 661 714 -885 -271 1233 29
4099 29 -1159 829 921 -1511 -406 1852 -493 -2032 1467 1292 -2230 -825 2205 -53 -2331 741
4115 741 2004 -1104 -2022 882 1770 -1512 -2135 1650 1813 -2402 -1954 2743 1144 -3565 -264 3407
4131 3407 -853 -3186 1597 2203 -2473 -1714 2341 787 -2369 -613 1627 232 -1619 -242 1483
4146 1483 -242 -1650 460 1410 -1252 -1159 1677 519 -2062 211 1656 -1135 -1356 1792 397 -1920
4162 -1920 338 1506 -1016 -1109 1122 693 -915 -535 1060 349 -840 -310 1538 -51 -1594 543
4178 543 1898 -1056 -1769 2259 1498 -2613 -395 2999 -486 -2546 1415 2210 -1456 -1066 1858 1091
4194 1091 -1519 -664 1699 770 -1457 -478 2059 443 -1943 628 2290 -1106 -1480 1953 921 -2107
4210 -2107 230 1981 -742 -1378 1425 799 -1358 136 1502 -214 -1113 386 1142 -491 -1199 606
4226 606 1450 -1300 -1460 1672 1252 -2173 -804 2562 -82 -2691 742 2061 -1191 -1459 1317 668
4242 668 -1469 -419 813 -72 -547 -102 131 -10 -499 8 383 -344 -573 782 -92 -1646 576 1315
4260 1315 -1454 -1146 1888 228 -2282 268 1812 -984 -1451 931 822 -1219 -737 783 298 -844
4276 -844 -625 702 358 -1143 -193 1326 -520 -1313 1194 1023 -1835 -186 2432 -556 -2465 1265
4292 1265 2189 -1927 -1610 2033 1232 -1787 -828 1873 931 -1774 -1041 2134 1102 -2264 -714 2662
4308 2662 279 -2326 482 2130 -663 -1237 959 629 -216 -77 164 12 701 254 -518 542 1100
4325 1100 -574 -494 639 731 -121 -505 159 1008 266 -1082 369 1794 -381 -1717 1276 1656 -1727
4342 -1727 -759 2069 236 -1692 491 1371 -562 -862 673 646 -434 -504 551 471 -837 -625 1217
4359 1217 404 -1969 151 1945 -888 -2134 1402 1339 -2116 -989 1849 242 -1824 -190 1111 83
4375 83 -1054 -219 816 177 -1266 -424 1023 -41 -1438 158 700 -818 -554 726 -343 -690 377
4392 377 -176 -936 722 558 -1120 -257 1058 -228 -1100 280 471 -531 -375 179 431 26 -457 120
4410 120 813 -458 -826 814 636 -1211 -228 1490 -448 -835 1053 613 -1174 67 1417 -323 -912
4427 -912 584 828 -589 -653 795 745 -469 -904 994 1274 -1164 -912 2089 722 -2007 156 2381
4444 2381 -473 -1490 1025 1657 -978 -807 911 796 -371 -608 480 997 -60 -833 747 1037 -556
4461 -556 -508 905 512 -717 209 218 -227 190 1 -375 561 672 -963 -463 1140 64 -1292 530 1128
4480 1128 -630 -736 452 706 -306 -787 18 847 -287 -1365 375 1294 -1090 -1242 1447 673 -1786
4497 -1786 -15 1592 -593 -1383 735 534 -1069 -361 692 -28 -796 71 437 73 -828 -327 1002
4514 1002 -294 -1589 576 1386 -1386 -1151 1524 451 -1915 -155 1430 -462 -1249 443 737 -535
4530 -535 -478 12 525 128 -774 -164 803 -44 -1043 375 580 -555 60 341 -162 88 466 -370 -422 1029
4550 1029 -55 -1142 580 934 -817 -528 1158 102 -527 367 533 109 -221 12 509 63 -543 120
4568 120 760 -377 -1044 1408 973 -1748 -167 2383 -464 -2060 1187 2157 -1447 -1586 1649 1334 -1449
4585 -1449 -1007 1440 1578 -1620 -1335 1749 1549 -2131 -1106 2506 847 -2315 -340 2188 -140 -1747
4601 -1747 193 1032 -196 -344 -403 459 640 -503 -992 660 1038 -871 -905 817 431 -675 -570 126
4619 126 669 -82 -1069 35 1377 -642 -1652 1035 1111 -1570 -772 1671 -112 -1816 567 1145 -854
4636 -854 -1014 784 681 -1244 -736 963 653 -1626 -898 1831 368 -2437 -223 2588 -635 -2667
4652 -2667 1135 2298 -1707 -1546 1666 1124 -1683 -869 1125 821 -983 -777 746 1010 -734 -987 973
4669 973 797 -752 -133 646 209 -66 225 -428 310 1059 -670 -1068 1162 914 -1502 -305 1716 -42
4687 -42 -1508 496 1100 -125 -750 368 824 -135 -661 564 1139 -683 -716 1422 664 -1269 159 1740
4705 1740 -929 -1448 1757 1275 -1945 -459 2048 303 -1717 334 1573 61 -1462 371 1640
4720 1640 -172 -1681 681 1799 -765 -1949 1474 1339 -1609 -881 1480 296 -1181 193 573 -566
4736 -566 -69 318 -436 -35 357 -352 -434 286 193 -438 -348 -72 462 -208 -1204 192 973 -620 -1158 1064
4756 1064 884 -1486 -481 1561 -454 -1550 564 697 -1082 -586 715 113 -644 -39 411 -235 -459
4773 -459 31 400 -463 -1052 717 901 -1086 -828 1598 176 -1799 348 1866 -722 -1586 1157 779
4790 779 -1368 -448 1212 367 -811 -274 841 258 -939 -152 1111 -132 -1301 736 1128 -889 -665
4807 -665 1327 179 -1178 611 1210 -872 -487 1252 149 -889 252 694 -103 -422 227 591 212
4824 212 -546 -13 991 91 -829 529 990 -678 -388 1032 -33 -413 682 72 -661 634 690 -952
4842 -952 176 1195 -94 -1359 618 1182 -645 -927 541 859 -534 -1079 616 1503 -1034 -1399 1441
4859 1441 1490 -1793 -1094 1963 186 -2102 181 1636 -772 -1207 352 641 -549 -873 254 497 -527
4876 -527 -964 583 617 -870 -677 1031 -4 -1247 159 725 -765 -683 753 -92 -876 -105 428 -502
4894 -502 8 152 -344 34 69 -646 -5 404 -379 -664 158 5 -312 -390 -119 208 184 -650 -593 842 179
4915 179 -1281 184 1654 -632 -1487 987 1395 -1104 -844 1238 741 -784 -592 911 953 -781 -751
4932 -751 1201 932 -1166 -422 1853 134 -1529 423 1368 -593 -845 1067 648 -268 -62 493 322
4949 322 -210 -454 264 671 -266 -472 655 466 -473 -240 689 -65 -350 401 97 -113 309 -25 -183 477
4969 477 201 -776 183 880 -502 -551 868 46 -879 -123 590 206 -592 -126 164 445 -387 -654 602
4988 602 536 -1246 -170 1044 -279 -1418 455 890 -828 -617 518 244 -473 -376 200 197 -363 -456 150
5007 150 497 -809 -609 810 307 -1159 -19 679 -326 -622 397 35 -622 10 -356 -301 146 200 -576
5026 -576 12 183 -395 -232 4 -88 -43 74 -321 -86 597 -219 -598 612 295 -631 -259 720 -66 -445
5046 -445 407 4 89 -99 44 -53 482 141 -195 141 475 -246 -160 400 108 -220 129 -364 209 679 -313
5067 -313 -426 763 454 -751 40 1094 -151 -360 319 274 -83 -180 355 58 245 -279 37 462 18
5086 18 -232 386 499 -414 268 860 -321 -526 785 313 -822 226 787 -354 -755 533 342 -456
5104 -456 -236 214 432 -94 -666 -99 885 -323 -1095 535 593 -989 -551 779 -204 -698 255 156 -323
5123 -323 -162 112 -266 92 -78 -597 -111 261 -291 -455 209 -329 -338 51 -173 -278 339 54 -479 253 49
5144 49 -559 -73 361 -414 -176 561 -102 -641 657 579 -1028 -525 1082 -162 -822 32 761 94 -839
5163 -839 -185 998 246 -1309 -245 1748 -152 -1879 536 1806 -1076 -1452 1319 1219 -1083 -701
5179 -701 1030 829 -896 -717 1045 1242 -698 -998 1289 1232 -1024 -444 1528 371 -1087 306 962
5196 962 112 -181 -230 249 664 -67 -962 541 1023 -682 -988 1103 833 -1020 -325 1112 458 -938
5214 -938 -443 911 595 -1002 -742 1348 675 -1463 -210 1890 -236 -1745 726 1550 -1198 -1348 1320
5231 1320 779 -1350 -485 1250 292 -1019 -383 1067 406 -1280 -515 1366 111 -1637 200 1217
5247 1217 -752 -1258 757 696 -672 -554 384 -45 -288 -451 -164 399 476 -896 -420 1083 15 -1117
5265 -1117 -81 1002 -117 -924 -191 954 371 -1119 -622 1393 260 -1931 -97 1988 -286 -2004
5281 -2004 782 1804 -1205 -1198 1101 822 -951 -897 759 616 -708 -690 792 612 -878 -439 1093 173
5299 173 -961 494 751 -611 -201 1094 -101 -787 788 551 -733 -288 838 230 -314 -2 569
5316 569 283 -171 -346 530 573 -387 -152 447 66 -353 531 39 -309 659 458 -730 245 1150 -435 -903
5336 -903 991 776 -1094 -357 1297 262 -980 -115 1095 151 -940 -236 1268 398 -1420 100 1388
5353 1388 -394 -1268 580 1045 -871 -596 996 38 -788 338 386 -617 55 263 -420 -441 243 292 -478
5372 -478 -277 196 525 -525 -878 749 509 -1040 -509 1385 49 -1685 332 1152 -602 -890 511
5389 511 292 -704 -274 201 -150 -440 -114 166 55 -245 -348 210 -168 -401 286 255 -868 -51 884 -293
5409 -293 -792 484 471 -838 128 811 -242 -644 501 264 -334 3 132 272 -94 -9 117 144 -311 56
5429 56 551 -245 -481 651 428 -923 40 1321 -317 -1294 756 1184 -1029 -514 1380 505 -1029 -279
5447 -279 1005 439 -720 -369 1049 524 -854 -198 1381 139 -1190 449 1250 -530 -724 813 239
5464 239 -496 169 383 -140 199 191 -467 60 465 -113 -88 256 -105 69 75 -44 -32 226 -285 -466 551 -132
5486 -132 -591 512 421 -905 -320 932 -280 -718 303 487 -1030 -192 643 -141 -695 32 299 -198
5504 -198 -565 -151 549 176 -1034 77 1066 -520 -1298 608 634 -937 -766 1127 197 -994 -56 387
5522 387 -379 -366 -148 69 437 -418 -371 269 268 -655 113 465 -191 -147 275 63 -321 267 -4 -426 254 263
5544 263 -539 -155 615 -314 -271 152 247 -149 340 106 -286 194 585 -126 -123 281 -7 200 204 -132 309 476
5566 476 -458 -274 914 99 -827 174 945 -416 -659 644 510 -71 -246 227 190 327 -503 58 926
5585 926 171 -689 270 895 -321 -456 660 172 -274 306 190 16 176 69 -320 380 369 -521 -1 372
5605 372 -238 -279 488 -104 -267 298 200 -451 57 141 -311 -175 222 -118 -155 94 -131 -131 252 -383 -475 231
5627 231 157 -577 -39 515 -305 -484 393 -74 -330 158 -158 -474 84 -61 -580 46 265 -348 -159 128
5647 128 -137 -15 -65 -178 -77 257 -189 -370 364 173 -610 230 250 -342 -160 220 -284 -168 422 57 -253
5668 -253 422 105 -394 -81 290 -71 -40 205 -202 57 414 -186 -295 451 -26 -208 407 211 -378 265
5688 265 657 -199 -183 541 182 -281 439 357 -322 -92 500 306 -196 -51 302 357 24 -516 665 627 -552
5709 -552 -462 971 450 -804 123 862 -196 -404 229 447 -148 -72 98 62 364 -266 -251 353 247 -437
5729 -437 17 409 -106 -142 -40 -365 67 208 -358 -315 641 -235 -655 478 480 -459 -380 362 -239 -469 131
5750 131 -139 -282 185 331 -174 -195 -38 4 3 -472 -47 543 98 -1098 18 1153 -464 -1081 679 844
5770 844 -978 -691 957 344 -801 -462 707 395 -716 -843 636 730 -853 -704 935 463 -1005
5787 -1005 -151 919 118 -808 -156 367 151 -105 -673 18 912 -395 -916 731 964 -739 -472 935
5805 935 604 -826 -339 775 512 -328 -473 703 696 -823 -447 1165 224 -1140 91 1411 -284 -989
5823 -989 783 792 -834 -271 913 91 -322 -40 543 347 -265 -235 695 352 -839 -282 975 40 -706
5842 -706 479 592 -313 -398 523 197 114 14 -249 167 409 -472 -633 659 290 -961 -91 998 -70
5861 -70 -754 115 723 -226 -617 -37 704 29 -877 10 1146 -439 -1206 501 994 -840 -1186 931 429
5880 429 -1123 -272 785 106 -685 -221 269 105 -460 -394 548 481 -598 -152 393 -99 -449 158 -166 -249
5900 -249 87 -142 -577 427 327 -784 -107 574 -66 -850 402 805 -348 -469 224 284 -161 -206 98
5919 98 369 -112 -568 45 272 -555 -342 671 103 -770 410 403 -566 -115 687 -235 -909 663 599 -517
5939 -517 -50 754 215 -223 65 473 212 -552 -270 923 423 -780 -3 918 -162 -636 379 478 -574
5958 -574 201 579 -366 -277 547 48 -526 326 482 -341 -337 419 264 -292 -370 330 700 -347 -659 979 552
5979 552 -958 -542 1219 174 -1172 402 832 -511 -484 477 124 -288 -54 48 -166 -76 -78 -179 67
5998 67 -23 -106 -158 -5 85 260 -178 -717 370 525 -956 -417 977 15 -1323 539 829 -666 -823 675
6018 675 189 -718 -322 334 225 -408 -227 414 63 -608 33 805 -222 -942 436 530 -736 -248 884
6037 884 -184 -1013 461 569 -706 -420 773 202 -532 -128 535 331 -440 -334 537 321 -473 -229 771
6056 771 99 -558 282 352 -498 -155 477 -397 -18 539 -81 -554 521 278 -722 33 1042 61 -488
6075 -488 187 439 -180 -383 22 599 244 -779 80 979 -437 -809 578 940 -928 -238 1229 139
6093 139 -681 417 733 -464 -347 435 198 -284 -144 259 334 -338 -303 389 318 -525 63 710 -170 -684
6113 -684 424 480 -763 -63 636 -130 -476 158 -2 -100 17 31 -203 36 187 -363 188 24 -190 25
6133 25 -91 -303 253 -24 -470 -120 461 -300 -635 549 313 -566 -45 728 -277 -610 265 101 -594 -131
6153 -131 237 85 -233 -227 137 95 -417 -60 623 -67 -681 25 853 -414 -635 547 398 -808 -110 725
6173 725 109 -408 31 327 118 -235 -182 388 526 -398 -464 532 181 -396 -30 518 13 -202 323 120 317
6194 317 119 -78 117 611 -16 -401 493 433 -247 -386 484 115 -18 172 83 -41 126 -92 -152 250 -71
6215 -71 -135 343 108 -306 46 401 -332 -4 631 -113 -411 268 319 -329 4 71 -63 285 144 -322 120
6236 120 283 -329 -196 445 74 -480 135 367 -81 -286 -92 106 112 -75 -282 145 190 -523 -412 484 196
6257 196 -800 38 322 -367 -320 119 -54 -54 149 -129 -248 181 61 -50 115 203 -221 95 218 -80 -31 -174
6279 -174 -292 137 293 -386 -241 547 21 -690 143 618 -515 -438 404 47 -682 175 359 11 -143 -265
6299 -265 258 337 -337 -85 431 131 -631 106 774 -269 -356 646 412 -403 -10 297 31 -82 134 86
6319 86 143 328 -304 -339 456 182 -492 82 285 208 30 121 -48 375 -170 -689 554 508 -611 -206 912
6340 912 -109 -828 198 696 -274 -231 654 399 -339 -313 438 331 -353 -249 294 282 -495 -136 485 -85
6360 -85 -803 364 659 -552 -372 781 88 -845 313 481 -324 -542 157 330 -153 -436 -60 542 38
6379 38 -576 -101 349 -203 -462 158 225 -212 -388 -49 -75 280 -86 -726 273 887 -616 -887 727 455
6399 455 -949 -493 941 -17 -815 -179 572 344 -784 -272 767 273 -965 -254 1010 -177 -1098 351
6417 351 904 -572 -631 647 147 -548 -5 344 -73 -226 -72 107 140 -64 -10 211 159 -359 12 323 -87
6438 -87 -70 434 134 -228 236 265 -234 185 247 -310 171 521 -385 -264 669 180 -460 289 617 -148 -390
6459 -390 267 488 41 -467 52 616 15 -1007 362 1140 -540 -888 894 761 -831 -426 925 185
6477 185 -677 21 416 113 -119 -109 185 215 -364 -291 512 107 -590 70 0 -43 -346 125 -253 -191 18 -316
6499 -316 -411 362 47 -670 49 577 -450 -583 356 189 -488 -189 272 105 -272 -241 90 285 -203 -338
6519 -338 290 168 -623 -4 485 -423 -484 376 -105 -547 21 201 -374 -187 501 54 -241 117 -12 -118
6539 -118 -135 -224 214 151 -265 -196 364 207 -561 117 303 -300 -269 638 -72 -234 344 107 -275 308 255 -450
6561 -450 21 523 167 -433 101 412 -173 -207 148 158 105 -495 38 707 -77 -492 388 758 -405 -239 611
6582 611 198 -376 283 437 -29 205 66 -109 227 381 -74 -218 180 179 -56 -125 106 477 -73 -424 200
6603 200 543 -132 -618 684 740 -572 -426 832 285 -737 132 543 -260 -232 348 272 -479 -17 56 -39
6623 -39 -195 -188 241 77 -535 163 517 -355 -642 360 269 -792 -131 689 -235 -601 223 162 -453 -260 270
6644 270 -23 -299 -50 -94 -7 -177 -115 223 20 -244 97 61 -126 166 373 -437 -437 498 463 -851 -89 1075
6666 1075 -280 -773 396 423 -560 -422 550 307 -443 -114 460 298 -391 -313 556 166 -838 74 811
6685 811 -209 -651 362 626 -683 -36 676 22 -508 413 567 -332 -220 521 92 -71 -93 242 242 -257
6705 -257 -138 475 358 -470 140 384 -469 -243 518 -23 -439 401 490 -393 51 732 -236 -443 359 305 -306
6726 -306 -217 310 197 -303 -231 478 354 -447 -285 704 82 -861 46 842 -400 -680 683 448 -671 -255
6746 -255 906 -56 -252 124 228 -318 -312 130 15 -357 -253 350 338 -509 -222 530 -55 -840 166 755
6766 755 -351 -468 350 302 -613 -197 454 10 -312 24 -198 67 98 -147 -209 81 -6 -212 -174 129 -23
6787 -23 -129 -337 36 405 -202 -624 407 599 -571 -447 661 362 -809 82 850 -79 -637 83 551
6806 551 51 -461 46 566 173 -398 -208 716 -108 -372 409 111 -413 176 403 -13 -68 569 -32 -128 202
6827 202 14 -131 108 38 44 303 106 94 182 8 -112 -34 300 -192 -197 221 -34 -33 374 125 -328 217 432
6850 432 -267 1 453 98 -396 201 195 -289 105 100 -126 -69 -55 -201 22 225 -374 -160 364 -213 -560 290
6872 290 271 -137 -112 160 -7 -159 48 -175 122 199 -433 -281 374 16 -732 110 477 -458 -453 292 136 -158
6894 -158 -214 33 360 100 -384 -127 450 -236 -389 77 365 -180 -412 133 161 -26 -99 -50 22 370 -174 -300
6916 -300 348 243 -661 -187 643 39 -516 210 337 -54 -355 2 265 530 -602 -46 467 0 -446 230
6936 230 690 -342 -434 570 130 -322 6 258 79 -156 197 -23 -59 95 41 239 -1 -277 249 311 -14
6957 -14 -135 466 106 -475 179 537 -106 -52 456 -32 -3 247 -35 -438 398 178 -337 46 313 -301 -360
6978 -360 316 234 -147 -250 290 323 -177 -582 111 610 -577 -691 613 640 -923 -437 937 123 -915
6997 -915 -55 797 -190 -602 -45 401 -219 -532 29 430 -39 -633 119 515 -474 -448 191 -87 -352 67
7017 67 394 -383 -29 367 -310 -207 113 -105 -301 167 159 -317 -150 43 47 186 -84 -187 176 -62 -232 279
7039 279 273 -485 -30 462 -364 -617 415 430 -906 -53 910 -127 -787 200 599 -343 -405 216 621 -261
7059 -261 -689 165 779 -338 -717 630 609 -751 -167 822 113 -600 194 592 -67 -85 306 104 -92 -8
7079 -8 148 165 286 -72 22 390 133 -78 -58 88 111 -24 133 -173 398 102 -689 -108 770 -269 -631 471
7101 471 450 -667 -39 582 135 -396 62 405 48 -363 -6 339 -34 -424 -269 507 -345 -494 311 402
7121 402 -439 -268 378 49 -789 150 88 -260 -15 196 -201 -56 134 -116 -196 12 -365 3 306 -66 30
7142 30 248 -266 -174 426 -214 -311 295 206 -368 -63 419 -425 -505 375 143 -453 -28 278 -170 -194 40 136
7164 136 -164 -80 -142 193 53 -473 97 295 -242 -616 289 314 -426 -135 532 -181 -278 78 71 31 250 -42
7186 -42 -149 253 47 -235 120 281 -231 30 508 128 -89 204 19 244 87 -240 -34 552 -151 -538
7206 -538 111 472 -438 -276 446 210 -359 93 306 -165 -109 183 47 112 -144 -110 380 114 -354 222 361
7227 361 -360 -391 434 107 -347 341 372 -133 35 189 -234 -160 51 -95 -244 166 -129 -153 46 -76 -198
7248 -198 -100 176 -223 -73 7 84 14 38 -327 81 309 -414 -308 443 65 -839 -166 692 -89 -846 361
7269 361 476 -280 -479 230 234 -220 -464 245 231 -419 -450 276 230 -651 -160 648 -173 -415 219 282 -223 -144
7291 -144 223 -157 -45 173 -150 -208 91 123 -230 25 131 -35 -85 -61 161 235 -97 44 388 32 -455 153
7313 153 657 -412 -372 520 264 -588 97 533 -161 -534 454 338 -307 -284 335 205 -126 -318 308 355 -309
7334 -309 -260 641 184 -389 50 666 -167 -462 582 310 -585 -35 428 -303 -430 232 295 -105 -92 50 210
7355 210 -96 63 49 99 -250 -23 182 -142 -331 135 390 -392 -207 623 -229 -537 438 247 -361 -125 547
7376 547 -236 -462 323 136 -277 -70 105 237 -154 -315 165 351 -431 -172 450 103 -813 25 424 -569
7396 -569 -584 440 125 -742 -104 470 -217 -390 -70 114 18 -246 193 261 -134 -220 134 73 -426 -292 378
7417 378 -231 -498 159 356 -579 -158 358 123 -294 309 375 -248 -176 116 11 19 61 166 23 -145 -21 362
7439 362 92 -457 136 501 -169 -267 549 150 -470 110 695 -130 -369 156 329 -178 92 321 73 -69
7459 -69 -32 186 360 -46 -83 87 -60 -82 15 122 -360 -193 441 -219 -255 339 214 -241 205 463 -98 -40
7481 -40 187 126 -119 -157 10 -81 -137 -149 -101 134 -102 -347 437 19 -557 -43 593 -212 -540 187 225 -298 -7
7504 -7 524 90 -207 -100 92 146 65 -438 47 558 -459 -334 321 174 -392 -302 307 -15 -128 232 3
7525 3 212 -26 -168 -14 464 -134 -390 489 414 -432 -378 273 128 -199 -140 168 126 39 -517 -1 568 -84
7547 -84 -431 355 331 -486 -29 440 226 -431 160 423 77 -231 6 149 292 -229 -261 332 167 -529 -43
7568 -43 508 -188 -370 541 119 -355 55 325 66 -247 119 81 173 13 -116 90 473 -500 -135 580 38
7589 38 -346 128 420 -134 -223 501 4 -106 102 266 -1 231 -185 -154 238 19 -223 18 239 26 -182
7610 -182 -38 -4 71 138 -116 58 322 -241 -281 260 335 -754 59 532 -175 -551 11 98 -218 -206 77 -10
7632 -10 -57 -241 -157 337 -108 -360 515 56 -489 -337 278 -203 -446 269 167 -464 -103 453 -149 -376 142
7653 142 147 -264 -148 20 -30 38 -389 -34 292 -201 -314 339 232 -304 -93 402 -77 -152 271 -61 -369 -81
7675 -81 137 -448 95 344 -180 -233 181 107 -172 -222 58 213 -61 -407 72 501 -217 -170 538 302 -736
7696 -736 -270 721 2 -620 335 560 -272 -324 418 228 -107 -28 146 150 -320 -235 353 245 -147 45 265 -2
7718 -2 -377 298 260 -264 268 313 -323 -215 305 35 -289 157 166 -225 -245 122 128 -233 -15 134 3 -9 -131
7741 -131 196 111 -432 -152 354 -381 -495 526 619 -591 -106 568 -140 -398 239 243 -223 -355 150 135 -372
7762 -372 -278 -50 289 -175 -390 140 67 -464 -453 301 50 -534 268 140 -451 25 78 -190 -72 25 -215 -207
7784 -207 311 -65 -260 255 196 -332 -104 -143 145 92 -276 -184 290 -35 -385 -100 516 -166 -601 291 218 -417
7806 -417 -254 240 96 -198 99 434 2 -236 114 414 41 -178 20 341 49 -168 145 387 -407 31
7826 31 400 -22 -105 242 127 -108 23 361 135 59 9 -158 75 285 -127 -124 274 162 -228 -5 55 -27 73
7849 73 -202 66 250 -104 -206 205 419 -343 -201 471 121 -424 45 494 -158 -254 106 -72 -159 -15 98
7870 98 235 43 -44 161 177 84 -384 257 345 -386 -160 229 -125 -96 169 -31 -130 88 -12 -171 53 177
7892 177 -148 81 259 -267 -103 219 44 -307 7 14 -104 -244 -144 65 241 -328 -188 418 -61 -400 -66
7913 -66 503 -254 -380 277 35 -443 35 293 -192 -154 -41 57 -71 -41 7 51 197 11 3 97 45 -194 214
7936 214 217 -96 197 234 -252 19 414 -225 -306 172 90 -117 5 156 62 -180 139 -5 -60 21 114 -43 74
7959 74 -166 -59 320 -257 -87 337 27 -309 82 557 -148 -314 303 167 -505 7 334 -187 -146 342 281
7980 281 -262 -193 -58 61 0 -289 248 323 -220 -162 468 -6 -339 355 356 -433 -436 635 74 -453 44 149
8002 149 -218 -244 236 36 -48 -299 72 213 -214 -367 38 153 -409 -8 366 -233 -315 366 83 -450 -87
8023 -87 92 -349 -292 364 -1 -214 -294 311 31 -250 -24 315 45 -20 -27 41 -55 -286 136 233 -458 -29 506
8046 506 20 -583 272 309 -439 -2 185 27 -311 245 327 -36 -168 219 266 -82 -211 281 148 -174 -335
8067 -335 472 138 -641 8 637 -86 -482 337 360 -390 -64 440 108 -237 45 360 -226 -138 -2 97 207
8088 207 -137 -6 400 -91 -199 226 186 -454 134 308 -189 -186 342 112 -296 261 222 -213 136 234 -35 -6
8110 -6 60 78 -148 74 83 -57 -261 -49 180 53 -359 -358 576 -61 -709 137 484 -422 -493 427 267 -291 -325
8133 -325 512 229 -393 -104 353 226 -260 -328 309 167 -577 -58 445 -236 -494 175 216 -187 -318 175 -78
8154 -78 -153 -143 93 -137 96 81 -15 59 64 -96 9 144 -267 -41 303 -127 -72 259 -5 -246 84 -17 -95
8177 -95 218 -73 -332 104 199 -273 -14 201 289 -255 0 239 132 -150
8191a50
$$ Imaginary data points
##PAGE= N=2
##DATA TABLE= (X++(I..I)), XYDATA
0 0 0 0 0 8 -8 0 -1 12 -16 8 -16 24 -32 32 -36 48 -59 65 -76 92 -108 123 -141 164 -188 214 -240 272 -310
29 -310 347 -392 438 -490 546 -608 677 -750 830 -922 1021 -1127 1249 -1383 1534 -1699 1888
46 1888 -2103 2351 -2639 2977 -3382 3883 -4512 5325 -6426 8004 -10437 14606 -23101 46940
60 46940 -239328 -783606 311157 720643 -359784 -662068 404991 568498 -418506 -488778
70 -488778 418309 391696 -397889 -313425 363827 226669 -318294 -160828 258749 94517
80 94517 -193431 -56013 117729 25549 -48100 -26559 -18566 36999 63447 -70318 -94251 101938
92 101938 97594 -141370 -87804 167782 56782 -192267 -20118 201274 -30417 -206340 82997
103 82997 195694 -144964 -176735 205801 139449 -267785 -89262 319185 22010 -358385
113 -358385 53494 377733 -133373 -376647 209067 357511 -274536 -322640 327998 279669
123 279669 -365404 -228437 391496 176743 -400843 -119634 401126 66347 -382168 -11400
133 -11400 352805 -32030 -303937 68561 249740 -83069 -184312 85802 126574 -65520
143 -65520 -69778 39199 31410 1166 1125 -37603 -15402 80106 26457 -113955 -22391 151307
155 151307 15412 -178100 5936 204509 -30960 -215505 68132 218122 -103149 -200753
165 -200753 140113 172722 -165552 -129845 182524 83768 -184254 -33999 176255 -11337
175 -11337 -157945 53872 133997 -91185 -104264 123736 68923 -151203 -29549 169658 -15648
186 -15648 -179870 60552 174919 -105474 -160278 139964 131702 -166700 -101016 176520 64596
197 64596 -179089 -35483 166727 5994 -153739 12859 130890 -33170 -110543 43294
207 43294 80867 -55014 -54231 54271 19557 -50964 8077 33118 -36826 -13029 50963 -16739
219 -16739 -60298 41536 54216 -67107 -44806 81572 26368 -93417 -10770 95839 -8967
230 -8967 -97611 25198 92875 -45164 -86918 63177 73382 -82228 -55512 96855 30626
241 30626 -105567 -2493 105709 -25120 -96909 50156 82142 -67481 -62314 79665 43964
252 43964 -83489 -24550 86000 10145 -83118 6670 81737 -19055 -73577 35919 65807
263 65807 -46343 -49027 57242 33212 -57627 -11290 55882 -3418 -42771 18362 31818 -22034
275 -22034 -14817 25644 5481 -20852 6557 20064 -11031 -13812 19814 12591 -24443 -5085 33153
288 33153 -495 -36390 13232 39903 -24063 -35002 36768 27988 -43515 -15559 47496 4921
300 4921 -44978 5176 40521 -10689 -34638 14071 29855 -15658 -27205 17100 24131 -20768
312 -20768 -21266 23404 14364 -26745 -7600 24378 -2194 -21237 6936 11720 -11742 -5415 8324
325 8324 -3640 -6057 4912 -1076 -8094 2506 4451 -6693 -6102 3624 3893 -6325 -8268 4991
339 4991 8414 -11154 -12251 13621 8225 -20719 -5886 21245 -2198 -22722 5655 17158 -10482
352 -10482 -14440 9015 9146 -8191 -8852 4284 8435 -4319 -11437 4607 12221 -8002 -11871 10509
366 10509 8287 -11958 -4022 10303 1043 -6192 551 2753 1706 497 -4359 633 8310 -1627
380 -1627 -8348 6457 8120 -7321 -2819 9065 1354 -4686 2732 3231 -101 1658 -176 -258 5275
395 5275 981 -4116 4476 5707 -4444 -315 7022 -1243 -2687 5835 1004 -3758 4701 3291 -4761
410 -4761 2526 6310 -3208 -1821 5708 874 -2802 1973 1786 309 1313 -1585 -197 5353 -1838
425 -1838 -6045 6450 5362 -9683 -1412 11306 -3224 -10329 6849 6831 -9016 -3739 8052 809
439 809 -7336 -1036 5180 1106 -7051 -3237 8320 754 -13150 528 13555 -7851 -15401 11641
453 11641 9910 -18169 -6567 17437 -1483 -18322 3732 13007 -8195 -12240 6257 8288 -8354
466 -8354 -9699 6778 7697 -10791 -8901 12049 3817 -16145 -535 14434 -7082 -12883 10886
479 10886 5370 -14543 797 11947 -8401 -8633 11569 1990 -13730 2865 13019 -7617 -11788
492 -11788 10853 11263 -14538 -10451 19634 9145 -25835 -5278 33731 -1023 -39274 12199 43501
505 43501 -24010 -41501 38072 37553 -47530 -27683 56701 19660 -59224 -8138 63362 1224
517 1224 -62165 9043 64573 -15637 -61687 27396 60799 -35257 -51937 46385 43496 -50577
529 -50577 -27944 54246 15745 -48431 -1135 42210 -6607 -29880 13610 20812 -14033 -9163
541 -9163 14640 2029 -11752 6863 10146 -13345 -4892 21596 -1476 -26810 11964 30112 -24017
554 -24017 -28110 37513 20689 -49000 -7953 56229 -8496 -58769 25372 54990 -42695 -48326
566 -48326 56281 37172 -69767 -26197 78905 10854 -89454 4010 94764 -24577 -100066
577 -100066 43999 97258 -68046 -91515 86904 76027 -105162 -60009 113625 37926 -119197
588 -119197 -20150 114988 905 -110293 11343 98967 -24035 -89145 29934 73951 -36936
599 -36936 -60336 36512 41685 -34725 -26020 24220 8710 -10806 1912 -9580 -8551 29724 6310
612 6310 -50727 1172 67029 -14845 -78892 30520 84940 -47360 -86140 64544 83231 -81151
624 -81151 -74875 97784 62986 -112193 -44013 125156 20988 -131522 8870 132482 -38875
635 -38875 -123083 70427 107850 -95848 -83726 118391 58658 -131164 -28728 141121 2791
646 2791 -142221 25626 141807 -48310 -133247 73046 123651 -90061 -105024 105948 86195
657 86195 -110934 -61232 110870 40170 -98819 -19497 83027 8408 -59406 -1289 37151
668 37151 3803 -13124 -9988 -6189 22624 24436 -37063 -37539 55750 47821 -75937 -52173 98836
681 98836 50410 -121257 -41460 141613 24464 -157254 -1444 164549 -25691 -164326
691 -164326 52717 153678 -78512 -137447 98677 114227 -115971 -89879 125494 60615 -132728
702 -132728 -32734 131817 1266 -128000 26765 114485 -56391 -97590 77266 71620 -94727
713 -94727 -45261 100067 15173 -100038 8853 88986 -31654 -76008 45059 56562 -55330
724 -55330 -38532 57319 17181 -56925 1037 48644 -21266 -37145 36579 17729 -49986 4843
736 4843 55582 -31933 -54737 58125 45077 -82567 -28518 101246 7092 -113198 16827
747 16827 118272 -40296 -116728 63162 110614 -82957 -98931 100982 84132 -114159 -63359
758 -63359 124553 40927 -126800 -13915 123857 -10503 -110680 34913 92959 -50842
768 -50842 -67348 63362 43033 -65227 -15931 63648 -5554 -53916 27155 43800 -41720 -27752
780 -27752 56168 12155 -63016 8343 68066 -27339 -63869 48666 55719 -65078 -38580 78733
792 78733 20030 -83211 3441 82653 -23966 -74008 43246 62146 -57161 -45808 68150
803 68150 28808 -74630 -9799 77930 -9107 -77075 28552 71027 -47339 -60410 62929
814 62929 43869 -75166 -24855 79520 2954 -78483 16329 69337 -34217 -57537 45575
825 45575 40745 -54396 -25230 56163 7374 -56730 7196 51577 -24241 -45547 36758 32928
837 32928 -50083 -19932 56636 965 -60916 16216 56291 -35150 -49020 47977 34291 -58728
849 -58728 -20529 61677 3709 -62840 9505 58103 -23732 -52897 33573 43800 -44277 -34424
861 -34424 51526 20931 -57439 -6526 58042 -9951 -54979 24676 46578 -37385 -34683 45527
873 45527 20803 -48679 -6461 48354 -5484 -43852 16503 39022 -23880 -31746 31354 24840
885 24840 -35627 -14854 40007 5742 -39843 6610 38335 -16421 -30626 26369 22451 -30430
897 -30430 -9690 32764 -250 -28858 11045 24561 -16572 -16164 22679 10292 -23706 -1326
909 -1326 26543 -4326 -25049 13238 25216 -19984 -20223 29107 15203 -34683 -5665 39242 -3979
922 -3979 -38691 14927 36063 -22927 -29309 29653 22740 -32360 -14943 33900 8552 -33480 -2565
935 -2565 32977 -3206 -31786 8997 29383 -15789 -25802 20985 19093 -25810 -12220 26802
947 26802 3352 -26506 2850 22192 -8676 -18494 10031 12426 -11359 -10311 9336 6815 -9528
960 -9528 -6703 7675 3847 -8179 -3288 5277 -197 -3869 259 -1902 -1338 5690 -2057 -11722 5220
975 5220 13357 -11960 -15266 16243 12940 -21481 -11465 23203 8036 -25178 -7035 25400 4971
988 4971 -26867 -4681 27907 2285 -29698 471 30346 -4426 -29736 8275 27046 -11180
1000 -11180 -22764 13004 18629 -11768 -14376 10549 12660 -7980 -11159 7498 11432 -6351 -10142
1013 -10142 8033 9736 -7509 -6102 8222 4533 -5408 -1799 4558 2583 -1209 -2308 1748 5146
1027 5146 -1073 -4859 4446 6248 -5908 -3139 8946 1994 -8431 1776 9210 -2592 -7174 4043
1041 4043 7936 -2752 -7565 3411 10248 -3573 -11451 6130 13587 -8363 -13181 11889 12039 -13398
1055 -13398 -9570 14003 7749 -13145 -6568 11572 6954 -10529 -7979 10461 8689 -11502 -9239
1068 -9239 12351 7731 -13673 -6568 12274 3909 -11404 -4024 8155 3702 -7402 -6379 5695
1081 5695 7441 -7661 -9683 8177 8309 -11045 -8196 10890 4836 -11923 -4724 9709 2892 -10201
1095 -10201 -4248 8919 3488 -11053 -4572 11981 2024 -14743 -241 14634 -3932 -14388 6378
1108 6378 11515 -8942 -9375 8482 6306 -8451 -5370 6785 4686 -6562 -5055 6836 4859 -7758
1122 -7758 -3567 8233 1719 -7366 772 5595 -1679 -2181 1967 -629 656 3149 -2908 -2954 6518
1137 6518 2584 -7989 288 9751 -1587 -8464 3977 9220 -4032 -8077 5821 9728 -6576
1150 -6576 -9018 10538 10089 -13280 -7176 18367 4945 -20290 1297 22993 -6151 -21386 12556
1163 12556 20371 -15646 -16552 19248 14582 -20236 -11291 22703 10011 -23355 -6944 26161 4514
1176 4514 -26754 146 27012 -4341 -24624 8611 20522 -10492 -15069 10581 9971 -8367 -5842
1189 -5842 4643 3290 -358 -2496 -3695 1900 6704 -2927 -10450 2427 13169 -3927 -18089 5021
1203 5021 21583 -9311 -26232 13933 26781 -21790 -26922 27702 22135 -34428 -17308 36747
1215 36747 8875 -39022 -2715 37101 -5236 -36014 10567 31738 -17314 -29127 22244 23327
1227 23327 -29071 -17628 33267 8521 -37712 305 37579 -11005 -36028 19014 30650 -26484
1239 -26484 -24322 29901 17187 -31307 -11245 30347 5830 -28225 -2205 25021 -1377 -21244
1251 -21244 4093 16546 -5911 -9836 6369 2719 -3875 6055 -581 -12355 9115 18254 -18060
1264 -18060 -19249 28989 18665 -37175 -13584 45667 8525 -50130 -994 54847 -5006 -55842
1276 -55842 13322 57241 -20652 -55020 30242 52235 -38034 -44429 46458 35405 -50478 -21966
1288 -21966 52929 10065 -49397 3277 44509 -12897 -35515 21555 27119 -25938 -16566 29927
1300 29927 7671 -30654 2321 30887 -11448 -27988 20785 23168 -28342 -15659 33585 5916
1312 5916 -35754 4629 33187 -14654 -27696 22003 18769 -27351 -9504 28248 -1013 -27902
1324 -27902 10020 24178 -19374 -20344 26691 13325 -34699 -6280 39900 -4685 -44597 15140
1336 15140 44397 -28284 -42047 38963 34231 -48854 -25399 53505 13089 -56271 -2746 53831
1348 53831 -8488 -50576 16512 43037 -24708 -36164 29528 26090 -34490 -16003 35973 3198
1360 3198 -35614 8760 30260 -21518 -22292 30488 10526 -37148 1855 38724 -15161 -37106
1372 -37106 26515 32117 -35514 -25307 42434 17182 -46916 -8135 49817 -1204 -49702 11776
1384 11776 48108 -21598 -42107 31772 33675 -38281 -21494 43009 9553 -42097 4527 38871
1396 38871 -15007 -30692 24946 22372 -30037 -11426 34108 2261 -34447 8420 34470 -17117
1408 -17117 -30250 27151 25892 -34612 -16661 41622 6936 -43538 5771 43344 -17010 -37647
1420 -37647 28053 29889 -34577 -18888 39439 8354 -39825 3113 38564 -12931 -34638 22421
1432 22421 29424 -30609 -21837 37748 12604 -42848 -1437 44913 -10779 -43913 22693 38527
1444 38527 -33315 -30686 40424 19652 -45022 -9327 44929 -1815 -43014 10046 37939 -18015
1456 -18015 -32913 23319 25233 -28437 -18096 30649 8100 -32162 1147 29077 -11838 -24813
1468 -24813 19236 15726 -26161 -6544 27807 -4686 -27863 13223 23359 -21736 -18740 26742
1480 26742 11762 -31249 -5876 32505 -1631 -34123 8447 32868 -16248 -30009 23141 24350
1492 24350 -29630 -16502 33544 6727 -34213 3583 31615 -13041 -26216 20802 18702 -25734
1504 -25734 -10403 28957 2568 -29787 6024 30021 -13327 -28272 21192 25904 -28002 -20308
1516 -20308 34942 14576 -38701 -5561 41418 -2431 -39292 11258 35842 -16666 -28896 21467
1528 21467 22728 -21857 -15398 22159 10270 -19488 -4246 17830 243 -13672 4967 10133
1540 10133 -8000 -3921 11522 -1825 -11398 9819 10553 -15938 -6129 21280 1051 -23353 5434
1553 5434 23954 -10517 -21493 15299 18673 -18081 -15126 20578 11213 -22034 -7143 23012 1991
1566 1991 -23441 3447 22244 -10020 -19879 15558 14806 -21096 -8807 23551 1115 -25080 4927
1579 4927 23041 -11172 -21148 14417 17654 -18244 -15610 19217 12305 -21459 -10364 21962 6549
1592 6549 -23317 -3562 21427 -1019 -20061 3102 15270 -5305 -11279 4415 5871 -3038 -2942
1605 -2942 -1102 -54 4104 253 -7956 -925 9706 388 -12359 -385 13799 -88 -16294
1618 -16294 322 18552 -2376 -20686 5006 21683 -8369 -21174 11995 19064 -14899 -15406
1630 -15406 16320 11472 -16170 -7457 15236 4964 -13510 -2296 12696 836 -10924 1808
1642 1808 10631 -3686 -8298 7050 6633 -8605 -2450 10467 -424 -9639 4334 8851 -5753
1655 -5753 -6022 7255 4753 -6051 -2787 5776 3223 -3964 -2734 4328 3605 -3260 -2842 3748 2841
1670 2841 -2169 -1574 1078 2009 1906 -2442 -3973 4638 5669 -7072 -5744 9958 5271 -11717 -3690
1685 -3690 12741 2012 -12708 -1118 12352 530 -12146 -413 12252 -11 -13205 597
1697 597 13102 -2745 -13128 4044 11149 -6136 -9285 6182 5820 -6181 -4412 3987 2408 -3023
1711 -3023 -2985 1173 2556 -1468 -3736 763 2504 -1612 -2628 883 1019 -879 -1190 -1030 735 1092
1727 1092 -2607 -2489 3522 1135 -5885 62 5960 -2890 -6029 4082 4221 -5642 -3304 5685 1685
1742 1685 -6062 -1235 5483 1200 -5936 -1158 6852 466 -7970 934 8820 -3049 -8247 5222
1756 5222 7161 -6503 -4766 7186 3038 -6094 -1065 5380 1031 -3949 -571 3631 1881 -3207
1770 -3207 -1284 4063 1415 -3466 123 3937 -194 -1824 933 1182 744 368 -1812 340 4616 -722
1786 -722 -5565 3416 7139 -5083 -6015 7437 5781 -8071 -4076 9561 3806 -9099 -2794 10489
1800 10489 3353 -11464 -2116 13409 1192 -14375 1536 14962 -4167 -13979 7036 12249 -8739
1813 -8739 -9596 9187 7009 -8915 -4904 7835 3217 -7183 -2609 6164 1382 -6037 -537 4816
1827 4816 -1340 -4192 2288 1608 -3794 403 2869 -3667 -2019 4680 -1262 -5758 2999 4122 -5787
1842 -5787 -3152 6015 6 -6958 1401 6050 -3740 -6381 4750 5293 -7157 -5454 9097 3666
1856 3666 -12345 -2523 14614 -1144 -17203 4763 17376 -9686 -17162 13434 14799 -16712 -11877
1869 -11877 18434 8749 -19354 -6359 19386 4066 -19291 -1793 19212 -809 -18407 3676
1881 3676 17137 -6446 -14202 8887 10774 -9727 -5668 9456 2263 -7146 1703 4274 -3223 -431
1895 -431 4411 -2045 -3578 5263 3568 -6493 -1843 9094 1584 -10169 940 12458 -2959 -12991
1909 -12991 6994 13745 -10285 -11272 14896 8776 -17046 -3562 19101 -793 -18306 6310 17148
1922 17148 -9749 -14287 13390 11759 -15635 -8379 18064 5733 -19375 -1691 20717 -2498
1934 -2498 -20724 7494 19507 -12318 -16543 16084 12113 -18413 -6915 18375 1632 -17572
1946 -17572 2468 14364 -6207 -11573 8062 7949 -10081 -4890 10617 622 -11614 3016 10760
1959 10760 -8010 -9636 11615 6050 -15829 -1885 17467 -4285 -18181 9134 15787 -14578
1971 -14578 -13132 17305 8512 -19994 -4715 20286 -302 -20640 3744 19188 -8424 -18128
1983 -18128 12002 14900 -16206 -11374 18661 5806 -20703 -129 20026 -6444 -17896 11570
1995 11570 13325 -15522 -8143 17381 2302 -18064 3012 16950 -7568 -15147 11527 12929 -15046
2008 -15046 -9622 18734 5716 -20969 -379 22575 -5091 -21588 11342 19649 -16312 -14584
2020 -14584 20378 9937 -21478 -3184 21857 -1682 -19420 6868 17321 -10100 -13294 13868
2032 13868 10041 -15518 -4843 17978 552 -18056 5948 17898 -11164 -14564 17219 10641
2044 10641 -20437 -4380 22475 -1154 -21593 7167 19848 -11442 -16186 15029 12453 -17018
2056 -17018 -8035 18160 3671 -18242 1284 17518 -5813 -15520 10868 11970 -15422 -6940 18132
2069 18132 570 -19410 5927 18395 -12307 -15755 16860 11106 -20684 -6872 22092 1534
2081 1534 -23098 2469 22106 -7223 -21373 10756 18462 -15199 -15711 18039 10421 -20925 -5059
2094 -5059 20755 -2032 -19994 7403 15812 -12985 -11634 15569 5643 -17929 -828 17643 -4588
2107 -4588 -17482 8338 15562 -12782 -13894 15525 10629 -18889 -7521 20708 2523 -21489 2409
2120 2409 19944 -7263 -16792 10998 12334 -13228 -6899 13420 1728 -12228 2912 10105 -6557
2133 -6557 -6774 9784 3624 -11601 733 13875 -4384 -14237 9491 14688 -14052 -12450 19341
2146 19341 9587 -22366 -4547 25054 -312 -24738 6124 23620 -10013 -20262 13925 17485
2158 17485 -15471 -12868 17515 9723 -17790 -5081 18298 1421 -17569 3463 16411 -7077
2170 -7077 -12976 11088 9263 -12914 -4085 13988 -189 -12521 4415 10496 -7065 -7337 8950
2183 8950 4472 -9291 -1742 9331 -1003 -8451 3525 7586 -6014 -6046 8251 3060 -10523 201
2197 201 11237 -4865 -11142 8967 8713 -12869 -6254 15292 1768 -16882 1837 16244 -5841
2210 -5841 -16029 8280 14009 -11361 -13166 12946 10668 -15667 -8841 16925 4876 -18637 -1909
2223 -1909 17780 -2800 -16971 6008 13673 -8951 -10854 9684 6655 -10167 -4238 9012 1239
2236 1239 -7936 113 6285 -1950 -5521 2709 3690 -4142 -2061 4785 -800 -5060 3392 3825 -5772
2251 -5772 -1595 7695 -1197 -8167 4327 7809 -6831 -5766 8951 4300 -9891 -2027 10742 694
2265 694 -10754 1404 11358 -2767 -10910 5324 11106 -6980 -9464 9978 7760 -11096 -4266
2278 -4266 12502 1457 -11550 2127 10443 -3692 -7839 5632 6516 -5714 -3957 6541 3147
2291 3147 -6166 -1202 6962 163 -6656 1832 6564 -3599 -4819 5587 3516 -5829 -952 6115
2305 6115 -704 -4490 2650 2948 -2879 -975 2935 -527 -2002 1570 1202 -2371 -727 2880 46
2320 46 -3822 539 4675 -1926 -5855 3300 6130 -5821 -6245 7704 4591 -9773 -3128 10189 576
2335 576 -10643 562 9293 -2328 -8857 2342 7536 -3396 -7445 3226 6396 -4374 -6180
2348 -6180 4447 4313 -5705 -3412 5296 875 -4873 629 2607 -2024 -1361 1637 -610 -1617 1468
2363 1468 332 -2306 398 2044 -905 -1904 755 1871 -1042 -2482 1221 2461 -2002 -2666 3065
2378 3065 2084 -4177 -423 4480 -991 -4237 3071 3366 -4093 -1440 5054 -111 -4723 1585 4712
2393 4712 -2115 -3753 2896 4194 -2923 -3701 4320 4298 -4790 -3275 6520 2784 -6784 -986 7619 -257
2409 -257 -6398 2427 5872 -2186 -3863 2783 3053 -1627 -1758 1468 1840 -439 -1492 739 1730 -292
2425 -292 -787 158 389 742 509 -1569 -358 3215 47 -4420 1406 5026 -2866 -4740 4393 3751 -5190
2442 -5190 -2760 5343 1343 -5468 -611 4599 -220 -4533 756 4405 -1367 -4709 2372 4126 -3998
2457 -3998 -3648 4995 1518 -6372 -220 5808 -2029 -5595 3093 3667 -4364 -2633 4261 1178 -4093
2472 -4093 -1093 3190 203 -3504 -369 3085 -466 -3568 1018 2624 -2607 -1792 2722 -231 -3156
2487 -3156 1555 1991 -3358 -484 3828 -1514 -3985 2624 2992 -4170 -2139 4412 1400 -4688 -817
2502 -817 4629 220 -5069 452 5846 -1599 -6006 3488 5917 -4848 -4477 6880 3101 -7608 -363
2517 -363 7984 -1245 -6850 3238 5962 -3846 -4314 4525 3682 -4122 -2385 4787 2168 -4498 -746
2532 -746 5157 228 -4523 1937 4071 -2727 -1639 4313 -33 -3992 2550 3240 -4199 -1179 5709
2547 5709 -159 -5792 2185 6071 -3050 -5427 4464 5709 -5157 -5278 6471 5119 -7606 -3979
2561 -3979 9162 2424 -9825 -238 9895 -2139 -8851 4347 7006 -5599 -4637 5963 2252
2574 2252 -5970 -496 5059 -1159 -4808 2038 3782 -3545 -3373 4359 1759 -6439 -648 6758 -1917
2589 -1917 -7382 3756 6031 -6332 -4506 7308 1661 -8205 337 7010 -2982 -6223 4215 4077
2603 4077 -5592 -2980 5840 1201 -7056 -77 7142 -2453 -7953 4450 7503 -7353 -6839 9302
2617 9302 4537 -11143 -1952 11686 -1021 -11481 3632 10066 -5619 -8175 6611 6356 -7285
2630 -7285 -4635 7516 3011 -7518 -1274 7607 -472 -6851 3114 6373 -4789 -4081 6876 1735
2644 1735 -7103 1609 7261 -3877 -5205 6647 3565 -7138 -882 7960 -589 -7217 2940 7174
2658 7174 -4003 -6221 6140 5767 -7230 -3985 9394 2351 -10437 938 11255 -3755 -9973
2671 -9973 7282 8909 -9429 -5559 10934 2906 -11121 -60 10861 -1927 -9761 3815 8841
2684 8841 -5397 -7458 6702 5922 -8150 -3805 9086 1127 -9657 1828 8736 -4976 -7330
2697 -7330 7353 4365 -9137 -1430 9219 -1578 -8707 3509 7363 -5475 -6277 6240 4729
2710 4729 -7609 -3603 7849 1566 -8747 250 8297 -3229 -7875 5049 5668 -7887 -3234 8338
2724 8338 -648 -8855 3544 7274 -6642 -5980 8207 3227 -9777 -1573 10183 -891 -11234
2737 -11234 2352 11221 -4819 -11390 7005 10278 -9511 -9136 11403 6246 -12807 -3301 12754
2750 12754 255 -11467 2611 9444 -4460 -6810 5295 4523 -5488 -2079 5738 363 -5098
2763 -5098 1802 4693 -3417 -3648 5810 2425 -7254 194 8915 -2434 -8460 5735 7730 -7661
2777 -7661 -5485 9649 3301 -9947 -42 9802 -1719 -8250 3913 7693 -4919 -6060 6715
2790 6715 5022 -7769 -2664 9410 764 -9989 2393 10480 -5272 -8905 8260 7580 -9927
2803 -9927 -4689 11287 2077 -10963 508 10407 -1943 -9000 3458 8235 -4198 -6545 5173
2816 5173 5428 -6026 -3743 6426 1338 -6511 757 5228 -3476 -3430 5032 895 -5972 1750 5077
2831 5077 -4515 -4429 6050 2540 -7650 -1283 7379 -732 -8397 1553 8002 -3644 -8330 5077
2845 5077 7540 -7042 -6954 8655 4708 -10836 -2698 11055 -660 -11119 2803 9200 -5515
2858 -5515 -7783 6205 5463 -6987 -3930 6761 2356 -7226 -1322 7005 -397 -6929 1479 6161
2872 6161 -3330 -4948 4903 2981 -5559 -638 5294 -1662 -4194 3110 2550 -4320 -192 4373 -1328
2887 -1328 -3933 2730 3827 -3661 -2668 4658 2460 -5315 -1553 6502 778 -6921 1320 7778 -2795
2902 -2795 -6876 5567 6092 -6706 -3725 8001 1655 -7748 974 7379 -2203 -5757 3951 5291
2916 5291 -4164 -3680 5536 3267 -5662 -1924 7057 827 -7399 1111 8001 -2462 -6930 4622 5581
2931 5581 -5503 -3646 5936 1814 -5128 -306 4295 -256 -2953 794 1989 -838 -1381 1114 528
2946 528 -1416 45 1586 -1398 -1700 2376 886 -4235 100 4669 -2124 -5174 3481 4190 -5287 -3196
2962 -3196 5473 1304 -6169 -460 5469 -967 -5452 1086 4680 -2070 -4833 2536 4064 -4111 -3925
2977 -3925 4847 2268 -6414 -894 6249 -1451 -6103 2771 4875 -4159 -3683 4261 2084 -4467 -1304
2992 -1304 3907 496 -3643 -383 3417 -318 -3463 895 3234 -1649 -2647 2474 1360 -2896 -120
3007 -120 2658 -1422 -1504 2369 390 -2501 1153 2337 -1702 -1323 2619 515 -2363 294 2559 -279
3023 -279 -2141 660 2632 -796 -2927 2258 3405 -2921 -2678 4664 1928 -5039 -70 5705 -1114
3038 -1114 -4902 2768 4503 -3148 -2823 3957 2244 -3292 -1293 3761 1308 -3384 -760 4103 389
3053 389 -3966 878 4077 -1826 -3307 2973 2237 -3195 -601 3343 -786 -2273 1627 1115 -1752 -399
3069 -399 1485 -571 -1274 537 595 -875 -1145 704 968 -1259 -1129 1733 769 -2704 -18 2716 -1526
3086 -1526 -2873 2225 1530 -3184 -817 3069 -828 -2834 1421 1866 -2099 -1439 1800 473 -1903 -576
3102 -576 1743 214 -2537 -238 2548 -671 -3432 1569 2812 -3231 -2653 3644 1194 -4342 -138
3117 -138 3665 -1401 -3253 1617 2194 -1755 -1551 1185 1120 -1179 -1207 1041 878 -1324 -313 1522 -148
3134 -148 -1160 1415 937 -1824 349 2668 -1805 -2121 3325 1577 -3693 -238 4121 -359 -3620 1266
3150 1266 3807 -1251 -3195 1796 3683 -1600 -3283 2389 3646 -2836 -3009 3946 2679 -3974 -812
3165 -812 4010 382 -3056 1037 2226 -1089 -260 1009 18 -46 739 -278 -623 986 927 -786 -914
3182 -914 1096 1422 -1048 -1983 1921 2462 -2810 -2229 3930 1558 -4903 -437 5149 -1002 -4743 2289
3198 2289 3959 -3119 -2949 3056 1942 -3258 -1586 2970 646 -3261 -804 3419 -513 -3930 1234
3213 1234 3496 -2845 -3139 3686 1636 -4665 -557 4306 -1217 -4217 1650 2922 -2577 -2418 2011
3228 2011 1276 -2092 -1639 1518 1004 -1955 -1099 1415 269 -1551 93 632 -1135 -32 1146 -1680
3244 -1680 -1482 2900 180 -4118 768 4400 -2364 -4387 3466 3995 -4001 -3355 4611 2931 -4886 -2767
3260 -2767 5234 2613 -5703 -1833 6410 1040 -6745 641 6769 -1840 -5746 3434 4636 -3883 -2767
3275 -2767 4181 1650 -3318 -87 2961 -210 -1867 1126 1712 -1067 -762 2074 643 -2402 213
3290 213 3261 -1219 -2939 2879 2888 -3919 -1658 4810 712 -4615 860 4364 -1698 -3147 2276 2477
3306 2477 -2311 -1412 2222 925 -1886 -329 1833 -86 -1694 1096 1362 -2097 -748 3114 -420
3321 -420 -4041 2132 4106 -3886 -3817 5239 2344 -6247 -1180 6692 -132 -6701 643 6085 -1537 -6313
3337 -6313 1747 5917 -2763 -5886 3098 5305 -4653 -4310 4851 2357 -5266 -1186 4302 -853 -3735
3352 -3735 1856 1606 -2784 -587 2186 -1000 -2425 1836 1800 -2641 -1815 3183 1635 -4019 -1389 4586
3368 4586 854 -5329 314 5511 -1926 -5304 2864 3938 -3642 -2719 4057 982 -3418 265 2572
3383 2572 -1432 -1642 2046 675 -2021 82 2806 -595 -3156 1650 3766 -2648 -3720 4203 3729
3398 3729 -5272 -2588 6760 1452 -6943 384 7019 -1438 -5875 2729 5147 -2857 -3726 3327 2972
3413 2972 -2710 -2020 3148 1548 -3130 -119 3392 -874 -2969 2715 2063 -3545 -574 4569 -942
3428 -942 -4441 2952 4084 -4072 -2983 4875 1993 -4860 -1110 4971 559 -4697 128 4790 -620
3443 -620 -4582 1381 4206 -2408 -3430 3174 1977 -3799 -725 3509 -1017 -2722 2144 1430 -2947
3458 -2947 -78 3052 -1398 -2970 2127 2277 -3047 -2286 2984 1273 -3858 -1606 4204 266 -5232
3473 -5232 221 5494 -1989 -5434 3052 4366 -4659 -3381 5270 1439 -5908 -235 4855 -1241 -4650
3488 -4650 1667 3711 -2682 -3491 2611 2900 -3721 -2458 3929 1352 -4651 -376 4649 -1100 -4165
3503 -4165 2346 3072 -3175 -1549 3514 388 -2939 997 2521 -1637 -1215 1915 895 -2034 45
3518 45 2415 -264 -2264 977 2835 -1586 -2315 2701 2467 -3383 -918 4335 56 -4406 1755 4109
3534 4109 -2822 -2763 4069 1842 -3741 -466 4147 -9 -3701 1068 3766 -1390 -3532 2467 3585
3549 3585 -2931 -3011 4175 2393 -4793 -888 5368 -262 -4786 1617 4278 -2502 -3156 3103 2127 -2911
3565 -2911 -1153 2471 525 -2350 -131 2213 -193 -2258 771 1871 -1653 -1209 2057 224 -2883
3580 -2883 696 2460 -2212 -1898 2934 653 -3501 288 2856 -1481 -2530 1936 1678 -2551 -1454
3595 -1454 2420 785 -2746 -802 2887 -294 -3592 452 3353 -1883 -3620 2783 2615 -3971 -1652
3610 -1652 3978 -181 -4196 964 3483 -1997 -2678 2009 1541 -2275 -1313 2292 874 -2549 -540 2595
3626 2595 -26 -2741 640 2867 -1857 -2241 2842 1531 -3167 -144 3454 -813 -2703 1782 2198
3641 2198 -1907 -1250 1991 576 -1719 -92 1765 195 -1461 462 1752 -530 -1539 1576 1313
3656 1313 -1895 -181 2737 -505 -2397 1937 2297 -2550 -985 3307 519 -2889 594 3084 -782
3671 -782 -2467 1054 2418 -782 -1986 1303 2300 -1235 -1841 1901 1619 -2058 -710 2227 -102 -1583
3687 -1583 952 838 -1623 294 1469 -1544 -1154 1915 374 -2547 -62 1935 -311 -2241 207
3702 207 2280 -489 -2741 573 2939 -1520 -3351 1682 2719 -2768 -2344 2946 1092 -3439 -427
3717 -427 2451 -711 -2172 639 1063 -918 -597 811 241 -1042 -364 952 -248 -1464 336 1431
3733 1431 -1640 -1910 1919 971 -2771 -667 2743 -506 -2888 1016 1917 -1384 -1577 1230 748 -920
3749 -920 -643 438 681 -265 -866 290 801 -301 -341 462 -243 107 826 -421 -861 1481 791 -2117
3767 -2117 10 2556 -509 -2443 1436 2143 -1900 -1296 2075 1090 -1500 -546 1745 828 -1682 -481
3783 -481 2131 412 -2129 437 2606 -1029 -2060 2236 1879 -2671 -623 3225 -211 -2735 861
3798 861 2510 -1033 -1613 1387 1648 -957 -1683 1091 1874 -1317 -1808 1773 1419 -2081 -704 2070 153
3815 153 -1721 505 981 -745 -207 338 -674 285 742 -859 -747 1217 120 -1572 -17 1465 -363
3832 -363 -1388 320 1188 -317 -1707 80 2000 -676 -2560 1074 2660 -2319 -2523 2982 1545 -3550
3848 -3550 -1052 3397 -149 -3381 480 2611 -1122 -2780 970 2423 -1157 -2676 1002 2387 -1953
3863 -1953 -2508 2166 1848 -2925 -1218 2620 198 -2403 291 1502 -504 -924 304 199 -11 -99 -285
3880 -285 122 678 -284 -731 295 658 -145 -538 110 739 639 -1256 -646 1910 285 -2246 503 2643
3898 2643 -1076 -2042 2005 1594 -2147 -699 2310 178 -1641 542 1547 -376 -1098 808 1612 -848
3914 -848 -1210 1643 1298 -2080 -784 3119 133 -3204 1040 3302 -2053 -2709 2905 2133 -2750 -1275
3930 -1275 3044 830 -2237 -767 2324 763 -2253 -775 2600 578 -2372 299 2393 -624 -1874
3945 -1874 1185 1159 -1289 -211 792 -612 -116 838 -672 -865 1044 564 -1481 -231 1343 -204
3961 -204 -1260 -6 939 -228 -1379 -151 1289 -435 -2013 666 1592 -1665 -1415 1826 279 -2451
3977 -2451 570 1968 -1850 -1681 2169 653 -2694 -519 2398 -395 -2610 298 2373 -779 -3019
3992 -3019 743 3057 -1699 -3561 2168 3104 -3111 -2561 3583 1494 -3591 -670 3193 -190 -2668
4007 -2668 573 1806 -300 -1468 167 1272 -189 -891 341 959 -557 -278 662 -156 -474 1144
4023 1144 359 -1462 640 1909 -1192 -1265 1976 1065 -2146 -30 2319 -429 -1733 1300 1476 -680
4039 -680 -745 927 1037 -637 -643 1600 882 -1503 -21 2250 -629 -2157 1731 2083 -2368 -1108 3320
4056 3320 310 -3149 712 3200 -1339 -2506 1782 2204 -1797 -1693 1785 1668 -1970 -1644 2559 1260
4072 1260 -3001 -720 2983 -365 -3023 1287 2364 -2007 -1523 1985 418 -2050 160 1487 -698
4087 -698 -1041 501 515 -637 -669 362 246 -803 -669 994 35 -1383 332 1029 -1395 -946 1435 -89
4105 -89 -2035 830 1683 -2035 -1114 2222 197 -2617 517 2158 -1018 -2196 980 1880 -1437 -1831
4121 -1831 1401 1721 -1985 -1876 2705 1210 -3298 -963 3333 -340 -3272 1251 2860 -1719 -2192 2270
4137 2270 1152 -2239 -577 2033 254 -1591 133 1672 -173 -1357 453 1644 -625 -1297 1709
4152 1709 955 -1820 125 2165 -847 -1427 1665 818 -1713 140 1748 -696 -1245 1165 872 -1017
4168 -1017 -419 1062 592 -747 -301 1364 310 -1386 312 1945 -598 -1813 1639 1613 -2391 -803
4184 -803 2757 222 -2527 1094 2353 -1423 -1830 1868 1244 -1591 -662 1492 606 -1650 -638 1830
4200 1830 219 -2015 8 2215 -1036 -2059 1652 1067 -2146 -484 2111 -743 -1891 1009 917 -1678
4216 -1678 -540 1499 -101 -1496 187 986 -595 -1508 242 1259 -960 -1712 1247 1365 -2116 -1364
4232 -1364 2299 388 -2925 268 2301 -1288 -1862 1069 936 -1521 -522 1082 10 -846 -372 412
4248 412 1 -498 -132 544 -231 -517 579 201 -1206 354 1333 -990 -1308 1803 689 -2197 44
4265 44 2374 -575 -1862 1063 1407 -1155 -839 1119 793 -685 -317 733 582 -877 -223 1198 -81
4282 -81 -1409 1065 1430 -1624 -817 2458 -137 -2311 1067 2414 -1566 -1686 2015 1322 -1785 -915 1886
4299 1886 1073 -1592 -795 1884 1217 -2109 -943 2689 408 -2457 130 2275 -730 -1552 885 1083
4315 1083 -669 -347 401 -122 437 85 -782 309 915 -503 -977 585 513 -479 -679 -41 639 215 -1074
4334 -1074 -190 1608 -543 -1898 755 1484 -1710 -1378 1670 284 -2071 103 1519 -778 -1121 624
4350 624 524 -769 -848 498 390 -814 -738 962 380 -1635 -287 1784 -477 -2281 1039 1717 -1913
4367 -1913 -1246 1838 535 -1961 -165 1405 -60 -1058 6 943 26 -1114 -382 1232 217 -1284
4383 -1284 201 1206 -881 -736 874 227 -545 427 175 -934 393 815 -863 -249 1061 86 -898
4400 -898 537 770 -485 -543 574 489 -210 -357 162 716 -48 -884 626 992 -816 -319 1529 74
4418 74 -1115 748 1087 -1023 -246 1592 -278 -1166 733 1078 -484 -655 538 748 -334 -788 662
4435 662 1234 -977 -1170 1558 971 -1936 -486 2338 -94 -2152 796 1654 -1123 -1204 1074 647 -741
4452 -741 -550 374 707 -183 -913 380 1013 -852 -957 772 164 -1004 105 467 -322 -142 -136 -599 -8
4471 -8 540 -670 -784 1156 330 -1662 -63 1068 -534 -1071 480 768 -572 -851 119 759 -410 -1256
4489 -1256 -72 1307 -658 -1607 1189 920 -1842 -598 1773 -389 -1542 574 929 -832 -507 894
4505 894 58 -659 -53 616 101 -795 -91 1049 -56 -1322 351 1532 -1031 -1205 1587 780 -1784
4522 -1784 -358 1967 -177 -1418 719 1186 -324 -519 276 659 91 -665 -116 935 284 -752 476
4539 476 924 -217 -220 572 -10 -32 743 -191 -570 895 275 -1052 379 1104 -639 -602 1099 309 -775
4558 -775 232 500 -203 -353 115 394 -53 -477 148 684 -379 -803 881 899 -1556 -363 2078 -275
4576 -275 -2185 893 2214 -1338 -1887 1709 1339 -1737 -1444 1454 1147 -1550 -1569 1427 1483 -2160 -1605
4593 -1605 2449 958 -2578 -717 2257 -116 -1849 96 913 -384 -907 -282 287 366 -473 -913 532
4610 532 985 -898 -943 645 723 -729 -645 412 772 -247 -1090 104 1310 -508 -1772 828 1330 -1575
4628 -1575 -885 1876 475 -1818 453 1496 -735 -1070 1032 751 -1122 -473 1000 829 -1139 -724
4644 -724 1762 612 -2024 -145 2539 50 -2493 1044 2493 -1446 -1845 1895 1710 -1641 -890 1560
4660 1560 735 -847 -542 1016 978 -672 -599 880 942 -737 -431 966 276 -252 299 163 62 770 -235
4679 -235 -984 977 1096 -1371 -549 1582 258 -1258 172 1310 -365 -698 427 787 -313 -682 384
4696 384 808 -567 -994 826 582 -1366 -255 1690 -438 -1681 1443 1199 -1898 -1009 1900 102
4712 102 -2033 -134 1693 -270 -1743 156 1469 -250 -1837 233 1865 -772 -2057 1009 1456
4727 1456 -1621 -1227 1537 282 -1617 -77 720 -526 -486 208 -301 -165 426 -381 -432 367 260 -331
4745 -331 -605 99 356 -138 -664 53 913 -519 -1225 980 1104 -1319 -643 1716 39 -1699 710 1129
4763 1129 -708 -676 943 411 -721 71 622 49 -414 66 709 8 -690 412 1039 -779 -839 1637
4781 1637 611 -1575 31 1967 -489 -1375 1081 1224 -1056 -535 1399 383 -1012 -155 1200 260
4797 260 -570 -230 1008 367 -1077 339 1246 -511 -897 1225 663 -1296 267 1335 -594 -807 1158
4814 1158 390 -938 92 915 -233 -787 77 570 7 -400 53 656 -154 -941 384 471 -578 -654 789
4833 789 276 -767 293 349 -817 192 682 -814 -580 1021 -196 -1124 306 818 -748 -1205 543
4850 543 726 -357 -1193 366 1195 -932 -1648 1100 1294 -1760 -1233 2038 617 -2372 88 1840 -488
4867 -488 -1612 586 946 -578 -888 445 696 -280 -913 466 754 -627 -509 821 220 -1199 195
4884 195 967 -688 -673 933 205 -706 95 694 -167 -116 219 63 135 244 -379 12 592 -17 -400 348
4904 348 476 -85 -40 261 182 136 -143 -398 972 317 -1298 -5 1503 -286 -1674 996 1444 -782
4922 -782 -979 1165 792 -665 -529 899 816 -705 -533 999 953 -1028 -707 1649 421 -1680 184
4939 184 1313 -539 -1156 706 580 -708 -373 410 295 -423 -416 64 397 -111 -641 383 628 -617 -281
4958 -281 806 57 -700 424 147 -284 -28 -25 -526 110 29 -813 -131 587 -534 -801 825 354 -845
4977 -845 -429 500 -241 -632 -59 146 329 -523 -525 440 313 -904 -377 1081 23 -1357 303 1140 -751
4996 -751 -832 795 463 -687 -371 457 241 -242 -342 199 724 -281 -721 739 466 -953 -38 1011
5014 1011 -276 -470 444 281 -241 116 174 -285 353 359 -402 -144 381 43 33 354 118 -76 270 -254 -49
5035 -49 720 105 -613 295 830 -492 -171 905 17 -374 411 390 -199 229 258 -127 409 123 -401 189
5055 189 545 -105 -292 539 203 -93 51 -327 35 574 -277 -470 512 591 -712 -269 932 -71 -915
5074 -915 404 574 -372 -263 166 -43 29 -190 -247 330 -47 -401 193 357 -492 -144 490 -131 -691 574
5094 574 298 -957 -134 848 -514 -769 374 327 -627 -414 270 368 -67 -635 -62 623 -337 -867 474
5113 474 520 -851 -651 767 76 -767 -65 578 -568 -260 271 -198 28 167 -234 -91 349 -127 -71 233
5133 233 131 -333 281 -71 -172 256 400 -267 21 415 -379 -142 446 -207 -380 846 -99 -690 511
5152 511 745 -710 -306 1066 218 -907 101 1092 105 -805 -253 1164 426 -870 -88 1695 192
5169 192 -1675 412 1987 -667 -1520 1029 1253 -1136 -1004 1290 918 -690 -748 777 941 -647 -817
5186 -817 968 926 -1041 -659 1279 613 -1084 -103 1157 31 -655 101 302 243 -258 -737 329 783
5204 783 -845 -1019 1066 971 -1108 -663 955 306 -843 -460 861 302 -1273 -787 898 590 -1541
5221 -1541 -635 1679 141 -1970 345 1700 -1053 -1568 1108 946 -1377 -899 1190 449 -1270 -696
5237 -696 793 298 -1399 -402 1461 96 -1583 -70 1466 -587 -1389 748 1027 -817 -706 489
5253 489 136 -230 -262 -114 361 209 -698 -307 1131 55 -1208 96 948 24 -1020 62 935 320
5271 320 -863 -536 1174 657 -1531 -266 1916 -35 -1969 640 1906 -907 -1483 1100 1400 -947
5287 -947 -844 738 933 -500 -630 730 659 -444 -463 1075 335 -942 385 936 -676 -206 970 110
5305 110 -886 382 760 -576 -193 762 327 -758 1 320 -115 -163 -211 110 364 -533 -183 369 -121 -625
5325 -625 269 146 -572 30 470 -788 -181 719 -331 -1004 928 927 -1118 -473 1104 181 -970 -271 1114
5344 1114 93 -1109 -394 944 265 -1442 -386 1365 -290 -1627 418 1005 -906 -921 861 212
5360 212 -880 198 491 -411 -102 454 -277 -422 264 264 -470 -346 177 527 -359 -666 707 810 -781
5379 -781 -772 1048 322 -1429 -8 1320 -396 -1044 853 859 -733 -229 553 90 -363 -87 318 175 -326
5398 -326 -69 361 145 -245 242 337 -437 -39 796 -124 -702 779 535 -896 -24 910 -25 -675 502
5417 502 526 -372 -72 382 -133 -105 133 20 193 -109 24 524 20 -465 460 526 -758 -334 1338 -101
5437 -101 -1286 510 1348 -897 -961 1090 622 -1114 -429 1012 250 -809 -356 815 499 -971 -343
5454 -343 1349 60 -1218 280 1118 -427 -956 957 431 -722 -392 323 -183 -300 35 -168 -111 137
5472 137 -146 -300 135 85 -330 18 -45 -58 134 -357 -272 23 52 -716 165 643 -468 -348 501 -176 -671
5493 -671 384 656 -889 -378 721 65 -559 8 505 -123 -592 13 354 -92 -900 148 851 -305
5511 -305 -1210 832 983 -770 -786 1040 416 -992 42 650 -45 -305 245 256 67 -224 -356 395 381
5530 381 -390 -111 506 -14 -381 663 56 -65 151 378 -344 89 537 -316 -90 592 100 -459 404 223
5550 223 -220 265 232 -218 106 580 -14 61 352 -25 84 182 -141 137 382 -247 -411 873 291 -981
5570 -981 84 1167 -282 -853 360 798 -474 -283 211 191 -90 -447 -176 655 154 -885 96 652
5588 652 -377 -604 515 322 -465 -198 230 -168 -19 -40 -424 79 309 -424 -230 506 -202 -628 214 -21
5608 -21 -553 159 43 -352 -70 291 -425 -403 354 -47 -165 76 -136 -161 266 -71 -373 230 276 -482 0
5629 0 423 -303 -385 234 -128 -116 254 81 -215 296 297 -496 -22 530 -269 -73 279 135 -159 124 -6 -114
5651 -114 225 206 -185 355 368 -402 -3 504 -142 -190 467 41 -126 369 60 -182 215 460 -158 16 411
5672 411 -123 85 243 80 -59 119 -38 -127 378 -9 -346 374 473 -434 21 521 -260 -272 587 49 -547
5693 -547 334 338 -348 -139 416 21 -180 135 25 216 -119 -334 218 422 -473 -605 712 402 -1149 -174
5713 -174 827 -202 -703 16 295 -261 -190 -12 -15 71 -181 -373 275 330 -488 -248 398 -240 -199 38 -16 -21
5735 -21 203 -358 -354 544 110 -946 134 490 -427 -392 611 -37 -601 277 15 -273 -66 164 -136 -208 214
5756 214 186 -54 -293 -127 647 182 -885 137 1072 -571 -1255 663 900 -1078 -898 1004 731 -842
5774 -842 -474 814 403 -446 -457 621 871 -805 -847 970 767 -887 -349 1163 -4 -810 -12 584
5792 584 176 -14 -398 263 763 -277 -1016 545 1080 -625 -856 950 683 -877 -403 934 428 -580
5810 -580 -307 609 569 -634 -435 1049 458 -1192 -209 1284 -266 -1167 645 988 -914 -551 800 259
5828 259 -725 -82 502 37 -301 -191 438 382 -608 -374 768 244 -896 185 550 -326 -621 142 199 -258
5848 -258 -222 -107 34 256 -288 -368 656 389 -906 -217 923 -29 -953 -140 830 -355 -673 61 698
5867 698 -52 -938 -397 1130 -14 -1500 203 1403 -703 -1252 1002 974 -1263 -528 908 124 -471
5884 -471 -399 476 36 -453 -396 402 392 -467 -399 772 319 -545 25 287 -3 184 163 -333 217 444 -290
5905 -290 -414 911 104 -906 235 759 -205 -398 339 432 -48 -202 186 536 226 -575 -9 464 35
5924 35 -270 755 180 -775 399 608 -404 -303 781 -108 -718 548 667 -453 -363 648 217 -407
5942 -407 -185 366 322 -168 -361 631 355 -711 -355 835 -88 -770 441 408 -734 -96 444 -260 -405
5961 -405 697 213 -450 292 388 -299 -561 367 161 -429 -437 206 426 -479 -673 579 674 -982 -574 1138
5981 1138 56 -1219 61 895 -451 -893 451 199 -722 -257 65 -188 19 -27 -138 196 114 -312 -74
6000 -74 -246 -100 146 109 -344 376 480 -767 -561 925 67 -1138 187 1142 -545 -870 615 537 -602
6019 -602 -236 586 120 -315 -198 496 207 -569 42 699 -46 -707 655 737 -700 -532 1133 273 -1109
6038 -1109 480 997 -510 -548 689 610 -589 -174 498 199 -392 -210 459 380 -590 -239 884 286 -587
6057 -587 281 717 -238 -82 636 -178 -289 324 -108 -447 547 294 -601 -279 574 164 -771 107 434 -146
6077 -146 -443 160 423 -52 -658 -26 1129 -256 -1162 540 876 -1016 -469 915 257 -1013 168 625
6095 625 -573 -604 357 249 -415 -362 169 193 -372 -426 292 285 -551 -326 652 -120 -851 276 521 -622 -281
6116 -281 709 -96 -410 221 151 -385 17 169 -150 11 22 -185 -114 46 -27 -20 105 -96 -33 111 -359 70
6138 70 431 -48 -600 480 483 -476 -70 592 -132 -558 339 454 -398 -457 515 54 -166 -80 254 38 -370
6159 -370 -97 503 173 -573 92 926 -417 -802 643 688 -700 -46 840 29 -560 20 543 45 -213
6178 -213 -165 300 442 -4 -455 462 384 -427 29 595 -133 -321 129 41 120 86 -355 -96 538 -35 -617 387
6200 387 507 -359 -417 458 188 -365 -125 26 -101 115 -66 17 173 -110 -320 41 204 -298 -150 380 -302
6221 -302 -386 346 -50 -431 296 130 -516 -222 236 -146 -97 -134 -337 -199 89 -344 -393 440 122 -474 59
6242 59 344 -71 -463 257 77 -61 219 -287 9 281 -347 -448 315 409 -563 -74 641 -120 -113 286 78
6263 78 -237 233 -65 -274 347 156 -297 207 248 23 -99 136 94 -25 121 -60 114 399 -198 -287 520
6284 520 287 -509 92 777 -412 -720 521 431 -412 -79 379 1 -54 -85 195 12 -183 -208 628 365 -417
6305 -417 173 832 -341 -524 523 295 -486 30 456 -174 -176 354 56 -132 365 -130 -7 212 97 -448
6325 -448 -117 303 28 -43 -120 -41 165 -23 -437 400 445 -576 -549 615 118 -1099 74 753 -369 -615
6345 -615 548 449 -595 -340 373 157 -367 -341 322 219 -571 -201 388 -107 -604 301 633 -622 -628 744
6365 744 36 -839 -10 441 -62 -582 71 227 -271 -177 42 328 100 -539 -199 546 -63 -541 172 311
6385 311 -218 -184 -99 -73 17 17 -569 136 656 -488 -755 710 764 -728 -691 962 357 -746 -278 888 349
6406 349 -579 -333 916 382 -1074 -209 1247 162 -1051 444 945 -461 -683 859 619 -629 -88
6423 -88 444 186 -303 -65 324 37 51 13 89 217 -329 105 392 -75 -227 296 81 -202 194 125 -253 9
6445 9 206 -259 19 583 -247 -235 397 8 -592 75 585 -120 -643 -31 366 -216 -475 -74 282 -81 -882
6466 -882 34 922 -554 -1046 717 715 -936 -638 708 314 -883 26 680 -27 -318 -93 280 407 -443
6485 -443 -492 482 251 -651 -196 299 -112 -454 208 40 -7 119 -263 -131 377 131 -630 86 663 -286 -588
6506 -588 411 297 -383 -146 206 -19 -199 40 192 274 31 -395 375 250 -372 -38 430 -170 -523 258
6526 258 131 -450 -134 492 -328 -228 490 78 -267 173 182 -125 -76 52 8 74 50 -67 266 100 -291 110
6548 110 330 -252 -108 371 98 -186 265 206 -254 369 461 -215 -279 513 -41 -462 185 448 -187 -245 157
6569 157 277 32 -333 -112 533 52 -620 168 534 -506 -536 517 219 -543 -82 390 12 -130 94 -63
6589 -63 -160 302 -57 -355 166 77 -338 -307 -92 212 -108 -357 24 327 -49 -607 271 412 -757 -616 777
6610 777 172 -928 25 661 -366 -581 363 260 -630 -52 230 -34 -399 -113 253 -126 -425 -127 555
6629 555 -197 -714 481 489 -682 -201 628 -130 -638 327 709 -374 -227 463 217 -119 -173 114 -104 -139
6649 -139 -100 103 87 198 -117 155 -56 -160 447 -71 -612 438 351 -604 -154 810 -16 -863 519 873
6669 873 -557 -335 567 307 -767 -328 489 305 -462 -184 278 238 -486 -87 808 -235 -813 516 531
6688 531 -596 -206 642 -43 -706 297 659 -388 11 337 333 -261 -59 193 -85 -200 -73 378 184 -524
6708 -524 -112 359 -352 -557 570 157 -275 148 95 -428 -209 672 -61 -533 206 400 -442 -219 492 290
6728 290 -373 -238 676 206 -693 -424 553 219 -753 -19 1007 -187 -858 530 279 -592 -330 649 24
6747 24 -691 170 462 -162 -359 240 183 -170 -150 345 246 -287 -211 567 67 -645 -38 572 -236 -461 466 532
6769 532 -611 -209 529 -7 -183 -27 -65 -35 28 -145 -133 221 1 -237 61 335 -1 221 -64 4 501
6790 501 30 -554 327 696 -353 -621 641 289 -821 -170 829 -127 -729 93 544 14 -204 -44 312
6809 312 40 -667 6 630 133 -484 271 287 -309 -186 474 -132 -248 311 3 -299 -33 215 -216 -102
6829 -102 123 -117 -27 56 75 80 57 -24 -81 130 -182 -65 205 117 -184 162 296 -170 185 276 -271 -221 387 -166
6853 -166 -494 70 215 -5 -104 18 -25 -131 -178 -224 -63 4 -301 -136 300 -311 -641 139 360 -410 -312 221
6875 221 -42 -99 -54 25 48 240 -157 -281 576 -46 -620 252 386 -82 -253 187 201 -93 -88 64 6 224 -426
6898 -426 -256 384 132 -571 -44 510 -71 -386 144 194 -133 -35 -78 52 243 -251 -313 411 463 -586 -199
6919 -199 720 58 -554 119 343 106 -251 104 392 156 -341 -236 455 175 -518 44 666 -183 -443 352
6939 352 277 -492 149 538 -80 -176 154 -82 -103 38 -66 -16 144 -1 164 219 -205 -472 525 182 -564 140
6961 140 377 -302 -335 194 -21 -364 252 -27 -256 171 277 -277 -121 439 -204 -255 222 140 -436 -329 53
6982 53 302 -52 -548 60 709 -338 -592 493 711 -692 -513 985 261 -1017 -51 778 -67 -722 185
7001 185 346 -17 -446 -33 438 116 -569 235 557 -330 -517 286 -22 -430 30 385 -159 -200 442 -9
7021 -9 -281 260 251 -310 -22 296 -183 -223 106 26 69 -12 -46 181 -30 -205 276 204 -335 -112 522 -57 -589
7044 -589 462 538 -571 -94 774 -51 -570 27 691 -120 -418 145 435 -186 -534 423 625 -363 -625 443
7064 443 553 -554 -316 857 272 -662 65 859 -213 -559 203 273 -238 43 72 -127 89 -12 -130 163
7084 163 200 -165 -21 13 -8 -69 -75 -177 127 255 -474 -148 497 -287 -603 237 387 -596 -620 396 8 -529
7106 -529 -99 463 -33 -361 -97 376 -87 -590 -142 555 -95 -759 200 478 -508 -346 537 126 -510 60
7126 60 302 -242 -163 138 -30 -273 253 -49 0 133 -68 -244 -53 -1 -220 28 18 -49 113 -178 -674 192
7148 192 423 -348 -187 450 -69 -462 278 366 -227 -64 584 10 -165 137 325 119 -30 113 289 169
7168 169 -608 107 563 -43 -255 329 419 -380 -242 543 -62 -214 235 124 -179 -43 190 68 111 88 -258
7189 -258 167 310 -68 -184 280 86 -27 -124 95 272 55 -329 -173 316 -1 -570 202 734 -463 -501
7209 -501 462 216 -456 -81 331 -275 -309 -92 -32 -219 -285 -157 119 205 -345 -156 188 -265 -308 225 -68 -488
7231 -488 19 245 -320 -247 225 7 -145 131 102 -241 -42 -29 -237 5 110 -303 -213 7 -123 -382 16
7252 16 -17 22 -62 -257 160 190 -369 -423 428 319 -680 -187 913 36 -726 408 624 -362 -313 340 362 -369
7274 -369 -167 2 424 -194 -435 417 250 -403 -214 688 172 -701 172 296 -321 -192 447 108 -29 253
7294 253 -60 -193 194 255 -213 103 182 -35 0 115 49 -33 -58 -55 256 211 -503 115 527 -245 -351 698 223
7317 223 -592 -251 635 -79 -635 261 539 -232 -391 318 197 -206 -213 251 261 -344 -374 336 295 -782 -4
7338 -4 683 -279 -469 476 400 -678 -145 600 -134 -365 171 208 -191 -343 123 -139 -97 -43 47 132 -183 -170 331
7361 331 -13 -333 287 270 -389 -216 516 -139 -543 511 267 -628 -286 539 52 -497 282 31 -203 -333
7381 -333 102 176 -378 -138 193 179 -184 -373 423 275 -540 57 625 -259 -444 361 278 -510 64 414 -292
7402 -292 -304 277 269 24 -148 114 234 -115 -295 156 575 -162 -113 439 -72 -518 285 649 -343 -211 697
7423 697 26 -210 302 419 -178 -236 384 -273 -296 155 323 63 -172 117 95 68 -319 -66 482 -262 -282 585
7445 585 254 -697 61 585 -304 -168 438 307 -432 111 301 -24 -249 63 -50 -143 25 -277 140 96 -141
7466 -141 -28 242 -295 -112 292 -129 -223 144 287 -429 -291 439 -192 -523 185 359 -298 -168 174 -6
7486 -6 -9 -210 75 344 -19 -380 115 206 -563 -216 469 -106 -392 123 214 -479 -138 237 -96 -50 22 -13 29
7509 29 -45 -285 -31 105 -123 -310 317 223 -222 -4 350 9 -101 -1 75 178 -48 -143 -137 374 -113 -505
7531 -505 383 450 -398 -314 442 326 -312 -290 276 188 -158 -378 178 442 -46 -365 336 565 -264 -272 428 127
7553 127 -158 100 432 27 -197 -50 287 180 -114 -22 393 191 -411 -29 424 93 -163 294 224 -243 -189
7574 -189 326 19 -367 -56 130 63 43 -177 253 262 -353 9 468 164 -600 78 422 -282 -373 293 176 -165
7596 -165 -139 12 -175 -45 -32 -354 159 69 -468 -147 102 -98 -210 67 -110 -97 -91 -198 165 196 -261 -433
7618 -433 330 161 -375 -304 267 -2 -557 117 153 -211 -414 204 189 -74 -264 23 312 -16 -330 180 422
7639 422 -249 -95 360 -53 -238 334 222 -455 -182 425 146 -241 111 285 -209 -155 -87 94 63 -176 18
7660 18 221 -76 -370 46 236 -299 -4 364 111 -191 301 121 -209 180 84 -208 -172 522 -34 -295 360
7681 360 268 13 -341 258 272 60 -206 201 524 -251 -316 446 391 -632 -29 642 104 -579 -25 642 -342
7702 -342 -349 190 195 -259 -91 138 134 -97 -210 119 269 -285 -10 169 109 -347 103 363 -376 -265 187 -260
7724 -260 -293 336 -235 -292 156 163 -202 -64 134 145 -440 -293 125 63 -275 -216 380 173 -401 125 560 -178
7746 -178 -574 154 404 -545 -392 582 103 -688 -6 291 -148 -304 89 163 44 -225 178 77 -226 -386
7766 -386 45 401 -479 -126 533 17 -338 193 209 -104 23 379 -212 1 115 -110 -333 223 -43 -157
7786 -157 62 268 162 -226 107 122 191 -147 35 218 205 -430 116 650 -84 -628 386 516 -293 -275 431
7807 431 293 -305 159 307 82 -55 96 221 -120 -173 -67 225 111 -248 -1 596 -215 -1 288 80
7827 80 -294 59 353 -253 126 -44 -28 -103 -139 -231 -58 264 -249 -256 184 243 -216 7 186 -210 -203 -2 -80 140
7851 140 -154 -363 198 347 -483 -355 557 148 -477 -22 305 -135 -427 162 365 -404 -5 240 50 29
7871 29 -248 -150 290 -100 -246 49 155 -322 -41 432 -113 -236 11 24 -201 -37 161 -188 -80 33 -306
7892 -306 -115 281 -75 -4 302 -9 -262 -27 186 -120 17 191 -47 146 50 -4 272 284 -224 -177 536 -126
7914 -126 -551 288 397 -311 2 322 3 -113 56 245 -53 63 35 175 174 -106 10 410 70 -279 188
7935 188 147 -243 -34 195 -205 -195 158 175 -219 188 197 -276 95 324 -12 -234 144 -34 -271 -120 26 248
7957 248 127 -137 47 125 -93 -109 177 81 -345 43 393 -196 -456 334 104 -473 69 427 -238 -318 22
7978 22 17 -253 -111 39 119 -289 -134 49 130 -365 -43 272 13 -593 187 343 -377 -546 328 52 -514 -85
8000 -85 263 -56 -405 41 163 -181 -148 204 1 -209 -216 121 230 -267 -13 358 42 -452 336 323 -341 -170
8022 -170 343 23 -295 339 114 -321 -206 230 -13 -114 255 274 72 -151 -34 206 47 -320 54 434
8042 434 -164 -128 465 399 -301 249 354 -254 -227 600 110 -389 55 200 0 -236 255 237 1 -33 156 272
8064 272 -216 -345 382 161 -437 -13 445 50 -542 258 335 -241 -146 326 190 -85 141 63 -290 -282 64 -36
8086 -36 96 -58 162 57 -11 -235 271 237 -520 -127 232 -235 -240 286 99 -439 -158 325 -92 -15 121 -10
8108 -10 -131 66 26 -307 -27 116 72 -108 -103 -112 274 -297 -254 256 71 -627 242 405 -335 -554 257 455 -492
8131 -492 -332 467 271 -598 -52 282 134 -310 -249 161 238 -397 -252 387 99 -576 141 335 -182 -289 296
8152 296 346 -174 -85 -23 52 226 19 60 161 -50 -183 193 194 -157 -70 302 -112 44 206 -61 54 170 198
8175 198 -124 244 225 -194 -41 177 -194 -86 278 206 -336 -71 243 95 -315 8
8191H
##END NTUPLES=NMR FID
##END=
