##TITLE=1H_CA-8648-2
 CDCl3, 8 sc, 
 20.9.2019
##JCAMPDX= 6.0         $$ Bruker NMR JCAMP-DX V2.0
##DATA TYPE= NMR FID
##DATA CLASS= NTUPLES
##ORIGIN= UXNMR, Bruker Analytische Messtechnik GmbH
##OWNER= root
$$ XWIN-NMR		Version 3.5
$$ Fri Sep 20 15:26:08 2019 Russian Standard Time (UT+4h)  she@DPX200
##.OBSERVE FREQUENCY= 200.1315
##.OBSERVE NUCLEUS= ^1H
##.DELAY= (6, 6)
##.ACQUISITION MODE= SIMULTANEOUS
##.ACQUISITION SCHEME= undefined
##.AVERAGES= 8
##.DIGITISER RES= 18
##SPECTROMETER/DATA SYSTEM= spect
##.PULSE SEQUENCE= zg30
##.SOLVENT NAME= CDCl3
##.SHIFT REFERENCE= (INTERNAL, CDCl3, 0, 15.7039)
##AUDIT TRAIL= $$ (NUMBER, WHEN, WHO, WHERE, WHAT)
$$ ##TITLE= Audit trail, XWIN-NMR		Version 3.5
$$ ##JCAMPDX= 5.01
$$ ##ORIGIN= Bruker BioSpin GmbH
$$ ##OWNER= she
$$ F:/spectra/data/she/nmr/H-F/1/audita.txt
$$ ##AUDIT TRAIL=  $$ (NUMBER, WHEN, WHO, WHERE, WHAT)
(   1,<2019-09-20 15:25:16.70 +0400>,<she>,<DPX200>,
      <created by zg, POWCHK disabled, PULCHK disabled
       configuration hash MD5:
       00 E9 B6 7A A2 85 ED C7 34 08 36 98 17 FE 4E 26
       data hash MD5: 16K
       A2 68 F8 89 D3 1B C6 0E 40 57 64 68 21 E3 81 EE>)
$$ ##END=
$$ 
$$ hash MD5
$$ AA 84 D9 D9 E0 CE 89 17 7B B7 23 6F E0 88 4E 08
##$RELAX= 
##$RELAX= 
##$RELAX= 
##$RELAX= 
##$RELAX= 
##$RELAX= 
$$ Bruker specific parameters
$$ --------------------------
##$DU= <F:/spectra>
##$EXPNO= 1
##$NAME= <H-F>
##$PROCNO= 1
##$TYPE= <nmr>
##$USER= <she>
##$AMP= (0..31)
100 100 100 100 100 100 100 100 100 100 100 100 100 100 100 100 100 100 
100 100 100 100 100 100 100 100 100 100 100 100 100 100 
##$AQSEQ= 0
##$AQ_mod= 1
##$AUNM= <au_zg>
##$AUTOPOS= <>
##$BF1= 200.13
##$BF2= 200.13
##$BF3= 200.13
##$BF4= 200.13
##$BF5= 200.13
##$BF6= 200.13
##$BF7= 200.13
##$BF8= 200.13
##$BYTORDA= 1
##$CFDGTYP= 0
##$CFRGTYP= 5
##$CHEMSTR= <none>
##$CNST= (0..31)
1 1 145 1 1 1 1 1 1 1 1 1 1 1 1 1 1 1 1 1 1 1 1 1 1 1 1 1 1 1 1 1 
##$CPDPRG= <>
##$CPDPRG1= <>
##$CPDPRG2= <>
##$CPDPRG3= <>
##$CPDPRG4= <mlev>
##$CPDPRG5= <mlev>
##$CPDPRG6= <mlev>
##$CPDPRG7= <mlev>
##$CPDPRG8= <mlev>
##$CPDPRGB= <>
##$CPDPRGT= <>
##$D= (0..31)
0 1.2 0 0 0 0 0 0 0 0.06 0 0.03 0 0 0 0 0.0002 0 0 0 0 0 0 0 0 0 0 0 0 
0 0 0 
##$DATE= 1568978716
##$DBL= (0..7)
120 120 120 120 120 120 120 120 
##$DBP= (0..7)
150 150 150 150 150 150 150 150 
##$DBP07= 0
##$DBPNAM0= <>
##$DBPNAM1= <>
##$DBPNAM2= <>
##$DBPNAM3= <>
##$DBPNAM4= <>
##$DBPNAM5= <>
##$DBPNAM6= <>
##$DBPNAM7= <>
##$DBPOAL= (0..7)
0.5 0.5 0.5 0.5 0.5 0.5 0.5 0.5 
##$DBPOFFS= (0..7)
0 0 0 0 0 0 0 0 
##$DE= 6
##$DECBNUC= <off>
##$DECIM= 24
##$DECNUC= <off>
##$DECSTAT= 4
##$DIGMOD= 1
##$DIGTYP= 9
##$DL= (0..7)
0 120 120 120 120 120 120 120 
##$DP= (0..7)
150 150 150 150 150 150 150 150 
##$DP07= 0
##$DPNAME0= <>
##$DPNAME1= <>
##$DPNAME2= <>
##$DPNAME3= <>
##$DPNAME4= <>
##$DPNAME5= <>
##$DPNAME6= <>
##$DPNAME7= <>
##$DPOAL= (0..7)
0.5 0.5 0.5 0.5 0.5 0.5 0.5 0.5 
##$DPOFFS= (0..7)
0 0 0 0 0 0 0 0 
##$DQDMODE= 0
##$DR= 18
##$DS= 0
##$DSLIST= <SSSSSSSSSSSSSSS>
$$ [...]
##$SUBNAM2= <"">
##$SUBNAM3= <"">
##$SUBNAM4= <"">
##$SUBNAM5= <"">
##$SUBNAM6= <"">
##$SUBNAM7= <"">
##$SUBNAM8= <"">
##$SUBNAM9= <"">
##$SW= 24.0689530833862
##$SWIBOX= (0..15)
0 0 2 0 0 0 0 0 0 0 0 0 0 0 0 0 
##$SW_h= 4816.95568400771
##$TD= 16384
##$TD0= 1
##$TE= 0
##$TE2= 300
##$TE3= 300
##$TEG= 300
##$TL= (0..7)
0 120 120 120 120 120 120 120 
##$TP= (0..7)
150 150 150 150 150 150 150 150 
##$TP07= 0
##$TPNAME0= <>
##$TPNAME1= <>
##$TPNAME2= <>
##$TPNAME3= <>
##$TPNAME4= <>
##$TPNAME5= <>
##$TPNAME6= <>
##$TPNAME7= <>
##$TPOAL= (0..7)
0.5 0.5 0.5 0.5 0.5 0.5 0.5 0.5 
##$TPOFFS= (0..7)
0 0 0 0 0 0 0 0 
##$TUNHIN= 0
##$TUNHOUT= 0
##$TUNXOUT= 0
##$USERA1= <user>
##$USERA2= <user>
##$USERA3= <user>
##$USERA4= <user>
##$USERA5= <user>
##$V9= 5
##$VALIST= <valist>
##$VCLIST= <CCCCCCCCCCCCCCC>
##$VD= 0
##$VDLIST= <DDDDDDDDDDDDDDD>
##$VPLIST= <PPPPPPPPPPPPPPP>
##$VTLIST= <TTTTTTTTTTTTTTT>
##$WBST= 1024
##$WBSW= 4
##$XGAIN= (0..3)
0 0 0 0 
##$XL= 0
##$YL= 0
##$YMAX_a= 762967
##$YMIN_a= -1014218
##$ZGOPTNS= <>
##$ZL1= 120
##$ZL2= 120
##$ZL3= 120
##$ZL4= 120
##$ABSF1= 10
##$ABSF2= 0
##$ABSG= 5
##$ABSL= 3
##$ALPHA= 0
##$AQORDER= 0
##$ASSFAC= 0
##$ASSFACI= 0
##$ASSFACX= 0
##$ASSWID= 0
##$AUNMP= <proc_1d>
##$AZFE= 0.1
##$AZFW= 0.1
##$BCFW= 1
##$BC_mod= 2
##$BYTORDP= 1
##$COROFFS= 0
##$CY= 11.3945322036743
##$DATMOD= 1
##$DC= 2
##$DFILT= <>
##$DTYPP= 0
##$F1P= 20.1720416913024
##$F2P= 0.152960286110954
##$FCOR= 0.5
##$FTSIZE= 0
##$FT_mod= 4
##$GAMMA= 1
##$GB= 0.15
##$INTBC= 1
##$INTSCL= 1
##$ISEN= 128
##$LB= 0.24
##$LEV0= 0
##$LPBIN= 0
##$MAXI= 10000
##$MC2= 0
##$MEAN= 0
##$ME_mod= 0
##$MI= 1.114404
##$NCOEF= 0
##$NC_proc= 0
##$NLEV= 6
##$NOISF1= 3.799351
##$NOISF2= 2.8
##$NSP= 1
##$NTH_PI= 0
##$NZP= 0
##$OFFSET= 15.70392
##$PC= 1
##$PHC0= -9576.965
##$PHC1= 20.80096
##$PH_mod= 1
##$PKNL= yes
##$PPARMOD= 0
##$PSCAL= 0
##$PSIGN= 0
##$REVERSE= no
##$SF= 200.130013532006
##$SI= 16384
##$SIGF1= 3
##$SIGF2= 2
##$SINO= 400
##$SIOLD= 16384
##$SREGLST= <1H.CDCl3>
##$SSB= 0
##$STSI= 0
##$STSR= 0
##$SW_p= 3612.71676300578
##$SYMM= 0
##$S_DEV= 0
##$TDeff= 0
##$TDoff= 0
##$TI= <>
##$TILT= no
##$TM1= 0
##$TM2= 0
##$TOPLEV= 0
##$USERP1= <user>
##$USERP2= <user>
##$USERP3= <user>
##$USERP4= <user>
##$USERP5= <user>
##$WDW= 1
##$XDIM= 8192
##$YMAX_p= 0
##$YMIN_p= 0
$$ End of Bruker specific parameters
$$ ---------------------------------
##NTUPLES= NMR FID
##VAR_NAME=  TIME,          FID/REAL,        FID/IMAG
##SYMBOL=    X,             R,               I
##VAR_TYPE=  INDEPENDENT,   DEPENDENT,       DEPENDENT
##VAR_FORM=  AFFN,          ASDF,            ASDF
##VAR_DIM=   8192,          8192,            8192
##UNITS=     SECONDS,       ARBITRARY UNITS, ARBITRARY UNITS
##FACTOR=    0.0002076,     1,               1
##FIRST=     0,             0,               0
##LAST=      1.7004516,     0,               0
##MIN=       0,             -1014218,        0
##MAX=       1.7004516,     762967,          0
$$ Real data points
##PAGE= N=1
##DATA TABLE= (X++(R..R)), XYDATA
0 0 0 0 0 -8 16 -16 16 -24 38 -48 50 -64 88 -108 128 -153 186 -225 265 -308 363 -427 493 -567 653 -749
26 -749 856 -973 1101 -1245 1404 -1580 1771 -1978 2210 -2467 2742 -3044 3376 -3746 4151 -4595
42 -4595 5082 -5630 6239 -6918 7681 -8552 9554 -10710 12068 -13699 15692 -18191 21423
55 21423 -25803 32105 -41982 59738 -101457 390406 -139245 -940663 448138 718337 -516075
66 -516075 -727001 511948 448117 -559576 -363879 551664 205418 -461661 -71411 426038
76 426038 -27954 -300726 112409 225395 -146957 -99883 124848 -42999 -134382 137354
86 137354 77203 -188890 33536 274661 -102556 -265333 201636 233240 -322323 -224801 351601
97 351601 133765 -403771 -42631 432583 -44666 -434831 130236 400947 -226674 -361336
107 -361336 300482 290033 -362839 -199485 415360 116890 -418429 -15401 400297 -73316
117 -73316 -341275 167137 278092 -234179 -210831 251504 100405 -288081 -31605 268860
127 268860 -59483 -252638 130797 221518 -184878 -174807 219514 106586 -247525 -33535
137 -33535 267278 -17598 -240435 82603 203941 -134195 -159702 152435 83189 -180663
147 -180663 -38012 160606 -21980 -134840 71617 102467 -98783 -42717 146129 18420
157 18420 -141267 39899 141758 -98426 -142814 131833 104072 -184409 -74483 209554
167 209554 28800 -210980 43563 223900 -84720 -191331 148120 173591 -174635 -125915
177 -125915 201805 75798 -228494 -45170 221154 -6727 -225269 38867 210043 -67337
187 -67337 -174170 112907 157098 -122326 -109460 137024 67924 -133419 -27556 110492 -17600
198 -17600 -89123 43188 57855 -53254 -15788 62490 -13489 -52885 47113 43794 -72906 -31706
210 -31706 87153 7442 -103048 17598 114384 -42060 -112383 73848 106506 -97510 -83329
221 -83329 121261 53117 -139223 -23229 139375 -14394 -136623 40926 118612 -67728
231 -67728 -101213 82957 77283 -98206 -60901 99325 36737 -99504 -11894 97962 -10565
242 -10565 -90123 27040 64749 -57734 -54651 57821 16757 -68748 9691 69127 -26968 -49594
254 -49594 52330 40344 -59568 -23432 60816 1031 -70874 538 57217 -20694 -56706 31527
266 31527 53642 -32825 -30627 53980 25849 -52674 -7163 44674 -25720 -53086 29058 28487 -49798
279 -49798 -13687 63100 9754 -49435 19069 60605 -18083 -51014 23753 42722 -32082 -43724
291 -43724 27996 32500 -33551 -25841 35159 17671 -30799 -3350 25739 -9589 -20171 13195
303 13195 3026 -20215 10433 26386 -6289 -2456 34610 18989 -17718 -1345 22059 -3290
315 -3290 -27834 -6730 13581 -6611 -23679 1292 18536 -6827 -15593 14571 15207 -12378 817
328 817 23875 245 -12301 17429 17065 -15110 -6135 19825 3050 -20583 -7625 7422 -4255
341 -4255 -19502 -12720 6582 7344 -8981 -4101 17855 13813 -5463 -1628 6331 -2209 -7694 -7366
355 -7366 -9816 -2616 4795 -5282 -6048 12715 11764 -4928 676 11109 729 -6644 -2530 -4444
369 -4444 -6717 -5674 -10166 -8663 1884 -416 -5631 4386 9633 2222 3335 6037 -703 -344 2965
384 2965 -5143 -7201 2809 460 -6899 -2649 -545 -3795 -921 -3868 -10389 1026 8410 -8094
398 -8094 -10068 11347 10267 -8940 -4204 11796 9125 -1822 -3451 4815 9806 -2314 -14089 -838
412 -838 8639 -9080 -14193 5745 7675 -5730 1009 11198 5407 4823 9680 3869 2087 6952 -521
427 -521 -8714 -2998 -596 -7298 -7727 -2569 1884 3646 -915 258 13180 11337 -4113 3184 16690
442 16690 139 -11950 5216 6167 -13583 -6716 9172 -2601 -11357 4652 9117 -6223 -7627
455 -7627 5866 7860 -5218 -7663 7906 12209 -6717 -8547 12892 8238 -14320 -2203 14504
468 14504 -5034 -12989 10530 8073 -13607 -180 17069 -2826 -13107 8519 10782 -13411 -13990
481 -13990 7409 4016 -17957 -12141 14094 7172 -18816 -2051 27327 2702 -23018 10186 25651
494 25651 -16587 -22824 18599 9710 -28984 -8707 21887 -5919 -26029 6600 18126 -15513
506 -15513 -19697 15127 14046 -21562 -13975 24281 10526 -26503 -1080 34400 258 -26170 15458
519 15458 25955 -21391 -18951 22334 1366 -31715 1651 22335 -16434 -20729 21677 14214 -24814
532 -24814 -5071 31560 3842 -27793 9157 34789 -12968 -31966 24181 29958 -34493 -23776
544 -23776 43240 13263 -49480 -959 49069 -14924 -46060 27186 37949 -34610 -23129 44401
556 44401 14288 -43979 -502 44783 -10925 -43591 21549 40772 -29919 -31505 44615 27687
568 27687 -47091 -8638 57193 -3193 -54245 21284 46538 -39984 -38117 48080 19040 -55825
580 -55825 12 60040 -11709 -48343 34830 46733 -43409 -33202 53739 16067 -67709 -5015
592 -5015 67807 -19013 -72649 38383 68467 -57937 -55270 79543 41079 -90488 -17467 95861
604 95861 -9325 -98406 27219 82584 -53071 -71517 66911 53263 -76016 -30722 83116
615 83116 10150 -85068 9531 77691 -34438 -72032 50011 52374 -69662 -33721 77707
626 77707 7952 -79168 20863 76363 -41462 -59428 61791 38522 -76196 -19166 75148
637 75148 -9888 -77065 27870 64351 -50269 -51057 66293 33433 -77105 -8520 87178 -14760
649 -14760 -86865 41077 77592 -70051 -65663 87609 38293 -104653 -10386 109955 -20349
660 -20349 -103581 53719 93829 -76311 -70092 100460 48358 -112108 -19656 119727 -9437
671 -9437 -120420 37617 113598 -64150 -98134 90465 79562 -107362 -50304 120202 20806
682 20806 -121285 10487 112860 -39086 -95142 62638 74098 -73100 -42072 84198 20721
693 20721 -75095 12031 71341 -31450 -54874 51004 33569 -70342 -15925 73423 -16367
704 -16367 -80670 40249 72696 -66597 -55696 91831 37351 -101937 -4458 113248 -20788
715 -20788 -106616 51893 97275 -75786 -80211 93939 57131 -108572 -34576 113784 6524
726 6524 -117227 16954 108280 -46831 -99983 66592 78038 -87261 -53881 99071 26397
737 26397 -99557 6499 97206 -29014 -78250 54002 59516 -68517 -37256 71719 5700
748 5700 -80649 8875 65213 -39970 -62257 52934 42832 -69531 -22358 81841 2474
759 2474 -80708 27014 79636 -49469 -65874 70361 45107 -87714 -23448 93073 -4403
770 -4403 -93574 28862 85333 -51268 -73881 65692 52939 -82768 -38167 85757 12516
781 12516 -90781 9902 90399 -28433 -75453 57621 69251 -66696 -41448 85235 22652
792 22652 -87515 1584 81744 -28487 -77611 40470 56360 -59549 -43953 63455 23901
803 23901 -66204 -4798 67707 -7533 -55478 30268 53506 -36284 -32348 52967 19690 -55309
815 -55309 1908 55023 -23756 -51763 38575 36246 -55386 -22999 61754 5544 -63393 12093
827 12093 62077 -24188 -52462 38251 44624 -44799 -29808 54184 19134 -54008 505 58052
839 58052 -13203 -50796 31079 41751 -46660 -31132 52756 10800 -61244 2625 57009 -20695
851 -20695 -52478 32820 42907 -41574 -31805 46712 19411 -49781 -9380 47747 -3971 -46254
863 -46254 14251 40240 -24839 -30582 35295 19297 -41494 -5729 42547 -10945 -43177 20501
875 20501 32887 -34653 -27388 36804 14236 -40582 -5700 38718 -2286 -33809 11233 29972
887 29972 -16502 -23114 22029 14162 -27887 -6534 28704 -6040 -29839 16743 26299 -25994 -18504
900 -18504 34703 10346 -38036 -1462 36068 -9677 -35729 12792 27800 -18937 -22943 20643
912 20643 17503 -20104 -9726 22071 5475 -19724 2832 18192 -9893 -13879 17337 8528 -21173
925 -21173 1190 26250 -6084 -22340 15559 20889 -19232 -15750 20137 8957 -20734 -5133
937 -5133 18933 2503 -14176 3899 16229 -2672 -9691 9705 9836 -11352 -4400 15217 -632
950 -632 -16794 6347 15857 -11987 -13376 14848 7948 -16939 -4698 15176 1265 -11757 2301
963 2301 11903 1525 -4638 3077 6704 -817 -4987 -654 -1390 -6603 -3332 45 -6910 -4419 8621
978 8621 3149 -8463 4685 15059 -2501 -9425 8053 7817 -9962 -6696 6396 1201 -6824 -426
992 -426 5245 284 -4040 -542 2088 -3849 -8621 -1556 2107 -7323 -6970 6350 5369 -5298 979
1007 979 9681 2389 -3025 1472 943 -2152 -1821 -5205 -5349 1996 1493 -6617 -1034 8566 2348 -6211
1023 -6211 -1066 5078 -123 -8641 -7001 3075 3050 -9043 -6048 10264 7711 -6605 964 13566
1037 13566 4536 -4326 2794 5799 -752 -2277 -1480 -2677 -1080 -1296 -5154 -2993 398 -1880 -2430
1052 -2430 835 1185 1761 4401 3671 3483 5817 3988 2041 3955 63 -4694 504 864 -9850 -6636
1068 -6636 5985 -304 -10319 1764 12167 704 -5610 5796 10362 45 -6135 842 6417
1081 6417 -1119 -8728 -726 6968 -1296 -5831 3537 5355 -1561 232 2494 -2518 331 4784 -3794
1096 -3794 -6490 5927 5625 -7394 -4272 8087 3557 -7247 -3447 5020 2336 -6608 -5242 4097
1110 4097 2011 -6957 -2268 6265 -812 -4750 5599 4621 -6881 14 8856 -4204 -10984 3443
1124 3443 5177 -10088 -9190 5392 4096 -7522 -4839 7324 7309 -4155 -3890 8173 5899 -7870
1138 -7870 -5017 4951 -2460 -9409 -954 775 -5461 554 6537 -1676 -936 10869 6481 -5827 -339
1153 -339 8370 -128 -10505 -4599 3560 -2229 -10798 -4346 6276 48 -7250 2808 8729 -1418
1167 -1418 -1045 9657 2835 -5259 6587 8977 -7923 -5505 11431 1848 -15410 -3291 10684
1180 10684 -3726 -15354 797 12834 -1627 -10170 7654 15786 -2928 -7476 11443 8468 -11322
1193 -11322 -3476 11364 -4410 -12164 9416 9304 -12766 -1469 20121 177 -17692 6814 17949
1206 17949 -12288 -19648 11050 13192 -17666 -13098 19857 11924 -17637 -1946 25725 1619 -21871
1219 -21871 7283 19193 -17574 -19852 18467 8525 -25521 -2545 27394 -1593 -21734 11780
1231 11780 21295 -14099 -17079 14080 7440 -20607 -8000 15777 -842 -16145 7814 17085 -10117
1244 -10117 -8522 20220 4955 -23912 2173 23750 -15015 -27461 19317 20126 -28949 -15735
1256 -15735 32499 8517 -33922 -1778 32047 -5618 -30459 9710 24988 -13951 -18730 19334
1268 19334 13462 -21058 -5106 21146 -6515 -23828 11475 15343 -24504 -11978 29075 3393
1280 3393 -30448 10033 34142 -14542 -26097 24607 20647 -30702 -15139 30301 3758 -34173
1292 -34173 2878 33164 -9575 -28430 20821 27379 -26295 -19925 32079 10021 -38681 -2231
1304 -2231 38157 -8573 -33803 21360 32462 -22586 -18237 31690 12865 -30377 -3293 26315
1316 26315 -8603 -27185 10741 17264 -20028 -12265 25756 7766 -24987 6350 33091 -9736
1328 -9736 -27671 22056 25271 -30669 -20499 33398 7892 -39262 -1138 35867 -8883 -30863
1340 -30863 18523 27747 -19808 -15499 28045 11627 -26782 -2450 26340 -7514 -28424 11136
1352 11136 20783 -22910 -18459 27132 9813 -30042 1346 33326 -8386 -27812 19668 22666
1364 22666 -26098 -14731 28510 2875 -32011 3793 27545 -14785 -26318 20454 19779 -28297
1376 -28297 -15325 32649 7157 -37205 174 38378 -9688 -37605 18433 32677 -27446 -26459
1388 -26459 31214 14738 -35854 -6228 33743 -3925 -29318 13881 26025 -17605 -16974 23423
1400 23423 10553 -26502 -4841 25464 -5850 -28277 10564 23067 -20039 -19919 25548 12298
1412 12298 -29627 -2906 31947 -5091 -27839 16567 26132 -18884 -13825 28693 10704 -26974
1424 -26974 -1072 26067 -9859 -30462 8520 18298 -23605 -21813 24027 14720 -26024 -1810
1436 -1810 36800 3815 -25562 14993 29859 -17900 -21197 23225 9733 -30547 -5325 26720
1448 26720 -6188 -25907 13614 23436 -17064 -15752 23063 11592 -25585 -6065 25883 -1823
1460 -1823 -26568 9133 25756 -13928 -18140 24033 14975 -25367 -4734 27872 -4037 -26847
1472 -26847 11996 22347 -18627 -16147 22917 9316 -26159 -5167 22865 -5410 -27315 5495
1484 5495 20639 -14412 -19104 19637 17500 -18678 -4922 28194 3812 -23059 7123 20725
1496 20725 -16677 -19927 16951 7134 -25968 -4787 23185 -4193 -22221 9982 20092 -13933
1508 -13933 -16557 16729 11592 -20411 -7895 22137 3220 -21334 5360 22947 -9550 -18252
1520 -18252 15053 11805 -22455 -9294 19058 -2784 -22848 6130 18441 -10776 -12055 17422
1532 17422 11825 -14932 -3645 17719 476 -18939 974 14374 -8887 -16289 10115 11727
1544 11727 -14058 -5993 18858 3438 -16212 5867 17545 -9306 -12848 13983 8036 -16882
1556 -16882 -4175 16098 -803 -15325 4599 14272 -5719 -10363 10278 10326 -10164 -5497 13823
1569 13823 2671 -14733 1341 14406 -7156 -13641 11351 10245 -14682 -5066 17722 1920
1581 1920 -15484 4929 16152 -6056 -12274 8913 10217 -10339 -8532 10488 5753 -11515 -3646
1594 -3646 11677 851 -11468 2208 9761 -6198 -7608 8582 3270 -10146 990 9768 -4944
1607 -4944 -7720 8534 5661 -9359 -1912 10347 81 -9423 1658 8769 -3810 -9271 3917
1620 3917 7182 -7609 -8285 7368 4506 -10994 -2935 11026 -811 -10201 4360 8540 -6995
1633 -6995 -5936 7184 987 -9388 -503 5875 -3698 -5823 4739 5615 -3379 -2330 6612 3516
1647 3516 -6586 -2857 5992 -2075 -10651 28 6142 -6487 -7438 7577 5149 -7489 229 10245
1661 10245 -68 -6324 4020 5793 -3963 -3822 3696 2707 -3176 -1111 4132 2319 -3225 -1001 3396
1676 3396 -1934 -5841 337 1689 -5033 -2313 4900 540 -2877 5411 5773 -2192 1241 7341 292
1691 292 -4493 2123 3637 -3616 -4119 1560 2078 -2912 -3319 1850 3335 -2305 -2925 3738 2660 -3590
1707 -3590 -270 5055 504 -1813 3376 2628 -1710 1104 2454 -2067 -1351 2084 -858 -2604 1175
1722 1175 1772 -1391 -814 1217 610 -1202 -1922 -565 778 -2310 -3555 1332 2270 -2556 -399 5453
1738 5453 1834 -1606 3295 3789 -2380 -2099 1172 -1843 -4565 -2583 -1392 -1664 -1975 -1907 574 2377
1754 2377 -331 -1248 3056 2233 -1812 435 2237 -1274 -1115 1668 -751 -2270 1013 359 -2586 -519
1770 -519 821 -1532 -1957 -702 -673 -605 -923 -2017 789 2311 -1505 -1399 3732 1921 -2713 745 3303
1787 3303 -517 -1603 736 -93 -818 -206 -1548 -1581 1400 331 -2518 723 3228 75 -915 1281
1803 1281 1747 574 -547 -1092 849 1560 -2182 -1716 2813 1003 -2493 1263 3431 -367 27 3531
1819 3531 810 -1378 1652 779 -2100 85 1063 -2052 -1104 1853 556 -875 1100 2495 737 -960
1835 -960 208 2626 323 -3655 -288 3901 -2312 -5850 2930 4723 -5058 -3382 7372 3327 -5290
1850 -5290 516 7107 463 -4465 -141 3328 -795 -4903 -2530 1983 -242 -4235 -849 2684 638
1865 638 -981 1205 1051 1161 2162 -1153 -2884 2490 2344 -5636 -3295 5444 204 -7010 611 5928
1881 5928 -2314 -5580 2443 3644 -3747 -4588 2113 2120 -4449 -3394 3496 1977 -4681 -361 6048 -312
1897 -312 -4098 3882 4053 -5159 -2193 4789 -1719 -6172 1955 2488 -5435 -2166 5144 -389 -5184 2751
1913 2751 5803 -2666 -4192 5128 5297 -5660 -4679 7655 4195 -9376 -3147 10748 922 -10975
1927 -10975 2229 10572 -3942 -8186 6249 5741 -6640 -2735 5935 -38 -5258 1777 3993 -2472
1941 -2472 -1801 4439 1982 -4146 788 6498 -1154 -6201 3924 6781 -6457 -6217 8078 3315 -10301
1956 -10301 -664 10779 -1769 -8796 5872 8487 -6268 -4215 8870 3031 -8123 -141 7962
1969 7962 -2078 -8448 2526 6784 -5575 -6986 6614 5406 -7685 -2063 9922 553 -8590
1982 -8590 3833 7416 -7088 -5003 8264 634 -10155 2099 8762 -5715 -7911 7572 6014
1995 6014 -9599 -4828 9905 2213 -11968 -1803 11107 -1937 -12437 3809 11279 -6523 -8788
2008 -8788 9901 6746 -10642 -2473 10998 -1970 -10795 4000 7005 -8241 -5814 8303 1849
2021 1849 -9561 -191 9380 -2353 -9080 3850 8329 -6165 -7493 7917 4966 -10114 -2408
2034 -2408 10955 -1254 -10238 5931 9573 -8803 -6098 11526 2690 -12771 63 12306 -4147
2047 -4147 -12235 5561 9788 -7809 -8931 9519 7763 -9851 -4341 12245 3243 -10987 1066
2060 1066 11498 -4025 -9311 6489 5744 -8973 -2068 9596 -1162 -7863 6006 7528 -6613
2073 -6613 -3423 9681 2554 -9152 798 9699 -3060 -10072 4362 7762 -8213 -7687 9781 4867
2087 4867 -11774 -1062 14339 -1345 -12285 7701 13247 -8619 -8558 12951 6457 -13666 -3793
2100 -3793 12188 -1179 -13439 1122 9891 -5021 -9605 5845 7665 -7150 -4563 8865 2333
2113 2333 -9129 1848 9101 -5032 -7156 8831 5001 -10514 -1220 11971 -2405 -11911 4697
2126 4697 9242 -8597 -9256 7801 4846 -10394 -4356 9513 1378 -9892 599 9478 -3743
2139 -3743 -8915 5750 6234 -8915 -3507 11021 1545 -9397 4248 10811 -5129 -7598 7293
2152 7293 3649 -10554 -4520 6053 -2386 -9605 537 6056 -3604 -4657 6722 5910 -4863 -513
2166 -513 9708 921 -8496 3396 9116 -6099 -8227 8476 5392 -10924 -3445 10553 -374
2179 -374 -11327 1190 8530 -4692 -7824 5155 6414 -4850 -3084 8033 4375 -5752 437
2192 437 8429 -1162 -7731 3904 6527 -6837 -5676 8112 3032 -8563 -173 8569 -1419 -6662
2206 -6662 3121 4911 -4011 -3523 3778 1634 -3462 195 4446 -242 -2818 3299 4149 -4082 -2614
2221 -2614 5990 1034 -7982 162 7867 -2958 -8010 5045 6515 -6621 -4862 6484 1945 -7318
2235 -7318 -1477 5669 -599 -5064 2006 5229 -1761 -2977 4618 3450 -5145 -2039 5358 -1125 -8309
2250 -8309 506 5606 -5372 -6763 5367 4385 -6244 -1557 6793 556 -5400 948 4077 -2381
2264 -2381 -3791 2111 1727 -3963 -1896 3616 9 -5015 1025 5669 -2584 -5362 4808 4754 -6210
2279 -6210 -3616 6447 1038 -6922 419 5738 -1985 -4171 2631 2559 -2865 -1300 2384 28 -2532
2294 -2532 728 2298 -1888 -2601 3142 2346 -4107 -788 6385 796 -5736 2119 6603 -3162 -5494
2309 -5494 4051 3101 -5795 -2322 4732 283 -3852 1484 3822 -885 -1778 3006 2758 -1918 -1348 3763
2325 3763 1840 -3731 -294 4966 -818 -4916 1836 3925 -3193 -3074 3485 1491 -3167 625 2854
2340 2854 -26 -125 2120 1018 -424 975 546 -1736 -1999 -414 -384 -2268 -2240 1626 2015 -1516 -510
2357 -510 4526 1573 -3202 429 3376 -1847 -3463 1411 693 -2688 -386 1716 -176 -813 1292 854
2373 854 -683 -1193 -517 -298 -1802 -2830 -190 1541 -1275 -1247 2990 2169 -1476 -227 1999 -750 -2284
2390 -2284 -572 -111 -1007 -397 374 845 1305 592 277 1012 -507 -2414 -813 -1166 -3968 -2640 628
2407 628 -1855 -2346 1853 2740 -96 1299 3553 2019 358 977 990 -60 -463 -552 -241 -574 -1430 -996
2425 -996 -627 -2193 -2098 365 -989 -2694 1350 3167 -611 433 5323 3292 -805 1734 3500 -733
2441 -733 -2227 -42 -523 -2453 -1537 -222 -760 -138 1138 1723 1095 685 1903 1829 -1560 -1662 1749 -209
2459 -209 -4078 -170 3460 -1250 -2293 3590 3328 -1712 191 3667 82 -1804 950 851 -1749 -887
2475 -887 614 -217 -1512 -620 1075 134 -2323 -43 2383 -680 -2552 1981 2687 -1597 -313 3589
2491 3589 791 -1878 1506 1064 -2496 -1211 771 -2350 -3078 558 320 -2667 -1143 1944 1025 -986
2507 -986 -439 2331 2116 -1184 -929 2216 584 -2979 -1019 1160 -1801 -2571 -137 -608 -1306 838 149
2524 149 -970 2109 2556 -1625 -567 3395 384 -3113 -266 1749 -1667 -3211 -301 638 -1373 -1998
2540 -1998 585 1703 -619 -998 2693 2372 -1422 712 3850 -101 -2568 2116 2085 -3195 -1714 1935
2556 1935 -777 -3288 122 1398 -784 239 1731 1206 815 1282 1006 338 -394 -188 230 -1422 -1526
2573 -1526 1298 1216 -2042 669 4119 334 -2108 2687 3264 -2418 -2171 2132 -260 -3353 -431 1490
2589 1490 -675 -509 1548 1184 254 577 1100 402 -1324 -406 1146 -930 -2193 1548 2369 -1815 -800
2606 -800 3974 534 -3923 477 2765 -3002 -3979 1964 923 -3322 -723 3229 1043 -1704 936
2621 936 3039 108 -2484 181 2036 -2288 -3884 1372 1798 -3411 -1383 3949 364 -3747 922
2636 922 2762 -2955 -2826 1692 366 -2617 556 2623 140 -862 1338 1296 -1464 -2006 286 -261
2652 -261 -3450 -2128 2126 -245 -3471 1680 4548 -1438 -1930 4641 2378 -4548 -1044 3999 -1808
2667 -1808 -4832 1312 3146 -2273 -1892 3235 2710 -2058 -1665 2335 792 -4019 -1378 3108 -398 -3019
2683 -3019 2464 3980 -1427 -422 4602 731 -3620 1536 2470 -3677 -2946 2713 -31 -4059 541
2698 541 4033 -326 -2159 2779 4061 -1475 -2540 3211 2669 -4200 -2656 4516 1213 -5495 393
2713 393 5889 -1570 -4532 3830 4046 -3765 -1511 4780 680 -3781 486 2874 -1798 -2974 1236
2728 1236 1470 -2534 -1549 2433 1049 -2916 492 4459 -783 -3458 3466 3643 -4252 -2269 5037 -36
2744 -36 -6297 340 4099 -3255 -4565 2640 2605 -3416 -1735 3548 1270 -2905 -125 3586 -21 -3426
2760 -3426 1002 3041 -2664 -3212 2665 800 -5113 -1125 3768 -1784 -4050 3150 3384 -3117 -768
2775 -768 4615 739 -3247 915 2808 -2173 -3477 955 1508 -3350 -2928 2443 1278 -4097 -755 4900
2791 4900 246 -4494 2390 5341 -2151 -2673 4703 2819 -3585 -182 3598 -1194 -3742 433 967
2806 967 -2874 -2471 1415 633 -2214 207 4116 1226 -2067 2369 4494 -1860 -3649 3344 2345 -4789
2822 -4789 -1745 4706 212 -4078 2046 4453 -1433 -1802 2585 1265 -2368 -833 1734 -646 -2313
2837 -2313 246 2301 -1021 -2093 2683 3000 -3074 -872 5050 1114 -4281 1585 5329 -1873 -3780
2852 -3780 3432 2719 -3914 -2266 2406 -829 -3796 -991 1299 -1343 -2150 1046 2514 -379 -533 3251
2868 3251 2412 -2077 -39 3337 -950 -3820 1213 1747 -3777 -2022 2408 -98 -3407 367 1910
2883 1910 -1841 -1967 1219 202 -1836 -443 1348 274 -933 1077 2891 67 -1826 1636 1915
2898 1915 -3131 -2695 2258 -497 -4593 -162 2933 -1631 -2236 2922 2049 -2088 111 2363 -645 -2486
2914 -2486 27 794 -1682 -2089 991 1741 -841 -762 3275 2392 -2115 -236 3190 -524 -3507 578
2930 578 1731 -2668 -2000 1731 255 -1796 711 1682 -51 349 1414 960 270 525 527 238 -242 -326
2948 -326 464 -9 -1139 333 1048 -1440 -672 2039 520 -1247 1442 2430 -898 -704 1918 225 -1840
2965 -1840 91 947 -600 -539 439 483 165 35 47 1035 305 -679 324 426 -869 -430 899 -835 -1239
2984 -1239 1271 696 -1693 401 2381 -405 -1469 977 986 -870 -1093 -115 241 -88 -1435 -862 1101
3001 1101 491 -1599 15 1788 -124 -1251 366 356 -444 -466 -1064 -618 584 -609 -1951 502 1719
3018 1719 -852 -736 1559 1344 -567 -49 426 164 -288 -1235 -1137 23 -392 -1928 -337 1090 -638
3035 -638 -651 1475 734 -974 683 1191 -398 -323 564 332 33 -89 -272 912 943 -1112 -369 1842 145
3054 145 -2361 -262 1428 -766 -1762 -106 695 298 -155 -449 1489 2390 -313 -1032 2218 2311 -1312
3071 -1312 -980 2035 1049 -1132 -970 301 861 -358 -1852 -453 1878 -174 -1967 571 2404 -182
3087 -182 -879 900 931 340 117 -438 265 1592 143 -1371 756 1560 -623 -792 824 257 -812 -450
3105 -450 -770 -807 -361 -832 -1216 300 401 -557 699 1048 204 806 1247 -152 -225 1148 -255 -1602 -77
3124 -77 233 -1553 -1175 -362 -908 -421 82 -1026 -362 1511 71 -1043 468 1098 -579 -736 186 631
3142 631 153 -616 -812 955 1105 -1673 -1156 1297 231 -2289 -488 769 -911 -1258 -244 -483 -251
3159 -251 394 -495 -115 1260 650 -348 568 1174 121 -193 -74 -360 -14 -154 -1258 -396 915 -951
3177 -951 -1261 1021 795 -862 615 1582 113 -22 1180 191 -403 717 253 -189 51 138 -85 489
3195 489 -106 -496 957 774 -1031 -104 1389 -345 -1082 717 715 -883 -66 841 126 277 827 -67 277
3214 277 731 63 -141 409 12 -375 29 -58 -298 429 19 -700 688 668 -679 3 1441 -660 -985
3233 -985 1201 317 -1795 -253 1469 -581 -1317 628 886 -526 -588 233 867 135 -910 21 1103
3250 1103 -354 -1302 614 641 -1232 -375 906 -731 -744 816 -171 -1433 507 845 -1562 -1122 747
3267 747 -19 -1275 -455 546 240 -524 -307 928 1003 -778 -464 1596 63 -1791 312 820 -1687
3284 -1687 -1339 964 -314 -1704 528 1149 -979 -466 1231 459 -668 -172 399 580 -146 -744 500
3301 500 1160 -485 -571 1070 561 -753 125 86 -508 341 605 -1273 -136 2252 -337 -1949 1406 2360
3319 2360 -1065 -1421 1552 1441 -1178 -1094 784 1467 -401 -1455 1073 1864 -1175 -1126 1670 508 -1711
3336 -1711 292 1482 -784 -465 1751 345 -833 1234 1363 -693 -634 869 -36 -983 -635 7 197
3353 197 -313 -351 703 948 -49 379 1190 -175 -648 863 -166 -1881 410 1122 -1600 -1277 2065 854
3371 854 -1887 -75 1758 -301 -1778 -161 567 -533 -1684 -515 888 170 -1408 80 1389 -491
3387 -491 -706 1200 87 -1237 490 861 -1264 -597 1232 -244 -1652 371 781 -1004 -1064 -246 -198
3404 -198 -511 -748 -548 712 549 -254 519 1205 210 -35 817 -223 -720 569 -120 -1731 -25 1002
3422 1002 -1568 -1332 1362 566 -1279 106 1341 152 -540 219 1067 492 -469 -89 1352 365 -1201
3439 -1201 555 1446 -1268 -1410 1720 280 -2157 131 2107 -550 -1203 1383 1476 -568 -253 994
3455 994 546 -256 -604 69 252 -623 -751 730 217 -493 805 1194 -667 617 2370 -138 -1357 1679
3473 1679 1443 -2120 -1222 1566 -47 -2277 67 1261 -155 -803 262 1325 581 -507 161 1004
3489 1004 -337 -1165 353 -54 -1306 -223 847 -1080 -501 1831 273 -1467 898 1830 -1219 -1127
3505 -1127 1261 300 -1521 -384 922 -192 -1426 -337 506 -497 -1630 -266 975 -1063 -1266 1419
3521 1419 1737 -1283 219 2949 390 -1462 1253 1266 -1736 -1727 70 -969 -2028 -912 -393 -835 -130
3538 -130 359 151 416 1195 892 276 31 720 963 -659 -1107 1292 1135 -1841 -817 2328 73 -2676
3556 -2676 168 1764 -1205 -1706 910 773 -527 -30 1091 1083 420 9 404 744 -342 -663 426 225
3574 225 -541 658 1044 -41 834 1531 -82 -474 747 -48 -1539 -710 111 -1164 -647 876 147 -4
3592 -4 1474 1027 -109 656 872 19 -325 -38 -131 259 -190 -526 780 696 -1075 -185 957 -649 -1642
3611 -1642 25 186 -1437 -481 982 118 64 1255 837 508 842 188 -668 -347 -420 -1165 -1018 -542 -546 -219
3631 -219 -38 -208 777 1097 -632 -520 1211 18 -1656 -103 509 -1050 -878 413 360 20 -175 -243
3649 -243 -33 372 -1066 -821 467 51 -1220 -129 908 -429 -355 493 222 -142 121 -471 -475 93 -481
3668 -481 -656 264 295 -692 57 1028 -260 -523 546 331 -661 -26 225 -74 66 -278 -124 636 82 -975
3688 -975 499 1279 -639 -917 1252 1033 -912 -193 1007 383 -208 59 318 638 365 -722 100 1145
3706 1145 226 -971 69 508 -301 -626 -355 140 830 -10 -674 889 1834 -245 -955 1554 1311 -1469
3724 -1469 -772 890 -233 -1290 -698 313 604 -249 -309 996 1211 -211 -472 1063 196 -1468 -406
3741 -406 388 -998 -563 720 157 -96 730 341 -191 474 -62 -611 56 196 -1011 -453 801 -201
3759 -201 -963 19 383 -369 -1008 -299 199 -143 -1087 -311 1552 531 -1097 1039 2810 -137 -1488 1259
3777 1259 1041 -2222 -2017 -363 -767 -1790 -1097 -57 319 244 -18 959 1415 277 16 1082 208 -720
3795 -720 228 101 -535 95 809 -614 -457 607 -379 -1207 -298 -152 -1007 -498 140 -302 245 944 432
3814 432 757 1221 541 -15 184 -189 -601 -331 -508 -582 629 616 -183 792 1679 -56 -501 878 108 -1603
3834 -1603 -950 31 -657 -752 -202 81 438 926 501 945 1545 460 298 1002 209 -492 173 -15 -950 92
3854 92 517 -1069 -965 395 -151 -1372 -527 461 365 46 212 969 1467 897 -169 626 1250 -585 -1322
3873 -1322 -21 -212 -1445 -874 -173 -242 20 -53 -369 669 1189 -599 -397 1078 322 -1100 -497 261
3891 261 -329 -631 -528 -41 152 -275 -744 218 722 -683 -753 1047 176 -674 561 655 -662 -180 785
3910 785 -525 -1242 -14 311 -744 -784 -73 368 196 -423 117 1366 628 -1127 352 1393 -564 -1242
3928 -1242 297 405 -762 -527 124 -31 445 140 -511 539 1027 -187 -590 819 696 -437 -405 65
3946 65 209 -23 -751 -435 894 589 -777 533 1604 300 -269 1037 673 -574 139 387 -308 -208
3964 -208 655 -128 -22 557 260 -177 19 82 -173 253 -159 -515 615 83 -508 551 1052 128 215 1080
3984 1080 30 -614 421 -365 -1507 -134 298 -787 -600 1121 750 -106 158 1007 610 -95 -912 104
4002 104 470 -943 -1057 554 364 -1206 -145 1326 -171 -981 588 298 -1082 -461 267 -536 -431
4019 -431 556 389 202 106 44 193 146 -798 -805 170 -495 -1156 -282 227 -456 -75 473 80 295 557 -297 -444
4041 -444 537 -360 -1353 136 767 -713 -299 902 273 -503 170 155 -151 -339 -576 -181 -89 -533 -380 801
4061 801 650 -280 892 1468 -283 -452 933 219 -1201 -186 340 -351 -125 441 215 354 610 120
4079 120 257 829 -55 -515 311 -226 -370 5 61 -308 802 738 -402 548 1459 -181 -560 894 699
4098 699 -723 -206 470 -99 -457 -133 -354 -29 72 -320 -40 508 -69 19 703 333 177 813 497 -373
4118 -373 376 480 -711 -738 -39 -457 -1023 -134 -19 -637 380 532 -227 314 881 -74 -302 340 215 -398
4138 -398 -332 -96 -55 -17 -546 -668 433 253 -868 -45 687 -514 -528 511 -23 -550 278 253 -965 13
4158 13 669 -734 -643 505 178 -640 -515 205 353 -116 -1016 -275 925 -265 -1102 512 1040 -661 -374
4177 -374 1188 239 -868 116 379 -618 -157 77 -592 8 452 51 97 412 125 299 674 -235 -263 393
4197 393 -106 -606 152 484 -274 60 750 310 434 962 -62 -145 1133 204 -1070 -45 513 -777 -1093
4216 -1093 211 282 -284 -280 260 848 574 -107 559 1313 249 -563 972 904 -969 -323 779 -639 -1174
4235 -1174 423 -33 -1102 -316 572 64 -202 463 478 322 103 -118 503 411 -441 -366 400 -87 -411 280
4255 280 79 -406 324 346 -1102 -316 798 -644 -1659 156 653 -944 -700 760 566 -77 -249 149
4273 149 840 -22 -1057 82 635 -571 -982 276 144 -715 157 144 -688 227 322 -899 -571 833 -82
4292 -82 -1306 -19 675 -309 -423 417 466 284 210 122 275 222 -478 -414 88 -667 -405 502 -448 -824 507
4313 507 692 -1098 -303 1201 138 -909 272 869 4 -76 394 280 128 -176 -428 74 369 -296 -290
4332 -290 294 136 216 309 -89 128 981 313 -896 560 1171 -940 -935 885 567 -912 -141 657 323 -112
4352 -112 26 409 744 28 -653 -7 424 -268 -402 310 -265 -478 357 55 -418 670 521 -560 -104
4371 -104 503 -329 -713 322 -19 -518 -54 -110 -386 82 366 -301 11 416 73 -40 97 -168 195 117
4391 117 -788 -590 793 115 -1418 -88 1008 -475 -661 631 471 -548 -246 -93 -157 -79 -536 -753
4409 -753 85 66 -908 -198 527 7 -419 399 306 -100 114 -182 -339 287 -110 -755 47 375 -504 -283 808
4430 808 74 -658 348 681 -421 -321 58 -136 -278 -284 -239 256 157 -397 413 1210 -71 -273 1106 1115 -601
4451 -601 -153 891 -74 -719 -144 41 -125 -240 -331 -72 376 -136 -333 833 542 -716 180 1329 -80
4470 -80 -607 625 680 -80 -74 301 312 368 -195 -395 485 378 -957 -207 896 -140 -827 284 354 -559 -54
4491 -54 187 -129 222 98 47 541 807 -149 116 725 -81 -753 -24 -228 -855 -315 83 -752 -739 115 -49
4512 -49 -272 51 23 159 264 -241 -102 779 45 -838 474 944 -438 -505 717 295 -740 -201 19 -536
4532 -536 -607 -739 -423 -378 -7 -415 154 448 67 254 633 20 -185 738 8 -786 156 442 -681 -430
4552 -430 483 -45 -561 -117 -8 -9 262 -235 -282 565 176 -656 -79 844 -40 -286 162 488 429 238 -238
4573 -238 -124 817 89 -849 324 1056 -382 -626 510 278 -614 -238 -158 -4 110 -199 -227 813 795 -375
4593 -375 401 855 161 22 479 45 -376 281 -12 -523 282 130 -438 -43 169 -266 -3 559 -398 -58
4613 -58 689 255 -574 228 786 -231 -390 195 294 63 -150 -331 425 617 -768 -637 1072 242 -1268
4632 -1268 33 1237 -187 -982 159 500 -286 -507 -92 235 184 -774 -288 489 -117 -1024 114 801
4650 801 -467 -263 622 178 -324 233 281 -367 -19 -84 -462 -209 -12 -785 -99 628 -322 -493 539 527
4670 527 -441 -55 434 254 -227 -153 122 377 -32 -346 173 756 -428 -406 786 300 -686 -194 558 -99
4690 -99 -304 156 184 140 293 -85 -170 543 -19 -610 106 566 -269 -59 221 197 266 69 -252 433 616 -446
4712 -446 -539 1048 347 -881 26 921 -23 -378 635 658 -235 -99 43 -10 -104 -281 -198 430 272 -413 272
4733 272 952 -16 170 423 36 -364 132 -320 -545 135 -41 -707 418 946 3 -140 728 156 -624 -50
4753 -50 -38 -432 -512 -487 -406 -43 -118 -296 410 574 -201 -179 602 35 -324 184 117 -272 184 197 -289 219 465
4776 465 -376 -636 442 -504 -1154 -223 -20 -416 -550 154 404 394 148 217 943 435 -559 -21 751 -569
4796 -569 -1050 367 497 -792 -590 473 74 -352 1 247 -60 226 -198 -235 393 142 -242 253 517
4815 517 -68 -190 178 1 141 -30 -192 -125 414 -169 -409 813 442 -528 242 756 -508 -653 219 -10
4835 -10 -691 -313 307 7 1 252 316 405 267 96 669 659 -452 42 464 -246 -721 205 -142 -715 -13 374
4857 374 -342 28 556 74 -133 592 193 -190 263 197 57 -310 -186 -337 -121 -160 -297 -15 113 -203 164
4878 164 863 10 -282 541 527 -665 -195 433 -282 -488 176 -117 -559 -220 -128 -277 -224 -233 -207 232 55 -201
4900 -201 470 701 -310 61 415 47 -418 148 -50 -719 -361 -48 -514 -355 172 -105 31 328 140 -148
4920 -148 239 -44 -348 7 162 -236 186 206 -145 338 148 -332 -48 251 -68 -520 440 266 -403 51
4940 51 502 -156 -276 419 17 -292 -96 -169 -349 -149 -100 99 477 459 -6 699 765 -3 293 534 -297 -661
4962 -661 -8 -341 -1006 -379 370 -421 37 692 699 401 386 347 151 213 -188 -135 263 -62 -223 382 284 -440
4984 -440 213 333 -540 -356 424 -393 -765 75 448 -102 310 446 114 178 273 -54 -399 -6 -333 -472 -64
5005 -64 -268 -245 155 -23 146 463 208 -453 180 397 -504 -596 102 30 -429 104 320 21 -69 314 25 -124
5027 -124 2 -191 -459 5 -490 -613 267 125 -320 361 293 84 20 133 -219 -243 20 -296 -401 150 -65
5048 -65 -217 569 399 -383 -75 592 -126 -543 -19 82 120 -221 -368 204 571 -247 -507 719 515 -223
5068 -223 -367 685 288 -469 74 541 -58 -163 -16 188 547 -52 -410 307 414 -406 -234 508 -50 -187
5088 -187 302 456 -181 150 494 98 115 230 203 1 143 -152 79 185 -151 -189 246 121 -301 162 534
5109 534 -119 89 137 12 86 279 -286 -511 513 74 -610 -169 483 -209 -259 62 93 162 54 35 195 421
5131 421 -106 -208 185 273 -296 -227 -65 -356 -259 -259 -515 -346 305 -271 -408 431 504 85 174 889 345 -15
5153 -15 149 -272 -433 -204 -447 -699 -336 -268 -322 112 -121 -113 345 329 -323 56 464 -249 -652 316 326 -650
5175 -650 -237 488 160 -193 9 178 181 -67 -463 30 347 -221 -208 232 137 -304 470 420 -389 -27 473 -265
5197 -265 -437 244 251 -82 223 486 418 491 205 95 486 -17 -640 -385 -22 -366 -815 92 156 23 515 295
5219 295 300 493 657 28 61 248 -159 -328 192 -93 -173 -6 99 -326 -101 27 -415 -361 8 -30 -219 64
5241 64 218 332 533 301 202 651 402 -468 -38 289 -605 -643 94 37 -532 -182 189 259 -114 4 -276 214
5263 214 -11 -305 -37 87 -237 -296 440 -77 -122 440 113 -411 208 391 -326 -339 258 -38 -421 -168 77
5284 77 17 -42 56 -404 -79 -29 -177 -72 50 -199 34 306 -210 -12 677 162 -467 194 365 -485 -371 228
5306 228 -61 -380 -323 37 56 136 166 -42 414 290 -234 266 481 -53 -150 -32 -165 132 135 -193 -156 345 157
5329 157 -397 256 280 -276 -34 531 -181 39 501 189 -441 -66 563 -254 -412 59 342 177 -213 -210 339
5350 339 187 -547 100 970 36 -609 102 434 -240 -183 196 157 -119 6 -337 -57 190 -7 -397 171 479
5371 479 -204 -24 312 202 135 70 -310 -60 244 -186 -343 308 -127 -156 240 131 -155 15 303 -317 -433
5392 -433 197 -63 -472 177 375 1 0 240 18 321 32 -351 -71 126 -541 -404 -10 -5 -291 129 -54
5413 -54 -62 235 -82 -692 4 371 -560 -485 380 150 -502 72 460 85 -145 147 69 199 -106 -307 0 -143
5435 -143 -481 -200 309 -160 13 330 286 -403 400 344 -330 -396 196 278 5 78 206 212 226 116 -329 266 246
5458 246 -337 -101 102 -160 -181 166 -62 46 292 30 86 329 261 -59 155 600 -111 -78 403 238 -147
5479 -147 26 -4 -57 37 24 -323 -33 212 -210 21 172 72 130 173 -6 185 425 14 -466 233 133 -434
5501 -434 -486 141 -245 -294 280 136 -204 177 268 -49 -259 68 -237 -144 -112 -225 94 210 -194 -178 406 -14
5523 -14 -335 436 257 -228 -237 185 -249 -305 58 -139 -152 333 -171 -219 157 104 -196 -165 169 32 133 -125 -118
5546 -118 -132 237 -219 -217 209 65 -357 4 168 -402 -161 323 -188 -196 163 -141 -148 59 298 -200 -28 83
5568 83 -22 128 185 -291 117 304 -189 -179 241 171 -194 -52 208 64 220 216 -228 292 430 -291 50 438
5590 438 16 -542 -46 340 -140 -97 181 -16 231 -31 -86 211 518 -109 -168 445 337 -156 269 363 -221
5611 -221 -333 198 -193 -325 154 -280 -56 70 16 -48 410 -199 -346 255 306 -384 -123 304 -5 -412 139
5632 139 353 -41 -20 -157 -75 64 -83 -470 -79 -83 -457 -529 87 -38 -397 128 221 -77 210 271 -278 386
5654 386 232 -122 -255 219 -46 -433 59 -73 -133 166 -82 -320 93 -94 -134 -78 141 -193 -125 130 -39
5675 -39 -147 268 161 -113 173 99 -203 153 -63 -267 -143 383 -115 -198 307 146 -291 -39 258 -2 -112
5696 -112 124 224 91 -56 -288 295 375 -184 -296 470 176 -700 -110 560 -269 -364 102 -5 -124 112 7
5717 7 20 167 28 -116 224 113 -195 -196 244 19 335 52 -107 -153 283 75 -261 196 315 -342 -256 396
5739 396 -79 -391 76 315 -179 -92 161 176 38 38 -119 382 20 -453 38 561 -349 -550 400 118 -453
5760 -453 -74 378 -48 -128 103 -51 35 16 -271 30 269 -292 -347 103 -39 -251 -156 185 -257 -199 -4 -309
5782 -309 166 118 -308 65 362 -25 -321 365 289 -407 -149 535 -103 -517 -62 -74 -409 -47 -22 160 -159
5803 -159 -171 199 159 -246 -248 349 292 -482 -246 341 -155 -425 224 457 -381 -310 123 44 147 206 195 161 242 -113
5827 -113 34 126 -282 -87 182 -322 -432 22 336 -261 -10 192 -99 -193 195 110 -304 276 29 -304 28
5848 28 235 96 -132 194 75 -228 165 137 -92 230 104 -194 263 275 -48 95 39 -247 -139 219 -266
5869 -266 -337 167 54 -341 321 446 -56 125 448 -8 -51 137 3 -297 -249 -128 -18 -61 -240 -270 -16 -111
5891 -111 -360 167 21 -221 -155 324 -146 -245 369 405 -143 61 358 -48 -422 -217 -85 -389 -160 -487 -262
5912 -262 -111 -176 -162 114 -11 -226 156 388 -201 -117 87 -181 -415 59 47 -351 -23 261 -105 106 484
5933 484 -143 54 7 -75 -80 133 -170 -306 210 87 -79 -166 248 14 168 294 -45 227 270 -93 -90 415 199
5956 199 -317 326 283 -244 -250 36 -145 -267 -8 -15 -178 273 131 97 346 -27 9 200 191 -359 -7 324 -319
5979 -319 -142 232 -188 -196 162 90 -204 109 154 -265 -126 254 -114 -142 61 124 21 83 315 -23 29 -124 -38
6002 -38 130 -294 -331 32 107 -357 -173 463 138 -309 110 311 -26 -171 82 -247 -166 70 -302 -228 8 36
6024 36 -344 130 162 -174 -48 112 -16 -60 69 -226 -61 80 -374 -330 222 -363 -521 282 231 -352 -156 523
6046 523 -44 -280 246 2 -197 -7 40 -38 -42 -279 19 251 -77 -63 203 454 -418 -188 308 225 -231 64
6068 64 289 -380 -179 118 131 -23 82 -139 7 118 -97 -159 115 334 -21 188 110 10 197 8 -405
6089 -405 65 125 -286 -162 429 121 -315 375 354 -125 101 273 -205 -230 235 147 -298 -103 137 -11 127
6110 127 176 190 285 -131 -182 210 164 -471 -203 127 -167 -311 399 218 21 272 253 47 -119 214 -215 -364
6132 -364 16 -331 -369 -301 44 126 -13 -144 -5 325 115 -423 3 470 -209 -205 387 259 -433 228 105 -22
6154 -22 -11 -72 -288 -511 24 -48 -314 7 165 -5 60 61 122 289 -155 -253 92 310 -488 -176 376 154 -366
6177 -366 511 180 33 296 -17 -323 -184 182 75 -311 74 -28 -64 206 -31 323 437 160 -102 330
6197 330 93 -334 7 211 -133 231 304 90 -37 278 31 -342 -60 -43 -179 -413 104 88 -49 -71 390
6218 390 379 260 215 215 654 7 -236 134 325 -440 -96 395 -82 -231 345 255 -199 42 390 -52 42 238
6240 238 -79 96 306 -215 51 69 -182 -332 189 61 -130 -32 -40 -191 182 202 -147 30 198 -220 -330 299
6262 299 105 -346 -63 -90 -199 -294 -175 -135 6 52 -117 217 438 -188 77 -21 87 -220 199 -25 -383 -159
6284 -159 -164 -263 -49 242 -161 -4 459 224 -72 100 255 -45 35 47 -108 -228 -6 -183 -314 -84 43 109
6306 109 138 103 -192 120 265 -493 -116 404 33 81 3 265 22 -162 -139 -4 123 -140 -566 58 115 -130
6328 -130 -177 514 170 241 344 319 6 36 -143 -156 -166 -66 -299 -254 85 29 52 67 -2 64 482 60 -212 192
6352 192 151 -338 -88 278 -33 -265 290 256 -100 -123 208 43 -202 -83 -239 -267 45 -104 194 254 -165 240
6374 240 379 -136 -554 196 29 -400 -223 230 102 -103 26 10 17 -139 43 -135 74 93 -393 -71 77
6395 77 -233 -142 -68 138 202 156 -236 43 215 7 -457 28 4 -331 17 157 -47 -40 616 97 -288 110 208
6418 208 -427 -170 241 20 -268 -32 222 115 -221 -174 430 281 -357 -120 318 -85 -352 -76 284 -128
6438 -128 -162 542 42 -221 205 199 -31 -26 209 -64 -304 60 16 -90 94 -123 194 160 -35 -71 230 26 -388
6461 -388 -45 191 -15 227 368 -32 91 264 74 -265 53 220 -151 -132 -92 -34 -113 -70 109 -28 266 -78
6483 -78 -126 264 239 -73 -31 25 13 -41 50 -394 84 230 -356 -337 266 59 -377 37 353 -84 -128 134 123 69
6507 69 91 -71 36 -40 -163 -55 -16 -239 -138 166 -54 -625 -12 130 -204 -108 204 219 -156 114 84 86 -67
6530 -67 -43 -86 -19 -206 -561 -40 121 -195 -210 204 138 -151 104 -123 -82 219 205 -449 169 300 -140 -463 102
6553 102 275 -65 -22 38 -23 -93 -14 -40 176 292 -307 -55 307 -76 -201 -9 -9 -268 -70 -110 -90 -17 33 -211
6577 -211 342 254 65 41 528 205 -143 143 -41 -332 -133 -141 -197 -105 74 152 196 93 100 307 318 -42 -88 192
6601 192 -41 -216 21 287 -89 -67 192 63 -64 -86 -2 -357 -103 -126 -264 -37 -4 127 212 230 80 301
6623 301 12 -158 5 276 -94 -290 99 63 -235 -22 228 -51 -140 3 -136 -239 100 0 -433 -62 -25
6644 -25 -291 107 323 -22 -102 360 313 -107 35 -34 5 15 -178 -240 217 -133 -427 354 166 -352 -593 245
6666 245 123 -319 -99 374 42 -120 11 171 221 -78 2 232 181 -157 -107 141 39 -285 44 -187 -266 -26
6688 -26 -73 -281 -170 394 150 -89 375 168 -202 116 123 -24 152 128 175 -34 -44 13 185 70 -103 231 276
6711 276 -135 -29 533 180 -483 -28 391 -118 -469 204 27 -44 28 166 279 16 45 30 145 210 -62 -146
6733 -146 17 37 138 -152 -131 130 304 -170 -174 499 383 -436 -105 444 -158 -525 288 179 4 -254 66
6754 66 38 -180 64 -94 -10 -190 207 179 -275 -178 155 193 -255 -167 410 -16 -428 -57 269 -82 -289 15
6776 15 108 -259 18 -40 -148 -40 23 63 18 105 -105 128 67 -91 184 -59 -419 -102 280 -195 -430 123 389
6799 389 -219 -277 403 17 -66 -18 99 -195 -92 114 -84 90 29 -131 53 70 78 -59 142 -165 235 372
6821 372 -257 -11 152 53 -491 -101 223 -82 -239 264 129 -223 -42 33 -78 -157 -75 15 27 -216 207 184
6843 184 145 60 71 239 -258 103 514 34 -351 182 219 -248 -105 132 1 -211 23 18 -107 -13 64 46 85
6866 85 140 42 147 194 134 146 170 -109 105 161 -29 -244 196 193 -406 -19 43 -99 -227 72 -137 -166 -97 -25 -160
6891 -160 71 60 93 2 95 -184 -12 31 -163 -12 97 -254 -243 26 -103 -343 -61 116 -106 -169 -99 -271 -127
6914 -127 197 -155 -145 -5 122 -66 -91 65 -51 -5 239 82 76 49 -231 149 80 -358 -305 362 -30 -310 117
6937 117 185 -220 -39 25 303 96 -186 -7 105 105 -273 -88 89 66 -329 -138 184 -127 57 73 -200 -187
6959 -187 144 17 -56 136 285 -34 -28 -58 144 198 -79 -35 88 199 -157 -82 319 20 -257 283 238 -142 -65
6982 -65 78 98 -178 101 141 29 247 176 -38 200 -13 -186 103 -118 -193 -25 229 -227 -53 209 41 -173
7004 -173 66 196 -188 -83 47 -238 45 151 -185 -176 183 -299 -395 189 74 -309 -186 39 -194 -155 -149 143
7026 143 339 -17 -166 -167 150 -73 -92 228 270 -235 100 28 -54 -182 295 111 -213 76 -20 102 -45 -162
7048 -162 73 282 33 -19 14 130 -218 89 536 -11 -177 294 -35 -197 -120 -39 -179 -128 174 -115 27 185
7070 185 277 -195 -9 160 -92 -14 6 -55 168 -237 -225 220 256 26 229 342 158 -431 141 297 -280 -105
7092 -105 103 41 70 114 139 198 187 14 53 158 -68 -55 155 -43 -71 -33 94 95 -1 231 -117 -186 91 -121 -221
7117 -221 61 101 -289 97 241 -82 -133 127 57 178 102 -5 -62 -196 -158 31 -16 -100 -312 233 196 -200 89
7140 89 410 -297 -253 -36 4 -259 -44 232 -76 15 26 24 220 -12 -174 -45 75 -90 -146 98 17 -90 129
7163 129 95 -257 34 90 -14 -263 118 -41 -118 -68 171 -30 -53 155 -14 63 -142 -13 -19 126 -157 -266 69
7186 69 15 -307 11 154 -61 54 209 -51 113 253 -108 82 225 -1 -115 163 167 -156 -72 202 -20 -63
7208 -63 187 38 -36 -53 53 9 135 103 109 291 100 -81 -21 42 -199 4 209 8 -221 255 -5 -146 192
7231 192 70 31 -17 240 81 -79 199 56 -154 -116 -112 -77 43 -173 -233 7 -81 -60 -97 148 -93 116 239
7254 239 14 -196 70 -2 -100 74 -120 -304 -57 -107 -245 0 122 -24 -217 -181 -273 6 69 -24 57 -42 59
7277 59 15 61 -164 -127 -8 301 -157 -293 73 28 -277 -104 22 -5 -57 193 112 -49 -130 -14 -206 58 -101
7300 -101 -178 6 -47 19 20 200 -60 182 370 -214 -254 136 -164 -285 1 276 -147 -314 21 -80 -85 154 129
7323 129 -28 13 3 -57 117 132 155 163 -4 -67 146 103 -375 -114 228 -168 -424 102 61 -49 -80 412 213 14
7347 14 530 -48 123 104 -69 -254 -11 201 -53 -31 69 226 215 0 -141 16 260 -419 -417 218 -25 -419
7369 -419 236 342 -153 -66 227 156 47 -35 -8 -13 -42 81 -24 -99 -74 -3 223 -169 -35 235 175 -194 39 217
7393 217 -126 -258 106 169 -71 -4 248 -64 -175 246 -132 -170 -114 -3 4 -106 -274 59 -92 -270 -131 113
7415 113 -154 -432 165 220 -323 -246 225 83 -411 31 318 -143 -70 153 21 -48 -68 -24 -265 -122 162 24
7437 24 45 -29 62 157 -27 -269 231 234 -137 -62 267 25 -369 193 53 -302 -40 251 -149 -12 254 134 30
7460 30 -53 130 101 67 30 54 166 -220 -56 376 -10 -475 214 321 -44 -302 422 49 -362 -2 307 183
7482 183 -208 12 228 81 -60 84 34 76 -66 -26 223 -256 -193 94 -141 -134 79 186 100 214 319 31
7504 31 -31 322 174 -310 -134 323 -51 -320 -224 -135 77 -90 -251 -55 57 -262 -234 -54 -42 -53 134 -26
7526 -26 -45 -162 104 -293 -277 86 -238 -270 99 88 -131 -209 181 51 -75 -43 21 8 -117 -49 -220 -166 -354 -156
7550 -156 129 -68 -43 305 27 -146 -147 243 18 -295 107 295 -430 -72 -61 161 79 -157 17 404 123 -345
7572 -345 -76 343 -89 -240 317 149 67 191 139 -127 120 129 -164 -280 32 -46 -464 -90 245 168 5 246
7594 246 200 403 51 -87 150 289 -111 -172 277 -17 -240 -167 257 -75 114 55 -104 55 244 -133 -152 262
7616 262 120 -153 -25 44 -88 28 31 -321 -135 85 -238 -79 195 -177 -268 -15 -14 7 266 122 -432 -13
7638 -13 15 -281 -383 164 -105 -304 60 136 13 -111 -47 126 228 -82 -90 159 14 -144 -293 65 -70 -113
7660 -113 203 -76 119 -124 167 -221 -151 269 -79 -30 -26 102 256 -10 -137 0 93 48 -389 211 115 -203
7682 -203 -227 66 5 -184 280 -35 -94 211 224 -83 48 169 65 119 -29 7 48 -41 35 -71 176 -300 -118
7705 -118 352 -7 -27 39 329 109 -61 28 -22 -121 -88 -128 -155 179 -12 -89 43 222 30 2 101 -41 -114 -57
7729 -57 -103 -196 285 70 25 201 -7 97 89 321 -168 23 186 -128 -363 158 42 -58 -73 64 10 94 -106
7752 -106 10 -18 -20 -129 -130 283 -303 -145 223 154 -69 179 -92 -134 -68 88 -203 -368 70 -46 -218 -18 135
7775 135 50 22 92 115 -127 -131 34 83 -33 -131 29 232 -62 -227 -16 254 -199 30 314 52 -246 69 177
7798 177 -270 -22 6 40 47 41 -52 117 142 -225 -279 -65 -164 -197 105 149 63 182 16 12 55 234 -163 117 267
7823 267 -38 -173 156 22 -72 85 137 -57 -66 -33 -117 -134 -55 32 38 42 -54 56 278 8 -85 198 154 -165 110
7848 110 276 -104 -2 -10 173 26 204 133 2 76 94 -165 -30 126 -33 66 133 -11 127 216 -36 93 227
7871 227 34 -175 32 191 -16 -176 137 62 -92 49 64 -169 71 -87 -152 86 56 -260 -84 65 90 -118
7893 -118 -87 -45 -21 -107 -95 93 -1 -64 -161 71 114 -183 10 75 -212 -218 89 84 -124 64 254 -105 -55 144 -146
7918 -146 6 -67 -81 37 -60 -114 137 226 -111 -418 156 32 -103 211 13 -139 98 10 -49 2 287 -127 -231
7941 -231 11 210 85 -182 115 160 -2 103 -215 144 142 -101 148 267 -53 -133 429 184 -89 44 244
7962 244 50 -212 193 37 -313 49 26 43 -7 -13 51 77 294 -190 -20 150 51 89 42 70 102 165 123 18 192
7987 192 1 -334 -148 165 -310 -177 158 61 -235 235 328 -232 -19 186 16 -112 4 -61 45 47 204 169
8009 169 264 -104 -6 278 -136 -238 132 16 -399 -124 260 157 -216 -22 146 29 31 88 -213 -25 -190 -84
8031 -84 53 125 -79 -83 -40 -20 -73 36 -274 -131 199 -76 -398 -37 175 -213 -72 267 123 -105 7 268
8053 268 -39 124 140 -12 -27 24 73 81 -135 -88 27 121 -62 -136 152 14 -290 91 239 -250 -42 244 -64
8076 -64 -198 114 217 73 40 282 -61 -66 93 -86 -19 -66 133 153 84 -199 -152 310 -114 -307 201 134 -107
8099 -107 -114 214 -61 -55 86 198 -182 113 181 186 -26 24 51 179 14 0 -34 3 -120 -21 76 -103 -17 169 96
8124 96 -33 117 154 -303 -162 462 -63 -192 154 221 -236 -227 12 -37 56 -47 122 301 -1 -135 -211 141 -37
8147 -37 -232 204 -38 -111 84 90 -163 -121 34 -199 -134 94 -35 -280 -82 -13 -87 -173 40 -15 -7 33 -21 -3 12
8172 12 -219 143 36 -166 -215 194 -172 -379 180 218 33 -21 299 156 -101 160 248 158 57
8191E7
$$ Imaginary data points
##PAGE= N=2
##DATA TABLE= (X++(I..I)), XYDATA
0 0 0 0 0 8 -8 0 -8 16 -16 16 -16 32 -40 40 -48 60 -72 84 -96 114 -135 156 -178 204 -235 269 -302 342 -388
29 -388 439 -493 550 -611 685 -765 850 -941 1042 -1158 1283 -1418 1568 -1737 1928 -2136
45 -2136 2369 -2641 2956 -3316 3737 -4249 4879 -5667 6688 -8072 10056 -13114 18358 -29061
59 -29061 59165 -305337 -1014218 290492 762967 -511095 -764851 512636 579504 -525701
69 -525701 -396180 580483 294371 -494542 -131072 453867 17662 -363657 69141 260506
79 260506 -144236 -171366 131381 25909 -132146 100512 116205 -160024 -23250 233274
89 233274 -76010 -285904 138263 239915 -274131 -236447 339932 185914 -375630 -85475
99 -85475 422563 -382 -437647 87111 421246 -177579 -381735 268258 331499 -330180
109 -330180 -243355 394353 159470 -421887 -67555 411744 -31655 -376823 117033 304795
119 304795 -211109 -252514 240987 153824 -272230 -63186 284436 -10551 -257701 101138
129 101138 241840 -157704 -197984 206508 145428 -231301 -66038 262932 8206 -258252
139 -258252 48332 220791 -114004 -186006 143975 122120 -166783 -55908 178879 13511
149 13511 -142504 54486 126056 -80716 -68685 126197 30356 -148540 5319 137884 -73314
160 -73314 -146433 115046 126658 -155973 -85511 205142 59348 -206629 10921 221877 -63773
171 -63773 -209889 115785 180640 -167382 -155986 183977 95959 -220215 -62312 225552 20331
182 20331 -221433 27152 223485 -49097 -189936 92745 166521 -120783 -137129 127852
192 127852 85600 -140239 -49989 121642 3329 -100539 33024 75202 -48688 -36673 58410
203 58410 -383 -60468 29147 46616 -63124 -40237 79351 19666 -95571 4881 109542
214 109542 -29966 -115469 56763 109312 -88007 -98878 107421 66178 -134121 -40775 138910
225 138910 2796 -140261 27373 127634 -55760 -110915 75367 88249 -92021 -69482
235 -69482 99427 49291 -99689 -24952 98379 -1149 -97488 16753 76570 -43896 -59731
246 -59731 60463 39272 -60414 1075 73766 -16151 -58503 40733 44324 -58589 -33915 58838
258 58838 10258 -66906 1016 66857 -7082 -52598 30889 59687 -29281 -41101 43768 26897
270 26897 -56880 -20443 46310 -11151 -49561 29795 45633 -34730 -15161 63276 16347 -54215
282 -54215 6274 54658 -21488 -58900 18407 44410 -30018 -44003 30277 39158 -29432 -27495
294 -27495 36347 23550 -32173 -10287 29185 -2564 -22328 13982 15287 -12743 8847 28970
306 28970 -4208 -12073 21565 8674 -31176 -16266 13251 -7900 -30565 -5946 18054 -881
318 -881 -18011 5526 23489 -1085 -14634 13476 18098 -11701 -6063 18965 -720 -19884 6673
331 6673 11879 -20440 -16193 12962 -825 -25921 -9941 9903 -1250 -14567 -3869 14888 13241
344 13241 -4006 -2753 15716 10003 -13198 -10483 2338 -4479 -10914 -4749 -2067 2410 9484 1556
358 1556 -3123 11682 10602 -8941 -6728 5990 -3633 -13152 -5317 -2440 -5095 -1730 -1793 -276 9105
373 9105 8381 618 6639 11254 1063 -2270 1920 -3574 -5405 73 -4570 -7151 3153 3073 -5800
388 -5800 -1544 3532 -758 611 1446 -3296 4503 12374 -1414 -6303 13141 13397 -7590 -4896 12708
403 12708 7904 -6152 -6098 2696 5379 -4780 -13241 -516 11302 -3198 -9938 10370 14930 -1863
417 -1863 898 12512 4790 -1616 2769 -1733 -6530 -1921 -5050 -12013 -4603 1985 -3302 -2616 4593
432 4593 7550 6784 2706 1816 9399 7354 -8172 -5553 8463 -4496 -18405 -1532 5773 -12394
446 -12394 -8532 10404 1694 -10406 4243 10427 -5330 -8054 6277 7990 -5091 -7356 6475
459 6475 9986 -7657 -11285 9009 7299 -15240 -6823 13488 -2313 -15193 7084 10435 -12924
472 -12924 -5014 14474 -2989 -17547 3354 9238 -14033 -14674 8347 7656 -12692 -7145 17879
485 17879 11747 -14064 -2723 24741 3274 -26009 2156 22765 -15956 -27340 15473 14278
497 14278 -25744 -9917 25383 1364 -23451 7557 23354 -9803 -17266 17259 18702 -16109
509 -16109 -11689 25532 15326 -22947 -3721 32495 1817 -30418 6535 24861 -20927 -25113
521 -25113 20454 9073 -27783 784 28935 -7121 -18948 22369 20573 -20518 -6991 30655
533 30655 6471 -28530 3160 31547 -11311 -34176 17627 30607 -29885 -27587 38833 18827
545 18827 -47064 -7403 50476 -6466 -47300 22539 43943 -30019 -29693 40697 18984 -44598
557 -44598 -7553 44505 -5399 -44147 16859 43378 -24871 -35708 38259 30427 -46597 -19419
569 -19419 51248 1157 -58444 10269 49303 -32497 -43933 44543 29518 -51660 -8386 59732
581 59732 -5271 -55121 22232 45816 -42232 -43547 45913 22108 -63285 -12223 67434 -6786
593 -6786 -70597 29128 72036 -47893 -62870 68801 47690 -87411 -31265 92120 2206
604 2206 -99734 17456 90885 -40296 -76989 61501 63559 -71675 -42224 79692 19747
615 19747 -85561 -1310 81178 -22486 -75666 42733 63351 -59772 -42556 76092 22658
626 22658 -78249 7416 79189 -32049 -69521 51326 48182 -71274 -30043 76236 4630
637 4630 -76289 20125 72643 -37867 -56987 60190 44304 -71109 -20689 83074 -2830
648 -2830 -88115 27443 82829 -55761 -72275 80447 54181 -95581 -22872 110673 -2901
659 -2901 -105843 39225 101254 -64492 -82054 90004 59769 -107259 -34455 116725 5189
670 5189 -120601 24027 118509 -50445 -106190 78621 90356 -99413 -65598 114744 35725
681 35725 -121990 -4699 118591 -25059 -104228 52673 86148 -67830 -57541 79963 30994
692 30994 -81284 -5415 71951 -24863 -66628 38709 41692 -63760 -26574 71963 -22 -77450
704 -77450 29830 79398 -52179 -63644 80957 48269 -97587 -21462 108155 -9163 -112555
715 -112555 34717 101068 -66417 -91515 83841 67574 -103477 -47242 110837 19394 -117230
726 -117230 4378 112985 -32282 -104926 57283 90453 -76644 -65477 95208 41604 -99856
737 -99856 -9633 99237 -18896 -90217 40241 66941 -65231 -51533 68113 18919 -78386
748 -78386 1117 73580 -23852 -62674 49233 55671 -59116 -30375 78752 14451 -81019 12498
760 12498 81173 -38778 -74505 59750 55547 -80472 -34859 91582 9904 -93881 17231
771 17231 90503 -40388 -80212 59252 64193 -74128 -44434 86571 27779 -86028 1789
782 1789 94426 -16321 -81194 44984 74183 -62688 -57033 75095 30004 -89877 -13051
793 -13051 83161 -17170 -81594 34564 67781 -49702 -48525 64431 36530 -62604 -11184
804 -11184 70081 844 -60262 20368 55516 -33689 -44421 43579 24717 -56981 -11230 53990
816 53990 -14972 -55787 30893 44237 -47337 -29738 59875 15260 -62257 4183 63827 -17819
828 -17819 -57294 31759 48996 -41794 -37558 49576 24532 -55287 -10655 55150 -8452 -57147
840 -57147 20029 44351 -41578 -39346 48418 19932 -58835 -4321 59667 -11944 -55145 27401
852 27401 48050 -37768 -37738 44235 25042 -49123 -14701 48673 2556 -47390 9205 43783 -19900
865 -19900 -35976 30218 24661 -39632 -13739 41645 -3773 -44188 15588 37970 -28120 -29894
877 -29894 37042 22037 -38130 -8474 41279 2670 -35425 7435 32427 -13990 -26806 19310
889 19310 18752 -25336 -10461 28888 776 -28925 12245 29335 -21041 -22139 30909 14400 -36980
902 -36980 -5943 37338 -4370 -35853 11943 32786 -14736 -23891 21478 21781 -19068 -12506 22316
915 22316 8345 -20553 -1013 19561 -5790 -15829 14175 12055 -18637 -3104 24673 -3395
927 -3395 -24653 10842 21599 -18252 -18750 20058 12490 -20392 -6313 20810 4899 -15693 1283
940 1283 15583 -3152 -13324 5408 8918 -11596 -8187 12436 1065 -17108 2419 15854 -9838
953 -9838 -15355 13102 10387 -16376 -6618 16603 3511 -13113 1167 12047 -808 -9000 -473
966 -473 3768 -4332 -8661 -2587 -283 -4628 -1869 3708 -838 -802 9695 5858 -7099 1967 12130
981 12130 -3954 -13531 3879 7048 -10932 -8727 7182 3193 -7320 -983 5469 -358 -5666 -1931
995 -1931 1730 -2930 -6441 645 5930 -1672 -2995 9208 8494 -3861 -539 8516 607 -7344 -1700
1010 -1700 169 -3915 -2775 -2113 -1898 4278 4648 -3309 147 8876 2458 -7296 -2025 5067 -393 -7072
1026 -7072 -3172 6609 6631 -3573 -1758 12855 10035 -6063 -1360 11609 2268 -9502 -1952 3480
1040 3480 -3890 -5871 -2138 -1869 -776 365 -2012 -146 4075 2245 589 4133 4552 2982 4072
1055 4072 2797 613 1634 -83 -3365 -2256 -3488 -7168 -2654 698 -6547 -4344 8495 4829 -6399
1070 -6399 3158 13477 1332 -7714 3013 7659 -3761 -9443 -1071 4644 -2198 -8641 -471 7871
1084 7871 -116 -6249 2632 5727 -3021 -3091 1486 -2379 -2333 2807 -2791 -6552 4358 5675 -7490
1099 -7490 -5701 7144 3074 -8786 -4394 5262 2100 -6315 -4250 4566 3925 -5108 -1927 7248 1219
1114 1219 -5479 3208 4493 -6966 -3420 6692 -3381 -11470 2856 7370 -7290 -6886 8641 7695
1128 7695 -4714 -2751 8887 7380 -4868 -5413 5726 4168 -9255 -6919 5229 589 -7584 1447
1142 1447 6551 -616 2393 8782 1200 -2057 7401 3947 -9195 -4968 5250 -2225 -11555 -3557
1156 -3557 6356 1080 -6478 330 10670 4935 -4030 3979 10792 5 -3487 6873 2658 -7686
1170 -7686 1383 6375 -8952 -9018 8181 2120 -14579 -3268 12919 276 -11691 4138 16236
1183 16236 1259 -9064 6513 14363 -4365 -12099 6529 6934 -12886 -7668 10413 -994 -11945
1196 -11945 7251 11381 -10891 -5336 16392 4 -20217 1883 16078 -11518 -19852 11087
1208 11087 16538 -13720 -12272 20142 14142 -17738 -6878 21557 696 -25940 584 18742
1220 18742 -14562 -21181 17517 14611 -21403 -4519 27741 832 -24787 6269 20407 -14888
1232 -14888 -21133 12422 11127 -18053 -7660 18993 4975 -14621 5680 17978 -8374 -13151
1244 -13151 14307 5686 -23778 -3689 22688 -9500 -26725 17298 24636 -23831 -17430 31816
1256 31816 12724 -33313 -5009 33266 -1866 -31054 8366 28201 -11468 -21636 16872 16095
1268 16095 -20405 -10039 20569 -1061 -23295 9201 20823 -16880 -12351 29364 9785 -28201
1280 -28201 5004 33534 -12069 -30566 19329 22735 -28888 -18499 30713 9784 -31434 983
1292 983 35264 -4895 -29880 15911 28170 -23589 -24296 29106 15135 -35521 -5549 39749 -1716
1305 -1716 -34898 16372 34436 -21803 -25932 26845 14149 -33286 -10044 26724 -3989 -27414
1317 -27414 9857 23151 -14035 -13332 24957 11913 -24373 -92 29460 -8612 -31979 14311
1329 14311 25028 -28422 -24834 31247 13761 -36789 -4109 38620 -2916 -32532 14991 30191
1341 30191 -19228 -21941 23190 12213 -29169 -9418 24711 -4369 -29436 8519 24653 -17084
1353 -17084 -19362 25953 15489 -28213 -3997 32544 -5005 -31388 13569 24488 -24265 -20222
1365 -20222 26687 7595 -31327 23 29531 -9617 -26962 17762 23519 -24082 -17776 30766
1377 30766 11889 -34720 -3431 38407 -4674 -38535 14321 35222 -23382 -29902 29851 21129
1389 21129 -33520 -9575 36300 1944 -30679 9742 28149 -15731 -21801 20073 13087 -25876
1401 -25876 -8466 25723 -542 -27032 8522 26548 -14270 -20767 24239 17739 -26578 -6396
1413 -6396 32424 303 -28970 12024 27952 -17525 -20298 23454 11116 -30013 -8202 24457
1425 24457 -6922 -30116 8476 24870 -14792 -17977 27396 22350 -21252 -5026 34283 4548
1437 4548 -31120 4829 26350 -19071 -28600 18342 13501 -28960 -8281 28857 -155 -25889
1449 -25889 11045 25374 -15365 -19612 20180 13298 -24982 -9125 25670 2252 -25924 6198
1461 6198 26953 -11206 -22139 19124 16408 -25849 -10983 25913 -1114 -28837 7342 23888
1473 23888 -16363 -20568 19791 11509 -26034 -8374 23736 -895 -25729 5916 25280 -8256
1485 -8256 -18080 19269 20451 -17969 -10778 23504 3232 -27732 -629 19694 -14564 -22690 15544
1498 15544 12977 -21650 -5352 25516 1448 -21608 8234 21873 -11642 -18112 15710 14273
1510 14273 -18146 -9292 22067 6253 -21411 1231 22159 -7903 -21767 11259 14218 -20034
1522 -20034 -11468 20995 3616 -20019 6333 22602 -6814 -13590 15603 12871 -16141 -8473 15592
1535 15592 1031 -19382 -498 16303 -4749 -14773 11002 15796 -10532 -7535 17971 5965
1547 5965 -17041 1549 17306 -8151 -15856 11506 10319 -15771 -6293 16567 1985 -15558 3496
1560 3496 15406 -4622 -11952 8275 10370 -10440 -8422 11523 3678 -14919 -1400 14342 -4682
1573 -4682 -14311 9696 12588 -12536 -7381 16759 3822 -16643 1383 15709 -6016 -15101 6822
1586 6822 10229 -10610 -9972 9727 6747 -11314 -5109 11437 2031 -11995 491 10659 -4679
1599 -4679 -9136 7536 5375 -9773 -1201 10177 -3082 -9071 6629 6592 -9344 -4205 9420 327
1613 327 -10530 100 8346 -3504 -9660 3174 7617 -6183 -8321 7292 6649 -9008 -3517 11454
1627 11454 1307 -10712 2880 9451 -6031 -7592 7186 3083 -8482 -269 8307 -956 -4954
1640 -4954 5216 6456 -3369 -3692 4850 2470 -7496 -4179 5385 -457 -8627 1214 9255 -2233 -5404
1655 -5404 8915 7765 -6096 -1070 9890 270 -7841 2331 6007 -4047 -4962 4029 3395 -3389
1669 -3389 -1957 3390 1364 -4206 -2219 2786 -1109 -4927 1229 4380 -1857 -661 6856 3122 -2411
1684 -2411 4012 5381 -3470 -2056 4386 -1181 -6959 -375 2774 -4038 -4625 2148 2800 -2132 -2492 2660
1700 2660 3659 -1765 -2814 3493 3188 -3358 -1225 4604 675 -3591 1664 2145 -3129 -1695 1123 -2642
1716 -2642 -2889 1225 -346 -2805 636 1644 -1684 -1443 933 14 -1681 -1890 -466 1165 -886 -2200
1732 -2200 2253 3918 -1510 -546 4713 1067 -3833 -78 1596 -4414 -4641 -5 -1463 -3976 -1108
1747 -1108 1101 699 814 1071 2320 3264 406 -875 2270 1794 -2422 -1005 1742 -1339 -2432 1088
1763 1088 -124 -2393 588 955 -2143 -697 1632 -360 -1342 681 952 628 680 336 1724 3179 -261
1780 -261 -1363 3214 2364 -2942 -425 3183 -873 -2693 710 486 -886 -11 -190 -621 1958 1742 -1361
1797 -1361 1088 3644 238 -1537 910 1441 -273 -1190 -1122 598 1447 -1474 -1490 3065 2048 -2346 757
1814 757 3588 -799 -1630 1929 25 -2757 -79 244 -2638 -856 1399 -1259 -969 2074 990 -1303
1830 -1303 531 1923 -239 -1770 -838 1095 -741 -3847 -1200 3473 -1192 -5128 2718 5636 -3605
1845 -3605 -3602 6641 3624 -6370 -1702 5490 -943 -7010 -1575 2682 -1634 -4886 -1447 2950 1216
1860 1216 -2625 84 4137 1605 -1334 496 1089 -335 10 -1587 -3415 1004 1967 -4760 -3159 5262
1876 5262 1800 -6622 142 6522 -1580 -6083 2215 4279 -3190 -4207 2938 3599 -2710 -2259 4618
1891 4618 3681 -3396 -525 5965 350 -5386 2185 4262 -4692 -3620 4421 -348 -6022 1977 4800
1906 4800 -3509 -1609 6117 1679 -4212 2615 6156 -2140 -4429 4344 5058 -5301 -5176 6610 4413
1921 4413 -8543 -3483 10320 2217 -10504 966 11393 -2821 -9223 5372 7032 -6725 -4057
1934 -4057 6591 1469 -5303 1317 5067 -1842 -2401 3975 2087 -4254 -622 4989 -864 -6641 2058
1949 2058 6118 -5501 -6719 7307 4925 -9279 -2044 11087 -161 -9836 4020 9034 -6338
1962 -6338 -6610 7217 2899 -9229 -2413 7056 -1717 -8844 1772 7173 -4295 -6870 6360 6685
1976 6685 -7067 -3768 9061 1204 -9705 1353 7417 -6367 -7190 7078 2406 -9960 410
1989 410 9328 -4104 -8702 6629 6702 -8788 -5738 9490 3299 -11074 -2181 11610 17 -11723
2003 -11723 3180 12564 -4729 -9897 8758 7785 -10490 -4966 10511 -139 -11345 2859 8829
2016 8829 -6453 -6439 8460 4095 -8717 -614 9936 -683 -8723 3500 9047 -4969 -7801 7329
2030 7329 6754 -8705 -3639 11019 963 -10300 3896 10228 -7383 -7918 10103 4512 -12369
2043 -12369 -1311 12556 -2021 -11811 5354 11739 -6097 -8867 9497 9065 -9141 -5612 11411
2056 11411 4149 -11847 -1271 11233 -2883 -10654 5436 7587 -7655 -3634 9791 741 -8760
2069 -8760 3866 8074 -6367 -5745 8058 2471 -10093 -1475 8695 -2607 -10249 3198 8683
2082 8683 -6101 -7602 9246 6847 -10359 -2698 13468 427 -13021 4491 12675 -8784 -11744
2095 -11744 9824 6150 -14779 -6348 11679 408 -13429 847 11795 -2871 -9383 5623
2107 5623 9050 -6255 -5832 8296 3467 -9375 -403 9302 -3773 -8828 6842 6099 -10348 -3555
2121 -3555 10851 -1257 -12644 2822 9920 -7283 -9381 7947 6863 -8956 -4219 10387 3250
2134 3250 -9392 1 9966 -1694 -9034 5188 8298 -6716 -4535 10590 2980 -10058 1386
2147 1386 9844 -5686 -10330 5378 4645 -10064 -4854 8270 1309 -7204 2844 9564 -287 -3557
2161 -3557 6939 6757 -4880 -2778 7651 805 -9656 597 8354 -5341 -9533 6756 6553 -10226
2175 -10226 -4560 10601 1332 -10831 1387 10335 -2276 -7204 5827 8130 -3922 -3950 7124
2188 7124 4092 -6751 -2086 6605 -1365 -8695 1952 6694 -5655 -6289 7506 4261 -8178 -1406
2202 -1406 8709 -584 -7726 2186 5652 -3821 -4372 3856 2564 -3531 -517 4226 -115 -3583 1520
2217 1520 3068 -4271 -4071 4253 1357 -7521 -865 7744 -1922 -8154 3824 6912 -6230 -6010 6381
2232 6381 3211 -7209 -1650 6783 651 -5071 1684 5286 -1756 -4255 2800 2780 -5335 -3585 4281
2247 4281 -300 -7495 602 6907 -2763 -5699 5975 6059 -5442 -2517 6930 1035 -6175 11 4372
2262 4372 -2083 -4027 2228 2728 -2832 -1724 4252 1342 -4321 856 5540 -1575 -5553 3727 5031
2277 5031 -5413 -4279 6471 2327 -6665 -175 6615 -922 -4623 2693 3711 -2547 -1537 2948
2291 2948 823 -2165 504 2773 -974 -1833 2779 3021 -3177 -1198 5579 1077 -6048 491 5997
2306 5997 -3145 -6336 3481 4215 -4928 -2570 5563 1746 -3801 1103 4318 -861 -2372 2199 2324
2321 2324 -2498 -2134 2979 1354 -3990 -1567 4073 -493 -5170 1091 4352 -2735 -3604 3436 2153
2336 2153 -3087 -140 3374 -193 -1515 960 115 -2058 -855 -597 -2163 -2041 -27 417 -724 -656
2352 -656 2478 2695 -1029 -978 3132 804 -4287 -1121 2662 -1967 -4222 1381 1789 -2066 -671 2244
2368 2244 163 -1367 435 353 -1542 -1664 -389 56 -645 -1222 1092 2774 374 -621 2797 2272 -2229
2385 -2229 -1516 1508 -869 -2534 -47 1153 -133 226 1082 1046 620 -262 -1068 -292 -1218 -2734 -839
2402 -839 286 -1670 -648 3256 1781 186 3655 4309 290 476 2761 580 -1908 -956 -85 -1424
2418 -1424 -1880 -1136 -633 -618 -1068 -546 312 -429 -337 1756 1553 -440 2808 4697 348 -279 3923 1957
2436 1957 -3043 -1277 1348 -2423 -4130 -783 -123 -1614 -425 1247 943 1050 1442 1555 233 -492
2452 -492 148 214 -2362 -2388 1114 382 -3138 325 4277 -27 -2290 2704 3142 -2763 -1754 2103 -684
2469 -684 -3387 -432 555 -1920 -1452 739 81 -1356 -433 1261 297 -1572 -98 2433 -9 -2344
2485 -2344 1340 2703 -1672 -1818 2443 155 -3210 -446 772 -3196 -1972 1127 -1278 -2257 1529
2500 1529 1942 -1016 -5 3090 1717 -920 -315 1839 1139 -2039 -1904 1392 205 -3505 -1143 1882
2516 1882 -657 -1988 1135 1400 221 1590 1213 -137 1664 2433 -1626 -1585 2330 2 -3758 -819
2532 -819 2071 -1181 -2561 858 2066 -14 -710 1649 2806 411 -727 2549 2295 -1884 -723 2594
2548 2594 -612 -3732 706 1900 -3367 -2323 2536 404 -2297 1060 2722 408 309 1849 1350 -74
2564 -74 110 -2 -815 -1018 -746 -397 -551 -864 1541 1785 -1200 129 3344 115 -3556 815 2065 -3278
2582 -3278 -3508 2078 138 -3224 168 2667 65 -439 1641 1048 -579 -436 41 -586 -1609 -769 828
2599 828 -471 -1740 1254 2232 -1902 -1957 2657 453 -4736 -825 2947 -2445 -3705 2477 2615 -2609
2615 -2609 -606 3977 1006 -2108 187 2086 -949 -3417 -673 1599 -1748 -3162 1700 2812 -2285
2630 -2285 -1458 3935 922 -4073 150 3143 -1984 -2735 2550 1883 -1954 555 2920 86 -1623 525
2646 525 538 -2027 -2124 301 457 -1858 -703 3389 1628 -2008 1904 4776 -940 -3167 3051 1905
2662 1905 -4925 -2031 4002 -479 -4365 1991 4649 -1046 -2121 3070 2661 -2436 -2176 2153 1269 -3026
2678 -3026 -843 3891 1160 -2343 2130 4280 -1743 -2119 3011 246 -4548 -486 2485 -3128 -2983
2693 -2983 3355 1694 -2791 1007 4676 81 -2521 2049 3090 -2201 -3864 1885 2335 -4139 -3242
2708 -3242 4107 1708 -5138 -284 5590 -879 -5236 2853 4282 -4077 -3264 4030 699 -4639 -448
2723 -448 2937 -1482 -3150 1474 1895 -1928 -1387 2755 1372 -2563 -61 3654 -655 -3975 1845 3278
2739 3278 -4401 -3624 4040 518 -6480 -310 4993 -1987 -4481 3082 4068 -2759 -1863 3756 1753 -2928
2755 -2928 -798 3154 -72 -3945 102 2868 -2111 -3756 2496 1928 -3886 -1119 4827 -168 -3404
2770 -3404 3149 4307 -2659 -1604 4100 423 -4195 -143 2617 -2029 -3312 1192 2215 -2259 -1833
2785 -1833 3337 2892 -2698 -697 5168 1312 -3990 1651 5341 -1977 -3778 3608 2518 -4618 -1857
2800 -1857 2987 -1070 -4021 595 2105 -1637 -1155 3061 2226 -802 655 3885 1111 -2687 503
2815 503 3221 -2396 -4484 2250 2512 -4363 -2262 5175 1205 -4462 1157 4624 -1899 -3367 1851
2830 1851 1054 -3073 -1524 1864 17 -1925 514 2317 -472 -1809 2229 2758 -2702 -1914 3983 1041
2846 1041 -4783 -30 4539 -2484 -5255 1919 2286 -4301 -3004 2554 169 -3603 -161 3036 254
2861 254 -1042 1881 3039 -109 -1276 2183 1465 -3146 -1664 2082 -1305 -4476 331 2206 -2809
2876 -2809 -2378 3128 966 -2940 636 2694 -1086 -1490 1656 1271 -1322 -6 2258 1027 -872 627
2892 627 1855 -533 -2533 321 1417 -3065 -2934 2285 919 -3407 360 4551 -22 -1886 2944
2907 2944 2586 -2260 -767 2261 -599 -2644 151 1632 -711 -955 1673 2651 -167 -753 2328 1886
2923 1886 -2630 -1725 2386 -529 -3847 341 2640 -1697 -1642 2782 1677 -1240 791 2358 35 -269
2939 -269 921 247 -565 -346 -129 -410 -859 -720 185 -199 -1075 343 1437 -740 -697 2059 842 -1842
2957 -1842 452 1884 -1375 -1722 1248 160 -2385 -248 1292 -633 -907 390 415 -116 -275 -222 274
2974 274 -150 -1141 -434 316 -1000 -764 620 -144 -1207 1090 1157 -1572 -190 1820 -672 -2225 325
2991 325 816 -1476 -1456 62 467 5 -1011 -403 1396 863 -1361 -214 1937 -163 -1760 17 563
3008 563 -602 -741 -392 -193 983 361 -944 818 2421 -204 -1148 1519 1067 -1241 -729 92 -485
3025 -485 -814 -980 -717 709 589 -714 544 2256 522 -475 1558 1279 -1007 170 1303 -505 -715
3042 -715 629 633 -264 13 40 691 633 -1033 -1055 1577 391 -2343 -217 1772 -226 -1355 665 1857
3060 1857 979 109 106 1274 1858 -591 -1605 1400 1765 -2014 -2006 1570 759 -2013 -1378 425 497 -523
3078 -523 -1375 -31 1893 419 -1781 559 2373 -233 -1260 728 896 -347 -561 -606 -30 865 -371
3095 -371 -1839 55 1161 -1087 -1665 421 -74 -1428 -612 -364 -638 53 -115 -520 1002 1355 -47
3112 -47 662 1139 -48 -357 519 -892 -1242 174 -804 -2034 -426 540 -1125 -827 282 219 56 857
3130 857 -94 114 1790 594 -1276 439 1222 -641 -1127 250 665 29 -621 -646 686 799 -1478 -1229
3148 -1229 1545 602 -1996 -317 1351 -197 -880 582 694 481 834 383 254 1455 836 -725 219
3165 219 793 -417 -925 -233 -279 -233 -29 -861 -59 1145 57 -699 1316 1692 -671 222 1642 66
3183 66 -625 674 90 -865 128 93 -461 -74 382 -215 206 136 -511 568 638 -1165 -574 1314 -310 -1277
3203 -1277 351 939 -847 -242 1210 -13 -274 599 -143 -279 392 -465 -887 -109 -83 -732 -278 -44 -643
3222 -643 159 211 -544 196 623 -668 -510 818 -664 -1505 788 563 -1778 -527 1533 -217 -1560
3239 -1560 734 881 -654 -632 363 446 -6 -853 -59 834 -426 -1465 352 1075 -811 -639 1186 -134
3257 -134 -1142 737 128 -1308 140 1000 -1044 -871 1019 478 -782 379 1117 577 -201 38 919
3274 919 748 -671 -833 1002 -83 -2007 -161 1041 -999 -1053 1734 672 -1173 943 1873 -534
3290 -534 -599 1487 803 -681 -211 641 331 -194 -598 594 1227 -295 -874 924 607 -863 -330 561
3308 561 -287 187 766 -701 -399 2091 374 -1964 936 2249 -1189 -1877 1384 1418 -1306 -1315 907 1390
3326 1390 -738 -1429 1011 1573 -1108 -1666 1467 754 -1726 -142 1628 -515 -763 1391 420 -1420
3342 -1420 162 888 -1327 -1415 478 -246 -1232 -369 565 491 -207 -240 577 759 -527 -586 503 -442 -1385
3361 -1385 126 -272 -1839 112 1505 -1169 -1276 1908 976 -2146 -735 1754 -548 -2134 -323 894
3377 894 -216 -960 -174 1303 616 -951 295 1535 -284 -1118 764 466 -1347 75 1122 -897
3393 -897 -839 1162 230 -1564 -62 947 -669 -749 566 581 43 222 614 1315 1131 -99 213 1210 16
3412 16 -962 161 -391 -1051 268 95 -1307 -16 1639 -367 -760 1725 1236 -1037 47 1577 459
3429 459 -731 347 896 321 -452 -257 790 169 -1253 96 1189 -1069 -1527 1627 1084 -1734 66
3446 66 2281 -100 -1373 1146 1411 -997 -852 590 24 -886 -794 27 483 -180 -533 630 605 -561
3464 -561 372 942 -638 -340 1356 -685 -2267 547 1109 -2349 -1614 1645 192 -2306 -43 1950
3480 1950 38 -898 383 1141 112 -930 -392 477 -449 -1322 181 441 -967 -192 1272 -374 -627
3497 -627 1561 468 -1909 81 1639 -1228 -1946 1018 486 -1915 -754 1133 -18 -1354 14 953
3513 953 -1 -837 313 1498 80 -675 1812 2122 -935 -263 2238 -7 -2573 -143 881 -2253
3529 -2253 -2371 413 124 -985 221 1200 601 1010 1293 1010 906 969 521 -172 -266 1 315 -542 -1178
3548 -1178 847 1081 -1822 -865 2206 479 -2666 90 2218 -705 -1439 1468 1542 -342 -146 1261
3564 1261 717 -327 -394 -120 269 -437 -747 355 483 -192 388 1052 -162 -334 860 -574 -1443 -140
3582 -140 -107 -1646 -420 808 -212 -33 1373 425 -18 928 546 -643 -199 170 -733 -818 -506 -190 87
3601 87 -456 -637 442 389 -1152 -861 647 -544 -1821 307 1041 -661 -149 1562 613 -237 857 26
3619 26 -649 -304 -798 -1391 -777 -378 -812 -410 389 456 466 461 197 634 742 -723 -828 857 -75 -1759 -253
3640 -253 1054 -393 -851 641 515 -192 -257 -187 246 390 -749 -741 788 636 -747 227 1374 -26 -552
3659 -552 520 311 -297 -206 -213 -180 411 245 -376 567 995 -366 36 1081 28 -563 605 366 -755
3678 -755 -9 637 130 106 63 348 576 221 -688 294 1341 -436 -1132 955 961 -1157 -274 956 333 -610
3698 -610 -105 130 398 11 -833 -195 854 -229 -1196 246 801 -292 -629 284 418 599 310 -380 541
3717 541 1391 -824 -1740 695 620 -2021 -1721 1024 58 -1449 -209 1176 580 -36 -194 677 871 -665
3735 -665 -1204 536 35 -1496 -520 580 -468 -441 744 345 -277 421 334 -638 -283 -179 -977 -534 304
3754 304 -808 -509 920 88 -976 216 711 -646 -704 183 673 448 -347 403 1782 1086 -1012 300
3772 300 1723 -889 -2515 -152 439 -2174 -1759 810 448 -808 346 1184 1557 1123 725 1032 1226
3789 1226 -37 -973 325 -204 -933 -89 188 -394 -83 661 -543 -709 683 212 -945 53 747 -107
3807 -107 175 1282 787 710 1182 616 111 462 -206 -1036 -355 -420 -756 -235 182 -74 866 787 -304 38
3827 38 1233 -418 -1467 214 -123 -1496 -727 321 8 41 1015 1041 882 935 312 259 750 -215 -896 -232
3847 -232 -440 -1055 -508 45 -1162 -398 415 -663 -900 758 592 -730 243 1077 586 302 549 623 705
3866 705 59 -1023 -797 144 -1406 -1902 -319 32 -1118 -446 667 561 378 301 -12 563 653 -810 -843
3885 -843 438 60 -1514 -468 611 -94 -600 -186 317 606 84 -433 322 1045 -371 -611 826 456
3903 456 -799 429 880 -723 -427 804 -309 -1181 256 780 -153 -278 500 881 490 -9 136 1328
3921 1328 535 -1258 -123 1209 -502 -1552 451 786 -454 -167 687 427 498 556 -414 540 1096 -334
3939 -334 -935 391 494 -790 -694 189 201 -109 -283 -85 963 807 -497 203 1289 40 -1068 121
3957 121 394 -1060 -601 365 -491 -300 537 -141 -409 290 222 -524 -162 -60 -198 -87 -225 -441 324 430
3977 430 -368 200 844 -184 -483 91 -491 -1053 -160 -441 -1265 6 1002 -473 -352 1194 1002 -560
3995 -560 -205 446 32 -734 -854 -206 108 -933 -1116 654 1049 -831 -59 1429 -102 -1152 139 414
4013 414 -965 -311 848 151 -23 423 501 -96 -44 -258 -156 -18 -769 -647 353 215 -630 506 999
4032 999 33 262 867 305 -63 492 -160 -455 351 29 -1017 374 1066 -442 -265 862 480 -620
4050 -620 -59 150 -254 -293 -113 45 397 36 228 1026 717 -278 141 1051 -633 -1107 296 50 -1186
4069 -1186 -138 622 -106 -157 829 481 168 305 -131 -416 120 -292 -704 119 219 -28 276 383 -73 740
4089 740 609 -607 -211 976 -523 -1137 133 282 -910 -740 365 -86 -575 13 -179 -95 367 -262
4107 -262 -238 571 457 -338 238 298 -225 115 101 -773 -360 225 -1037 -1211 84 5 -748 164 572 -90 473
4128 473 688 -121 93 693 -254 -910 285 155 -772 -297 -22 131 158 -240 -438 548 597 -829 -111 883
4148 883 -101 -691 512 515 -490 329 581 -683 34 798 -426 -770 633 487 -573 -133 212 579 -154
4167 -154 -279 89 1143 214 -827 607 1279 -560 -741 963 349 -1195 -38 430 -464 -103 313 -14
4185 -14 186 766 291 -29 397 258 -94 448 -279 -509 301 129 -425 321 820 129 126 763 184 -37 272
4206 272 -247 -698 346 -22 -1449 -405 733 -471 -955 468 848 -101 227 629 994 392 -520 0
4224 0 532 -450 -1299 -81 264 -1331 -1022 586 -664 -1209 408 671 -966 -278 1001 281 -168 405
4242 405 600 7 -163 -300 -80 102 -560 -472 308 117 -559 171 18 -681 -4 328 -1058 -412 899 -431
4262 -431 -1415 594 1258 -491 -698 926 917 -426 -218 234 559 -230 -973 -250 610 -329 -1002 387 506
4281 506 -475 54 232 -348 112 823 -371 -740 976 431 -905 208 1179 30 -414 542 548 -9 -71
4300 -71 -137 53 121 -317 -282 256 -150 -209 648 380 -546 648 1155 -541 -471 1205 380 -1160 353 1138
4320 1138 -72 -531 67 111 -22 -186 -347 -149 325 -270 -233 442 298 61 223 125 -278 653 136 -1170
4340 -1170 146 1086 -1003 -1308 771 674 -939 -367 829 238 -556 -302 45 218 -202 -799 14 287
4358 287 -370 -768 303 129 -440 288 171 -497 129 496 -756 -459 521 -347 -872 -64 61 -445 -54
4377 -54 109 -313 162 535 -90 -137 183 31 -249 -406 -223 -373 259 -455 -808 655 322 -1107 5 1259
4397 1259 -128 -689 405 545 -415 -408 34 115 -31 -238 -333 656 556 -448 21 1130 283 -337 436 293
4417 293 -306 104 54 -232 131 217 -486 231 793 -300 -205 1156 656 -704 306 367 -414 -588 428 172
4437 172 -37 15 173 569 566 -195 273 1020 238 -608 464 580 -1174 -625 364 -226 -758 -259 155 79 85
4458 85 57 109 497 -128 -306 575 673 -679 -277 930 5 -1005 115 554 -509 -597 73 186 -128 -480
4478 -480 -480 168 99 -793 -371 875 -168 -897 234 582 -354 -165 392 252 106 405 -94 153 294 -469
4498 -469 -737 136 -460 -1005 -253 -136 -944 -232 387 -350 -162 682 283 -263 410 264 134 250 30 -275
4518 -275 619 44 -648 182 713 -717 -891 456 0 -1208 -456 138 -388 -215 16 279 484 587 -46
4537 -46 450 886 431 63 363 -41 -446 305 -138 -855 -122 529 -642 -564 694 175 -513 193 292 56
4557 56 168 146 -237 615 633 -413 86 807 102 -563 179 487 -341 -84 -344 -343 418 135 -728 132 835
4578 835 -483 -916 334 453 -514 -197 307 25 160 212 -7 725 482 -538 -41 667 -323 -804 75
4597 75 -96 -994 -204 -105 -394 -298 380 -251 -230 434 -186 -177 477 236 -319 400 12 -699 -292 405 39 -696
4619 -696 112 347 -86 -254 -475 378 392 -733 -593 1079 170 -1352 -304 1118 -78 -1389 286 831
4637 831 -420 -562 166 169 -38 -654 -349 561 308 -638 88 875 -154 -340 760 94 -283 116 405 -441
4657 -441 -109 -11 -491 58 126 -447 -118 744 67 -312 618 667 -425 -91 623 195 -185 23 401 403 79
4678 79 -305 252 681 -312 -856 586 423 -899 -414 706 192 -305 278 500 40 429 0 -107 471
4697 471 103 -678 -1 758 -221 -151 416 224 -63 108 -162 327 410 -480 -606 458 569 -886 -202 1135
4717 1135 88 -619 504 507 -526 -483 89 -116 -104 -74 -143 610 442 -206 193 540 -226 -454 136 -143 -522
4738 -522 -159 -146 -340 360 371 -449 485 999 -132 -595 258 -46 -973 -588 -92 -378 -513 -28 -127 401 329
4759 329 -143 348 482 -109 -301 235 53 -578 15 -84 -510 297 69 -251 -116 208 -451 -505 251 -102 -595
4780 -595 268 835 188 52 751 805 370 -57 87 509 140 -1018 -227 642 -574 -865 338 850 -356
4799 -356 -233 955 316 -501 234 252 143 134 -68 17 466 246 -96 139 669 -137 -278 156 -2 -255 -75
4820 -75 3 59 564 119 -78 576 449 -679 -308 577 -331 -723 110 245 -340 92 683 308 135 366 455
4841 455 131 166 -164 -56 74 -933 -457 266 -371 -901 198 269 -374 76 504 98 65 584 182 -250
4861 -250 122 3 -503 -87 49 -542 -528 -86 -133 -84 61 44 221 287 -174 -37 572 -253 -585 308 380 -737
4883 -737 -445 404 -450 -688 88 187 -486 -303 -32 120 -6 13 75 392 244 -107 230 590 -262 -309 360
4904 360 -428 -802 -92 63 -436 -175 276 46 -36 717 401 146 397 0 -140 211 14 -17 200 300 45
4925 45 -17 342 -211 -141 142 -245 -314 315 -303 -402 531 350 -358 115 808 -61 -217 182 143 -253 -31 96
4947 96 126 97 366 311 631 402 31 360 263 -580 -548 -64 -701 -928 76 163 -648 51 891 459 63 717
4969 717 422 -66 -92 -113 -384 -352 -418 -319 29 -102 -482 -84 113 -463 -37 154 -557 -597 357 225 -475 319
4991 319 424 2 183 380 -126 -206 -151 -540 -586 -309 -467 -331 150 165 49 332 140 -9 138 184 -580 -222
5013 -222 258 -480 -620 562 260 -378 316 563 132 -243 260 -325 -161 -301 -171 -220 298 -18 100 411
5033 411 387 -18 39 267 -223 -380 114 -366 -359 196 65 -22 331 60 -156 541 510 -331 -439 378 203 -467
5055 -467 -66 297 9 -74 -137 337 508 72 -337 384 539 -549 -284 633 237 -530 -50 574 125 -157
5075 -157 84 167 67 -181 -287 201 433 -144 -309 513 224 -483 333 545 -192 49 301 -51 -461 14
5095 14 -91 -248 -143 -239 -24 467 -369 -180 234 85 -327 121 484 161 -106 119 -285 -128 -64 -368 -512
5116 -512 204 147 -522 -127 631 28 -227 597 170 148 -38 -124 -277 145 -51 -536 90 115 -393 -391 -20 -262
5138 -262 -286 -69 -128 -107 299 218 -226 732 766 -14 13 270 -161 -489 -309 -495 -623 -322 -297 -578 123 237
5160 237 197 425 444 224 577 388 -326 -131 312 -313 -631 477 632 -226 -359 649 376 -371 -100 24
5180 24 156 63 -224 196 322 36 -140 391 218 -225 37 439 -308 -425 404 -106 -332 254 568 43 -68
5201 -68 396 73 -278 -88 -202 -309 -202 -647 -218 410 -9 -358 597 485 264 539 597 13 117 201 -350
5222 -350 -381 115 -397 -640 13 -47 -458 -142 -53 -340 -297 221 -135 -292 341 216 -31 330 339 401 205 73
5244 73 -291 92 49 -967 -422 202 -701 -726 213 493 -262 1 441 -16 -64 -242 -223 -145 -32 -322 21 191
5266 191 -281 -79 135 136 -195 320 99 -610 -107 501 -199 -683 332 187 -508 -68 -3 -282 -72 -30 -119
5287 -119 -128 184 -85 -94 475 33 269 401 5 97 403 -64 -514 46 309 -391 -452 349 101 -163 152 254
5309 254 242 101 254 -86 265 297 -236 -147 277 -316 -445 153 136 -28 93 -94 -1 161 145 -360 264 434
5331 434 -220 113 483 -213 -248 354 160 -585 74 434 -163 -486 46 403 49 -288 -327 351 167 -470 -217
5352 -217 600 112 -760 102 546 -28 -442 338 38 -153 -88 -259 -76 244 -19 -179 320 409 -119 -189 263
5373 263 -46 -177 -109 -90 23 134 -328 -179 337 86 -449 54 303 -208 -18 258 -240 -336 428 21 -261
5394 -261 90 378 -90 -183 -76 99 -115 -128 -451 -140 120 -263 -372 372 337 -72 -30 262 13 59 -14 -220
5416 -220 79 430 -330 -329 415 445 -368 13 603 196 -212 40 169 -10 -170 -250 19 85 -287 37 347 153
5438 153 81 329 284 -234 -126 364 -116 -266 289 98 -371 -62 260 126 170 -24 -139 -26 0 -379 -336 380
5460 380 329 -273 -41 208 -57 99 30 -181 318 257 -387 -192 406 -206 -468 422 -84 -524 7 -97 -265
5481 -265 -272 266 -146 32 419 52 -35 371 449 100 -32 -98 -328 57 -201 -606 -44 104 -395 -358 348 -40
5503 -40 -212 260 365 -300 174 264 -221 -209 -89 -228 -269 43 -66 -22 221 -109 -17 450 -58 -417 103 316
5525 316 -357 -244 112 -87 -225 185 93 -140 313 44 -87 251 295 -212 -232 383 109 -89 -81 21 64 74
5547 74 -152 -245 357 115 -333 139 419 -232 79 278 27 -83 197 167 -107 160 179 -125 -15 129 22
5568 22 -36 76 -100 60 260 -135 -205 309 176 -158 6 447 22 -117 275 -12 114 454 -329 -182 340
5589 340 -84 -412 54 350 -130 -228 226 182 -30 -10 -134 -118 324 -67 -346 41 143 -377 -209 139 -267
5610 -267 -166 47 -38 -243 -107 95 17 -101 45 -113 249 -84 -406 123 399 -385 -376 332 273 -385 65 169
5632 169 -142 -191 -150 -41 -124 -300 -481 166 38 -245 -252 333 142 -6 219 357 -43 57 125 -471 219 199
5654 199 -399 -415 217 112 -553 143 194 -263 -204 121 179 189 82 -230 46 372 68 -133 444 260 -219 64
5676 64 256 -86 84 218 -213 -10 184 -252 -185 76 -55 -183 318 266 -225 8 474 252 -55 152 233
5697 233 62 -102 -57 -166 391 -215 -242 241 414 -537 58 556 221 -281 26 394 -110 -211 59 104 223
5718 223 -80 -174 99 72 -204 -146 11 -92 -191 257 -67 -198 209 -55 -667 204 218 -447 -354 305 -41 -330
5740 -330 130 234 -114 -143 119 5 141 -201 -23 9 0 -676 -143 356 -398 -372 479 376 -231 -35 271 -159
5762 -159 -310 -38 -125 -85 -40 -195 -158 406 -225 -173 191 117 -277 -169 139 107 11 -87 -34 143 358 -146 25
5785 25 301 3 -342 176 350 -283 -305 527 -135 -404 197 158 -225 -45 136 -3 26 -52 95 389 -102 -302
5807 -302 138 551 -276 -287 448 -140 -393 427 303 -168 -117 379 193 -189 173 358 -111 23 -33 -8 117
5828 117 -51 -259 129 96 -173 -8 244 -123 -193 298 -3 -165 260 143 -105 11 282 -117 -13 212 -193
5849 -193 -100 180 -119 -247 -65 -138 -248 9 -99 -242 -31 5 -251 -50 189 -524 -229 115 72 -153 533
5870 533 224 -177 247 519 -93 -244 233 12 -453 -315 -219 -376 -205 -72 -171 36 -40 -46 36 -51 -117 97 441
5893 441 -234 -105 371 133 -330 311 308 -404 -305 113 21 -547 -16 -200 -211 -87 -27 111 235 153 -26 572
5915 572 226 39 266 355 -380 -337 200 -128 -277 161 265 -198 213 291 121 30 1 -113 -6 120 -123 -28
5937 -28 -26 -29 -131 169 420 25 -104 137 179 103 75 93 112 247 -236 -145 358 76 -517 -37 -30 -480 -482 252 139
5962 139 -265 178 300 170 -8 284 70 232 -69 -234 -102 -124 -552 -376 261 -153 -396 171 181 -425 122
5983 122 125 -182 -1 98 -267 -299 111 -52 -120 211 108 -54 -163 22 -70 -299 -28 -95 -76 83 -239 100 319
6006 319 -106 -121 402 175 -338 -221 239 -139 -213 -141 -216 -188 145 13 -16 398 -9 -349 167 288 24 -147
6028 -147 248 -258 -64 -48 -146 -162 203 -269 -209 335 125 -99 266 739 -263 -90 433 156 -314 287 307
6049 307 -68 -253 106 62 -88 124 9 267 91 -306 171 216 -375 -348 445 151 -389 298 357 38 -71
6070 -71 256 28 19 160 -32 99 263 218 69 121 212 -155 6 -100 39 86 -78 -356 -32 247 -230 -43
6092 -43 412 354 -312 -30 242 -262 -333 74 5 -286 -56 -23 -51 184 167 -40 -42 -3 -1 -21 -175 -412 117 33 -356
6117 -356 -324 498 66 -264 320 387 -180 -60 9 -438 -364 76 -332 -514 -14 205 -89 -25 358 75 15 -116
6139 -116 -18 98 109 -138 80 503 -104 -497 351 171 -378 -4 181 -423 -291 153 -98 -57 206 200 41 184
6161 184 330 63 160 17 -11 234 -163 -205 140 310 -232 -166 330 14 -163 353 213 -468 105 148 -139 -116
6183 -116 230 34 -138 310 246 141 -14 141 230 88 -9 -118 198 47 -194 241 313 -17 -216 410 73
6204 73 -394 -75 -128 -435 -50 316 -140 -315 285 291 52 257 337 231 181 -95 84 -42 -573 -501 -53 -9 -529
6227 -529 -255 253 -86 -205 262 335 -256 25 162 58 -261 90 -116 -145 -182 -315 -34 14 -231 -324 171 8
6249 8 -148 53 110 -95 36 61 -228 -194 101 -249 -449 119 169 -463 -207 228 -28 -242 133 267 46 181
6271 181 126 -24 304 -24 -124 56 -19 -231 57 9 -376 -110 168 47 -167 397 71 -62 206 -60 -126
6292 -126 272 240 -176 -158 64 40 -39 263 70 13 321 125 -13 267 75 -89 140 166 -454 -128 384 138
6314 138 -456 197 268 7 -140 -92 76 112 -57 -162 282 365 -54 60 418 253 -67 3 63 -225 -131 -98 -258
6337 -258 -366 317 -212 -101 271 431 -21 306 276 104 -176 -150 -236 65 -13 -82 -394 295 40 -297 220 142
6359 142 -285 -48 102 -187 -285 -47 -34 -51 137 148 3 45 -109 -99 18 -97 -402 -28 158 -291 -208 417
6381 417 54 -251 294 95 -201 31 -322 -205 -147 -210 -196 -212 193 162 -280 244 121 -106 -285 -156 71 141
6403 141 92 -347 225 70 -78 -3 325 -49 -8 259 -40 -393 -74 57 -554 -267 269 -4 -153 77 368
6424 368 164 35 -51 108 285 -276 -271 259 176 -516 -56 421 -35 -194 477 237 -244 67 196 -226 -170 238
6446 238 210 -69 -67 157 194 28 -247 -16 160 -183 -165 345 79 -233 92 298 84 6 383 8 -188 211
6468 211 -253 -392 -34 218 -180 -209 87 104 4 22 -27 68 -90 -439 -233 489 -164 -450 -88 -21 -263 -329
6490 -329 35 -148 -201 89 -280 -224 263 71 -301 -29 249 -157 -82 97 183 -116 -140 -65 128 -47 -335 -186
6512 -186 140 25 -217 200 53 -259 129 326 -66 -278 257 233 -327 -258 105 -20 -275 -84 -85 165 -108
6533 -108 -217 -11 285 -50 -195 156 61 -107 110 -39 -4 194 -41 -432 9 384 -120 -202 265 291 -83
6554 -83 39 110 -22 -49 -97 1 139 3 -214 22 221 -110 -24 103 121 -162 116 95 -80 146 277 -24 -47
6577 -47 465 60 -118 7 -116 -503 -38 -7 -176 -227 168 -88 -67 133 188 34 172 242 34 211 -152 -421
6599 -421 161 108 -422 51 196 60 -186 157 -8 -492 -38 -138 -177 -47 22 -99 39 188 145 -186 2
6620 2 92 39 -178 -218 -266 79 22 -462 158 311 4 -270 183 112 -225 -110 -67 -159 42 -14 -304 146 337 168
6644 168 55 314 403 -100 200 -34 -395 -150 -153 -103 -54 7 -145 42 105 -464 158 387 -191 -202 361 370 -197
6667 -197 -66 347 216 -97 130 111 -33 -101 -163 -75 -74 -400 -22 137 60 -202 175 9 -158 117 138 -84 -130
6690 -130 281 -10 -187 153 277 -94 -48 265 162 -5 209 -15 -38 204 258 240 116 -112 -73 228 -68 -252
6712 -252 237 92 -518 -87 457 -110 -324 198 205 -179 -99 163 -20 -85 86 -44 -70 67 -256 -264 -98 -52 29
6735 29 -160 -272 -135 32 64 -223 248 -107 -333 -62 510 50 -226 21 191 -413 -249 5 78 -40 -97
6756 -97 63 -154 -124 96 79 -156 -297 -159 111 -190 -253 326 160 -374 -110 447 -238 -248 162 217 -291 -70
6778 -70 139 -85 102 191 -23 53 144 -185 -39 52 -76 83 36 -162 -82 336 67 -479 222 366 -545 -198
6800 -198 472 201 -309 -5 230 -4 69 12 -4 -3 174 39 170 305 14 177 159 -258 36 355 -172 -139
6822 -139 342 -106 -316 37 269 80 -385 139 -116 -371 -9 126 -311 -146 248 -129 156 215 149 189 94
6843 94 42 275 241 -126 -237 452 -71 -328 83 203 -296 -366 137 35 -132 35 -86 306 55 -220 -21
6864 -21 59 99 -240 -207 -26 -204 140 -59 -364 -136 -40 -53 -318 138 4 -256 108 105 -282 -167 11 262 -52
6887 -52 -17 71 19 88 253 -26 45 198 -261 -24 -7 -108 -153 0 -70 -178 158 -51 -131 -81 68 -210 -30 126
6911 126 42 -20 198 7 -147 301 85 -284 23 70 -155 -134 -48 212 22 -174 -161 119 59 -296 -113 278
6933 278 243 -340 -7 437 98 -321 286 206 37 -15 -104 301 29 -15 -160 354 168 -232 -204 293 33 -109
6955 -109 238 90 -45 163 -106 -98 90 371 5 -93 122 51 162 184 -12 69 95 -260 -162 355 18 -505 18
6978 18 275 -234 -46 124 -72 -113 34 -15 -54 -203 -186 -257 -51 -45 -273 -114 133 -90 -17 305 -172 -77 178
7001 178 162 -327 -190 162 -21 -222 86 -158 -245 -39 -202 -111 304 -126 -363 114 244 -104 -173 125 93 -109
7023 -109 81 92 54 39 -250 156 252 -186 -156 -4 41 -220 -71 168 -67 -228 160 93 -274 72 37 -1 132
7046 132 42 71 72 33 -33 156 147 46 -57 130 -172 -213 96 175 -201 -37 173 -73 -57 210 187 -157 229 71
7070 71 22 -17 106 67 -105 -144 49 209 14 51 249 353 -77 -120 385 187 -519 -84 219 -110 -146 -13 63
7093 63 -71 53 231 73 110 19 239 173 80 -58 -127 -37 -414 -241 205 -153 -128 32 -226 -164 86 92 -108 14
7117 14 130 -245 -15 250 77 -229 -174 156 -490 -113 92 13 -195 16 121 -38 190 -9 243 240 -313 -228
7139 -228 328 6 -441 278 50 -274 -79 261 -198 -267 93 47 -126 -139 -193 26 66 56 -28 -29 259 -105 241
7162 241 104 -28 -16 102 42 -209 229 170 -311 2 243 1 53 6 12 -39 -42 -93 -45 87 -83 -94 126 141 -57
7187 -57 -87 196 -9 -86 99 -123 71 367 -109 7 195 337 -303 154 48 -273 -155 212 -119 -28 53 -123
7209 -123 134 5 165 -74 108 17 -44 27 142 -214 -53 83 -132 -244 127 124 -60 -43 -36 -101 63 113 -187
7232 -187 -63 131 96 -220 69 -91 -83 -297 -37 -120 -37 67 -63 222 280 -54 77 378 -25 -120 121 -71
7254 -71 -244 -56 -71 -143 -222 8 -281 -141 135 -212 -320 148 -146 -289 15 28 -229 -214 162 90 -9 205 75
7277 75 -20 -8 -198 -63 40 -16 -369 113 332 -468 -75 554 276 -89 133 180 -19 -187 -13 17 142 120
7299 120 -60 -74 121 216 329 -17 144 -26 171 -121 -282 294 -104 -252 -107 278 -135 -237 376 383 -116
7320 -116 143 315 -106 -117 104 184 23 264 -52 44 -249 -321 -159 54 -466 -192 188 -95 -265 237 360
7341 360 -7 17 281 194 -77 80 -172 -246 100 -171 -308 -127 -35 34 144 12 42 115 -59 -256 -130 146
7363 146 -288 -492 270 258 -481 36 563 37 -132 91 159 -342 -136 129 -177 -81 73 -119 -52 38 -17 11
7385 11 55 -159 88 41 -197 -232 121 -69 -327 69 443 -66 -116 149 8 -173 69 96 9 -26 11 -40 -51 -32
7409 -32 60 10 -80 -54 282 278 -43 61 240 -34 -329 264 190 -451 107 309 -47 -45 419 -53 49 -60 202
7432 202 37 -70 145 57 19 -3 -18 70 -112 -174 183 26 -374 -136 349 42 -286 6 203 -229 -93 322
7454 322 -51 -137 216 165 -120 -16 286 -191 -230 -129 54 25 -1 -75 233 68 -230 25 202 -99 -137 95
7476 95 -40 -432 -64 274 -61 -131 163 59 83 -125 161 -25 36 -104 -55 18 -28 -313 244 58 -231 147
7498 147 182 -75 -76 116 25 -273 -64 24 -334 -139 37 -192 -313 79 86 79 31 6 -140 47 -101 18 225 100
7522 100 -132 38 143 -313 -89 66 -181 -207 77 103 -307 74 157 -55 -17 374 105 -54 103 114 24 -106
7544 -106 -149 -124 34 -12 164 148 174 -32 149 345 -264 -142 140 -50 -422 64 30 -171 122 411 155 54
7566 54 103 140 219 176 -203 57 249 -143 -85 202 196 -34 -162 44 -270 37 -151 -196 -145 -44 1 -98 121 295
7590 295 132 17 76 168 156 28 -203 -149 97 -250 -289 124 226 -318 36 27 162 8 76 -155 -248 39 -30
7613 -30 -79 117 135 -190 -22 -158 0 -3 147 -217 74 21 -110 -134 231 36 -92 243 -46 -11 -35 -27 -212 7
7637 7 99 -143 -145 224 13 -317 79 182 284 51 127 87 344 -8 -275 -20 111 -271 -106 226 -78 -146 -86
7660 -86 -62 -113 62 294 -42 -227 157 -127 -132 8 56 134 31 -211 -70 302 -48 -228 95 183 -158 -18 392
7683 392 117 -170 47 43 82 -15 146 -145 1 164 -7 -153 -9 107 137 -126 -121 27 299 165 -103 282
7705 282 299 -183 -65 210 -36 -221 -50 59 -41 39 -50 -94 258 19 19 -22 167 -213 -132 -26 -68 -92 -116 29
7729 29 -43 -72 58 -110 21 -56 -186 -29 213 -214 -275 87 56 -438 8 129 73 -128 61 -23 -150 -132 33
7752 33 90 -33 -48 -96 306 33 -71 135 95 -193 -120 143 -175 -175 -64 51 -110 174 250 -81 38 276 148
7775 148 -96 75 155 -65 -162 7 -21 183 -2 11 274 101 -90 303 273 -87 -75 321 -71 -185 -59 240
7797 240 -149 46 278 119 -32 -92 -20 -44 22 -80 -82 30 105 -290 213 166 -40 40 22 55 -123 84 -332 113
7821 113 236 -101 -76 124 105 -76 45 59 54 -134 191 79 -19 154 70 47 -20 82 -49 186 106 63 127 213
7845 213 -139 -39 63 -68 70 82 53 -147 62 168 -50 64 53 -85 -68 126 15 108 -76 -220 -100 136
7867 136 -356 -172 124 199 -236 -159 8 -165 -150 36 23 -83 71 -32 -54 8 71 -207 -54 235 -276 -136
7889 -136 96 -86 -176 340 54 -141 28 -51 -104 91 107 -249 -46 -82 -139 -93 113 -44 -6 -5 -148 -61 190 94
7913 94 63 85 -26 -57 -22 171 -94 -107 270 16 81 155 136 -48 229 50 -112 119 100 -77 -22 127 -139 -85
7937 -85 217 10 14 -163 152 68 -46 48 155 48 -61 52 -55 150 43 3 307 14 -197 83 137 -88
7959 -88 64 127 -131 -189 -167 5 -208 63 85 -7 0 184 -9 152 25 10 -98 -6 161 -64 17 12 85 54 -163
7984 -163 -41 118 70 -224 -16 202 6 -288 185 166 -163 94 287 -26 -199 -105 -68 -46 -194 199 190 77
8006 77 -110 -20 25 -210 -280 61 8 -351 14 3 -212 -147 257 52 -210 21 260 -89 166 229 -9 -99 -78
8029 -78 -84 -27 -257 -174 -23 44 -349 124 201 -6 -234 72 235 -102 -127 385 80 -112 215 343 77 126 231
8052 231 -58 -109 101 -52 22 -68 -37 163 20 -114 50 -76 -269 24 208 -24 -135 68 266 -169 -131 404
8074 404 -25 -252 304 260 -286 -69 113 -130 -219 34 -79 1 -210 -134 229 -10 -164 -64 -19 69 -368 117
8096 117 179 -166 -14 261 -158 -58 113 12 -217 -73 -23 74 164 7 -10 102 -28 52 64 42 -57 -103 93
8119 93 -69 -17 268 52 -125 237 291 -254 -35 369 84 -361 4 203 -191 -221 6 -32 -147 140 73 94
8141 94 -132 -157 -166 -16 -79 -236 -27 -63 -52 64 20 -121 -73 254 -92 -161 321 -126 -98 128 168 6 -133 147
8165 147 -127 19 143 118 -69 71 62 99 253 -144 2 281 212 -361 91 235 -120 -280 121 358 -240 -106
8187 -106 137 -126 -82 -84
8191h4
##END NTUPLES=NMR FID
##END=
