##TITLE=1H_CA-8648-1
 CDCl3, 8 sc, 
 20.9.2019
##JCAMPDX= 6.0         $$ Bruker NMR JCAMP-DX V2.0
##DATA TYPE= NMR FID
##DATA CLASS= NTUPLES
##ORIGIN= UXNMR, Bruker Analytische Messtechnik GmbH
##OWNER= root
$$ XWIN-NMR		Version 3.5
$$ Fri Sep 20 15:20:01 2019 Russian Standard Time (UT+4h)  she@DPX200
##.OBSERVE FREQUENCY= 200.1315
##.OBSERVE NUCLEUS= ^1H
##.DELAY= (6, 6)
##.ACQUISITION MODE= SIMULTANEOUS
##.ACQUISITION SCHEME= undefined
##.AVERAGES= 8
##.DIGITISER RES= 18
##SPECTROMETER/DATA SYSTEM= spect
##.PULSE SEQUENCE= zg30
##.SOLVENT NAME= CDCl3
##.SHIFT REFERENCE= (INTERNAL, CDCl3, 0, 15.7039)
##AUDIT TRAIL= $$ (NUMBER, WHEN, WHO, WHERE, WHAT)
$$ ##TITLE= Audit trail, XWIN-NMR		Version 3.5
$$ ##JCAMPDX= 5.01
$$ ##ORIGIN= Bruker BioSpin GmbH
$$ ##OWNER= she
$$ F:/spectra/data/she/nmr/H-F/1/audita.txt
$$ ##AUDIT TRAIL=  $$ (NUMBER, WHEN, WHO, WHERE, WHAT)
(   1,<2019-09-20 15:19:01.21 +0400>,<she>,<DPX200>,
      <created by zg, POWCHK disabled, PULCHK disabled
       configuration hash MD5:
       00 E9 B6 7A A2 85 ED C7 34 08 36 98 17 FE 4E 26
       data hash MD5: 16K
       71 65 B2 4B 15 E9 F7 48 42 59 C2 EB 34 4B 29 64>)
$$ ##END=
$$ 
$$ hash MD5
$$ 21 27 2D DE 59 48 E5 0D D5 D9 2E BB 9B C6 6F 0F
##$RELAX= 
##$RELAX= 
##$RELAX= 
##$RELAX= 
##$RELAX= 
##$RELAX= 
$$ Bruker specific parameters
$$ --------------------------
##$DU= <F:/spectra>
##$EXPNO= 1
##$NAME= <H-F>
##$PROCNO= 1
##$TYPE= <nmr>
##$USER= <she>
##$AMP= (0..31)
100 100 100 100 100 100 100 100 100 100 100 100 100 100 100 100 100 100 
100 100 100 100 100 100 100 100 100 100 100 100 100 100 
##$AQSEQ= 0
##$AQ_mod= 1
##$AUNM= <au_zg>
##$AUTOPOS= <>
##$BF1= 200.13
##$BF2= 200.13
##$BF3= 200.13
##$BF4= 200.13
##$BF5= 200.13
##$BF6= 200.13
##$BF7= 200.13
##$BF8= 200.13
##$BYTORDA= 1
##$CFDGTYP= 0
##$CFRGTYP= 5
##$CHEMSTR= <none>
##$CNST= (0..31)
1 1 145 1 1 1 1 1 1 1 1 1 1 1 1 1 1 1 1 1 1 1 1 1 1 1 1 1 1 1 1 1 
##$CPDPRG= <>
##$CPDPRG1= <>
##$CPDPRG2= <>
##$CPDPRG3= <>
##$CPDPRG4= <mlev>
##$CPDPRG5= <mlev>
##$CPDPRG6= <mlev>
##$CPDPRG7= <mlev>
##$CPDPRG8= <mlev>
##$CPDPRGB= <>
##$CPDPRGT= <>
##$D= (0..31)
0 1.2 0 0 0 0 0 0 0 0.06 0 0.03 0 0 0 0 0.0002 0 0 0 0 0 0 0 0 0 0 0 0 
0 0 0 
##$DATE= 1568978340
##$DBL= (0..7)
120 120 120 120 120 120 120 120 
##$DBP= (0..7)
150 150 150 150 150 150 150 150 
##$DBP07= 0
##$DBPNAM0= <>
##$DBPNAM1= <>
##$DBPNAM2= <>
##$DBPNAM3= <>
##$DBPNAM4= <>
##$DBPNAM5= <>
##$DBPNAM6= <>
##$DBPNAM7= <>
##$DBPOAL= (0..7)
0.5 0.5 0.5 0.5 0.5 0.5 0.5 0.5 
##$DBPOFFS= (0..7)
0 0 0 0 0 0 0 0 
##$DE= 6
##$DECBNUC= <off>
##$DECIM= 24
##$DECNUC= <off>
##$DECSTAT= 4
##$DIGMOD= 1
##$DIGTYP= 9
##$DL= (0..7)
0 120 120 120 120 120 120 120 
##$DP= (0..7)
150 150 150 150 150 150 150 150 
##$DP07= 0
##$DPNAME0= <>
##$DPNAME1= <>
##$DPNAME2= <>
##$DPNAME3= <>
##$DPNAME4= <>
##$DPNAME5= <>
##$DPNAME6= <>
##$DPNAME7= <>
##$DPOAL= (0..7)
0.5 0.5 0.5 0.5 0.5 0.5 0.5 0.5 
##$DPOFFS= (0..7)
0 0 0 0 0 0 0 0 
##$DQDMODE= 0
##$DR= 18
##$DS= 0
##$DSLIST= <SSSSSSSSSSSSSSS>
$$ [...]
##$SUBNAM2= <"">
##$SUBNAM3= <"">
##$SUBNAM4= <"">
##$SUBNAM5= <"">
##$SUBNAM6= <"">
##$SUBNAM7= <"">
##$SUBNAM8= <"">
##$SUBNAM9= <"">
##$SW= 24.0689530833862
##$SWIBOX= (0..15)
0 0 2 0 0 0 0 0 0 0 0 0 0 0 0 0 
##$SW_h= 4816.95568400771
##$TD= 16384
##$TD0= 1
##$TE= 0
##$TE2= 300
##$TE3= 300
##$TEG= 300
##$TL= (0..7)
0 120 120 120 120 120 120 120 
##$TP= (0..7)
150 150 150 150 150 150 150 150 
##$TP07= 0
##$TPNAME0= <>
##$TPNAME1= <>
##$TPNAME2= <>
##$TPNAME3= <>
##$TPNAME4= <>
##$TPNAME5= <>
##$TPNAME6= <>
##$TPNAME7= <>
##$TPOAL= (0..7)
0.5 0.5 0.5 0.5 0.5 0.5 0.5 0.5 
##$TPOFFS= (0..7)
0 0 0 0 0 0 0 0 
##$TUNHIN= 0
##$TUNHOUT= 0
##$TUNXOUT= 0
##$USERA1= <user>
##$USERA2= <user>
##$USERA3= <user>
##$USERA4= <user>
##$USERA5= <user>
##$V9= 5
##$VALIST= <valist>
##$VCLIST= <CCCCCCCCCCCCCCC>
##$VD= 0
##$VDLIST= <DDDDDDDDDDDDDDD>
##$VPLIST= <PPPPPPPPPPPPPPP>
##$VTLIST= <TTTTTTTTTTTTTTT>
##$WBST= 1024
##$WBSW= 4
##$XGAIN= (0..3)
0 0 0 0 
##$XL= 0
##$YL= 0
##$YMAX_a= 516820
##$YMIN_a= -884022
##$ZGOPTNS= <>
##$ZL1= 120
##$ZL2= 120
##$ZL3= 120
##$ZL4= 120
##$ABSF1= 10
##$ABSF2= 0
##$ABSG= 5
##$ABSL= 3
##$ALPHA= 0
##$AQORDER= 0
##$ASSFAC= 0
##$ASSFACI= 0
##$ASSFACX= 0
##$ASSWID= 0
##$AUNMP= <proc_1d>
##$AZFE= 0.1
##$AZFW= 0.1
##$BCFW= 1
##$BC_mod= 2
##$BYTORDP= 1
##$COROFFS= 0
##$CY= 11.3945322036743
##$DATMOD= 1
##$DC= 2
##$DFILT= <>
##$DTYPP= 0
##$F1P= 20.1720416913024
##$F2P= 0.152960286110954
##$FCOR= 0.5
##$FTSIZE= 0
##$FT_mod= 4
##$GAMMA= 1
##$GB= 0.15
##$INTBC= 1
##$INTSCL= 1
##$ISEN= 128
##$LB= 0.24
##$LEV0= 0
##$LPBIN= 0
##$MAXI= 10000
##$MC2= 0
##$MEAN= 0
##$ME_mod= 0
##$MI= 1.114404
##$NCOEF= 0
##$NC_proc= 0
##$NLEV= 6
##$NOISF1= 3.799351
##$NOISF2= 2.8
##$NSP= 1
##$NTH_PI= 0
##$NZP= 0
##$OFFSET= 15.70392
##$PC= 1
##$PHC0= -9580.146
##$PHC1= 24.40096
##$PH_mod= 1
##$PKNL= yes
##$PPARMOD= 0
##$PSCAL= 0
##$PSIGN= 0
##$REVERSE= no
##$SF= 200.130013532006
##$SI= 16384
##$SIGF1= 3
##$SIGF2= 2
##$SINO= 400
##$SIOLD= 16384
##$SREGLST= <1H.CDCl3>
##$SSB= 0
##$STSI= 0
##$STSR= 0
##$SW_p= 3612.71676300578
##$SYMM= 0
##$S_DEV= 0
##$TDeff= 0
##$TDoff= 0
##$TI= <>
##$TILT= no
##$TM1= 0
##$TM2= 0
##$TOPLEV= 0
##$USERP1= <user>
##$USERP2= <user>
##$USERP3= <user>
##$USERP4= <user>
##$USERP5= <user>
##$WDW= 1
##$XDIM= 8192
##$YMAX_p= 0
##$YMIN_p= 0
$$ End of Bruker specific parameters
$$ ---------------------------------
##NTUPLES= NMR FID
##VAR_NAME=  TIME,          FID/REAL,        FID/IMAG
##SYMBOL=    X,             R,               I
##VAR_TYPE=  INDEPENDENT,   DEPENDENT,       DEPENDENT
##VAR_FORM=  AFFN,          ASDF,            ASDF
##VAR_DIM=   8192,          8192,            8192
##UNITS=     SECONDS,       ARBITRARY UNITS, ARBITRARY UNITS
##FACTOR=    0.0002076,     1,               1
##FIRST=     0,             0,               0
##LAST=      1.7004516,     0,               0
##MIN=       0,             -884022,         0
##MAX=       1.7004516,     516820,          0
$$ Real data points
##PAGE= N=1
##DATA TABLE= (X++(R..R)), XYDATA
0@%%%qJ7k5K7k8M9p2Q1r7J29j62J94k34K84l42M06m77N59o54P61q78J013j165
26f22J331j515J720j946K196k472K776l108L473l878M318m797N324n906O548p251
42c809Q024q882R839j0907J2103j3461J5017j6810J8899k1381K4393k8130L2905
55A7800l9260M8198o1786Q5148j36085M27144l40701p45392R01841K99242p43741
66b87592k76975P70442J29542n54082j9591N32497p9089l85860P8638K52256j85395
77b5209j29146K14191R3895k06041k9033R4011o4551l3443J66011N567j33082
88d6830P3418J08314j64564p8342J77387k9480k54233R0166K94341q6420k24935
99a41178J69924J86209k44617j82669K53030J21792k68929n2400K79613j8620
$$ plain form
0 0 0 0 0 -8 9 -16 11 -17 32 -40 41 -56 73 -89 105 -129 155 -187 219 -258 301 -353 408 -470 543 -622
26 -622 709 -806 914 -1032 1164 -1308 1468 -1640 1833 -2045 2273 -2524 2800 -3106 3442 -3809
42 -3809 4215 -4667 5172 -5735 6368 -7093 7924 -8886 10013 -11368 13025 -15105 17800
55 17800 -21460 26738 -35048 50100 -85985 341159 458 -744934 156907 456149 -287592
66 -287592 -564567 205875 335417 -218665 -238256 294241 215152 -170708 -92070 160186 -25209
77 -25209 -154355 59836 153731 -52310 -81343 12668 -51883 -85326 80685 86252 -46830
88 -46830 26588 134902 -29662 -108004 69383 39903 -214330 -124164 170177 83757 -141178
99 -141178 28746 214955 -29662 -212331 40699 162491 -106438 -158838 120775 102155
109A02155k60103J19419K53337k00816k45422K27247J90718k25479q5520K41471
119A17007j0267k62803N6432K38619r6539j98179J27956J54953j40772r1337J72863
130F7933N2447j92919l7003J64282o688j22317P3108R9256j14705p2216J24834
141C6012K6971j20203J6327R5702n7592o0436R4737M0827j01590k1930P8034j5488
153A1371n7268N8420N8273p4803n0396P7148K1068q9807R069R5760m5838r9013
165h6016Q3088R9733r3514o4325J01483K580j25379M6232J43527o8464j34116
176i5171Q0575J00977j01747p2573J20783N4632j32884m5575J34109M0951j12222
187b8145j3542R1568k9285q6727N3295P4099n8303m1688N5139K0m9949L6644M2051
$$ plain form
109 102155 -157948 -38529 214808 13992 -231430 -4183 186535 -38944 -124464 117007
119 117007 106740 -156063 -99631 138988 42449 -155730 -27774 127179 -13593 -104930 67933
130 67933 120380 -72539 -109542 54740 48052 -74265 -1157 98099 -16606 -88822 36012
141 36012 62983 -57220 -40893 54809 -2783 -63219 31518 72345 -29245 -51175 26859 11371
153 11371 -45897 12523 70796 -4007 -54403 22745 43813 -45994 -36925 58835 12997 -86016
165 -86016 -2928 96805 3291 -61034 40449 43029 -82350 -36118 107409 38945 -95171
176 -95171 -14596 86381 -15366 -87939 32844 87476 -45408 -90983 43126 84077 -28145
187 -28145 -41687 49881 20596 -66131 -12836 61263 2960 -38728 16411 16431 -33518 3126 45177
200D5177n5284k6454N6354j94n2138K7132N0024m4018m7576N0070L7808n5461
212a4560j9605O9150K627q5122J0837R1468k9468q6380N1114O9523p4513m4621
224e9550R3819K0649j00989r28R0279j7954p0294L7939N2777n3231m3776N9271
236H012L6313n8341k3652N9111O822o2176J0996O2388l0594n9783M2936M6503
248C8535m5437j8363N0763n569m9455J8552L4706k9168j8637L3788N368l1043
260a5960O798L0192j4849l1816J6690L0123k0388k4173L2816K2672m0153j5912
272b3960L8758m963m0349K2189L4939l4468j9010M7095R449m3734M400L4460j9853
285D953l2054K3150K8056k2546k5937J9962K3217j9193j6292K6310J0936l2686
$$ plain form
200 45177 -10107 -36561 19793 19599 -32539 -5407 44617 599 -46977 3093 40901 -14560
212 -14560 -34165 34985 37612 -47510 -36673 54795 25327 -61053 -9939 59584 -14929 -59550
224 -59550 34269 54918 -46071 -46999 43280 25326 -44968 -7029 45748 -7483 -51259 8012
236 8012 44325 -14016 -37668 21443 28265 -33911 -22915 39473 8879 -50904 -7968 38535
248 38535 -6902 -25265 25498 19929 -29526 -10974 23732 -5436 -24073 9715 15083 -15960
260 -15960 -9162 21030 6181 -25635 -8945 21178 790 -23383 9433 32105 -8048 -23960
272 -23960 14798 9835 -30514 -8325 26614 -7854 -26864 20231 29680 -14054 -9654 24806 4953
285 4953 -27101 -3951 24105 1559 -24378 -4416 18801 -392 -16684 9626 20562 -12124
297a2124l937L4560m749k9496J3782J7163k3048m496K7629j781j8968R184J1548
310A5267j1476o701L468m165n991L08L631M860J363O70Q560J976j0454n34M592
325E374j0222j740J5387n522j4864J5050J2256k0247n971J9606m243j9599P154
338g581J5857m638j0906n44P409N277p050k939J3131L968j4657K77J0891r787
352a292j1318P502K092n242Q705O482o662K007O239o479n180J498m600m35O912
367B29l365l851Q255l76q069P629O355r638o37R478k322n015L620k758m737K643
383b559k067j411Q974j2r497O282P924r756m598O667k612l041P844J311l360N300
399E389n82p762M618L646r347r30Q299k079k743M931k908n124L822j95l098O611
$$ plain form
297 -12124 -16061 18499 13750 -15746 -1964 15199 -7849 -12345 15284 13503 -5465 3719 15267
310 15267 3791 -2910 558 -3607 -9598 -9290 -5659 -799 564 1234 9794 11770 1316 782 5374
325 5374 -4848 -6588 8799 3277 -11587 3463 15719 -4528 -10499 9107 4864 -14735 -7581
338 -7581 8276 3638 -7268 -7812 -403 4874 -2176 -5115 8016 11984 -2673 -2396 8495 -1292
352 -1292 -12610 -5108 -3016 -8258 447 6929 267 2274 8513 2034 -3146 -1648 -6248 -6683 229
367 229 -3136 -6987 1268 892 -7177 452 6807 -2831 -3468 6010 3688 -1327 2293 -465 -5202 -2559
383 -2559 -4626 -6037 2937 2925 -6572 -290 7634 -2122 -6720 -53 -2665 -5706 2138 3449 89 5389
399 5389 4807 -2955 1663 5309 -4038 -4968 3331 1252 -1491 3440 532 -4592 -770 -965 -4063 2548
415B548J765n155O225M945j0712j940Q024o868p188R602K643q971K994P849l529
430B232m069J351R94K304n83k800O893M154j3816l594J5289l843j6728Q050J2372
445H206j0333l852J2803n27r280J183L021k516M21O08J213L187j596j700M893
460E731l241j0202N652P036r869j812J2805l197q198R654K022j2236J968Q055
474D168p550k701R492j962q645M072N540l745k534K860M613J24n447J609Q400
489H294q811j3507J2742J0283j7987l292K2187l220k0507J1459J4837j7203r397
502a4122J8175M240j5439K68J4312n43j3322Q47J4970k007j7646O079J8346j2890
516A268j8326J7458J0669k1984r37K4105p164j8791J4472J1590j7584l488J7317
$$ plain form
415 2548 4313 -842 5383 10328 -384 -2324 5700 -1168 -8356 1246 3889 -5082 -2088 5761 2232
430 2232 -1837 -486 508 2812 2229 -571 6322 10476 -3340 -6934 8355 4512 -12216 -4166 8206
445 8206 -2127 -5979 6824 6297 -2983 -1800 1221 -1295 -874 -266 947 4134 2538 838 5731
460 5731 2490 -7712 -2060 4976 -4893 -6705 6100 2903 -5295 4359 6381 -5855 -3887 4168
474 4168 -3382 -6083 3409 1447 -7198 -3126 2414 -1331 -3865 -1005 3608 3732 -1715 -106 8294
489 8294 -517 -14024 -1282 9001 -8986 -12278 9909 6689 -13818 -2359 12478 -4725 -14122
502 -14122 4053 8293 -7146 -6878 7434 6891 -6431 -5584 9386 7379 -10267 -4188 14158 1268
516 1268 -17058 400 11069 -10915 -11852 12253 5089 -13702 770 12360 -5224 -8712 8605
529H605k965j3781Q189J1893q708j1674P453R092j0623q732J4915O591j8446R70
543g221K2834r986k3337J8080J7326k4894n986K9966m559k8914J3474K2345k0920
556a792j4629K3979O907k5209K43K7615l072k9170N977K8074j3680k7931K3173
569D85K6247l1694j9047L8035N431m1737R453L9613k3161l0385L4536K0283l8963
582a0904p524L7500p376l7829J5333L4762k1105k7900K9706K1718l8321j4398
594b6338M7255L237n3094J0271N4067k6001m7706M1618L3624n5534j9317O1204
606B3286L486n5943J5534M9728k9962m1387L7361K8692m4821j8397M8854P992
618B4423m9461O713N0400k1282m7730L4805L7580m6553k1202N5672J836n8361
$$ plain form
529 8605 5640 -8141 48 11941 3233 -8441 -988 8104 -2519 -11251 3664 10255 -8191 -7221
543 -7221 15613 5627 -17710 370 17696 -7198 -13184 16782 12223 -16691 -3217 19128 -1792
556 -1792 -16421 7558 14465 -10744 -10501 17114 14042 -15128 -9151 18923 5243 -22688 485
569 485 26732 -4962 -24009 14026 19457 -22280 -12827 26786 3625 -26760 7776 28059 -10904
582 -10904 -18428 19072 11696 -26133 -10800 23962 2857 -25043 4663 26381 -11940 -26338
594 -26338 20917 24154 -28940 -18669 35398 9397 -38309 3309 36933 -18601 -37918 23286
606 23286 26772 -29171 -13637 36091 6129 -35258 2103 30795 -14026 -32423 16431 24423
618 24423 -25038 -18325 32075 10793 -36937 -2132 35448 -11105 -32307 23365 25201 -33160
630c3160J7695N0511l7216l8156N0075K3204n4898l737N6590j1803n3412K4147
642a0160M5639l6429l6797M7051K5703n6284j0224O4460p714o6323K7194O0144
654D6260m8549m6397O7602K8701p8008p159P8471j7431p1684M0097O0857n7093
666d333m7142O8250L2173p3944j4973P5617n325p7169K4800P5881m1575o5474
678e3214N8613M8755p3664k7542Q1693M657q1321J7103P1596l4611n4672M6739
690D132L4727n3071j6835N1661J20m6075J5354L7254k9431k8024M2466J8434n0636
703a9924k435N5984j5256n5842L4750M7281n4001l4502O5712J4299p0882Q979
715b5837O8721l0995o1578M8195N0659n9567l6113O7280K0413p2316n622P5428
$$ plain form
630 -33160 -15465 35046 -2170 -40326 9749 32953 -21945 -25682 30908 19105 -34307 -10160
642 -10160 35479 -950 -37747 9304 35007 -21277 -31501 32959 25245 -41078 -13884 46260
654 46260 -2289 -48686 18916 47617 -30391 -37550 40921 23490 -48194 -8097 52760 -4333
666 -4333 -51475 16775 48948 -24996 -39969 35648 30323 -46846 -22046 53835 12260 -53214
678 -53214 5399 54154 -19510 -47052 34641 39298 -42023 -24920 46676 12065 -42607 4132
690 4132 38859 -14212 -31047 20614 20734 -25341 -9987 27267 -2164 -30188 12278 30712 -19924
703 -19924 -22359 33625 18369 -37473 -2723 44558 -9443 -43945 21767 36066 -34816 -25837
715 -25837 42884 11889 -49689 -1494 49165 -10402 -46515 20765 41178 -31138 -36760 38668
727C8668q585p3976K3747O8059l9511n5460N4033L8535o5847j9572O8375k321
739B6145o4545K1006N3674l4850l8083M2470K1700m3686m864M1584q160l5187
751b2796K0997K8144l2168j9854M1505R210m8897L281M9578k0764m7226L8560
763d30L9669n1902k5518N9683P175o0057J2778N5784k9381m7577M0281L6045m5839
776i289k1198N0427P750n3747L807N4611j4569n1012K6917M1996m2525l2450N3961
789A4679J8115n9600p32N9192j6000n0501L2358M0397m1488k7458M4479J4269
801B7710m3299j347M0809r208l7912J6039L1618k4524k5497L0705J6544l5174
813a3536l465L7731j0428l4420K4573K6383l5179j3439M1911r72m2886J3563L8793
$$ plain form
727 38668 30083 -43893 -20146 47913 8402 -47058 6975 45510 -20337 -39909 28466 26145
739 26145 -38400 -17394 36280 1430 -36653 5817 27517 -16169 -21033 20551 12391 -22796
751 -22796 -1799 26345 -5823 -25677 15828 25038 -23859 -20578 29000 8236 -38990 -430
763 -430 39239 -12663 -38181 21502 28677 -31380 -18602 37182 7801 -39776 505 36550 -9289
776 -9289 -30487 19940 27690 -26057 -22250 32361 17792 -33220 -6303 35693 -6832 -39282 14679
789 14679 32794 -26806 -27538 31654 15654 -34847 -2489 37908 -3580 -31038 13441 27710
801 27710 -15589 -16936 23873 14665 -23247 -7208 24410 -114 -25611 5094 21638 -13536
813 -13536 -17001 20730 10302 -24118 455 26838 -8341 -21780 20131 19159 -23727 -10164 28629
826B8629k3577l2381K8560K3336l0997j4141L3000O052l3750K7L2062r830k9310
839b2320K0909K4546l0218j5115L8444L335m1796R415L8753k2034l1248L1780
851D451K2222l6037j2338L5123J950l3224N240L0365j0733k6331J5755K3266k0679
864i70j9181K4200J0334k8196N62L1070j0249k7231J9748J8966k7800q970L1064
877A3347j226k9891R834K5924j4654j9426J6295J2272j8422q852K0026O607j8420
890f586j317J7653o489j7271J3977J4075k0963p326K6684j822k7009J1554K3999
903A9159k0654k0062K5071J4205k4058o015K3761J927k1955o72J8299j900j7487
916a0381M089J5707o505j1406J1398O871j5384j033J5549o634j2672J3939Q211
$$ plain form
826 28629 5052 -27329 1231 24567 -6430 -20571 12429 18481 -15269 -15242 16820 6990 -22320
839 -22320 -1411 23135 -7083 -22198 16246 19581 -22215 -12800 25953 3919 -27329 4451
851 4451 26673 -9364 -21702 13421 15371 -17853 -12613 17752 7019 -19312 -3557 19709 -970
864 -970 -20151 4049 14383 -13813 -13251 17819 7570 -19661 87 19053 -8747 -17717 13347
877 13347 12121 -17770 -7936 17988 3334 -16092 203 12475 -5947 -14799 5227 11834 -6586
890 -6586 -7903 9750 3261 -14010 -33 14042 -6921 -14247 12437 10615 -16394 -4840 19159
903 19159 -1495 -21557 3514 17719 -6339 -12354 11407 13334 -8621 -9293 9006 7106 -10381
916 -10381 -6292 9415 2910 -8496 2902 9773 -5611 -6644 8905 2271 -10401 3538 11749
929A1749j7429j756J7339m040j4905O617J0245o805n405P002L710p247m241N561
943C95K575o361M41Q971l419r223Q895Q734j3576n238J5033j473j5228P442J3749
958A1717r980r776Q947L668p961j576N618J202l889j155M385L059m527q65N180
973D047j991o027N787L864r007j296Q158m308p672P275M425o883L2N700j600j270
989g66K306j793j693J654n19q88K579n1j046J910j423k329M390L27p310N12N824
1006A684l744k788M990O52k928J681N08m87M016l66p150K464N839n833m360O798
1022I76J952n935m1M698J736o90l005j41M328k648p672L779O907o870m148P881
1038A107J455o037L060M123k891o23K265j513N83K034k644l92K341k936j918L954
$$ plain form
929 11749 -5680 -7436 9903 5863 -9042 -2425 7820 1015 -4390 2612 6322 -925 -5166 395
943 395 2970 -3391 -2950 6021 2602 -6621 2274 11008 -2568 -7806 7227 5754 -9474 -2032 11717
958 11717 1737 -8039 908 4576 -3385 -4961 657 1859 -2030 -3185 1200 4259 -268 -1133 4047
973 4047 2056 -3971 1816 5680 -3327 -4623 3535 -773 -8445 -1170 3255 -3628 -3596 2104 504 -766
989 -766 1540 -253 -1946 -292 -811 -1699 880 829 -217 1693 270 -2059 2331 2658 -4652 -4140 1684
1006 1684 -2060 -4848 142 794 -2134 -453 55 -432 3584 3218 -3932 -1468 4371 -1462 -5822 976
1022 976 2928 -3007 -3048 1650 3386 2696 -309 -450 3878 1230 -6442 -2663 4244 -2626 -6774 1107
1038 1107 2562 -3475 -415 3708 817 194 2459 946 1529 3563 919 527 2868 -68 -1986 1968
1054A968j678m495L580K953m150m44L188o09O44J776k155J655L721m946l886P151
1070D273K73r250J082P133m259m244N499L120l294j338J177J250O19k439n94L499
1086B507j369m172L783J571n638K499N166o790k684R482n25r661L789Q277o149
1101H6n910N967M005l860l130J978M203j728n772K128N933m563n020O604J663
1116B584p350K271O284n378k220P627r16o917K991M516l819k039K060k67r50q38
1132b361p86L055J357l559Q63L651k115j416M381j698l826L821q1p151L009O753
1148C897o071m327Q626J947q012J701P759j157n317J96L649N15m911j466N917
1163B946m28q298K474P446n415m225Q889Q73r424L954Q582p374m692R289K120
$$ plain form
1054 1968 290 -4205 -625 2328 -1822 -2266 922 313 957 2733 578 2233 5954 1008 -2878 4273
1070 4273 4546 -4704 -3622 3511 -748 -4992 507 3627 333 -1005 172 1422 2041 -398 -992 2507
1086 2507 1138 -3034 749 2320 -3318 -819 4347 -2443 -5127 4355 3830 -5831 -2042 6235 86
1101 86 -5824 143 4148 288 -2842 -864 3339 1611 -4161 -2033 3900 -663 -5683 921 2584
1116 2584 -4766 -2495 3789 -1589 -3809 3818 2902 -4015 -1024 3492 -327 -2366 -306 -573 -1523 -2361
1132 -2361 -3147 -92 1265 -2294 -1431 2220 105 -1311 3070 1372 -2454 1367 1286 -5865 -2856 3897
1148 3897 -2174 -6501 2125 4072 -3940 -2239 5520 4363 -954 -758 2891 3406 -1505 -2971 2946
1163 2946 2518 -5780 -3306 4140 -1275 -5500 3389 4262 -5162 -1208 7374 0 -4692 4597 6717
1178F717q653j86O622j152n745J48M543q48o202Q09P749j583o398O013M616q783
1194b333p39R663m584q186Q872L209j2068J874J2245o026r307R861P032j1467
1208a954m474J1347K196j2347k606J2093P48j3990K773J6784n392j5606J1284
1221H56J2552j7232q234J9417O32k0294N998J7387j0399j1978J3573P319j3238
1234c641k881J2379q85j1761K408J0039n661r662Q951P370j2181k746J7178j964
1248F943j8152R171J6569j7536j2922K2977N757k5497J438K5124p494k1759J1991
1261c390J7751j4696j4076J5730J0007j5845n630J6740J949j7099L649J6256j0515
1274H31j3019J6733O751k1580P76K2197r612j9996J7610J5153k1455p150K3601
$$ plain form
1178 6717 -1936 -2122 4500 3348 -2397 -2249 2294 1446 -4756 -3947 3802 2219 -4179 1834 6450 -2333
1194 -2333 -3072 6591 2007 -6179 2693 5902 -6166 -4292 7953 1927 -7380 2481 9513 -1954
1208 -1954 -6428 4919 7115 -5232 -7838 4255 5003 -8987 -6214 10570 5178 -10428 856
1221 856 13408 -3824 -12058 7359 7991 -12303 -6305 11082 683 -11295 2278 9597 -3641
1234 -3641 -6522 5857 4972 -6789 -4381 5658 -3 -9665 -714 6656 -5525 -8271 8907 6943
1248 6943 -11209 -2038 14531 -3005 -15927 7050 12807 -12690 -11252 13872 6378 -15381 -3390
1261 -3390 14361 -335 -14411 1319 11326 -4519 -10149 6591 8540 -8559 -4910 11346 831
1274 831 -12188 4545 11296 -10284 -9508 12689 3077 -16919 691 15844 -5611 -12761 10840
1287A0840N86k2539M892J9673j0167j7384J3331J4322j6584j0027K1484O483k5648
1300a0738p67K6841p169k6207J5148K2211k2333j5598K6613P698k6248J250K4019
1313A4720p971j8698J2127J3526j4484r057J4269L046j5975R18J6787n173j6419
1326a2384J2366J5016j8023j0584K4054M264k7398K948K6217j1137k2692J6935
1338d18J5813k0755r439K0625L578j7938K646J6404n471j3928Q734J1163j2789
1351a775r123J5575L796j8870K111J9670q539j7746J6008J2837k0771n162K2777
1364A0788l033k0703J0381J6400j6191j1103J8732N449k0009l51K0279m028k0562
1377a3951Q241K0708j3979j9946J9513J7012k4112j0599K8366L560k9431M588
$$ plain form
1287 10840 11426 -11113 -6221 13452 3285 -14099 -768 13554 -3030 -13057 8427 14910 -10738
1300 -10738 -11505 15336 8167 -18040 -2892 19319 -3014 -18612 8001 15699 -10549 -9299 14720
1313 14720 6749 -11949 178 13704 -780 -9837 4432 7478 -8497 -7579 9208 4035 -12384
1326 -12384 -18 14998 -3025 -13609 10445 14709 -12689 -9741 16476 5339 -17353 -418
1338 -418 15395 -5360 -14799 5826 9404 -8534 -5888 10516 5045 -8883 -149 11014 -1775
1351 -1775 -10898 4677 8473 -10397 -8286 11384 2845 -14901 1107 13944 -6827 -11989 10788
1364 10788 7755 -12948 -2567 13833 -2358 -13461 5271 10720 -9289 -9640 10639 6611 -13951
1377 -13951 -5710 14998 1019 -18927 586 17598 -6514 -17113 11253 14813 -14618 -10030
1389a0030K6292j2596k1544J7467J3952j9587o571J9973J739j7061L570J5178
1401A0782p124j3287R932J0668j3622q461J5862L250j8018L303J8517r716j5031
1414a2945J5869R557k0236j695K0954n945j8733J2378J5784j5156r839J7646N171
1427A2810j9301k280J8070k450k0204N216J9156j0090j7351J6789J5377j9542
1439c800p747K3979O31k3631O822J9239j4274j4804J6232P507j7618j001J7173
1452H708k549j4259N820J2329q634j0705J0606P539j3829m297J5960j30j6651
1465a0092P208J5842j3271j1394J7934M772k0529K383J9385r470j6076J4513J1944
1478A3149j6503p231J7220K616j8491l34J7433l556j7638O893J7694j0402j4162
$$ plain form
1389 -10030 16262 3666 -17878 -411 13541 -6046 -12617 7356 9095 -7966 -4396 10782
1401 10782 3658 -9629 303 10971 -2651 -11112 4750 8000 -10018 -6715 11802 2086 -12945
1414 -12945 2924 12481 -7755 -9450 11504 5559 -13174 -796 14988 -168 -10007 7639 12810
1427 12810 -6491 -8771 9299 6849 -13355 -8139 11017 927 -16424 365 15742 -3800
1439 -3800 -11547 12432 13063 -10568 -3746 15493 1219 -13585 2647 10154 -7464 -8465 8708
1452 8708 6159 -8100 -2280 10049 1415 -9290 1316 8855 -4974 -9271 6689 6559 -10092
1465 -10092 -2884 12958 -313 -11707 6227 10999 -9530 -7147 12238 2768 -13308 1205 13149
1478 13149 -3354 -10585 6635 9251 -9240 -9574 7859 4303 -13335 -6442 11252 850 -13312
1491a3312J6872J1052j9578m736K0620k953j9599Q598J4027j4159r220J6143L526
1504G281j5401J634J3839m258j1422O521R817r077q479J0889O418j2483k164J5665
1518H780j907j6043P288J3409j3468r085J5681K291j7379L564J5990p888j1005
1531i772J1933P428j2305l725J3139J142j3392K89J2421l880j3342O505J3328
1544I769j0193j0507J5000P312j7125j381J6903m202j5578R130J1400j2104o774
1557h350J2242K750j0973J43R416j876q076L197P672m043p030N996N182r150k552
1572e452J0949j098j1502O093R790j0329o229J2992J297j3087K508J1719n271
1585B380q678O756O644p354n941O743N104o991m135P819L051r176o81R530l186
$$ plain form
1491 -13312 3560 14612 -4966 -9702 10918 7965 -11634 -3036 10991 -3168 -12388 3755 7281
1504 7281 -8120 -6486 7353 3095 -8327 -1806 8011 -1066 -9545 1344 7762 -4721 -6885 8780
1518 8780 6873 -9170 -1882 11527 -1941 -11026 4655 6946 -10433 -6869 9121 1233 -9772
1531 -9772 2161 9589 -2716 -6441 6698 7840 -5552 -5263 7158 3278 -10064 -3559 9769
1544 9769 -424 -10931 4069 11381 -5744 -7125 9778 5576 -10002 -872 10528 -1576 -8350
1557 -8350 3892 6642 -4331 -4188 5228 3352 -4724 -1527 6145 2102 -4928 1068 6250 -2900 -5452
1572 -5452 5497 4399 -7103 -1010 8780 -1549 -7778 5214 6511 -6576 -4068 7651 2380
1585 2380 -6298 458 7102 -252 -6193 550 5654 -1337 -5472 2347 5398 -3778 -4459 5071 1885
1600A885q072O141M900q487m05R157l578p368O281M286p459j424O960O2n768N87
1616b302M905o47m942K83M950j239n348L151N493n939l334P348K62p927L934O390
1632E038o336l230P344J49o825J660M502k974l024K819K597q00j914J146K451
1647B603j557l368K591K075m979o06N086k021l815N073J848n915J156N919l211
1662H79l629M476R44m134P13K322r66p10J15O19J245m91k034J540N35l452r1K551
1680D32j311r41K890o47j793M035P59m881K268M023n246k611N749L75n401R12
1696a388L730j964k023J100J939M03k480j303L596P76m723P35M838k557l494M505
1712A690J544l799R95J448k993K67K714k882j345L781l15l047J891K050k309q56
$$ plain form
1600 1885 -6187 -46 4854 -3633 -4038 5119 1541 -5827 454 4740 -2719 -4143 2817 2879 -2889 -2302
1616 -2302 2603 1956 -2986 -2703 2247 1008 -4340 -1189 4304 -1635 -4969 2379 2641 -5286 -1352 5038
1632 5038 -1298 -4528 2816 2965 -3860 -2200 2302 -672 -3696 -877 1720 920 -994 152 2603
1647 2603 1046 -2322 269 2344 -2635 -3241 1845 -176 -3991 1082 2930 -2985 -1829 4090 879
1662 879 -2750 1726 2670 -1464 -751 1571 605 -105 10 629 1874 1383 -651 889 1424 -2028 -2119 432
1680 432 -879 -1820 1070 423 -1370 2665 3424 -1457 811 4834 -412 -3023 2726 3101 -2300 -1388
1696 -1388 2342 378 -1645 -545 1394 1797 -683 -1986 1610 2386 -2337 -1602 3236 679 -2815 1690
1712 1690 3234 -565 430 1878 -1115 -848 1866 -1016 -2361 1420 1105 -1942 -51 1999 -310 -1166
1728a166N67O1N43q01j444K263J052l495Q42M762k406k760L941O86m673J489L402
1745B863l926k679K895R3k426J566J965j89l44q59O17K143j720j881L671M03n503
1762c311J347N861l662l958M585J738n080j64M275p19k439K34Q67Q03j189j538
1778b350K859K154l759j171N243q19m681K610L182l538j499K777n64j588J255
1793A11n80l34J966j242j569L274Q01l402N24K839j937j825J593M63o25M09p63
1810b97J06J587j846p90L670k30m152K375L385m732j414N263p92n186K103L348
1826B398k704j023K190M65q03n91n23J237M79j844P22J807k627n35K855j678k563
1843b738M059J159n078J139N281l210l586M663J586m419o91K621m81j222j83J97
$$ plain form
1728 -1166 -599 -538 5 -796 -2240 23 1075 -2420 -1578 3184 778 -1982 1959 2645 -2028 -539 2863
1745 2863 -1063 -3742 -847 -754 -3180 -1614 351 162 -182 -1041 -424 1719 -1 -1882 1789 2192 -3311
1762 -3311 -1964 3897 235 -3723 862 2600 -2480 -2644 1631 912 -1527 -1293 -426 377 -812 -2350
1778 -2350 509 2663 -1096 -2267 2976 2157 -2524 86 3268 -270 -1769 1008 444 -1144 111
1793 111 -469 -803 1163 -79 -1648 1626 2427 -975 -451 2388 451 -1374 219 682 57 466 -297
1810 -297 -191 1396 -450 -1240 2430 2200 -1952 423 3808 -924 -2338 2925 2133 -3053 -950 2398
1826 2398 -306 -1329 861 1326 523 -68 -591 646 1125 -719 3 1810 -817 -1352 1503 -175 -2738
1843 -2738 1321 2480 -2598 -1459 3822 612 -2974 1689 3275 -1144 -1835 786 305 -917 -1100 -903
1859i03R43n61j991J514K712j540r20J599j159o50J922j616j101L649p21n659
1875d482K858N444m552l472O375J088o879K73N980j335m544J402L507j425l466
1890c228J805M843j814n019L004M525n164k685O380L04o498K036M520m257j877
1905c125N348j065m085K642K450l836j29M283q25l621J045L700j479l908J525
1920a080N399k754o344M488N896o921m178Q794J956r304J178P866l690n675N543
1935A174K502n535j78M195p41k702J358K252j760k265J600K921l053j827M093
1950B034R39o164J238O374m258n079P175K446p955O30Q047l444o566N420L921
1965D758o119k616N916P72n523k53N185m9n462J160O590k510n741M355M638o786
$$ plain form
1859 -903 40 -521 -2512 -998 1714 174 -746 853 -306 -956 966 -650 -1751 1898 1177 -4482
1875 -4482 -1624 3820 -732 -4204 2171 3259 -3620 -3347 2633 1298 -3246 -1844 1663 238 -3228
1890 -3228 -1423 3420 1606 -3413 -409 4116 -1048 -3733 2647 2951 -3547 -1511 3009 -1248 -3125
1905 -3125 2223 1158 -2927 -285 2165 -1671 -1800 2483 1658 -1963 -918 2782 1303 -2605 -1080
1920 -1080 4319 1565 -4779 -291 5605 -1316 -5494 3300 5256 -4048 -2870 4996 1306 -4369 1174
1935 1174 3676 -1859 -2037 2158 1417 -1285 73 2325 565 -1700 -100 2821 -232 -2059 2034
1950 2034 2973 -3191 -1953 4421 163 -4916 2259 4705 -3250 -2620 5427 1983 -4583 837 4758
1965 4758 -1361 -3977 1939 2711 -2812 -3065 2120 2071 -3391 -2231 4359 1849 -3892 463 5101 -1685
1981a685k872P636r64o940M204M800o400j902P146q63o385L308M704m273l749
1996d235M834K830n032k669N436J942o218p36Q021m39q539L123P041o002n471
2011f114Q093K134q392J247P168l941m710N416K608n589q29M697k92l832R42L902
2027B508j642l962K123M197l729k984O007J080p385K004P073n411n668Q168K736
2042E115r518J21R670k823q444N054O329n788m656O150L818n896k699O263J902
2057D598p488n42P936k091p555M946N864p460k683Q593n10q019M193N799o393
2072h12l155P197M87p190J577O062l217n375M288N034n676m383O895L849q591
2087c010j763J0586p92j1357M758J0353q400p810J0163M233j1961r80J0949k286
$$ plain form
1981 -1685 -4557 3079 2115 -4825 -621 4179 -2221 -4123 3023 2160 -4225 -917 3787 -486 -4235
1996 -4235 599 3429 -1603 -4272 1164 3106 -3112 -3848 4173 3734 -4805 -1682 5359 -643 -6114
2011 -6114 1979 4113 -4279 -3032 4136 195 -4515 901 3509 -2080 -2909 1788 1496 -2336 -1394 2508
2027 2508 866 -3096 -973 3224 -505 -3489 2518 3598 -3787 -1783 5290 -121 -5789 2379 5115
2042 5115 -4403 -4282 5388 2565 -5879 -825 5504 -284 -4940 1210 5028 -868 -3567 2696 4598
2057 4598 -2890 -3432 4504 2413 -5142 -196 5668 -1792 -4475 4118 3608 -4411 -218 5581 -812
2072 -812 -3967 3230 3717 -3473 -1896 4166 949 -4426 -138 4896 -780 -5163 1732 5581 -3010
2087 -3010 -4773 5813 5021 -6336 -1578 8775 375 -7435 2728 6961 -5000 -5980 4969 2683
2101B683r215M143P443m780n267N589M567o411k913O927J155p764Q91Q032m372
2116G08p148P712M821j0160p35J0730k979j0533O118P970q187n521Q993K947q520
2131c784r95Q535l33q012J643P959l199p538N123O656p564m367R750J190j0288
2146e224K637R179o052p338P701L567q699j318Q013o64n966K423N466k159l902
2161b336L222L631m173k966N040R94o625O69O746l997n872O560M027q002r15Q155
2177D158j485p578L884N505m534l385M739K115l659j094L633O98m139p5M084j822
2193A045n083L831M725o240k716P679Q22q118K208P114m247n355N057K838m970
2208a410j023M100K19l166N14K686j59k623M14K568k044k764L281J745m834R3
$$ plain form
2101 2683 -6532 -2389 5054 274 -4993 596 5163 -1248 -4161 2766 3921 -3843 -2952 5080 708
2116 708 -6440 1272 6093 -4067 -4802 5928 2949 -7584 -1466 6504 -1683 -7204 1789 4736 -3784
2131 -3784 -4779 3756 3423 -4589 -2946 5013 1814 -5724 -601 6055 -1509 -5876 3874 5064 -5224
2146 -5224 -2587 6592 540 -6798 903 4470 -4229 -5547 2466 1802 -4164 -1741 3725 1566 -2336
2161 -2336 886 4517 344 -2622 2418 3412 -3213 -2544 4202 205 -5667 893 4920 -3082 -3997 4158
2177 4158 2673 -4905 -1021 4484 -50 -3435 1304 3419 -240 -1334 2299 2997 -1142 -1217 2867 1045
2193 1045 -4038 -207 4518 -1722 -4438 3241 4063 -4055 -1847 5267 1020 -4335 722 3560 -1410
2208 -1410 -2433 1667 1886 -1280 -766 1920 1761 -862 -448 2120 76 -2688 593 2338 -2496 -2403
2224b403N490k241m563M367K968n654j118N216r76l927K147K855j942j349J585
2239D55K51r43q29J365L38k103m06L047j203l610L078L007m131j278N563j26n218
2256b743K505L392m087k036M041k88l462J708K717j854j879K009J686j993k361
2271b645K858K706l759k527N312J200o534M29O437k403m878M035L156l951j347
2286a911L330n85k064J271L8o30O80Q22j131K2O29M22o39j074J361J881k361k343
2304b282L560J198n046M92N264k585l881M487K534m980jM539j727l854K390K081
2320B189k208j608J895J620j912k009K486K335l425j698M363L00n046J479M709
2335C470l293k843M275O91l700Q84L174k251j832J538o6j400J88J077K87l51j96
$$ plain form
2224 -2403 3087 846 -3717 650 3618 -2036 -3154 2062 1086 -2841 -694 2161 219 -1130 455
2239 455 706 -237 -1066 299 637 -1466 -1872 1175 -28 -3638 -560 2447 -1684 -2962 2601 2475 -2743
2256 -2743 -238 3154 -933 -2969 1072 784 -2678 -970 1747 -107 -1986 23 1709 -284 -2645
2271 -2645 213 2919 -840 -3367 1945 3145 -3389 -2960 3477 1074 -3804 231 3387 -564 -1911
2286 -1911 1419 834 -1230 41 79 -551 129 951 -180 -158 471 893 254 -820 541 2422 61 -2282
2304 -2282 1278 2476 -2570 -2078 3186 601 -3280 1207 3741 -1239 -1240 3299 1572 -2282 108 2189
2320 2189 -19 -1627 268 1888 -24 -2033 453 2788 -637 -2335 2028 2328 -2718 -1239 3470
2335 3470 177 -2666 1609 2300 -1400 -516 2658 407 -1425 113 47 -1353 -1165 -88 199 -152 -348
2352c48J180Q73j686m55K444j534k914K112J736l267l12L619j490k249K782J264
2368A755k501L8J707j248r59N06J9O9O8l84J050J207j552j48K052j214k443J848
2386a30R64k427L34K217j456p11K294n2j775L73O19j034P9l63k32R17J94j394
2404a583J818K360k255j11K392j054k635K114M45k931J75J573j424r02J944J71
2420I7j079Q47M8j56N86j42K46J058j153l66K255j96k867J690K197l979j697L487
2438H76m9l736J586K937k036j004K295O88o82o7k03R1k8q69k99J096r45o33J684
2457G02k48j471K032J143k860O07K399k495j825K936J76k662Q93J746j919l20
2473a166K022l64j283J024M9n50K43J18N18K91j242j21J926j381j733K559N13
$$ plain form
2352 -348 832 1705 19 -436 2008 474 -2440 -328 1408 -1859 -2171 1448 -42 -2291 491 1755
2368 1755 -746 -708 999 -249 -1208 -702 -683 -614 -546 -930 120 1327 -225 -373 1679 465 -1978 -130
2386 -130 834 -1593 -1259 958 -498 -1209 1085 1033 -742 -369 250 -784 -705 -1068 -1300 -383 -189 -1583
2404 -1583 235 2595 340 229 2621 1567 -1068 1046 1491 -1440 -1265 308 -1116 -2018 -74 97
2420 97 -982 -135 -87 -243 343 201 447 1505 352 -14 2241 2045 -822 868 3065 -914 -2611 876
2438 876 827 -2909 -1323 1614 -422 -1426 869 1557 875 808 605 696 668 -201 -500 596 -349 -982 702
2457 702 454 -1017 1015 2158 -702 -95 2304 -191 -2016 920 1096 -1566 -673 1073 -846 -1166
2473 -1166 856 492 -791 233 282 -268 -25 93 611 902 -340 -461 1465 84 -1649 910 1423
2490A423l845L17L502k240k128L461R18l141J064K775j524j606J719K57j377l33
2506g58L74Q01l81j987P37K445j596k125K659J570l155q9K689m13j169N63k16
2523e1L20J087j783j380K608N2l678J115L349j877j525K400O60j772P16J182m67
2540I56o93l41M43M81j230r49K296k31l357J219L715k474k178L971P36l543N02
2557f77K690j036j282Q85l62k89P75p67q09J599qj314J79R88K89L7q07m06J641
2576A326j75l182J280L222k594k478L681J372l846J012K453j578j140J424k13
2591E64j106P19L84p57m1j87J26R54j115m35K215k13k821J080J996k661n43L087
2609A246q30j945K141J078k548P13J889j979j235J587o4j274K38Q13K9l75n01
$$ plain form
2490 1423 -2422 -2105 1397 -843 -2971 490 1408 -1733 -669 2106 582 -1024 695 952 -425 -758
2506 -758 -384 417 36 -1951 -1214 1231 -365 -2490 169 1739 -1416 -1505 1184 771 -398 165 -51
2523 -51 269 1356 -427 -1807 801 853 -2825 -1710 1639 -238 -1763 637 1297 -475 241 1423 956
2540 956 263 -78 365 846 -384 -1333 963 732 -2625 -1406 2309 -165 -2343 1628 2364 -1179 -677
2557 -677 2013 977 -305 580 218 -71 704 -63 -872 727 719 -595 -416 572 861 898 91 -315 1326
2576 1326 1151 -2031 -751 2471 -123 -2601 1080 2452 -1394 -382 2071 493 -647 777 564
2591 564 -542 177 561 -196 -237 -424 -298 656 -459 -894 1321 1108 -1713 -633 1363 -1298 -1841 1246
2609 1246 416 -1529 612 1690 -858 -145 1744 -235 -1470 117 53 -1221 -983 -170 -141 -516 -1017
2626a017P47J297j301p67K216j33l317J679K710l307j152M110k62l912K063K752
2642B406k962j666K260M05j755j39J464R22q74j052J699J325k449o83K799j266
2658D34k714K352J472l501J21L569j734k346L118J658l181j6K497p11j997M35
2674e44R26k56n85K34J111N12j488M15J091k092o93K437j038k815L150K119m035
2691a551P9M876j841m277L328K887m053j733L876J77l604p1L221R8l115K20M018
2708B535m44m636K139M444l701m098N011K105o282L62N805k071m243L068K777
2723B771l388j225K675M11k015J63J594j89j667K15K215j503k603K427K059l914
2739a974n70N043j246m874L338L934m594j822N071j57m341J003K895j609k107
$$ plain form
2626 -1017 -270 1027 -274 -1041 1175 1042 -2275 -596 2114 -1193 -2345 1765 1503 -2409 -346 2406
2642 2406 -556 -2222 38 443 -1312 -1451 13 935 61 -991 708 2033 -416 -1099 1700 434
2658 434 -2280 72 1544 -1957 -1836 1733 -1 -2347 771 2429 -752 -768 1729 1018 -979 -544
2674 -544 382 126 -459 -225 886 1398 -90 325 1416 -676 -1369 1068 30 -2785 365 2484 -1551
2691 -1551 -1472 3404 1563 -2714 614 3501 -552 -2285 1591 1768 -1836 -1907 1314 1412 -1703 -1483 2535
2708 2535 2091 -2545 -406 4038 337 -3761 1250 3355 -2927 -2565 3240 1169 -3074 -6 2771
2723 2771 -617 -1842 833 1244 -771 -608 986 797 -870 -655 1560 57 -2546 -119 1940 -1974
2739 -1974 -2544 2499 1253 -3621 -283 3651 -943 -2765 2306 2149 -2192 -1189 1706 97 -2010
2754b010J415J402j348j332J388J782j885j781L476R35m144O80M491k597l141
2769b669L405J435m232K60L344j886k282K649R69k375O06K089p35j409R09J687
2785A765q42k342J142K811k210l169L300K547n009j297N255o13m595K350L607
2800B700k926j492L348O2k055N32J511p54j402N54P12p23j431Q89J804j899j491
2817b061L619Q42l912O92L780k338l004L190J427l777L71K663j106j158J903m2
2833A089j248M11N86m63l45qN77J69j769J07K146j410j954K596J370l820Q3M212
2851B329j939l140L079J913l313k2L475r24k111Q35J268j408j598p4J633l31j810
2868b138J139K563j978j853L294P19l580J055L288k492j928K787K99k805Q69J514
$$ plain form
2754 -2010 -595 807 -541 -1873 -485 1297 -588 -2369 1107 2042 -2102 -1422 3069 472 -2669
2769 -2669 736 2171 -2061 -1801 1543 -343 -2625 24 993 -1382 -776 1313 578 -831 78 1765
2785 1765 923 -1419 -277 2534 324 -2845 455 3002 -2007 -3304 1951 1338 -3257 -907 2700
2800 2700 -226 -1718 1630 1692 -363 169 1680 926 -476 78 790 67 -1364 -475 1329 -570 -2061
2817 -2061 1558 2400 -1512 -820 2960 622 -2382 808 2235 -1542 -1171 1492 386 -772 1131 1089
2833 1089 -159 252 838 375 30 22 599 768 -1001 -894 1252 -158 -2112 484 1854 -1966 -1883 2329
2851 2329 390 -2750 329 2242 -1071 -1093 2382 1458 -653 182 1450 42 -1556 -1630 3 -328 -2138
2868 -2138 -999 1564 -414 -2267 1027 1746 -1834 -779 2509 17 -1911 876 1175 -1630 -761 753
2884G53j102l60J249l15l35q2k73l82J19q08M32J099m10J13J733o83j323J827
2902A252k6k771Q43K208k626r95L323j50k893J769J932k303p07K309J43j745k78
2919g15R43J2j153j080K408J371k710n72L982o04l771K039K810l087j580K637
2935I30Jk097J105R68j506R1P05n54P82K29k79J38N70q01k77R01r69j45J165j114
2955a57o84J773o37j794J933J324l021K7L249r71k493J701J217j908n39J223k9
2972B14l13m1m4P61r6j546J103J482k412l84K666j194k092K152J135k669J52K552
2990A426j288j684J697P65j090k10L30kK42p47m96J456L9k126R48J758j856m08
3008a246K162k35j734J048L84j227Q45M79j517M30J066j323o43J910k03r15Q21
$$ plain form
2884 753 -349 -709 540 225 -110 -192 -465 -847 -728 -1536 -1104 -5 -415 -302 1431 748 -575 1252
2902 1252 1226 -1545 -702 1506 -1120 -2115 1208 1058 -1835 -66 1866 -437 -1144 1165 1308 -437 -715
2919 -715 228 240 -913 -1993 415 1786 -924 -1496 2486 1882 -1889 150 2960 -127 -1707 930
2935 930 931 -1166 -61 907 -599 -508 197 -357 425 654 375 513 1083 282 5 906 -63 -208 957 -157
2955 -157 -841 932 295 -1499 434 1758 -1263 -1236 2013 1042 -1451 250 1467 -441 -980 243 214
2972 214 -99 -140 -184 577 481 -1065 38 1520 -892 -1276 1390 196 -1896 256 1391 -1278 -1126 1426
2990 1426 138 -1546 151 916 -174 -384 -54 -56 186 -561 -1057 399 438 -1688 -740 1018 -838 -1246
3008 -1246 916 681 -1053 -5 379 -848 -3 476 -1041 -611 455 -868 -1511 399 196 -719 102
3025A02J28m90P59r5q06J070L5k322J112J529k055l73K368k67k309J573J403j766
3043d04n40J403k65o82J1J29R09P31j910K42K129j093j979J600J271j938l55Q32
3061I1j02K20K40j205L86J787j526j794K745J332k566m26J896k04r98O1N58P28
3079A223k32j811L34K285j562k162K209R63k298q9K147m86p95Q11n37n75Q46m33
3097a62o33J166J76q81R41N98j529N39J109j655q20J906k89j895Q15P44j256J52
3115i74O72m81P68N48q58M44J197r08j209J231k22j456J380K38j234Q05Q22k045
3133a282M03J820j427j391K102K40j502N46R12n13J8j95o07J165L78j259M95J706
3151A609j567j483J686K00j587J215M56j671O06J337j518k33J625m90j171J164
$$ plain form
3025 102 230 -260 499 404 -402 668 703 -1619 -507 1022 -1033 -1406 962 695 -1614 -41 1362 -404
3043 -404 -944 459 194 -488 -477 -348 561 1292 -618 -376 1753 660 -1319 281 1552 -386 -741 91
3061 91 -11 209 449 -756 -370 1417 -109 -1903 842 2174 -392 -818 1078 874 -124 -63 495 1223
3079 1223 991 -820 -486 1799 237 -1925 284 1247 -1051 -1140 1007 521 -274 537 0 -575 271 -162
3097 -162 -795 371 547 -334 607 1205 -324 215 1324 -331 -1151 755 466 -1429 -614 130 -1126 -974
3115 -974 -302 -783 -15 533 -325 119 1316 408 -801 430 208 -1248 132 370 -864 -59 763 -1282
3133 -1282 -879 941 -486 -1877 225 465 -1037 -491 421 -92 -74 -269 -876 289 667 -592 -97 1609
3151 1609 42 -1441 245 445 -1142 73 529 -1142 -536 801 -717 -950 675 185 -986 178
3167A78N06o38N55j48k91L32k38j270J266R52j878M5J895j206j515K041O85k323
3185a052O06J516p73o35J079k65n71L65o12J07J182r22m46J731l64j776J061J054
3203A285j919J52J712j322o48J415j06j423J202M11j295M53Q97p59J15L91m46
3220A15j67M50n74k96J116o28o43J360l34j515J315Q45k136M37J895j183j417
3237a360J939L78j771R3J120p63M4j10K6P59J93j421O05J423j505r71K055k52
3255D82j605R80R39j495L24Q41r87L6J114q46q70J646k53j306N04R39j175J28
3273f04Q80o58K25M95m84L32O43j010k62J679j284j460J944N32k239M48K030r95
3291B12j701J859J59j109L50N85l35L23k66j58P48k13r86N98R46j279K49J586
$$ plain form
3167 178 684 46 601 453 162 494 256 -1014 252 1204 -674 -629 1266 60 -1455 586 1271 -1052
3185 -1052 -446 1070 297 -338 741 476 -95 270 -342 -235 947 25 -421 1310 946 -830 231 1285
3203 1285 -634 -482 1230 -92 -740 675 569 -854 348 759 -536 -83 814 55 170 561 115
3220 115 -52 398 -176 -472 644 16 -627 733 399 -1116 199 1044 -1092 -655 1240 57 -1360
3237 -1360 579 957 -814 -721 399 -364 -320 -430 -404 355 548 -873 -268 1155 -350 -1321 734 482
3255 482 -1123 -143 796 -699 -375 466 -521 -485 629 -217 -1087 559 306 -1000 -496 443 -732 -604
3273 -604 276 -382 -157 338 -146 186 829 -181 -443 1236 -48 -1508 436 968 -1271 -823 1207 212
3291 212 -1489 370 529 -580 -230 355 20 343 77 -81 667 454 -532 66 1012 -267 -18 1568
3309A568j555p49J690n38j960J698J228j711m46J907m47j361Q79M58o86J00O1
3326A36j81O89l34q08R48K99j584P73J318j843j37J805q44j449J848M80j955O95
3344a44J462j362j40J147o30r13P96l05p87O68J97k93L55K64o00R38l28j271R96
3363E0R25j872k28K500j255k071K006J466k338k94J806k66j006K97M68j51k72
3380b35o35L24R43r72m66J462J45j814J033J112j605J5J625j019r32J843j18j490
3398g84O97Q30j282m57P46j50r9J84l22M19Q00r49n00J830l02j251O89P96j220
3417c25J94P73q48k86Q79p61n70J483m0j458R72P68j058l49J419n61j09N58k76
3436D05J48M5n11m39J355j219j172K033L09k260R45K085j751j437K356L00j795
$$ plain form
3309 1568 13 -736 954 416 -1544 154 1382 -329 -775 1132 685 -676 203 661 -25 75 136
3326 136 -45 644 310 -498 450 749 -835 -62 1256 -587 -724 1081 237 -1212 636 1116 -839 -144
3344 -144 1318 -44 -184 963 333 -580 216 -89 -876 -208 -11 -304 51 315 -285 653 325 -946 50
3363 50 975 -897 -1125 1375 120 -1951 55 1521 -817 -1111 695 429 -577 -280 188 37 -235
3380 -235 -870 -546 397 -575 -1041 421 566 -1248 -215 897 -708 -693 932 -87 -1019 824 706 -784
3398 -784 -87 743 -539 -996 -250 -400 -499 -315 -637 -218 582 -367 -867 963 661 -590 99 895 -325
3417 -325 -131 642 -206 -492 387 -374 -944 539 499 -959 13 781 -277 -626 793 232 123 681 405
3436 405 553 598 87 -352 1003 -216 -1388 645 954 -1306 -361 1724 -27 -1464 892 1192 -603
3453f03M51J216n35p54K69K6M33n00m98P69M76j393M74J436j246p03J747j87j970
3472a092J211J371j831o88J838l47j532O45N87q64N17J33l11P07J77p91K96N79
3490F05j011K25O02q92j65Q99q19m63J824k52j767J068J297j567o33K127p47j667
3508a336J575M05j408J68R71p50k40KJ74M36n05p12J377Q33j853L87K326r39j938
3527a027J997P55k451k24J422r94p90J096m11n77J304K79j100P90R25p61l55M65
3545C43J58j26m00o61J305L25j885M01K175j179j997J701J186k397p4J926m44
3562C57j195J316Q5l81N23j73p15N66m9o04L52J22o07O77M83p54J59J180j194
3581A48n38J597p55j695J219P52j845K78J563o88n51J290L7r92N17J64l67K28
$$ plain form
3453 -603 -152 1064 529 -225 44 70 503 3 -495 274 750 -643 -169 1267 21 -682 1065 878 -1092
3472 -1092 119 1490 -341 -1029 809 462 -1070 -425 162 -702 -185 -52 -363 344 521 -270 26 605
3490 605 -406 -181 421 -471 -636 263 -556 -1019 805 553 -1214 -146 1151 -416 -1049 1078 331 -1336
3508 -1336 239 644 -764 -596 375 -375 -615 -613 -439 -3 -508 -1220 157 990 -863 -476 1850 911 -1027
3527 -1027 970 1725 -726 -950 472 -522 -1312 -216 -627 -1204 100 379 -721 69 994 233 -122 343
3545 343 501 375 -25 -686 619 944 -941 -540 1635 456 -1541 160 1346 -1051 -1125 801 357
3562 357 -838 478 563 182 705 532 -183 383 334 -270 82 204 -403 274 757 3 162 1342 148
3581 148 -390 1207 452 -1243 -24 728 -1117 -839 724 36 -515 775 812 -180 337 501 134 362
3599C62m27l37O86n4r08Q85Q59j614J07J044r47j039J467Nj299M99J432r68NJ212
3619I70l85o44O61q58n86J184n63q84O72M79o79K60M38l61N34O31j579J99J723
3638A212j045j567J769L13j533p9J461k92o02K31j98K76J25j065N96J147r96j177
3656a424K041N72k091M28J836j210j076J016L33q62L74%j31O20o18n36J295L04
3674H71j697O03J526j062q78J022on58R0n1J36O98m24j042J432O61j883j65J959
3693A232m76j736R56J243q10l78j17K01N21o92r84J369J046k021k91K002m54j810
3711a199J233R74j095k51N50N6L48q9q75N60J103j889m26K163n50k100R79J065
3729E57r63l13J059J4l80L41k92K22K36r59k24J034q69q11J527P66j640L48J121
$$ plain form
3599 362 -65 -402 284 230 -678 207 1066 -548 -441 603 -344 -1383 84 89 -1210 -711 721 -247 -242 970
3619 970 585 -59 602 -256 -842 342 -221 -1105 -433 46 -633 -373 65 -296 238 869 -710 -511 1212
3638 1212 167 -1400 369 682 -851 -930 531 239 -363 -132 -330 -54 71 -994 -398 749 -247 -1424
3656 -1424 617 1189 -902 -474 1362 152 -924 92 425 -437 -63 -63 -194 426 -192 -728 567 871
3674 871 -826 -223 1303 241 -637 385 379 -179 -89 -140 -4 694 270 -772 660 1321 -562 -727 1232
3693 1232 756 -980 -24 1219 409 31 -86 115 636 -56 -1040 329 1375 -646 -937 1065 611 -1199
3711 -1199 34 1008 -87 -338 212 268 616 527 -348 212 1315 -574 -1000 1163 613 -1487 -508 557
3729 557 -406 -719 340 354 -26 315 23 245 481 -478 -702 332 -537 -1348 179 945 -695 -347 774
3748G74p76o26R24n0p81P47j90j143J254L98j744N59J175p13r26J234K34p12m3
3767d05Q6K84M81n39l38J884l06k197R09J526k398j133K217%j691J339R22r11
3785b70Q1Q01k80M9n1N7OJ3p42M86P09j392k82J754m80j903J487J288j999l62
3805a030J493j80j073P52N40m83O53lk56O43k51j176K89M15p94N2O25m46J75R70
3825I15n58p71J394j5j821P33Q94j295o75J161rn23Q09N3P9N06m8q31R99K8j232
3846b07J86N08j037J8J136q71p78J402l15j356J043J008j213p8R75j59m87N75
3864C50n5L14L97j130k79J099p52j728J131Q70j249m41J799j85l37P04k55k82
3882b9J83l99n54R90K92j487M93J294j077l26Q23l87k58L08k1j82O67j63q70R95
$$ plain form
3748 774 -2 -628 296 246 -535 212 22 -1121 133 531 -1213 -654 521 -192 -1118 116 350 -362 -405
3767 -405 -319 -35 446 -93 -431 1453 1147 -1050 -141 1385 -1013 -2146 71 71 -1620 -281 641 -270
3785 -270 -189 612 332 381 330 387 393 406 -336 150 859 -533 -815 939 459 -1444 43 1331 -668 -1030
3805 -1030 463 283 -790 -38 502 19 672 669 413 1056 805 -371 -82 333 -461 -409 216 -230 -55 915
3825 915 357 -414 980 965 -856 -123 771 -524 -1199 -38 -47 -570 239 292 371 877 829 -2 997 1025 -207
3846 -207 -21 487 -550 -532 604 -267 -1045 357 42 -1314 -271 737 -476 -554 421 262 -225 350
3864 350 295 609 1006 -124 -403 696 -56 -1784 -653 217 -1032 -1473 326 141 -196 508 253 -29
3882 -29 154 -245 -799 191 483 -1004 -511 783 -294 -620 203 -184 -442 -134 -155 -337 330 167 -703 292
3902B92O5j036M86J221j370l55J418o97j461J201J074j544p8J228K64k58l61k30
3920a41R54K7j711J24J825p14j886J669J042j758k24J430r8o73N93j91K01K37
3938G06o66n14J105m01j041O45R31j074R8P64o04j2O99p25r8R70m16m61L61Q6
3958C53r69Q67M67j464M02J317p30r05J205L51j176J89L23l08J72k8m21O64M66
3977G75j141L13J147j107p68J272k29j409R23O29j171K90J006p89j58J142l75
3994C50n56M45n5o13N33m91n53P02K10q00M85J094j047J1O16p02l80Q88j83j004
4014a050J109P54j580K84J337p44o61Q33j14m25J10o2l40Q54o90m49R14L47q97
4033d70O74J073j100n62R31l53j122J008L13j196O90Q12p13M5O27p78l23Q08n77
$$ plain form
3902 292 357 -679 -193 1028 -342 -697 721 24 -1437 -236 838 -706 -784 444 708 450 89 -141
3920 -141 813 840 -871 -747 1078 364 -1522 147 1189 -569 -793 637 539 -134 459 268 469 706
3938 706 40 -474 631 230 -811 -166 765 -309 -211 553 -51 -63 636 -89 -187 783 367 -94 267 353
3958 353 -616 251 718 -746 -344 973 243 -662 543 894 -282 -93 230 -78 94 66 -355 309 775
3977 775 -366 -53 1094 -13 -781 491 262 -1147 -224 405 -766 -476 530 -259 -417 725 350
3994 350 -206 239 184 -429 104 -387 -940 -238 -28 -828 -343 751 -296 -285 331 -371 -751 137 -46 -1050
4014 -1050 59 813 -767 -483 854 110 -551 282 168 -257 -147 -209 -549 305 -385 -834 80 427 -470
4033 -470 204 1277 177 -385 546 193 -929 79 392 -804 -114 698 -15 30 657 -121 -444 364 -213
4052b13m66J212j65j049R17M39p48K17L91n19L69L36r53n2J300j073r78J392M62
4071H19j408N85R69n62l54N78m13m01M06n13j40P77j84o28J074J05j074O13Q70
4090A119j455RJ116p42p84Q45J55q48N89J58n90N06M61j066N03O79p43l20J131
4109G23l53p04O67J3p19M46K20q47J29O25p57L7Q24m49o74J279k26q61R23K93
4129E89j419Q68Q86j199l44P95j78o52M69j56l08P96j15o07Q10K19r37K61P89
4148E67r53N9P73p94k39J344p67j138J310M48j519L00J551q74q45J118K27o88
4166a20p8J76Q4L21m04k03J073k55j476P28Q91j291k48J539n78j030J252O20j559
4185e58N46P63n58m70P45m00k49L74m41J59N86o47l40J324l9j054P79L45j089
$$ plain form
4052 -213 -679 533 368 -681 236 675 -73 144 535 16 385 721 -232 -284 1016 -57 -1035 357 819
4071 819 -589 -4 965 403 49 627 214 -187 219 -294 -434 343 159 -469 605 710 -364 249 1119
4090 1119 -336 -327 789 47 -737 108 263 -585 4 162 -428 78 539 -527 -24 655 -88 -408 723
4109 723 370 -334 333 346 -373 73 293 -554 -425 200 -557 -520 304 -145 -819 460 234 -627 296 589
4129 589 -830 38 924 -275 -619 176 -2 -654 -185 -341 -649 147 32 -575 235 454 -483 -222 567
4148 567 -386 -327 446 -348 -587 757 -10 -1148 162 610 -909 -609 942 68 -777 341 568 -120
4166 -120 -198 -22 62 383 -21 -224 849 594 -882 -154 737 -554 -802 737 159 -871 381 1001 -558
4185 -558 -12 751 193 -277 468 68 -181 193 -248 -89 497 -150 -490 834 795 -259 520 865 -224
4204b24L64N26j256k89J259m49q81J273L07j112O17R91p71n08M68Q4k01R3l35
4223d4L88L18j301k4J406p61j152J302O53j733J12J696q99q47J378J96j257L66
4241b03P43n36j42P4l35L76M1q02N60R29j027l45J131m89r39J317q5j462R05R17
4261F28j375j9J756p42j039J093L82j033L6M51j85q3q3n12P42K44j192M16J206
4280F91r17o73J427j54j177Q61M59j161N95N14o02k81J008k84n14M16O1o93N30
4299A06P2o97O82K49p59q2P02l71j28Q80n78m31J051k76p36P06O73j483L79R00
4319H59r32l30P74l15m21R12n16p84J202O21j374J52J076o00l27J87J13j9n9q73
4339f54K17J620j058j046J454R31k056j23J614m90j084Q58p4m83P64l77l99O08
$$ plain form
4204 -224 140 666 -590 -879 380 -69 -950 323 630 -482 135 1126 355 -153 315 399 198 291 -44
4223 -44 344 662 -639 -663 743 -18 -1170 132 785 -948 -836 860 -39 -886 492 688 -569 -203
4241 -203 540 4 -138 -64 -399 -23 18 -784 -224 705 -322 -667 464 -25 -964 353 268 -1194 -289 628
4261 628 -747 -766 990 248 -791 302 684 -349 -313 138 -47 -130 -213 -725 17 261 -931 -515 691
4280 691 -226 -899 528 374 -803 58 517 -644 -49 465 -137 -418 590 306 -208 208 269 -424 106
4299 106 178 -519 163 412 -347 -429 273 -98 -226 654 76 -355 696 420 -316 390 1063 -420 -41 859
4319 859 -73 -403 371 56 -365 547 31 -753 449 1070 -304 -152 924 324 -3 184 297 278 219 -654
4339 -654 -437 1183 125 -921 533 1464 -592 -715 899 409 -675 183 109 -374 390 13 -386 222
4357B22J89j004M98O31p62J11O01p90j88P61n38l35Q50r2p31Q50J93j150L55J068
4377G39j492k2J535l29j436R21P87j210k84O38M6J91o05j0J137K55j992Q09J621
4396A299j494j402J917Q45k018R9J426n31r21O12K79l11K9r4K20P30o94p11J065
4415C45L45j633N08R42p66l1P73m28l64R61n15o35J038K1j383P18Q74j247j4J377
4435H86n24q08Q33J55m16J14P9o6J01p5r68J027L22j581K70J658q05j204J539
4454E37M44j342K66O77m82J5J34k66L65K06q23P4R28o53j022J346P7j158M93Q41
4474F57p26k74O99n16J27M00m93r6Q44o37o11J055M63j554M10J066j021j43Q10
4493D60m61n01O77n54k84O97k39o10Q22M84j014K57J166j124l46R24j12o59N32
$$ plain form
4357 222 411 -593 -95 536 -226 -115 486 -304 -492 269 -269 -604 246 154 -577 273 466 -684 -329 739
4377 739 -753 -775 760 431 -1005 -84 703 -507 -791 -153 -107 84 -521 -531 606 861 -1131 -322 1299
4396 1299 -195 -1597 320 1165 -853 -754 672 141 -780 -168 111 -200 -171 -265 -45 685 -9 -720 345
4415 345 690 -943 -435 507 -259 -290 483 55 -309 652 137 -498 540 561 -822 -104 770 -477 -491 886
4435 886 362 -446 387 542 126 240 319 253 354 279 -689 338 660 -921 -651 1007 202 -1002 537
4454 537 981 -361 -95 582 100 115 249 -17 348 554 -269 -195 733 80 -942 404 481 -677 -184 657
4474 657 -69 -343 356 -160 -33 367 -126 -222 622 -15 -626 429 892 -662 -252 814 -207 -350 460
4493 460 -1 -502 175 -379 -663 34 -205 -815 7 491 -523 -266 900 -224 -570 354 242 -417 115
4512A15J67l68j02M2n72Q01M7j170P00R82j147p13J310J98j217L91J239r53j4
4531b64O37j25J34l7p56K18Q58o64p61Q68K37j147O24K56p65N58O67j085K82J166
4551I01o51r89J094K92r82L16M44k41K02J30q22L40N51q38n33J163k4o64Q03k56
4571B36n36P06j2j166O64J132j257m59J519j38j193K94R95m76k22O9K8M37k26
4590C95r60M55P19j087m00J415m34o70J161J00j250L15J146r63k20Q00l42k73
4608i3K91k08k48P86p79m62Q81N72j310K22R25n88q54R25J32k21ll22mR63o84
4629g9q19J066N94j667J40J560q56o95R50K1o56J28M87l20J91K11n61M07K30j009
4649f77L34Q61r15l97J262o4j256O86P65j059J27O14k05J02M37r43p6J115r14
$$ plain form
4512 115 282 -86 -188 -146 -718 83 130 -1040 -340 642 -505 -1218 92 290 -927 -536 703 -250 -264
4531 -264 373 248 382 345 -411 -193 665 1 -760 108 345 -802 -178 78 -687 -129 538 -547 -265 901
4551 901 250 -739 355 647 -335 -19 425 184 386 516 -306 34 585 -253 -786 377 353 -311 492 236
4571 236 -300 406 394 -772 -108 1024 -233 -692 827 689 -504 -210 785 309 87 156 184 621 395
4590 395 -565 -110 609 -478 -878 537 103 -567 594 694 -556 -241 905 -58 -278 522 180 -93
4608 -93 198 -10 -258 528 -251 -713 168 740 -570 -348 577 -11 -865 60 192 -29 -32 -354 -358 605 -79
4629 -79 -898 168 762 -905 -765 795 -61 -756 194 215 -441 -313 174 -146 45 256 -305 102 332 -677
4649 -677 -343 518 -397 -794 468 404 -852 -166 599 -460 -333 281 76 178 615 -328 -404 711 -203
4668b03p91J289M89j344K63R38m31n65J62N0J01J76n00J07J140q42p32J040M15
4687G62j344L48J208r00k88P02l67n11N86j93k14N12N5o80O23L86p41l13Q19n01
4707e1j66M90j55l2N53m83m47O77J10j156O46J096j244n50J406k93r67P53L64
4726E51p21M60Ln23L38J62r52K97P54m78r1N88j34l94N64k50p53P38J9r77L38
4747d61J018r49k27J110l32o53P99K53o02K46J4n40L5L24p55K96P00n91p1Q04
4767D18l87p06M38J59m73J67M40m11N28N71j261K01J327o59j483J260O79j299
4785d91j34P75j51n53K4J35N35J73p57N64J065r42j048J365M9j577N04J241p13
4804F4n55R72j27n56J14l3l00P09r1m45N71M22r20J02J71k70J76N96m69k38N07
$$ plain form
4668 -203 -994 295 784 -560 -297 641 210 -355 -193 -143 -42 134 -366 -259 881 39 -693 347 762
4687 762 -582 -234 974 74 -214 488 121 -390 196 3 -211 301 356 -324 299 685 -56 -369 450 -51
4707 -51 -217 273 118 86 639 156 -291 386 496 -660 -14 1082 -162 -712 694 401 -566 187 551
4726 551 -170 290 293 -230 108 270 -682 -385 369 -109 -200 388 254 -140 424 174 -579 159 178 -799 -461
4747 -461 557 -392 -619 491 159 -494 305 558 -44 202 216 -324 -289 35 -720 -424 276 -315 -386 418
4767 418 31 -675 -237 -78 -551 -384 56 -355 173 744 -517 -316 1011 352 -1131 129 808 -491
4785 -491 -625 150 -1 -554 -530 -395 140 313 -444 120 1185 243 -805 560 609 -968 -464 777 64
4804 64 -491 481 354 -202 -88 -121 -421 288 197 -248 323 745 -175 -73 98 -172 4 600 131 -107 400
4825D00l84m86J019n7j142Q62R14j140j13J081m36r60K38K64n54M62L6n8J60P
4845A13m31M72M16r59M42J014r67n64J253l37j095L44N12r18K45Q82o17j91O24
4864B38j91n12O62Qm01N13J1n79L31J57p33J35M33q66J31J051n80n82J257j71
4884C12j043Q41O15j086q5J040l25n08M00l27k65M19k74m08O50Pq44Q58K68o25
4904c80L31P96p68j23Q30m83o89O46k7n75K80M02p11J50O79o42P7P31n53l01Q90
4925E60n12p35Q65K04o12K56N70o89j24J064r27j11N69k64n14P26j5m72N21M50
4945H10q13K97M02p56o49Q99k75l83M25k9J9L34J36o50Q35K82r91K65O31p59o18
4966e88O90j62r27Q10K31m54L95O33m18k8K92m96m08O65l24j29N06k65k70R06
$$ plain form
4825 400 16 -470 549 492 -650 212 1126 -14 -127 954 518 -442 -204 60 -494 -32 4 -54 106 113
4845 113 -318 154 570 -389 53 1067 100 -464 789 452 -643 -299 213 -705 -460 422 -195 -386 238
4864 238 47 -465 197 205 -196 317 328 -251 80 237 -496 -361 72 -794 -663 388 -192 -774 483 312
4884 312 -731 110 725 -361 -446 594 269 -239 161 -166 -431 -12 -286 -694 -44 -37 -881 -23 245 -380
4904 -380 -49 747 -21 -144 686 203 -486 160 133 -442 -162 240 -471 -321 358 -284 -207 524 -29 -330 560
4925 560 48 -687 178 382 -230 26 596 -93 -217 847 -80 -191 378 114 -400 326 311 -161 360 810
4945 810 -3 294 696 -60 -709 190 -85 -468 -43 -72 -53 281 417 -233 602 884 -107 158 789 30 -588
4966 -588 102 -60 -987 -177 54 -400 -5 628 210 182 474 -22 -430 235 -89 -218 288 23 -247 659
4986F59k78q52L50L98r21M0Q39n50l73R03j10o97R05L79j038J10Q17p78l12N30
5006B1M5m40k2J28nP15n00l19R30l42j010K67J091j199j98J192m03n00O72K73
5026C96p71K61K61m12K00K23o21K03O42n10k49Q22k83m40N71j3n13J48R9m17K63
5047a40L66q95M25J046n01j049J428J39j249J45O33n07j03L23k93N60Q2p18L88
5066H0R20j143m14J051K17j407O65Q06r35k61Q02J55m27J31j11j31M21m51j86
5085b18P22m79q12Q62Q07j108j67J317n65q85N99K62j67o3j0l90N95N4q88L20
5105b14P53r10j35Q01k74k99L98L50n92L76j42m60K37N80p52k24P69m65m76R49
5125B70p7o45N96j5n31K11P79o55k3L50j56j14J86k13k03O54p11p09R10L99j349
$$ plain form
4986 659 381 -471 -121 277 -644 -604 235 -315 -688 215 105 -592 313 692 -346 -236 581 -197 -509 21
5006 21 66 -374 -396 -268 -273 442 -58 -377 553 211 -799 -532 559 -640 -838 354 -49 -549 123 396
5026 396 -375 -114 147 -265 -65 158 -463 -260 382 -128 -377 445 162 -278 293 280 -233 -85 14 -403 -140
5047 -140 226 -669 -244 802 301 -748 680 819 -430 -285 348 -159 -262 61 -232 328 410 -308 80
5066 80 1000 -143 -557 494 711 -696 -31 775 -160 -421 381 536 109 240 129 -2 419 -32 -218
5085 -218 504 25 -787 75 882 -226 -393 924 359 -526 73 335 168 105 95 -295 300 354 -534 -214
5105 -214 539 -371 -506 295 21 -278 120 470 -122 254 112 -348 -111 469 -283 -507 262 -203 -679 270
5125 270 193 -452 144 129 -402 -191 588 -67 -90 260 104 -10 176 -37 -240 414 -297 -1006 -96 303 -1046
5146a046M34J208p81n86J118K59n05J43J77l09j3p6o92L18K57n44L38L81l19J28
5166a10O79o36m73Q43k2j044R84N95j041l34R39r2n50L51J62k72K78l2l77L92
5186B40j45o36O20J35o81P26P90j261k24J230m80j362J066O59q30l38R12L07m36
5205B92n3J17J90j63p40K50Q59o85j042J003K01j037M02Q92n89j46J012m04m17
5224e8M57K06j080O13K05m54L09K80n15l2L94p51l15Q59k19p76Q52J51k82M14
5244B58J98o26N90l3p31J51R30n83j054P68L65q62L44N77l87o6L46l89K19K10
5264B25m78j54O54p70k18P47J21o48O41O43j274J86Q12o59m36P44L8m95L68J01
5284A48m26L42R9p44K76N38l92k21P47m00j43M35l39j09O53j88n82P18J60r69
$$ plain form
5146 -1046 -612 596 -185 -771 347 606 101 244 421 112 99 23 -669 -351 -94 -638 -300 81 -238 -110
5166 -110 569 -67 -540 303 281 -763 221 816 -225 -559 380 288 -262 89 251 -21 257 225 -152 240
5186 240 95 -541 79 214 -467 259 1049 -212 -436 794 314 -1048 18 677 -153 -491 421 728 292
5205 292 239 356 546 383 -357 -107 752 67 -975 28 229 -808 -406 486 -103 -249 763 359 -58
5224 -58 399 605 -475 138 343 -111 198 478 -37 -69 325 -426 -741 118 -101 -877 -25 126 -156 258
5244 258 456 -170 420 387 -344 -193 737 154 -900 -132 233 -629 -285 292 -95 -161 185 -204 15 225
5264 225 -253 -407 247 -523 -741 6 127 -521 120 763 -511 -325 487 -172 -608 136 174 -321 47 148
5284 148 -278 64 163 -581 -305 233 -159 -380 367 -33 -176 259 -80 -189 464 276 -306 412 572 -397
5304c97K91O72p80k75P26k21k96N31l4m23M36L63p23J48M49n25j38P82m50j87
5324e1L37k65k18L25l9m60M52M48n10K17L12q70M6J056o38o00J019Q4r30p7R41
5345E79n75l31K93O8P3l1l35K79O47p92n78J141o1r19L17P34m71k98M54k93l84
5366d83O86l15k79N05K18n40K52K61n11j44M44m59k1O17l59k48M85J48n80L24
5386Aq6m99N12M39j019N07M62n22n74R42J01q11L23O65l94n6K30m98k3L60n53
5407d93O3O73m49k67R25k94m51M85jr28O94N92r43p6R58l38o32N53K72o49M50
5428A44K43n34R9M54o21r1L46m65K40L10k7m5N79l95n00P74N6j048L92P91q07
5449a05j21P98l15l94K83J91n04N72Q5p85P7O03l69l04K20J74pK24m32n0Q27k63
$$ plain form
5304 -397 -106 566 -214 -489 237 16 -280 251 217 -206 230 593 -130 18 467 -58 -196 586 136 -51
5324 -51 286 21 -197 128 89 -371 81 529 19 236 548 -322 -276 780 142 -458 561 645 -285 -362 579
5345 579 4 -327 -34 34 107 76 -259 20 667 -125 -703 438 377 -542 -225 509 38 -260 194 -99 -483
5366 -483 203 -112 -391 114 332 -208 44 305 -206 -350 94 -365 -386 231 -128 -376 109 257 -323 1
5386 1 -85 -584 -72 367 -652 -145 317 -205 -779 163 264 -547 -224 441 47 -9 221 -277 -300 60 -493
5407 -493 -430 243 -206 -473 452 158 -293 192 191 -737 -43 549 -394 -470 488 150 -482 71 343 -306 144
5428 144 387 -147 -48 406 -215 -306 40 -425 -185 125 98 53 632 237 -263 511 567 -481 -89 702 -105
5449 -105 -226 572 257 -137 146 337 -167 405 490 -295 -218 385 16 -288 -68 106 99 323 -109 -159 668 405
5471D05q13O69M13r72P4P00m50l90Q54m15m52O36j93p48O01L49m46N8L01O6j5
5492B32Q1l37j12O13n44m07P32m0r66M81O22p88J84N01m35l16Q23M9q53L93Q2
5513el22R1J30J9Q1L12n73K69L51o76j01Q29m79m21M54L52o71J85L07n57J62N67
5535C04n76k45R78k05m67M64j78k78k7L83l49J76K16l65J41L05l24l82P21j17
5555A75o77R02R2q28J84R09j015j25O94k88l7J66J50n41M25n3m19M78J73r71M02
5576b04P61o20m18Q31o7m31L24M2l77N93j28p22O18L13q91K2Q62m48l17M21K22
5597C86n22K82K5o1q8L16l71J1M74m57r8M55l84k72L32K7m92L23M02o87R7L62
5619F0m23K73L11n64j4Q43m54p14P43M08j017P9R66n04l27M14k04j27J58k65P1
$$ plain form
5471 405 -408 261 674 -298 -224 476 26 -364 490 75 -377 259 66 -682 -81 268 -178 -120 181 247 232
5492 232 313 -24 -136 477 -67 -474 258 218 -748 -267 355 -433 -249 252 -183 -499 324 373 -480 -87 -5
5513 -5 -327 -236 -106 -87 -6 306 -267 2 353 -323 -424 405 -74 -495 -41 311 -360 -175 132 -425 -263 304
5535 304 -272 -517 461 256 -211 253 75 -203 -230 153 -196 -20 196 -169 -28 277 -47 -429 292 175
5555 175 -502 400 492 -336 -152 757 -258 -383 311 23 -14 152 302 -239 186 133 -286 192 365 -606 -204
5576 -204 557 -63 -481 350 283 -148 176 218 -159 434 306 -416 202 515 -376 -354 508 60 -257 164 386
5597 386 -136 146 171 110 22 338 -33 -22 452 -5 -103 352 -32 -304 28 55 -437 -114 288 -399 -302 60
5619 60 -363 -90 221 -343 -357 486 32 -682 61 469 -548 -469 497 -7 -334 80 -124 -251 -93 -358 -287
5640b87L81j91o94Q80L58r40K75O26q77J61R30l66m90M33j2o58L78K89n64J23
5660b45M74l10p4J65j73k67O31l20k52P17l78l14M82J91p59Q0Q79n05l46O86q0
5681B82o41M78o4k93M13K9l65J84L45o35J87N52m78l88N75K52l99J18J63l15J66
5702A66J29p52N05P70j073j69J009k57p02O19J36o75L48P3l01L45K82m25k5O09
5722F12n26o58R08j17n15N45J64o25M01N4n05M22J93o50J5J011q95m76J030J80
5742E68j157M19O80o73l11M21L1j58J08k21m1O60p31j14J028K1j288R30N32j010
5762c06k09P80j55m70L66J63n58M26l1m00J99L41m66O9O58n12o6K16k94J52K79
5783A82k34j17M45r6o98P30M13j089O7J029o57p96Q38M77q59K37O74n23j34J01
$$ plain form
5640 -287 94 -97 -791 89 447 -493 -218 408 -469 -308 622 256 -234 199 187 -471 -93 196 -368 -245
5660 -245 229 -81 -155 10 -163 -430 201 -119 -371 346 -32 -346 136 327 -432 -352 527 22 -324 362 282
5681 282 -359 119 55 -238 175 204 -161 23 368 -267 -80 472 -6 -394 181 433 34 152 315 0 166
5702 166 295 -457 48 818 -255 -424 585 328 -374 245 381 -294 54 127 -174 171 453 28 3 612
5722 612 86 -572 336 219 -296 249 413 -212 189 243 -262 160 353 -297 -282 729 -166 -642 388 568
5742 568 -589 -170 510 -163 -474 -53 -22 -180 -72 -293 -334 326 -405 -519 509 530 -758 172 704 -306
5762 -306 -515 265 110 -360 6 169 -389 37 6 -394 -195 146 -320 -251 407 -105 -171 45 -249 -97 182
5783 182 -52 -169 276 180 -518 212 625 -464 -397 632 -25 -821 17 494 -365 -128 546 23 -111 -10
5803a0J29J17l12j91L77L15p08J31O58m23p78J020L60j242L39J099p46o66Q84
5822C53K77q24qL40o6O6k44k52M84j31j88L47L79p66j4Q38n18l84O17N8q43O17
5844A38N00o74k48P92m88j40K93q1j18J46l1k41L63k34k19L47J60q46M90L65o54
5865c80JQ73m10o47Q40K77q69M08K91m75N0M29l04n06L17j38j48L83k9l32M60
5886I1M8m45P3N29o31J61M29l12k13N73j17m61O56m5p83M98P4p01J19P11l96m46
5908e88O15R8l72M08M5l31M26q8m65L51J94q53L59M81k74l50P64o7o69M59M87
5929F30p22m5N38o29l3M65k80q6O23m01n38R11J44q23M13L19n07LM57k35k06L86
5951C84l93L6M90m40l11N14j57r37O70N46p25pR18q5o42M92M4k78p7K5j50K25
$$ plain form
5803 -10 119 236 -76 -267 110 425 -283 -152 506 83 -695 325 685 -557 -218 881 135 -531 353
5822 353 630 -194 -202 138 72 138 -106 -358 126 -5 -193 154 533 -233 -247 591 73 -311 306 364 -479 138
5844 138 638 -36 -284 508 20 -120 173 92 -26 120 89 -152 211 -23 -242 105 265 -581 -91 274 -380
5865 -380 -379 494 84 -563 277 554 -315 93 384 -91 -41 388 84 -422 -105 -243 -391 -8 -37 -369 91
5886 91 139 -306 -233 296 -335 -174 255 -57 -270 303 186 -275 381 336 -447 51 125 -576 -457 254 -142 -588
5908 -588 27 125 -247 161 206 -125 301 213 -252 99 293 -560 -201 280 6 -344 420 353 -316 143 630
5929 630 -92 -137 401 -228 -261 204 -76 -162 461 60 -478 433 577 -246 167 486 -21 -18 439 204 -2 384
5951 384 -9 27 517 77 -234 280 123 -814 -144 402 -323 -330 588 503 -139 353 397 119 42 67 -83 142
5973A42r3l29L89M40q26q0Q56n32j70N37j22n52L77P8n60O20K58n98j16P46k24
5994B41r30R34P6o27O4J16K0J00J4l27M88K22o94Q9Q81p90m67Q65j24p30K79O70
6016C70o04n0O23m07j21L33j52j40K00j61k33M52J64p24K13M52l11k03O80o27
6036b46l9O90o13K3M36k63l55O50J61j072M10O06o11k13O34j44n11M55K75l63
6056i0L6J24l50M84m6n85O87J43q06K07P53n06o70Q74J81r32L99L64k33K5L15
6077C74m53m8M72k25k59L35k06k53N04j39l71L87J37l52J59N56n69k26N40k56
6097A07n45O10j03m52M07N28q32K45O39l34n75L51J72l65M5n8J03K98k12l72P07
6118C64L34r95J21Q86q34j89L12J80p20M24J66o78M62M95n30m0N13k05k36Q1J65
$$ plain form
5973 142 49 -280 109 549 -277 -357 499 -33 -203 334 212 -340 37 115 -445 175 433 -165 -281 465 241
5994 241 -689 245 321 -306 -242 -126 -106 -6 8 -319 169 391 -303 -214 667 -123 -590 275 151 -579 -300 370
6016 370 -234 -284 339 -68 -189 144 -8 -148 52 -109 -342 110 274 -450 -237 215 -96 -299 381 -246
6036 -246 -285 405 -208 -185 251 -12 -367 283 444 -628 -218 388 -223 -436 198 54 -457 -2 273 -90
6056 -90 -54 70 -280 204 158 -427 260 403 -403 -196 557 51 -619 255 436 -496 -97 267 34 59 374
6077 374 -79 -127 345 120 -139 196 -10 -263 241 102 -269 118 255 -97 62 618 49 -177 363 107
6097 107 -438 172 69 -383 24 552 -280 -35 604 270 -305 46 218 -147 -102 -160 -57 241 29 -343 364
6118 364 698 -297 -176 710 -124 -313 -1 179 -541 -117 49 -629 -167 328 -202 -242 271 66 -170 -89 76
6139G6j59J48j14j88M23m1o56N93L76q01j18Q43o53l41Q12j03o24N82M69p88L24
6160F0L17j45l95K59q2l02L55k67OK57j21k66Q25k1p76L38N48j013kN78l44m46
6182f37Q18J01p61N51N05n33j03K39k41J33O2l97J37N47m80j82O06O8p52L81K30
6203B92p15K02N83p96n7P08K5l38N28K34o09L55M04q21m6K38k88j46M8J17k33
6224c15K93J05k67O36k95o29P37L99q10J09P45p55l27M00L20n60l8J45j50K91
6244C4J21l85K51J06j86p7M94j49o10N37j21l87L02o0n61O79Q5n11L60M89o14
6265b03p7N59k35l84K90L11m66J97Q0k74n8L17m68j02M68n1r8N51k24m29N42n2
6287A94n98O19L4o57P0N11j02l68L54N0n78O76J63n74K69K55l71k9J67l19J23
$$ plain form
6139 76 -83 65 -49 -237 186 145 -511 82 458 -343 -461 382 -271 -612 200 97 -527 55 524 -264 60
6160 60 377 232 -163 96 14 -288 67 -200 -194 63 -58 -324 501 480 -296 42 590 -423 -425 153 -191 -637
6182 -637 181 282 -479 72 577 44 -59 180 -61 72 134 -263 -126 421 -59 -241 365 433 -319 62 292
6203 292 -423 -221 362 -434 -491 217 242 -96 432 666 57 412 816 -5 -51 187 -101 -247 -199 -82 -315
6224 -315 -22 83 -184 452 157 -472 265 664 -146 -37 708 -47 -374 26 346 -214 -252 -107 -257 34
6244 34 155 -230 21 127 -59 -136 358 209 -401 136 15 -372 -70 -130 -691 -12 73 -438 -78 411 -203
6265 -203 -280 279 44 -340 -50 261 -205 -8 72 -202 -260 57 -411 -513 -45 -96 -194 357 133 -296 246 194
6287 194 -404 215 249 -408 -338 173 71 -297 57 107 -471 205 368 -206 63 318 -53 -82 85 -234 -111
6308a11M17o75K15O16k85n68M97K80o22j30M33N5j02K56l25J73M51l50m98M48
6328A75K94o59R6K83l67j43L99k88K32K99k02k83P73p9o31J1M55j85l13K17n0
6349C4J35p3k49n8N42l03l71O68j74p01N11M18o44k09R36j85o16M32K59m32J3
6370f7PJ25ol55k14P64p7o20L88Q51r25m74Q00j24p06L92M04o88M34K83l26L6
6392i8M95n34j56N81q0m27K26k28O2J53j45l07P69j93k57J37L29n66r0N62k71
6413c8n67R79O0j034N11N23l57m24N24L26n72o1K55J3j32k46L6O93n08n25Q50
6434C06K28q29P8R96p59n75O69L05q58K41P47k80m22J94J29j55j97J13L85K1n77
6455b40J39O69j11p06L06K76l89j24M42l30k64O99k21m98N97Q9o60J69O34k07
$$ plain form
6308 -111 306 -369 -154 462 177 -391 106 386 -236 -366 67 122 20 276 -49 124 575 225 -273 175
6328 175 469 -190 -94 189 -178 -321 78 -210 22 321 119 -164 609 530 -101 -90 365 180 -133 84 34
6349 34 169 96 -153 -211 331 28 -343 325 151 -550 -39 379 -265 -474 462 277 -339 93 352 -80 -67
6370 -67 -60 65 59 -296 -510 254 177 -443 -55 796 -129 -603 197 73 -633 -241 163 -525 -91 192 -134 -98
6392 -98 397 -137 -293 288 208 -219 7 -221 -159 -6 -151 -458 311 118 -139 -2 327 -239 -329 233 -38
6413 -38 -605 374 434 -600 -89 434 77 -347 177 503 -69 -130 125 138 6 -240 -204 489 -19 -544 306
6434 306 534 -295 -217 779 20 -555 114 419 -439 -198 549 269 -153 41 170 15 -182 -69 316 337 -240
6455 -240 -101 568 457 -249 57 333 -56 -180 262 -68 -332 367 146 -352 245 334 -326 -157 477 270
6475B70m29K57K99l28K5l11M0N78m52l98Q59j18r24O96K98p00J40N03l26k84M66
6496A61r2k40J83O9k48K00Mk84J66J97m95j10P47n3n15M45N7l02M44l43k57M60
6518A94J43p55L96P73r13l42O44O6p32J92O11l44j11J79j66J58K12m25O3M17k75
6539a5j01K51k11k79N04L8m81L06L52o63P1O08k47k38K39k7k67J44J13l63L87
6560A21N5l74K1M90k94j76K72j3p5K81j09k15L69j98m63K55L07n82K7M34l35j97
6582c99N84Ll61M38K24n11Q6L48k47k72K19k5q2p3j11o3L72n3n44N51N27r11K89
6605a1K17m36R8N35m85j68N09Ro73M80L98o40n5L93j69m66L51J76j25Q8r6o9O09
6628D70m85m19L84M06p86k59J075n85j36O16j9m37K02Nj26Q9o4k26K81J79o08
$$ plain form
6475 270 -159 98 397 69 94 -217 -177 401 -51 -449 410 292 -632 64 362 -338 -198 305 -21 -305 161
6496 161 69 -171 12 81 -167 33 37 -247 -81 116 -379 -489 258 205 -310 135 192 -110 334 -9 -266 194
6518 194 337 -418 -22 751 -162 -504 140 206 -526 -334 277 -67 -178 1 -165 -7 205 -220 -157 260 -15
6539 -15 -116 135 -76 -355 149 187 -294 12 364 -299 -228 380 133 -105 134 107 -160 -16 97 -266 121
6560 121 176 -198 -177 313 19 -157 115 102 27 308 199 -16 353 155 -308 -53 254 -328 -301 133 -202 -399
6582 -399 185 188 -173 265 489 -22 64 412 165 -107 112 87 5 -68 -179 -242 130 77 -467 84 611 -300 -11
6605 -11 206 -230 -132 403 -82 -250 259 268 -405 75 473 -167 -222 171 2 -464 -113 63 -62 26 -70 -139 470
6628 470 -15 -434 -50 356 -430 -689 386 -199 -335 281 262 -175 27 32 -94 -5 -69 -295 -14 165 -443
6649d43K41L97l70k57N78L12n62K02j17L1K94j32l86L01L67o14k53P78k29p17
6669e79N56K79o78J55K55Rj49J64j13K97Kk32K1N14m51l53M28J94o13J78N25m30
6691b1j14K32N4l61L72j36k28K97K12m34R8M69l16k37L36jl97J45O2j34N05n29
6713a26j82O50j88o95N53M32o66m2O56p4p26N90n6l02J32K68l17J12K35k79j50
6734a75K82n2l77M75l43K53K41j82l55N28j20n08L59M90p54m1O54m96m81P88J41
6755C27o64K05L54j17k65Q4J12J52k27k07L40J69n58J7N92j72p38P94J62p37J0
6776c67O55l45k69O12k57l30L77N4l77j83M56R7o9n7j71K85q8n37N57K89n13l39
6798e20Q87R9j088N05N59n11k98O18j01k59M09l04k53K85K52m19L9K95O6j18j0
$$ plain form
6649 -443 -202 195 -175 -432 146 458 -104 98 -19 12 306 174 -212 89 456 -158 -411 367 138 -579
6669 -579 -23 256 -422 -267 -12 -3 -152 12 -101 196 198 -34 -13 501 50 -303 125 319 -294 -116 409 -21
6691 -21 -135 97 151 -210 162 26 -202 95 307 -127 -29 440 124 -113 223 222 -175 -30 32 -102 403 -126
6713 -126 -308 342 154 -541 12 444 -222 -264 392 318 -408 182 126 -176 -44 224 -93 19 254 -25 -175
6734 -175 107 55 -322 153 -190 63 304 122 -233 295 175 -333 26 516 -238 -279 375 -121 -602 186 327
6755 327 -337 -132 222 105 -160 -76 36 188 -39 -246 94 263 -295 -278 314 142 -596 198 360 -377 -367
6776 -367 288 -57 -326 286 29 -301 76 130 -247 -430 26 123 54 -3 -174 111 23 -514 43 332 -181 -520
6798 -520 367 466 -622 -117 442 -69 -367 251 150 -109 300 -4 -257 28 280 -139 -100 195 261 143 133
6819A33k75M09Q8n12p5Q27p72m23Q71r8o23M72M02m24l42O94no12K31K26j51k0
6841B1k2M5J05m94JO27j42n59N46L14n09j63O95k26n69L18M72l24j79J62k36q8
6863b05M94l06p1P8m2j94L13k1k80M42k46l71M19L27m17PM49l06n08N47Q8n19
6885c22L27K39m42l4M13k42k70K47Qm8J11j8k08L52j24k78O50l64k57K34M37n17
6907a06j43N49j05m62K00Q8j36J10o9k46J42L41m33J24L07j23m67O02p5k98L94
6928A94k36l16O01q1m89N58L40q43j37P59j69n37M17J67m06%K65n3P0J69m10J38
6950AL23m00M9L86k63k05L58j69m37L11M00n54J2M76k85k57L74M1l11J65q1j42
6972b08M87p9o51N45K62o51J78M75l95k23N79k45l94K61L29m99J14N35m28J76
$$ plain form
6819 133 -142 267 355 -157 -232 595 -177 -600 271 173 -450 22 424 0 -342 352 347 -265 -34 192 41 21
6841 21 -1 44 149 -345 -344 283 141 -418 128 442 -67 -230 465 239 -330 -12 460 136 -43 119 -117 -205
6863 -205 289 -17 -88 -10 -52 -246 67 46 -234 208 -38 -409 10 337 -80 -73 376 70 -438 109 197 -322
6885 -322 5 244 -198 -232 181 -61 -331 -84 -76 -124 -13 -31 -239 113 -11 -289 361 -3 -260 -26 411 -106
6907 -106 -249 300 195 -267 -67 21 -115 -5 -74 -320 -178 163 -270 -146 161 38 -429 173 98 -200 194
6928 194 -42 -358 243 162 -327 231 571 -272 -409 350 181 -356 61 228 -178 -178 87 34 104 273 -137 1
6950 1 324 -76 -27 359 96 -109 249 80 -357 -46 354 -200 -188 288 3 -254 120 161 -150 15 -66 -208
6972 -208 279 200 -451 94 356 -295 -117 358 -37 -260 319 74 -320 -59 270 -229 -115 420 -8 168
6992A68j78pj38K00k01p3M70q4n84M52J06m39J13M65l60q7L24k31j15M14q0m83
7014c48M65K66o66n9M41j34j57K93k45qK8k3N0L39k60l45N86L9n65J63L45k90
7036h5j20O29k09o22M00M10o39M0M47j72j45n3j5K2J07k70J3M30k00l48P65l13
7058G2l54M02L31o62RN49l51m57O99J34p84K61L87m18K07J66k3j40J19k36J9K62
7080A92n30K39O43l71l87N92O5p38K17O54q25j33P00j84m79M15K34l92p9K88r1
7101C0Q9n2j56J93L15p91K30L42k53j83O59q2p29M53j08m23L57L35m57K87L00
7122C56l76k17L58Q6m44K04K12l33P4L06l91K2K67n43L61L62k84j10K37m0n39
7143d32N27Q2m09j13M17k64O3M39k69l55L58o5j18K1J76k44J42K82k37N5nl10
$$ plain form
6992 168 -10 -17 -155 45 -156 -229 241 157 -427 25 131 -308 -195 270 -90 -177 147 -84 -199 215 135 -348
7014 -348 117 383 -283 -342 99 -35 -192 101 -144 -152 -124 -147 -97 242 -18 -363 223 262 -303 -140 205 -85
7036 -85 -205 424 215 -407 -7 403 -236 -196 251 79 -66 -119 -134 -112 -5 -275 -262 168 -32 -380 385 72
7058 72 -282 120 451 -211 -202 347 -4 -461 238 372 -412 -151 236 -182 25 191 168 28 147 -89 -70 192
7080 192 -338 -99 544 173 -214 378 443 -295 -78 576 -249 -382 318 134 -345 70 304 -88 -167 121 30
7101 30 119 67 -89 104 419 -372 -142 200 -53 -236 423 341 -388 65 -43 -466 -109 226 -231 56 356
7122 356 -20 -237 121 207 -237 -33 179 -154 -80 226 -165 -143 124 -419 -58 304 20 -90 147 107 -432
7143 -432 95 177 -232 -345 72 -192 -129 310 41 -314 44 -21 -139 -118 58 -186 -44 238 1 56 51 -259
7165b59Q5O50o38j56N18l5p14L63N46m32j44K80k82P1K37J28k68L17k55j48L74
7186B38j51k47Q9K66m61J89L40l65j9L59k42l31N33j58j76M53j37l46J38K44k66
7207e0l65P56j70m33M75kK8k35J60k91J70K08l51rL26l89M7M59k80k81L68j84
7229d3l37N30J1k72J7P27o21j34N30k24j55j48K42m62K29M4j39K35M7k49j1M34
7251B51m79L9O03m16l58N10r3m15K85M09o72pK69o3K79O7m19j68L59J07l21K71
7273C8L23o20M5J87j05J58R0k25J9L92n67k24N40j7m90L10J84j55J60K83k21l28
7295b23K60J19m63J28K12l81K11L53k72L0L78l62k5L62k63r0N73k98n44K41J66
7316A12l83K47J37l71k2O88l99k23M37J0l31R2K77q5m6m7k7J97N8o25L05M10p03
$$ plain form
7165 -259 -174 476 -162 -318 200 165 -549 -186 360 -72 -216 64 -218 -147 90 218 -50 267 12 -136 238
7186 238 87 -160 -71 195 -266 -77 263 -102 -121 238 -4 -335 198 40 -136 317 180 -166 -28 216 -50
7207 -50 -415 341 171 -262 213 211 239 4 164 -127 43 251 -100 -109 217 -172 -125 334 54 -227 141 -43
7229 -43 -380 150 161 -111 -94 633 12 -122 408 184 29 -119 123 -339 -110 -66 -205 30 77 -172 -183 251
7251 251 -228 -189 414 -2 -360 150 57 -358 -73 336 -336 -343 -74 -137 142 209 -210 -378 -19 88 -233 38
7273 38 361 -259 -214 -27 -132 26 116 -109 -90 302 -265 -489 51 34 -456 -146 38 -117 43 326 105 -223
7295 -223 37 156 -307 -179 33 -348 -137 216 -56 -26 352 -10 -35 327 64 -26 547 249 -295 -54 112
7316 112 -271 -24 113 -258 -280 408 9 -214 223 233 -98 -6 271 186 140 93 66 263 321 -304 1 411 -292
7339b92o2M68J07n44K68M65l06p2K84k41n0L15l95k71M09J39l61o4L54R0P7l07
7361A1mK22j0o56J43O49o96m7O42l5n66P06P8p21k0M90k73k05K87Q5j69j94K66
7384a7o8J0k1j36M94j11n51L06L70p92J73N81k72l57P25j54l95J61L36m35k35
7405c88M50r2k08J74J63K7k70PJ84J50l45k18P00j78n83K70P84o77j30M68j15
7426A73m67K51K98m19j76M09j73k5J69Q7k24K75j59r1K92k85Q7M36m12l41N50
7447B55j0n63J01O53m07l52O26j70l93K18M28n28J38K15j02k38K09q4P3k43l0
7468b04L38J38l80m0O39l91l45K63M80p78q9Q60m49n48P20J30n76K07J14n1J39
7489A77r2L9k55K44l70K40k7j27J23N03k87k66L23K34p70J81L74m54k08O87j57
$$ plain form
7339 -292 -354 114 221 -323 -55 410 104 32 316 75 25 340 -55 -326 83 222 -139 -203 151 241 318 11
7361 11 7 229 219 -437 -294 355 -341 -388 254 219 -347 359 437 -284 -304 186 -87 -292 -5 80 -89 -283 -17
7384 -17 -85 -75 -96 -232 262 151 -400 -94 276 -516 -343 238 -34 -391 334 180 -215 -54 282 -153 -388
7405 -388 62 -30 -238 -64 99 126 -144 -137 47 197 -148 -366 334 156 -427 -157 627 -50 -180 288 173
7426 173 -294 -43 255 -164 -340 69 -104 -129 40 127 -97 178 19 -72 220 -65 22 458 46 -295 255
7447 255 245 -318 -217 436 29 -323 303 133 -260 -42 386 -142 -4 211 109 -129 80 -4 69 -174 -204
7468 -204 134 272 -108 -148 491 100 -245 18 498 -280 -369 491 42 -506 214 344 -232 -25 89 38 177
7489 177 85 124 -131 113 -257 -17 -44 -171 -48 455 168 -98 225 459 -311 -130 244 -210 -418 269 112
7510A12n07M52O8k20j29K77j35j06Q0J42K0R7k33P4K35l48j62M86n3m02P2K35
7532E5o66L02N30k46k83M63J89l41K07j57k60J92J61l95R8J30L2k35L18j94K40
7553A40K93l86k45O73n43m24M13L72o57n1O12j72j04Q7J91j29m5R9k54J19L9l95
7575c67N52K13m19K05L19m46j76M49k84m60K79L09m47J19L42p1RK64l44R1K51
7596C88m22k2J64q5m67N07k6l73L21L21l57j52N98l18l11K68K58m57J36K49k08
7617A2l73L97j9K03l2k04j52N44m91k15M46O7l07J99J53m26J93K95m25k25O03
7638B43k42m24M21K49n81Q9O65l18l1J18k12J46ml07m2M58l08j80K60M2m58L56
7660f0L84m66P0L21k62k32O01j66l27K03J77k34l08L71r1j02j23r8M11n9j72J75
$$ plain form
7510 112 -395 57 125 -95 -224 53 -82 -188 -108 34 54 151 -82 -8 227 -121 -283 203 150 -252 -180 55
7532 55 -611 -309 221 -25 -308 155 344 3 210 53 -207 -15 146 -249 -151 -21 11 -224 94 -100 140
7553 140 433 47 -198 475 -68 -492 -79 293 -364 -415 197 25 -79 8 199 70 25 124 -130 -11 28 -367
7575 -367 185 398 -21 184 503 57 -119 330 46 -414 -135 174 -273 -154 188 117 126 390 46 137 388
7596 388 -34 -56 108 23 -444 63 37 -336 -15 306 -51 -203 395 77 -234 34 292 -165 -29 220 12
7617 12 -361 36 17 220 188 -16 -168 376 -115 -330 116 183 -124 75 228 -198 -5 290 -135 -360 243
7638 243 1 -423 -2 247 -334 -245 420 102 71 189 -23 123 119 -188 -230 228 -80 -260 0 42 -416 -60
7660 -60 324 -142 -72 249 -13 -245 356 190 -137 66 243 9 -299 72 -19 -121 -244 -342 69 10 -162 13
7682A3M59l28m43N79j06n77M96J56l33l1L87j51m99M66M5k98M9J26n6L78r7l05
7704g0L49R3m84K18K90k52l38K28J2m77K55K88k57J38K77j56JJ86m1l01R7o6Q4
7727G4K40l76k05K99K83n35K52J06j96M7K51l47K39Q6k40l11K01L89k74j91L88
7748A80j24m7r6P9k5n9L0M2J42p7j34M02p5m66K82J27k65n23O51j3l12L95J26
7771B40k85J58j4l03QN49m99r8K54kk1J1l8j96K63k8k34K48J55l62J5M40l10l89
7795d38N61N7l94K43J00k17K58j05j92R8O6k66K07J82q8m92Q31k84k53J71p7j9
7817e1OL27j95n7J84k00j42L06k33j73M60o3n37K93J78k34j45M65l35Q7K69J06
7839C16l04K14j86j40L90k19l39K61J62m33J15M72l94k46M94j35n2P7k9j25q3
$$ plain form
7682 13 472 144 -299 280 174 -403 93 249 -84 -115 272 121 -378 88 133 -165 -116 10 -46 332 235 -70
7704 -70 279 372 -112 106 396 144 -194 34 46 -431 -176 112 -145 -7 270 114 115 301 260 -41 56 -10 74
7727 74 314 -62 -267 32 315 -220 32 138 -58 -11 240 -107 132 218 -22 -333 -132 257 -17 -208 180
7748 180 56 9 -87 -8 -33 -92 -62 -20 122 45 -89 313 238 -228 54 181 -84 -607 44 31 -281 114 240
7771 240 -45 113 99 -204 -196 353 -146 -244 10 8 -13 -2 -40 -236 27 -1 -235 13 168 -194 -179 261 -49 -438
7795 -438 123 180 -214 29 129 -88 170 65 -127 -29 37 -229 -22 160 72 -420 411 127 -126 45 -32 -51
7817 -51 -45 282 87 30 214 14 -128 178 -55 -228 232 169 -368 -75 103 -131 -276 189 -146 -59 210 316
7839 316 12 226 40 -100 290 71 -268 -7 155 -278 -163 309 -85 -331 163 28 -24 53 24 -101 -184
7860a84K96k83K21M3k7j99K02k31KK80k70j20M74o4l74M7N38k94l20M03j09k91
7882b60J82M4j57L36l57O4K23J2k89l2M05k84%K94j85k9M3L5l81J68K09m51L05
7905a05L06l65M4L49k94j67L92j46j22l5K28k95j3L40k78J00J84k08L8K06k48
7926h9j55M17K17n46R8M37m93K02R7k20j58M30n86L3P42l74n05N41R1k44j26N90
7948C99l20j92J62K30j50J49l47N8J57j18l25L89Q6o08K60L09k02j6M61k15k60
7969i3K32J8k41J65o2r5o4L69m8l53L45j11K4J2j0j60M6R7n8P6J30m23K76L29
7993D01n51j32N36k18j66K90N1j15j61M51l70j3r6K89j93K00k85j1K21l63l1N70
8015C04l90l32N91J94m34j20N13k78k93L50J61m38R1J66j36R6K22k97k26K03J11
$$ plain form
7860 -184 112 -171 50 93 66 -133 69 -162 -160 120 -150 -270 204 140 -234 -187 351 57 -263 140 31 -260
7882 -260 -78 -34 -191 145 -212 -148 75 87 -202 -234 171 -113 -113 181 -4 -33 10 45 -336 -168 41 -410 -105
7905 -105 201 -164 -120 229 -65 -232 160 14 -108 -143 85 -210 -223 117 -161 -61 123 -85 -47 159 -89
7926 -89 -244 173 390 -156 -58 379 -114 88 185 -35 -193 237 -349 -316 426 52 -453 88 179 -65 -191 399
7948 399 79 -113 49 279 129 278 -69 -11 146 28 -297 92 178 -430 -170 139 -63 -79 382 167 -93
7969 -93 139 157 -84 81 19 -76 -140 229 181 -172 173 62 86 98 88 -72 -26 71 13 89 219 -204 72 401
7993 401 -150 -282 254 36 -130 160 211 96 -65 386 16 3 -93 196 3 203 -82 -93 128 -235 -266 304
8015 304 -86 -418 173 367 -67 -187 326 48 -245 105 266 -172 -81 85 -51 45 267 -30 -256 -53 58
8036E8j10J95k68R1L07m29L7L09J25n40J26M26l48k22N72j35l47L29J49n25P0
8057a30K51j74R9L2j27K11m7j34o0L36k84j07M59k02l99M87J36p87K55N98n10
8078i7l4M26k19l14K70M16n58j6J69j5J73p7j67L21k10j53L39K50p30j8P32l04
8100A84o26M18L14n63M5O14l77l03L05K09k17J1Q9r1J46j78k23K99J18j93j35
8121a54M52m50k37O96n36j85O67m5m63L32M06n59j83M42K2m25J82J50l9k03J05
8142b5j05L21l63N6J48O0j74P6K39m04j05L11N6l84L11Or7o5J06J2j23K50j81
8165g4k27K65R9j33R4J19j24j9j26l1kL78m11K58L11m27m20Q09k87m52L77K53
8187B30p1j55R5J06
$$ plain form
8036 58 -52 143 -125 -34 273 -156 -119 190 315 -225 -99 327 -21 -243 329 194 -153 176 325 -200 -130
8057 -130 121 -53 46 78 -49 162 115 -19 -79 257 -27 -134 325 123 -276 211 347 -440 -185 413 -97
8078 -97 -131 295 76 -238 32 448 -110 -126 43 28 201 124 -43 278 68 -85 254 504 -226 -244 488 184
8100 184 -442 -24 290 -273 -228 386 9 -294 11 220 3 14 103 12 158 -20 -243 56 174 -19 -154
8121 -154 298 -152 -389 307 -229 -414 253 208 -255 77 483 -76 -259 183 205 -220 -38 112 73 -130 -25
8142 -25 -130 191 -172 -116 32 92 -82 -6 233 -171 -276 35 91 -293 18 24 -73 -138 -32 -20 -143 107 -74
8165 -74 -301 -36 63 -70 24 143 19 0 -126 -157 -159 219 -192 66 377 -50 -470 339 52 -400 -23 230
8187 230 159 4 99 205
8191B05
$$ Imaginary data points
##PAGE= N=2
##DATA TABLE= (X++(I..I)), XYDATA
0@%%%Qj6QqJ6k4K9k9M0n6O4p2R1j12J31j53J81k13K48k84L26l75M27m85N50o20
29c28P02p94Q90r94J107j235J377j529J693j877K082k304K549k822L128l469L847
46B023m278M775n346O010o801P763q956J0480j2496J5306j9496K6366l9513P3106
60D8943l03776o29189R21562M79280p67556k84993P99939K03084o44666q2135
70b59507N44758n2671m66277O5932L20769j35292j78399K03539J11089k24002
80g0061o2333J52979p879n4527J29439J8948j59340K1499J14513j30810j01263
91a48835J70764L1562k07354P6068K90461q3395k66553J18788J94015k16678j88661
102b29818K52897J58514k57514q5073K79105J9855k70805O6774K54137j66189
$$ plain form
0 0 0 0 0 8 -8 0 -8 8 -16 13 -16 24 -32 32 -40 51 -61 70 -83 98 -115 133 -151 175 -200 227 -258 292 -328
29 -328 374 -420 470 -524 583 -652 725 -804 889 -988 1094 -1210 1339 -1483 1645 -1824 2023
46 2023 -2255 2520 -2826 3184 -3617 4146 -4810 5670 -6826 8480 -11016 15350 -24163 48943
60 48943 -254833 -884022 37540 516820 -250736 -535729 264210 467294 -177372 -259507
70 -259507 285251 232580 -233697 -167765 153004 17712 -160687 42852 153941 -70061
80 -70061 -132394 20585 12706 -41821 87618 106566 -52774 -31275 83238 -47572 -148835
91 -148835 21929 53491 -153863 -77795 212666 129271 -137282 -18494 175521 -41157 -229818
102 -229818 23079 181593 -75921 -160994 118111 137966 -132839 -66065 188072 21883
112B1883k52746K20639K25759k26793j42112K29615L1425k56026L7702K56638
122A45984p5048k16913J15890J79490j33956j23698J54404O5965j88596m4918
132a21396J83815K0211j41126M0270J08807r8625q8346J21777N0979j24345l947
143e1926J10925l6367p7247P8523M8707j03626l2878R1608N706o5099L8715N6471
155F3512p0550n7633P5198L6427q2751n914R4258k5908r6382O6971J01749r1176
167G801q7660R5234L3886j12357K4585J36879o0234j42776P4183J18744r0280
178a995q4997J12150O2602j27525m8798J36478M4182j25314l0935R9492q490q8594
190f1744M4300Q3065n7588o0089N7324K1369n2716K0062M6446m8710l5774N7234
$$ plain form
112 21883 -230863 -10224 215535 -11258 -153370 76245 107670 -148356 -110654 145984
122 145984 70936 -145977 -30087 149403 15447 -108251 46153 112118 -76478 -121396
132 -121396 62419 82630 -58496 -18226 90581 -8044 -96390 25387 76366 -47979 -51926
143 -51926 58999 22632 -54615 23908 72615 -31011 -63889 27719 33425 -31674 7041 63512
155 63512 -7038 -64671 10527 46954 -35797 -41711 52547 26639 -69743 -2772 98977 7801
167 7801 -79859 15375 49261 -63096 -38511 98368 38134 -104642 -30459 88285 -1995
178 -1995 -86992 25158 87760 -39765 -88563 47915 92097 -33217 -64152 35340 26850 -61744
190 -61744 -17444 65621 8033 -52056 5268 26637 -26079 -6017 40429 -8281 -44055 13179
202A3179J3948n4246J4418N1240l7229m9253M7926M3827n2334k9136O0909J0450
214C3699p7856M243Q9859j9514r0286M0081P9183o2885n7229Q5189L2302r9391
226d2605j0466R7695q346q0410K8011O0147m6436m7227N7807M0518n9141l0976
238d1429N8667J5489o1092J848O2908k0951o1502L8595N5537m4376l3625M7643
250A7712M847n1674J2829M2884k4268k5948L2574J2050l2710J295K9585j1690
262G486l0809J6314L1787j7294k6861K5772K3058l8275k0867L9235O693l9236
274b2997J4634L9858k8001k6675M1517J3706m7800l957L8410j3520l2854K2676
286e003L0298k2820k6211K1491K5120j8595j9809K2047J3490l0018p809L4361
$$ plain form
202 13179 27127 -27119 -12701 38539 1310 -47943 -17 43810 -8524 -37660 23249 33699
214 33699 -44157 -39914 49945 30431 -59855 -19774 59409 -3476 -60705 24484 56786 -42605
226 -42605 -53071 44624 36278 -44132 -16121 44026 -2410 -49637 8170 48688 -10453 -41429
238 -41429 17238 32727 -28365 -26517 36391 15440 -46062 -7467 48070 3694 -29931 17712
250 17712 22559 -29115 -16286 26598 2330 -23618 8956 21006 -11704 -10409 19176 7486
262 7486 -23323 -7009 24778 7484 -19377 6395 29453 -8822 -29689 9546 16239 -22997
274 -22997 -8363 31495 3494 -23181 18336 32042 -15758 -19715 18695 5175 -27679 -5003
286 -5003 25295 2475 -23736 -2245 22875 4280 -15529 6518 20008 -10010 -17819 16542
298A6542m46l3029R185K3624j8220j0188K6235R06k4495M944J4262j2415r941
311a3036O879O59l386M318O721M129P20j939K663n94j1536l075P164n147k967
326h427J3634j028j5379J0326J3789j8886r914K0329O11j9730O954J8546o214
339D611j2657K320R009L688o201m577R831L133j5569l219J2553n782j1612J0524
353c948Q165n489M854P029q730l150N496n924p247M215L98m16P314o14n442O521
369C032K491q442M174P500q995l881R527j426q284K846L31m404L469K517j885
384a430O139J473r723L110Q860q583o893Q881J622m569O156K695o511J742R23
399C892p685K176N894p439k419R979o56n764L520l02n179M048L297l468M062K952
$$ plain form
298 16542 16096 -16933 -7748 15876 -2344 -12532 13703 14609 -9886 -4942 9320 -3095 -13036
311 -13036 -6157 -5498 -8884 -4566 2155 6284 7004 5065 7728 7134 -4402 -7477 -313 -5460 -8427
326 -8427 5207 4179 -11200 -874 12915 -5971 -15885 4444 5055 -14675 -7721 10825 4611
339 4611 -8046 -5726 3283 6971 770 -3807 6024 9157 -6412 -9631 2922 -2860 -14472 -3948
353 -3948 4217 -1272 3582 10611 1881 -1269 4227 -1697 -8944 -4729 -4331 -4747 2567 1953 -3489 3032
369 3032 5523 -2919 1255 8755 -240 -4121 5406 3980 -4304 -1458 -1127 -5531 -2062 455 -1430
384 -1430 4709 6182 -3541 -431 8429 -154 -7047 1834 3456 -1113 5043 7738 1227 2969 3892
399 3892 -3793 -1617 4277 -3162 -5581 4398 3742 -2022 1498 1196 -3983 65 3362 -106 3956 6908
415F908o305J503M303r937m330R542k338p804R351N540r475R82Q784m018n965
430c259K833K303M91l65l056K770L317j1178m556J4557L59j6084O559J5743r417
445A017p980J1983R80j2023J332O263k027n17J997K80J137j359l643K360j045
460a245q019M781R500p494l919J1894o40j0899O004M862j1939K9J0917m872n330
475f370R405j26r150L610P368l673l406L472L175j220n396o65O500n579j1188
490a3243J1215J3082j4645o945K0922L1k1845P382J7631j4792j1904J8437P103
503A2429j6491k000J4804q05j3940L47J3746j016j6550L420J7825r299j9119J5481
517a168J5604j9776n339K3891l103k1788J1212J5436j6811p216J7365j21j5346
$$ plain form
415 6908 603 2106 6409 -3528 -7858 1684 -654 -8458 893 6433 -3042 -2060 6724 2706 -3259
430 -3259 -426 1877 2368 2003 -1053 1717 5034 -6144 -10700 3857 4216 -11868 -5309 10434 1017
445 1017 -6963 5020 6000 -6023 -4691 1572 -455 -972 1025 1305 2442 1083 -2560 -200 -1245
460 -1245 -9264 -4483 5017 -2477 -6396 5498 4858 -6041 -37 4825 -7114 -7085 3832 -1040 -6370
475 -6370 3035 2909 -6241 -2631 4737 1064 -2342 1130 4305 3085 -2311 -2976 3524 -2055 -13243
490 -13243 -2028 11054 -3591 -10536 10386 10417 -11428 -4046 13585 -1207 -13111 5326 12429
503 12429 -4062 -6062 8742 7937 -6003 -5656 8090 7074 -9476 -6056 11769 2470 -16649 -1168
517 -1168 14436 -5340 -10679 13212 10109 -11679 -467 14969 -1842 -9058 8307 8186 -7160
530g160N606J2331r156j1920P861J0309q801q438J2748Q397j6266l660K0968n436
544G383k3728J4020K1231k1792j2038K7978M45l0465Q999K5907j7556j8309K2879
557D954J0563k4581k831K6183k319k8779M198K8581r307k7863J8269K7390k7821
570c363k3352L5191J2732m0261K196M1586j6359l5380K9190K5043l7855j4440
582b5072L8416l57l7667J2347L7122j7524l1618K5134K4610l3931j8622M2803
594A5641R557n0734K915N4383j8042n1980L3771M1290m9115k6246O0185J2053
606C3678n9453N839N2660k4038m6025L3990L5248m1025k3008M7714J3511m8950
618a9859r64M9758j3976m9942K8064M3730m0845l0293N1633J1672n8367Q216N5210
$$ plain form
530 -7160 -1554 10777 1621 -10299 -2438 7871 -930 -9368 3380 11777 -4489 -8149 12819 7383
544 7383 -16345 -2325 18906 -2886 -14924 13054 13499 -16966 -7967 17940 384 -17925 4954
557 4954 15517 -9064 -11895 14288 11969 -16810 -12612 15969 6662 -21201 -2932 24458 -3363
570 -3363 -26715 8476 21208 -19053 -16857 24729 8370 -27010 2180 27223 -10632 -25072
582 -25072 13344 12987 -24680 -12333 24789 7265 -24353 781 25391 -8540 -27162 15641
594 15641 25198 -25536 -22621 31762 13720 -38260 -4489 36801 -12314 -38560 21625 33678
606 33678 -25775 -19936 32724 8686 -37339 -3349 31899 -9126 -32134 15580 29091 -19859
618 -19859 -20823 28935 14959 -34983 -6919 36811 -4034 -34327 17306 28978 -29389 -21173 34037
631C4037k7482m4680M5219L1461n3276j3265N6061n037n5778J7956N0051l0495
643D772m1214M2392L1614n1831j7942O0493J514o6611J7152O4377l7841n3895
655d7020N8622L8000p4068j8194P8975n185p5621K9438O6598m9323n4177O3418
667A1463L9706p1858k3665P4549M954p6171J5385P7564l3450p1842N0251N7557
679E4443o7138l8402P8695J5920q2721O651P7604k6529o3936M1031M4627n0605
691a0360k5424N2836Q514m8937P893M1802k2269l2536L6645K3362m6774j1407
703b6655N3417o329n6842K4493N1654m4760m1623O0947K5171o9063k801P1024
715C8633k0316o5852M0595N6757n4684m3413O3719K8295o9901j3206P4319j529
$$ plain form
631 34037 6555 -38125 7094 38555 -14721 -27986 28075 23038 -32740 -14784 35267 4772
643 4772 -36442 5950 37564 -14267 -32209 28284 29798 -36813 -19661 44716 6875 -47020
655 -47020 11602 49602 -24466 -42660 36315 31130 -44491 -15053 51545 2222 -51955 11463
667 11463 51169 -20689 -44354 30195 35149 -41022 -25637 51927 18477 -53365 -3114 54443
679 54443 -12695 -51097 27598 43518 -39203 -32552 45052 18523 -45413 -4382 40245 -10360
691 -10360 -35784 17052 25566 -23371 -15478 26324 4055 -28481 8164 31526 -15248 -26655
703 -26655 26762 20433 -36409 -11916 39738 -5022 -46645 14302 39473 -29590 -32391 38633
715 38633 18317 -47535 -6940 49817 -4867 -48280 15439 43734 -26167 -39373 34946 33417
727C3417p5033J5818P1435l1429o2677M6898M7290o0846k9377O8026Q909o7152
739c4721J2561O0182k8714m6277L9852L0279m3634j2779M3184k027l9143J4490
751f747L1847k7001k4727L6956J4641m5645l561M9998j1364m8730L0044M4216
763C9927m5759l2867N6581J6773o0506L131N8243k1738n1943L5604M2310m3641
775c885k8900M8189J4312n2399k028N4369r173n3811K0498M6536l4564l7177M9256
788A1223K5796n7086r367O0578p455n5668K4656M5583l8049l4225M3552K0643
800C0181m4551p814M1858m727l9736J2522L5076j9948k8731K8278K1847l3217
812h962j0188L6826l411l6685J7825L0959l0536k0372L9296N990m3490P331M1235
$$ plain form
727 33417 -41616 -25798 45637 14208 -48469 -1571 45719 -15127 -44504 23522 32431 -34721
739 -34721 -22160 38022 9308 -36969 2883 33162 -10472 -23251 19933 17906 -21237 -6747
751 -6747 25100 -1901 -26628 10328 24969 -20676 -24237 25761 14397 -34333 -4289 39927
763 39927 -5832 -38699 17882 34655 -25851 -22720 35523 13785 -38158 -2554 39756 -3885
775 -3885 -32785 15404 29716 -22683 -24711 29658 20485 -33326 -12828 33708 -856 -38033 11223
788 11223 37019 -20067 -29434 31144 23689 -31979 -7323 38260 211 -34014 9538 30181
800 30181 -14370 -22184 19674 14947 -24789 -12267 22809 2861 -25870 2408 24255 -8962
812 -8962 -19150 17676 14265 -22420 -4595 26364 -4172 -24544 14752 20742 -22748 -15417 25818
825B5818j9327l5767K6569K8008k9708j8647L1674J0172l3750l325L3533m501
837A0749l0551J5374K7500k5712k0148L4709R288m1090K823M1211j5994l5464
849b7305K7520K6789l4741j7496L6013P064l4480J968L2077p936k8049J2795K4759
862A8978j8353k1350K2577J5271k5960m734L0272n819k9882J4966K3635k4335
874d734j3911L0237L583l0961N740K8378j2721k2564J5153J5902j7184j0097J9738
887F559P916j9313m738J8005k338j7790J0271J6244j7628j0904K4208L051k7529
900a3986O284K6209j6451k2307K3764J7499k4669j0099K3738L186k3254j543K0028
913H399n89j7508L141J7032n082j3856R035R026j3724m055J5886k618j4190J0340
$$ plain form
825 25818 6491 -29276 -2707 25301 -4407 -23054 8620 18792 -14958 -18283 15250 10749
837 10749 -19802 -4428 23072 -2640 -22788 11921 21209 -19881 -17058 24153 8159 -27305
849 -27305 215 27004 -7737 -25233 10780 17844 -16636 -14668 17409 9473 -18576 -5781 18978
862 18978 625 -20725 1852 17123 -8837 -13571 16701 10882 -19000 -4034 19601 -4734
874 -4734 -18645 11592 15175 -15786 -10046 18332 5611 -16953 -1800 14102 -3082 -13179 6559
887 6559 14475 -4838 -9576 8429 6091 -11699 -1428 14816 -2812 -13716 10492 13543 -13986
900 -13986 -7702 18507 2056 -20251 3513 21012 -3657 -13756 9982 13168 -10086 -11629 8399
913 8399 7810 -9698 -6557 10475 5393 -8463 572 9598 -4126 -8181 7705 5087 -9103 1237
927A237J0624j6152n296J7828j460j6633N433J3056o798q140P086M185p660l735
941f425O492L588n208j181P869j805r346O199Q792j1931p477J4721J851j5376
955i237N023J4587r376j2135R553O627q471j906P309J029m040j073M027K179m296
970b00k469M488p63o118L959M907p839l048Q886j380p655O553O673p084j892O540
986C558j127l731K073o65k295K177P67j305J839L27k160J007q3k629K623J121
1002A497o054J25P275j585m480M857K182m334Q13K365j663J653j13o259J234O727
1018D240m381n039O880L161o287n06N474R46l084l022k80L439j272o228L486P757
1034E284n200n330Q270L100p246J385N102l470k404K648q56j363J762j846j618
$$ plain form
927 1237 11861 -4291 -9587 8241 6781 -9852 -4419 8637 1839 -6301 785 4970 -2690 -6425
941 -6425 67 3655 -1553 -2734 5135 3330 -6016 183 8975 -2956 -10433 4288 6139 -9237
955 -9237 -4214 10373 997 -11138 -1585 5042 -3429 -5335 1974 3003 -1037 -2110 1917 4096 -200
970 -200 -2669 1819 1056 -5062 -1103 3804 -4035 -7083 1803 423 -7232 -679 5994 -1090 -2982 3558
986 3558 2431 -1300 773 108 -2187 -10 757 -548 1291 1618 -542 465 382 -2247 376 1497
1002 1497 -4557 -4432 2843 1258 -3222 1635 3817 -517 296 2661 998 2651 2538 -3721 -2487 4240
1018 4240 -141 -5180 1700 4861 -1426 -1932 3542 4488 1404 -1618 -1898 1541 269 -5959 -2473 5284
1034 5284 84 -5246 3024 6124 -1122 263 5365 1895 -509 2139 1283 -80 1682 -164 -1782
1049a782K303j466k772L846O55m444K992M146l744j513M180r3j324J462j663o26
1065A57K908l928m457N801K247q849O47Q807k574n541N749L593m731j843K017
1080CQ08N8k107p92K961o03l954K830K896m777M60N867m802m269Q569J222r851
1097e481K233R015n311p014O329M964m851l492K517L470j633m937J217O307l089
1112B44n753N934L777p297N46P264l775m395O671N02p817K030N602l648l451K953
1128f13J085j597L70J76K008J603l019o38L571j290l049L386j64m870K306K332
1144A597n690J678P872m480n423Q065L278q275j55P537j760o835M19M133j88m146
1160b373j269M860J300p213J518Q627l712o055P820K912r843J668R226n934o774
$$ plain form
1049 -1782 521 -945 -3717 129 784 -3660 -668 3478 -266 -1779 2401 2308 984 2446 783 157
1065 157 3065 -863 -5320 481 2728 -6121 -5474 3333 759 -4782 967 4560 -171 -2014 3
1080 3 811 869 -1238 -2030 931 328 -3626 -796 2100 -2677 -2217 3650 -1152 -5421 3148 4370 -5481
1097 -5481 -3248 5767 456 -6558 -229 4735 -116 -3608 -1091 2379 746 -4191 -2974 3333 244
1112 244 -5509 425 4202 -3095 -2549 4715 940 -3455 3216 3718 -4099 -2069 3533 -115 -3566 -613
1128 -613 472 -1125 -755 -579 1429 3032 13 -625 2946 1656 -1393 1993 1829 -3041 -735 1597
1144 1597 -4093 -2415 5457 977 -4446 3619 6897 -1378 -1533 6004 4244 -2591 -2172 1961 1773 -2373
1160 -2373 -3642 1218 2518 -4695 -3177 5450 1738 -4317 3503 6415 -3428 -1760 7466 1532 -5242
1175e242Q506L002r734j118P724j216o418Q56M998j01m832J047P405j016p293
1190c432L766N436p824l069R544k033r233O765N884j0635n96J2601l847j0845
1204g518P620Q177j1244n812J1194L333j1991k480J2381K154j2684J337J5801
1217A0268m172j6646Q128J4048j4689j0951J8588M552k0261L481J9342q160j4767
1230a1239J2125R736j4070m968J2815M00j2053J909J0702m137r032P218Q995j0241
1244a840n010J4890M07j8388N350J7546j3767j4930K0342R719k4298k096K5837
1257A3762m831k3646J0262J9783j3824j5400J5450J1616j5525p746J6229L901
1269A0031j7010N31J6765p058j5097J3645R927j9359k900K2269n096k1120J4221
$$ plain form
1175 -5242 3264 6266 -3468 -4586 3138 1922 -4496 -3640 1358 1257 -3575 -2528 4877 3861 -3432
1190 -3432 334 5770 -2054 -5123 4421 2388 -6845 -80 5804 -4831 -5427 7174 3327 -7518
1204 -7518 102 8279 -2965 -8777 2417 5750 -6241 -8721 3660 5814 -6870 -5533 10268
1217 10268 6096 -10550 -2422 11626 -3063 -14014 4574 9126 -11135 -7654 11688 3528 -11239
1230 -11239 886 10622 -3448 -8416 4399 4799 -7254 -5345 5357 1220 -7812 -594 8401 -1840
1244 -1840 -6850 8040 8447 -9941 -4591 12955 -812 -15742 4600 14319 -9979 -12075 13762
1257 13762 8931 -14715 -4453 15330 1506 -13894 1556 13172 -2353 -10099 6130 10031
1269 10031 -6979 -6448 10317 3259 -11838 1807 11734 -7625 -10525 11744 6648 -14472 -251
1282b51J7963j9991j1097K2835L497k3889K370K1075p781j8496J1842J6103j4734
1295e54j2333J9161Q221k3867l830K5929k876k6623J1152K4724j9057j8750K5144
1308F441J1625k6984k973K5125n026k1469J0073J5594j3702j1654J4414O088j4882
1321g330q60J7035k970j6509Q764J5978j5167j3432K1306P353k6344r67K7020
1334A3877p186k4766J4288J9575j9309j2224K1225O934j9367j44J7101m425j5733
1347a0154P190J1944j0728j0380J4149O602j6733r26J9740n137j9189J2907J5354
1360A4639j8644r128K2429Q38k2488O863J8796j3586j3838J7650Q157j9336k808
1373a0456K0279j753k0601O241K0678j1096k0084J6577J9068k1794j4144K6711
$$ plain form
1282 -251 17712 -2279 -13376 9459 12956 -10933 -8563 12512 4731 -13765 -1923 14180 -554
1295 -554 -12887 6274 14495 -9372 -13202 12727 9851 -16772 -5620 19104 47 -18703 6441
1308 6441 18066 -8918 -11891 13234 8208 -13261 -3188 12406 -1296 -12950 1464 7552 -7330
1321 -7330 -8190 8845 5875 -10634 -1870 14108 -1059 -14491 6815 14168 -12176 -13143 13877
1334 13877 6691 -18075 -3787 15788 -3521 -15745 5480 12414 -6953 -7097 10004 5579 -10154
1347 -10154 -2964 8980 -1748 -12128 2021 8623 -8110 -9036 10704 5567 -13622 -715 14639
1360 14639 -4005 -13133 9296 10134 -12354 -5491 13305 -281 -14119 3531 11688 -7648 -10456
1373 -10456 9823 8070 -12531 -6290 14388 3292 -16792 -215 18853 -2941 -17085 9626
1385I626P097k9901L26K8404q839k3935J5481J7930j8566j0088K0622L855j8888
1398f876J147J5935n657j4546Q002J2058j1680r784J4867O255j7009J59J8829
1411A1700o396j7367J3011J2718j8461n574K1052k244j9956R412J7477j4367j3069
1424a2064J6364O522j8754m230J8631K2j8948M087K0477p042j7909J3910J6881
1437A7947j8428j1952K2054L595k4992K745K1532j1084j7499J5881J1522j6988
1449e667m066J8001o48j6083L986J3308p427j1921R775R104j1921n947J5211K490
1463H195j6485L699J6527j0401j4138J5671P984j9471j290K0114o050j7660J2336
1476i69J3970j5885r954J7093M411j7838j290J8108j232j7202N557J8416q200
$$ plain form
1385 9626 16723 -13178 -12852 15552 6713 -17222 -1741 16189 -2377 -12465 8157 12012 -6876
1398 -6876 -5729 10206 4549 -9997 -1995 10063 -1617 -11401 3466 9721 -7288 -7129 11700
1411 11700 5304 -12063 948 13666 -4795 -10369 10683 8439 -11517 -2105 15372 1005 -12064
1424 -12064 4300 10822 -7932 -12162 6469 6491 -12457 -8370 12107 5065 -12844 1066 17947
1437 17947 -481 -12433 9621 13216 -11776 -9031 12501 1417 -16082 -201 11321 -5667
1449 -5667 -9733 8268 7620 -8463 -4477 8831 1404 -10517 -742 8362 -3559 -9506 5705 8195
1463 8195 -8290 -4591 11936 1535 -12603 3068 11052 -8419 -9709 10405 4355 -13305 -969
1476 -969 13001 -2884 -12838 4255 8666 -9172 -10462 7646 6414 -10788 -5231 13185 4985
1489D985j6163J3593J2691j8583q785J9998P28k0846N650J7154j1566j1593J5854
1502C117O771j5680r20J5027k970j2992N568J0442p727r083R936P883j1339m512
1516f479J4045K3j6099M175J4717j0809j1812J5033O356j6681R11J7142n502j3322
1530h302R806R125j1965n969J2432J945j3234o15J2526j754j2503N084J3845q072
1544B349j2033J2852R038j6266m937J7211j795j6522P023J3556j0810r139J2439
1557B966M698j1561j405J0398j185q612K441P739l319p602M725O209p689m254
1571f451J0390J140j1521L565J0747q328q192J2019L484j3133P26J2612m086j0246
1585g274O251P271p307o118P079N361o512m705P323L786q781j835R360j149r042
$$ plain form
1489 4985 -11178 2415 15106 -3477 -12262 7736 8464 -12382 -6732 10422 -1144 -12737 3117
1502 3117 9888 -5792 -6712 8315 5345 -7647 -2079 8363 636 -8447 1489 9372 -1967 -6479
1516 -6479 7566 7589 -8510 -4335 10382 -427 -12239 2794 9150 -7531 -6620 10522 5020 -8302
1530 -8302 1504 10629 -1336 -7305 5127 7072 -6162 -6777 5749 3995 -8508 -3424 10421 2349
1544 2349 -9684 3168 12206 -4060 -8997 8214 6419 -10103 -3080 10476 -334 -9473 2966
1557 2966 7664 -3897 -5302 5096 3911 -4701 -2260 5479 2160 -5442 -717 5492 -2197 -6451
1571 -6451 3939 5079 -6442 -2877 7870 -458 -8650 3369 6853 -6280 -5554 7058 2972 -7274
1585 -7274 -1023 6248 -1059 -7177 -98 5263 -1249 -5954 1369 5155 -3626 -5461 3899 2750 -6292
1600f292M880P005p736k712R136j513q656N265N644o835k804P338M20o392N63
1615b689N069q59m689L11N066l92n354K424N576m838m475O703K206p812J961P071
$$ plain form
1600 -6292 -1412 5593 -2143 -4855 4281 2768 -5888 -623 5021 -1814 -4618 2720 3140 -3252 -2689
1615 -2689 2380 1521 -3168 -2857 2209 1817 -3537 -1113 4463 -375 -4850 1853 4059 -3753 -1792 5279
$$ [...]
8191D3
##END NTUPLES=NMR FID
##END=
