##TITLE=1H_CA-8647-3
 CDCl3, 8 sc, 
 19.9.2019
##JCAMPDX= 6.0         $$ Bruker NMR JCAMP-DX V2.0
##DATA TYPE= NMR FID
##DATA CLASS= NTUPLES
##ORIGIN= UXNMR, Bruker Analytische Messtechnik GmbH
##OWNER= root
$$ XWIN-NMR		Version 3.5
$$ Thu Sep 19 14:22:44 2019 Russian Standard Time (UT+4h)  she@DPX200
##.OBSERVE FREQUENCY= 200.1315
##.OBSERVE NUCLEUS= ^1H
##.DELAY= (6, 6)
##.ACQUISITION MODE= SIMULTANEOUS
##.ACQUISITION SCHEME= undefined
##.AVERAGES= 8
##.DIGITISER RES= 18
##SPECTROMETER/DATA SYSTEM= spect
##.PULSE SEQUENCE= zg30
##.SOLVENT NAME= CDCl3
##.SHIFT REFERENCE= (INTERNAL, CDCl3, 0, 15.7039)
##AUDIT TRAIL= $$ (NUMBER, WHEN, WHO, WHERE, WHAT)
$$ ##TITLE= Audit trail, XWIN-NMR		Version 3.5
$$ ##JCAMPDX= 5.01
$$ ##ORIGIN= Bruker BioSpin GmbH
$$ ##OWNER= she
$$ F:/spectra/data/she/nmr/H-F/1/audita.txt
$$ ##AUDIT TRAIL=  $$ (NUMBER, WHEN, WHO, WHERE, WHAT)
(   1,<2019-09-19 14:21:53.28 +0400>,<she>,<DPX200>,
      <created by zg, POWCHK disabled, PULCHK disabled
       configuration hash MD5:
       00 E9 B6 7A A2 85 ED C7 34 08 36 98 17 FE 4E 26
       data hash MD5: 16K
       12 6B 02 88 21 D0 41 DC 94 D2 34 DA C6 EA 1C C5>)
$$ ##END=
$$ 
$$ hash MD5
$$ 73 C2 8C FD A4 43 BA 75 7B F3 96 A5 8E 69 E1 36
##$RELAX= 
##$RELAX= 
##$RELAX= 
##$RELAX= 
##$RELAX= 
##$RELAX= 
$$ Bruker specific parameters
$$ --------------------------
##$DU= <F:/spectra>
##$EXPNO= 1
##$NAME= <H-F>
##$PROCNO= 1
##$TYPE= <nmr>
##$USER= <she>
##$AMP= (0..31)
100 100 100 100 100 100 100 100 100 100 100 100 100 100 100 100 100 100 
100 100 100 100 100 100 100 100 100 100 100 100 100 100 
##$AQSEQ= 0
##$AQ_mod= 1
##$AUNM= <au_zg>
##$AUTOPOS= <>
##$BF1= 200.13
##$BF2= 200.13
##$BF3= 200.13
##$BF4= 200.13
##$BF5= 200.13
##$BF6= 200.13
##$BF7= 200.13
##$BF8= 200.13
##$BYTORDA= 1
##$CFDGTYP= 0
##$CFRGTYP= 5
##$CHEMSTR= <none>
##$CNST= (0..31)
1 1 145 1 1 1 1 1 1 1 1 1 1 1 1 1 1 1 1 1 1 1 1 1 1 1 1 1 1 1 1 1 
##$CPDPRG= <>
##$CPDPRG1= <>
##$CPDPRG2= <>
##$CPDPRG3= <>
##$CPDPRG4= <mlev>
##$CPDPRG5= <mlev>
##$CPDPRG6= <mlev>
##$CPDPRG7= <mlev>
##$CPDPRG8= <mlev>
##$CPDPRGB= <>
##$CPDPRGT= <>
##$D= (0..31)
0 1.2 0 0 0 0 0 0 0 0.06 0 0.03 0 0 0 0 0.0002 0 0 0 0 0 0 0 0 0 0 0 0 
0 0 0 
##$DATE= 1568888512
##$DBL= (0..7)
120 120 120 120 120 120 120 120 
##$DBP= (0..7)
150 150 150 150 150 150 150 150 
##$DBP07= 0
##$DBPNAM0= <>
##$DBPNAM1= <>
##$DBPNAM2= <>
##$DBPNAM3= <>
##$DBPNAM4= <>
##$DBPNAM5= <>
##$DBPNAM6= <>
##$DBPNAM7= <>
##$DBPOAL= (0..7)
0.5 0.5 0.5 0.5 0.5 0.5 0.5 0.5 
##$DBPOFFS= (0..7)
0 0 0 0 0 0 0 0 
##$DE= 6
##$DECBNUC= <off>
##$DECIM= 24
##$DECNUC= <off>
##$DECSTAT= 4
##$DIGMOD= 1
##$DIGTYP= 9
##$DL= (0..7)
0 120 120 120 120 120 120 120 
##$DP= (0..7)
150 150 150 150 150 150 150 150 
##$DP07= 0
##$DPNAME0= <>
##$DPNAME1= <>
##$DPNAME2= <>
##$DPNAME3= <>
##$DPNAME4= <>
##$DPNAME5= <>
##$DPNAME6= <>
##$DPNAME7= <>
##$DPOAL= (0..7)
0.5 0.5 0.5 0.5 0.5 0.5 0.5 0.5 
##$DPOFFS= (0..7)
0 0 0 0 0 0 0 0 
##$DQDMODE= 0
##$DR= 18
##$DS= 0
##$DSLIST= <SSSSSSSSSSSSSSS>
$$ [...]
##$SUBNAM2= <"">
##$SUBNAM3= <"">
##$SUBNAM4= <"">
##$SUBNAM5= <"">
##$SUBNAM6= <"">
##$SUBNAM7= <"">
##$SUBNAM8= <"">
##$SUBNAM9= <"">
##$SW= 24.0689530833862
##$SWIBOX= (0..15)
0 0 2 0 0 0 0 0 0 0 0 0 0 0 0 0 
##$SW_h= 4816.95568400771
##$TD= 16384
##$TD0= 1
##$TE= 0
##$TE2= 300
##$TE3= 300
##$TEG= 300
##$TL= (0..7)
0 120 120 120 120 120 120 120 
##$TP= (0..7)
150 150 150 150 150 150 150 150 
##$TP07= 0
##$TPNAME0= <>
##$TPNAME1= <>
##$TPNAME2= <>
##$TPNAME3= <>
##$TPNAME4= <>
##$TPNAME5= <>
##$TPNAME6= <>
##$TPNAME7= <>
##$TPOAL= (0..7)
0.5 0.5 0.5 0.5 0.5 0.5 0.5 0.5 
##$TPOFFS= (0..7)
0 0 0 0 0 0 0 0 
##$TUNHIN= 0
##$TUNHOUT= 0
##$TUNXOUT= 0
##$USERA1= <user>
##$USERA2= <user>
##$USERA3= <user>
##$USERA4= <user>
##$USERA5= <user>
##$V9= 5
##$VALIST= <valist>
##$VCLIST= <CCCCCCCCCCCCCCC>
##$VD= 0
##$VDLIST= <DDDDDDDDDDDDDDD>
##$VPLIST= <PPPPPPPPPPPPPPP>
##$VTLIST= <TTTTTTTTTTTTTTT>
##$WBST= 1024
##$WBSW= 4
##$XGAIN= (0..3)
0 0 0 0 
##$XL= 0
##$YL= 0
##$YMAX_a= 508031
##$YMIN_a= -466911
##$ZGOPTNS= <>
##$ZL1= 120
##$ZL2= 120
##$ZL3= 120
##$ZL4= 120
##$ABSF1= 10
##$ABSF2= 0
##$ABSG= 5
##$ABSL= 3
##$ALPHA= 0
##$AQORDER= 0
##$ASSFAC= 0
##$ASSFACI= 0
##$ASSFACX= 0
##$ASSWID= 0
##$AUNMP= <proc_1d>
##$AZFE= 0.1
##$AZFW= 0.1
##$BCFW= 1
##$BC_mod= 2
##$BYTORDP= 1
##$COROFFS= 0
##$CY= 11.3945322036743
##$DATMOD= 1
##$DC= 2
##$DFILT= <>
##$DTYPP= 0
##$F1P= 20.1720416913024
##$F2P= 0.152960286110954
##$FCOR= 0.5
##$FTSIZE= 0
##$FT_mod= 4
##$GAMMA= 1
##$GB= 0.15
##$INTBC= 1
##$INTSCL= 1
##$ISEN= 128
##$LB= 0.24
##$LEV0= 0
##$LPBIN= 0
##$MAXI= 10000
##$MC2= 0
##$MEAN= 0
##$ME_mod= 0
##$MI= 1.114404
##$NCOEF= 0
##$NC_proc= 0
##$NLEV= 6
##$NOISF1= 3.799351
##$NOISF2= 2.8
##$NSP= 1
##$NTH_PI= 0
##$NZP= 0
##$OFFSET= 15.70392
##$PC= 1
##$PHC0= -9737.091
##$PHC1= 22.80096
##$PH_mod= 1
##$PKNL= yes
##$PPARMOD= 0
##$PSCAL= 0
##$PSIGN= 0
##$REVERSE= no
##$SF= 200.130013532006
##$SI= 16384
##$SIGF1= 3
##$SIGF2= 2
##$SINO= 400
##$SIOLD= 16384
##$SREGLST= <1H.CDCl3>
##$SSB= 0
##$STSI= 0
##$STSR= 0
##$SW_p= 3612.71676300578
##$SYMM= 0
##$S_DEV= 0
##$TDeff= 0
##$TDoff= 0
##$TI= <>
##$TILT= no
##$TM1= 0
##$TM2= 0
##$TOPLEV= 0
##$USERP1= <user>
##$USERP2= <user>
##$USERP3= <user>
##$USERP4= <user>
##$USERP5= <user>
##$WDW= 1
##$XDIM= 8192
##$YMAX_p= 0
##$YMIN_p= 0
$$ End of Bruker specific parameters
$$ ---------------------------------
##NTUPLES= NMR FID
##VAR_NAME=  TIME,          FID/REAL,        FID/IMAG
##SYMBOL=    X,             R,               I
##VAR_TYPE=  INDEPENDENT,   DEPENDENT,       DEPENDENT
##VAR_FORM=  AFFN,          ASDF,            ASDF
##VAR_DIM=   8192,          8192,            8192
##UNITS=     SECONDS,       ARBITRARY UNITS, ARBITRARY UNITS
##FACTOR=    0.0002076,     1,               1
##FIRST=     0,             0,               0
##LAST=      1.7004516,     0,               0
##MIN=       0,             -466911,         0
##MAX=       1.7004516,     508031,          0
$$ Real data points
##PAGE= N=1
##DATA TABLE= (X++(R..R)), XYDATA
$$ [...]
2622b383L468J158l939l4L425n73k487O77K257o07k191M15K242q56k222J560K024
2639A934k360r58K981j71k773J595J860k712j125K778m07k842J627K018j556r92
2655a103K000R57j798p04J595M63k385p52K757J2l387J277L757k540k801L834
2671A182J694m530l70M394j492l900K165K998k345j902K643J654k451j303K390
2686H27J113l161q74L477n32l737J796L471k811k289M150P54m176R56L783k375
2702C72l007K964J738l428q19L001O26k919k51L279L1l607O97L820j678l591K838
2719F6K570l832j310M362p37l935K449K761l644j006M058j58l817J344L587j911
2735H47l449K506L525l413l649L963L403n286k623O344J378o870N52O714k027
$$ y = [-2383, 1085, 2243, -1696, -1730, 1695, 1122, -1365, -688, 1569, 962, -1229, -814, 1428, 572, -1650, -90, 1934, -426, -1384, 1597, 1426, -1347, 248, 2108, -604, -1729, 1049, 642, -2200, -573, 1445, -111, -1103, 897, 1854, 56, -648, 947, 1410, -975, -1727, 1030, 1042, -2345, -1068, 2689, 149, -2652, 1182, 2876, -1654, -2024, 2370, 878, -3022, -857, 2141, -204, -2106, 537, 2191, -260, -1563, 827, 1940, -1221, -2095, 1382, 850, -2887, -1091, 2380, -431, -2720, 1430, 2184, -1992, -1036, 2747, 372, -2635, 329, 2067, -1361, -2180, 821, 1447, -1472, -1723, 1556, 1587, -2020, -1323, 2497, 819, -2772, 66, 2636, -1196, -2506, 1856, 1119, -2816, -367, 2394, -1250, -2256, 1802, 1644, -2173, -829, 2758, 847, -2602, -96, 3429, 16, -3633, 330, 3733, -1553, -4176, 2168, 3546, -3324, -2772, 3942, 1915]
2750A915n725L508M070l805k547L891Q74l064m17K415l86j946P66J608j399j183
2766a425K268N76k985P78L827k311l773M195K722n577j447O052m76o136J934N359
2782C581k925m510L547L618l571k683L768K287l865j763M528Q41m954O20M682
2797C201k399m281L787K600n109q02N331j272m523K723M000l291k638L894J786
2812C007l775j343L467Q24m049o99M283m90m145J689M098k833k559L840Q02m152
2828b035J122L205k879k141L668O95m161P91M254j715l582K386L606k831l509
2843c126L403L395m382l106N424K144o450o01O636j414o439L084N111m246l299
2858c866M947K064m754m25M445j56l951O78L420j146l648J522L242k434k764L360
$$ y = [1915, -3810, -302, 3768, -37, -2584, 1307, 2181, -883, -1300, 1115, 729, -1217, -451, 1157, -242, -1425, 843, 1419, -1566, -788, 3039, 728, -3045, 1150, 3872, -1705, -3152, 2900, 2424, -3712, -1778, 3581, 656, -3854, -307, 3311, -260, -2943, 825, 3112, -753, -2516, 2012, 2853, -2101, -1481, 3201, 802, -3479, 308, 2908, -2201, -3003, 2328, 1056, -3467, -744, 3256, -35, -2673, 1221, 3007, -768, -2111, 1356, 2180, -1869, -2568, 1715, 1225, -2920, -1231, 2867, 34, -2525, 1315, 2117, -2035, -913, 2292, -587, -2728, 940, 1635, -2526, -1735, 2519, 804, -2778, -392, 3214, 383, -3126, 277, 3672, -710, -3816, 1608, 3752, -2698, -3299, 3337, 1923, -4516, -1432, 3679, -567, -3866, 1081, 3145, -1609, -2034, 2411, 2255, -1696, -1018, 2402, 1256, -2392, -870, 2372, -62, -2826, 534]
2874E34J731l743r2L745j552k823K690J169l152N78K988j848k035L055J281l360
2890h34k66L240k77l481J06L509j058m046J629M179k480l690M174L311m940j506
2906b430N461n03n472J964M167l542k953L881J724l769o54L930M32l644J70L782
2922B544o62m365J072L998k376l902L430K886l916j430M199O0l157J045K257j266
2938D17j102J204m2q51L40j45n85M26L43k79m50L75J014l77j607J119K090j724
2956A66k526L124J783m232q81M412l77m216J353L618j739k619K102K044j889j800
2972a677J552J705j704j804K007J545k578q50K970k20k521J483J987k231r16K576
2988A324l67k301Q50J608j261r11Q27Q00m65p32L03J423m65j399Q28J402j404
$$ y = [534, 2265, -1478, -1570, 2175, 623, -2200, 490, 1659, -1493, -915, 2073, 225, -1810, 1245, 2526, -834, -1100, 2140, 1863, -1618, -1512, 1997, 939, -3107, -1478, 2701, 221, -3469, 705, 4016, -924, -2430, 3031, 2528, -2944, -980, 3187, -355, -3308, 573, 2297, -1472, -2126, 1804, 2236, -1408, -1238, 2544, 1882, -2483, -1411, 2587, 211, -3691, -261, 2625, -1291, -2721, 1478, 1538, -1619, -574, 1683, 417, -685, 519, 477, -374, -34, -179, -764, -338, 5, -274, -724, -349, 665, 288, -1319, -200, 1890, 166, -2360, 764, 2547, -1685, -2566, 1846, 1469, -2747, -1394, 2224, 485, -2134, -32, 2012, 123, -1677, -125, 1580, -124, -1928, 79, 1624, -954, -1804, 1166, 946, -1575, -92, 1895, -336, -1252, 1324, 957, -1344, -494, 1114, -147, -1058, -231, 569, 104, -628, -325, 1098, 633, -766, 62, 1464, 60]
3005F0r94J501l4j362Q31M82j088N97R52j180j56J621m71j461Q90R73j260n93
3023f92P60K89o40n71M37J104m30j221J440J123k153m33K769o66k900J541K356
3040B113k633j446K649P81k432j95J917M63j550r65J665J053k060j194K303Q85
3056A354k684N6K368n53j167R23J42n79Q54l47j282R18J390k001j033K115K22
3073F96j653k74J195N28q24q36J044J364j260j317J815R51k158k98J878o34j222
3090a005J064L57j315R08Q01j486j5J629o27j295Q09O66p70n66K77P06L29j242
3108g75K62J580n11j523J424J214k148m21K319p22k248J401J268j849o15J740
3124C96J74r00j63P09O82m45r91P06J263j386j060J579K58j355K39P27o45L30
$$ y = [60, -934, 567, 533, -829, 2, 484, -604, -7, 945, -235, -391, 1230, 759, -702, 188, 1161, -99, -692, 68, 357, -283, -854, -417, 687, 257, -964, 476, 1599, -554, -987, 1782, 1116, -1784, -243, 2113, -520, -1966, 683, 1464, -968, -1163, 754, 1217, -333, -1298, 367, 1420, -640, -1834, 469, 1354, -1330, -1274, 1094, 541, -626, 297, 439, -140, 714, 367, -915, 3, 1393, -608, -1641, 474, 696, -957, -1231, -36, 492, -332, -1168, -124, 1240, -20, -1337, 478, 1429, -729, -1027, 851, 217, -1005, 59, 416, -899, 9, 810, -676, -691, 938, 311, -984, -175, 491, -279, -845, -568, 138, 467, -775, -513, 1067, 556, -967, 457, 1671, -477, -898, 1421, 699, -1549, -148, 1120, -729, -1344, 396, 570, -330, -493, 216, 898, 453, -538, 168, 1431, 45, -1015, 564, 822, -533, -294, 433, -212, 118]
3142A18N92j318O7J953r69j987J571J612j975j172J754R71j401j066J094J888
3158A732j031k073J458K164k002k009K252J148k615l98J917l20j104O52J97k46
3174b78O00Rp95Q75M57j070j18P11n4o00j85J18P42k90j161O14J541j441j140
3193a465K248M84k703M97K481j377k090J857J141j806m75J682J34j063n8Q77L60
3210G24r98n45J462J5j948O33J867j696j202K157P19k432O03K037j262j273J214
3227G5O33q66k72K59K18J64o21j83R36J33r92L20P72l50k36J54m84N08Q68j688
3247f52o07K570j43k996J078K936j855k347K111J776j787j571J475J613j487j840
3263a726J470K223j891k057K688J456k851o58K922k03k654J077J475j416p34P55
$$ y = [118, 710, -608, -541, 1412, 443, -1544, 27, 1639, -336, -1508, 246, 1217, -184, -1250, -156, 1732, 701, -1372, 86, 2250, 248, -1761, 491, 1639, -976, -1374, 543, 223, -881, -229, -32, -278, 322, 331, -464, 411, 868, -202, -320, 391, 337, -263, -448, -330, 412, 122, -1039, -425, 1116, -325, -1465, 783, 1267, -1436, -939, 1542, 165, -1925, -68, 1073, -733, -1208, 474, 608, -455, -513, 364, 724, -274, -819, 643, 658, -1290, -657, 1210, -486, -1688, 469, 1188, -1244, -641, 1396, 134, -1139, 75, 708, -158, -430, -171, 47, 211, -410, -593, 343, 476, -516, -196, 576, 226, -10, 144, -340, 168, 1036, -652, -1259, 1311, 1168, -1828, -750, 2186, 331, -2016, 95, 1871, 84, -1487, -12, 1601, 114, -1726, -256, 1967, 76, -1981, 707, 2163, -688, -1346, 1576, 1373, -1281, -204, 1271, -145, -879, -124]
3279a24K19k61n3k0K36N95n73k74O76m1m90L40k56j02O34n63j019J573P11k335
3299a127l1K778q25k658J511K023j908j356J767Q59j168q84R54R85o57j249O89
3316b97J362j288q94J503n1j273J078M86j686N07K052j688j681K395J067k673
3332a081p19K659L51k242k36K271N88k324r40K648N29l077k30L074o06k673J714
3349b94J702j641n17J645n05r71J202J37j713N52J265r22r90R17J014m95j204
3366h18N00J762j030j943J521J740k207j360K819K05k573R78J942j543r70J914
3382I37m6j686Q12J159j355o46J175N28j123o42J325P34j724p97K262M01k922
3399a608N09L330j648k649K661J895k797r76K822k77k321M82J351n56j172M31
$$ y = [-124, 95, -166, -219, -239, -3, 592, 19, -255, 421, 380, -110, 230, -26, -128, 506, -57, -1076, 497, 1208, -1127, -1158, 1620, 795, -1863, -352, 1671, -237, -1593, 174, 1033, -135, -1019, -65, 920, 263, -986, -297, 1065, -223, -1117, 386, 335, -938, 140, 626, -1060, -553, 1499, -189, -1870, 525, 1592, -1081, -1800, 859, 1210, -1032, -1268, 1003, 1591, -733, -1673, 975, 1504, -1573, -1803, 1271, 665, -2008, -294, 1408, -233, -750, 895, 390, -581, 621, 758, -955, -403, 862, -60, -1050, -133, 881, 386, -818, -318, 1444, 414, -1529, -8, 1732, -475, -1835, 984, 1189, -1384, -406, 1536, -7, -977, 937, 891, -795, 17, 1176, -179, -825, 350, 878, -245, -887, 438, 1172, -552, -1349, 913, 1314, -1608, -1099, 2231, 583, -2066, 595, 2490, -307, -1283, 1539, 1262, -1059, -577, 774, 218, -954, -523]
3415e23P84j3q56N08R53p97n91J373l40j606J145J498k353o50K791j35l245J401
3433f56K805k096k254K310J624k064j497J824J619j890j581J788J874k216j369
3448a779K616O17k520J29J946r78r73J107l1j160J053O35j439O5J972p56j522
3465a018Q46J291r38j374P05J590r70k047J386K281k077j781K890J159l274M0
3481a291L262j160k689J948J821k617j085K381M48j983j64K092J91j895o9K396
3497A586m88k737R96K500j791j968K388J038k831K64K352j271j378J793O09j996
3513i34N86J753r31j083J025J042j050j061R31R04j625j142J806O09k261J99K692
3530A460j050k065K300J540k863o7K693r88k515J681J618k287j139K289O34k315
$$ y = [-523, 261, 248, -608, -100, 853, 56, -535, 838, 498, -1108, 37, 1535, -818, -1468, 1323, 1188, -2057, -656, 2149, 53, -2201, 109, 1733, -331, -1828, -4, 1615, -275, -1856, -68, 1806, -410, -1779, 837, 1454, -1066, -937, 1009, 31, -942, 165, 134, -1026, 27, 662, -777, -712, 1260, 504, -1018, -172, 1119, 181, -1193, -488, 1102, 132, -1915, -529, 1752, -325, -2106, 784, 1943, -1331, -1291, 1971, 811, -1878, 70, 1891, -726, -1811, 570, 1018, -965, -1129, 963, 1154, -741, -810, 1586, 1098, -1639, -643, 1857, 66, -1902, 486, 1524, -1307, -1043, 1309, 38, -1340, 453, 1062, -934, -348, 1405, 474, -609, 416, 1458, 408, -653, 278, 1182, -443, -1585, 221, 830, -1431, -1232, 1460, 410, -1655, 645, 2185, -678, -745, 1948, 960, -1555, 126, 1744, -543, -1682, 607, 1241, -1074]
3546a074m31K390M98k581k12K832m18l141J304L067k109k252K769J449l112j37
3562a158K637r22j884J130J004j319l56J098J71o86r4Q97L2j171q9J312p31j413
3580a542J314J078j666k24K287o69j798J616J091k093k80J913o37j876J157J187
3596H58j200o60J181O22j004q33J318Q47k013o11K311J06k480P80K675j567j925
3613a595K401J009k549j78J902p80j436P27R72p60m03Q17M81k76n93P34N87j127
3631f7n86J607k60j984J014J611j633r15K221n1j836N41J368j123o72J099K40
3648E74q19L58L22o9k83r4L99j28p26K93J027j003r30J700M46k279M95K262j115
3667D30j918J702J173j754n39J374O2j032O9N12K35m01m01M88M79o37J15M00p07
$$ y = [-1074, -1505, 885, 1383, -1198, -1410, 1422, 1004, -2137, -833, 2234, 125, -2127, 642, 2091, -1021, -1158, 1479, 557, -1327, -197, 807, -512, -868, 230, 401, -285, -379, 518, 550, -621, -710, 602, -129, -1542, -228, 850, -816, -1040, 1247, 578, -1220, 396, 1487, -606, -886, 1027, 390, -1486, -329, 858, -342, -1002, 179, 801, -203, -1036, 282, 1129, -884, -1495, 816, 922, -1558, -778, 1897, 330, -1595, 806, 1815, -734, -912, 990, 210, -1226, -499, 473, -287, -690, 127, 608, 332, -261, 473, 1060, -67, -653, 954, 694, -1290, -276, 1335, -298, -1213, 1008, 957, -879, -338, 1030, -93, -765, 334, 574, -245, 113, 435, 366, 83, -11, 388, 260, -466, -173, 854, -149, -1079, 621, 1067, -1212, -717, 1545, 430, -1488, 214, 1387, -367, -906, 468, 530, -502, -433, 79, 314, -87, -488, 0, 479, -158, -43, 357, -350]
3686c50N3R19o54j233J519R43k129k66K544o20k322J234J719j580j111J199P52
3703F17p56p14O20Q73n47r99Q82J029j193n07J266k35j031O27N70j269J10J177
3721E20j081l57J323P6j248O21J272j038n82Q20J05o20l98J61O97k86r25Q06J424
3740A290j253p24J426L82k050L08J418q02o58Q76J39m47J51j41k96P29J55r57
3758d54L17P61n70k82M78O0J35j2l96J89P98j176p96J201K16j765L90J617o49
3777F2q49R72N87m80l7L39M8L8m34m93M25%p82K80O13o31R4Q84n01q39J039O5
3799D00j275M05J128o46l81Q41J39l24p0j10K31J79p42n54R28j30j107N71R07
3818C90o16j93Q34l26k10M58m86n95R60L9j372N42J223p31o85R02N25n07j16l0
$$ y = [-350, -297, 622, -32, -1265, 254, 1197, -932, -1198, 1346, 726, -1596, -362, 1357, -223, -1334, -135, 617, -139, -853, -233, 640, 93, -906, -24, 1005, -188, -695, 571, 336, -695, -68, 502, -767, -657, 520, -561, -918, 405, 481, -767, -146, 1126, 88, -494, 326, 431, -189, -587, -426, 271, -15, -940, -134, 1290, 37, -687, 739, 1121, -929, -621, 797, -5, -663, 213, 352, -95, 56, -85, -381, 348, 503, -454, -137, 624, 54, -228, 250, 310, 445, 433, 37, 226, 1024, -152, -948, 253, 469, -1296, -906, 711, 62, -787, 185, 772, 292, 255, 594, 642, 680, 246, -247, 178, 178, -604, -324, 289, -342, -248, 636, 135, -704, 335, 400, -875, -470, 658, 12, -369, 472, 611, 287, 217, 107, 338, 517, -225, -779, 149, 19, -1088, -517, 390, -226, -419, 415, 89, -121, 337, -149, -744, 216, 255, -1117, -575, 648, -83, -768, 134, 659, 152, 36, 6]
3838FN38q5r75j42R58m04j297R71J123j370k44J621m14j200Q67O12q78K6P62m2
3858D33l90P9L16P0n45m85M77M45j149l30J506j97j304O90J407q29m11P61k7m65
3878E2L60n16k48R10l12j087N80J038p95p56P28O05l74n43J10P99M69j480k28
3897f88J749k53j887Q88J386j288o97J112L4q72M78L36n53K46M62j85l45L65J45
3916D33n0m55l90R84K39j810J78J963o42j850J338J587j586r57J462L74r79l32
3934d93K44L99J8q07K3J065k09r46L99Q55n65k44L16r3K28K60r69J13J169q17
3954e4j226J151P70j280k75J607k79j155N77P73o99o34L65O47m3p78J21J179l20
3973D47j365Q09J379j695o83J737Qj765O15J162q68m51J098J06m93K50o7j22p8
$$ y = [6, 544, 459, -516, -658, 300, -104, -1401, -430, 693, -677, -921, 700, 286, -914, -47, 565, -313, -287, 475, 433, 43, 122, 438, 508, -37, -522, -45, 400, -749, -1079, 427, 230, -1074, -384, 1023, 194, -217, 544, 517, 52, 412, -104, -352, 558, 246, -841, -261, 777, -18, -774, -46, 559, 185, -358, -248, 551, 1020, -460, -688, 1061, 808, -1079, -191, 1195, -93, -790, 322, 356, -516, -38, 298, -255, -9, 453, 268, -77, 288, 433, 383, -72, -462, 522, 761, -1049, -871, 1092, 450, -1400, -62, 1525, -61, -1018, 444, 818, -161, -493, -249, 150, 168, -639, -616, 449, 240, -706, -307, 548, -17, -261, 55, -38, 190, 450, -519, -406, 763, -54, -1280, -129, 641, -639, -914, 693, 414, -741, -164, 609, -90, -724, -359, 288, 245, -533, -412, 767, 447, -918, -109, 1270, -425, -1108, 629, 637, -1128, -513, 649, -219, -670, 428, 534, 41, 291, 224, 102, 24]
3992B4j30n5L76n98j36R89k41j070Q74Q22j063k84J192o1j133M16K80l78K31J90
4012B45o48P23O21r03k97Q03k65q10O7L15L66j49m84K07J396p76j296J191J430
4031A736k008r27J918J58j971L53J434n94o86O54N50k29o03l9O51k72r30O50R51
4050G96j103o12J882l14j839J063J404j407p36J468J97j657J31Q82j70m25P1L70
4068AK54k74l39P47j9r21K83P15r40k90J314m64r77J066O76j261R7J149p51q61
4088g95Q69J93r84K77N73k41j04J47J55J02n69j41J088j41j320Q52J441j338j030
4107i66J704J10j791L26J419j008p21J176R7j017L25P33j10l21M8N73P8r40OJ198
4127I19p12j405J246J354k106n05K090j00j900Q29J525r54q08R61J92p66m2K55
$$ y = [24, -106, -161, 215, -383, -519, 470, 229, -841, 33, 855, -208, -492, 700, 639, -494, -78, 202, -176, 55, 245, -403, 320, 941, 38, -259, 544, 279, -531, -464, -149, 217, 68, -416, -209, 1187, 411, -885, 306, 1736, -272, -1199, 719, 877, -1094, -741, 693, 99, -587, 67, 617, 388, -215, -254, 397, 125, -805, -155, 796, -307, -919, 963, 649, -1190, -127, 1277, -130, -866, 602, 799, -858, -727, 155, -15, -440, -369, 1, 255, -19, -358, 389, 370, -551, -268, 447, -493, -783, 531, 67, -910, 156, 832, -429, -332, 817, 66, -795, 74, 267, -717, -440, 133, -108, -212, -65, 90, 192, -377, -518, 570, 429, -891, -39, 1402, 64, -966, 738, 848, -943, -617, 802, -206, -927, 249, 346, -671, -346, 387, 277, -44, 4, 577, 655, -285, -279, 919, 207, -1198, 48, 1402, -704, -1209, 881, 781, -1119, -290, 1235, 281, -527, 434, 626, -140, -182, 73]
4145G3l0j35J2L76Q0n69K31Q04r71q67J545M25j776J98J984j023j596J462R25
4164A148j583k08J378l68p07K62N12m92l16J75L72j92o89O64P56j129l39J722
4182I66j77j907J019J559j703j153J994J61k018O10J322m76q35O90M93m06m74
4199c35L17K79m17n34P12M75j363J27J383o25j284J409R78j700n1J844n62j573
4217i20J172P64j497l06J166m11q91M27P82k67o94K45J243l96j526J122J720j780
4235d7j353K290M67k397L3J952p87j284R49O06p04J03M14k09j56M41j45m06J71
4254f2J44J63o75l19J384M31j760K94K156j012k126J516J375k081p50J892R3j402
4272g39M47R14n96k53L47M5pk23K77J29m61l28J058k41j469J037J445j567j013
$$ y = [73, 43, -92, -80, 296, 376, -193, 38, 842, -129, -996, 549, 974, -802, -604, 1380, 357, -1239, 223, 1148, -435, -643, 735, 367, -340, -78, 434, -58, -374, -199, 173, -19, -708, -44, 712, -417, -756, 966, 789, -1118, -99, 1460, -243, -1396, 598, 759, -1259, -649, 673, 197, -638, 52, 545, 139, -335, -18, 261, -156, -690, 22, 497, -866, -739, 644, 19, -1265, 144, 1122, -578, -629, 1215, 653, -920, 252, 1016, -481, -787, 379, -32, -923, -496, 286, 19, -675, -430, 813, 417, -1109, 13, 1733, -47, -1400, 890, 1357, -1040, -1007, 945, 158, -1126, -177, 429, -275, -172, 242, 33, -123, 318, 173, -233, -62, 82, 245, -430, -749, 635, 1066, -694, -400, 1756, 744, -1382, 134, 1509, -572, -1322, 570, 663, -739, -292, 622, 26, -227, 120, 165, 158, -65, 212, 341, -120, -448, 610, 369, -1100, -63, 1382, -185, -1198]
4291a198K115L67k359M28J830q86j411J091P39r98l41N30M65m06k40M26M68o96
4309g6n08R45K34j269M74R69q64m90R94l35q68P12J46q13N51J037j016n20J422
4328G25j42j252L20R32k58q87p8P53M61j312l73J749J79j971M63K022j062j512
4346a243J288P83j263j58J009l42m78L58r0p2J39j00L20J81k63j11O19p25o19
4365g67R79J55j150L52J238p30o14P46K42o21L55m4j91M01J2q76L11R28q33n06
4385f13O29K91k37j38J05K03L77o30n48J223L7j409Q6J620r96j058J133O21q83
4404a87OO15q4j79o6k03L39n9n70K17O05p76k00J008k97q28Q38M28r23J54R24
4425G62o98l74O28l77l98L06L17n26L47Q0j7J56j25k40L94J09p17m0R13o61r11
$$ y = [-1198, 917, 1284, -1075, -647, 1183, 297, -1114, -23, 716, -282, -623, -93, 372, -34, -274, 152, 620, -76, -584, 361, 595, -674, -200, 769, -95, -585, 409, 74, -794, -82, 64, -749, -198, 839, -177, -697, 725, 583, -669, -349, 583, 325, -562, -640, 113, 574, -738, -1111, 638, 817, -1154, -691, 1331, 269, -1243, 45, 828, -435, -593, 416, 74, -404, -46, -136, -208, -69, -169, 151, 332, 69, -42, 577, -148, -767, 212, 367, -783, -431, 807, 77, -537, 209, 451, -170, 185, 141, -50, 351, 363, -513, -202, 726, -107, -613, 16, 307, 70, -68, 37, 240, 617, -13, -561, 662, 699, -710, -624, 996, 0, -1058, 75, 696, -187, -181, 434, 350, 171, 105, -98, 241, 182, -388, -171, 434, -342, -542, 466, 169, -659, 179, 607, -316, -162, 762, 64, -310, 318, -59, -457, -151, 166, -360, -13, 67, 50, 206, 81, -159, 235, 344, -373, -413, 500, -161, -1072]
4446a072J137K57r39M31N26m32J3L91l03r7N42l44n94P52N7o79R3L08m71J67J02
4467a55k36K56N12p16p5J211q37q32R84N23j131NJ022m09n02M68K11k35l8K4J22
4488A72J14n49p1Q31l18r91N94R78j300l44J304o0q58O25K50l08L03j5m09K74
4508B22L29q56o1P80k00n17L64K7l3R7k61l38Q39j82j065N96J030p24o14J149
4528E82L5p73N50J00n57K01J76o49J31N32m28l80L94L4o2N7k24K73O02m22q29
4549f57J072M29j390j27J496l30j079O25L85m54j84J91j33K45J38p14L3O52l09
4568a11j84L93k23K24L01p98j71J083j57j513Q84J377j086q70J374L89j276j22
4586d86O41l8l64m49L29P14l78p76O27Q39j091j97J057N4q43L17L80m87J45J85
$$ y = [-1072, 65, 322, -617, -186, 340, -92, -79, 312, 9, -88, 454, 110, -484, 268, 325, -354, -261, 47, -424, -257, -155, -391, -135, 377, -339, -414, 797, -40, -872, 112, 635, -496, -491, 531, 122, -380, 88, 299, 64, 26, 50, 172, 286, -263, -334, 497, 179, -812, -218, 760, -540, -884, 420, 360, -498, 127, 377, 69, 372, 357, -52, 222, 551, -305, -366, 414, 214, -303, 61, 88, 55, 152, -109, -447, 392, 210, -855, -259, 771, 47, -567, 582, 617, -156, 394, 494, -63, 138, 314, -335, -204, 328, -100, -480, -86, -52, -114, -57, -281, -8, 594, 172, -657, 415, 844, -546, -673, 823, 493, -586, 39, 424, -30, -214, -23, -156, 89, 227, -487, -454, 198, -111, -295, 98, -125, 99, 400, -398, -569, 514, 357, -1156, -272, 1105, 19, -851, 523, 912, -364, -486, 155, 117, -247, -696, -367, 347, -31, -807, -180, 659, -432, -629, 428, 482, -361, -44, 336, -151, -6, 179]
4606A79m31M14K00p82L5Q54m61p03Q63M62q12k73O57P9m41j42N4P26k16q97P57
4627A22Q40j116o51J419Kj416N53J142r07n51R87Q7q32J5P69o5m17j19L35K43
4647D40o46k72R67K9j524N42J501q74j214J344P16j193k05Q33O4m10l09j10N43
4666B22K86r77o5J335k32j103M20O88m93m80kK53O15m67p54Q85R01j207p08J427
4686E44L86j787K31J445p22o67M60L41j26j04k88L31L13o56k29Q46l23o50O15
4705d0M64p19O4P78p68m57R81P2r30M34N67o22k37L38k0Ol2j69N59L26q13j27
4727c45Q34n38p25O17M20o74P6P74m13q7O36k41o23O09k52o71L73L62n90K9N74
4748A45nm5J85j90L63J12p18jQ29o12r38R54N34j122J79Q98m26o70P73J64o87
$$ y = [179, -252, 162, 362, -420, -385, 469, 8, -695, 168, 630, -182, -455, 202, 281, -160, -302, -248, 478, 262, -635, 122, 962, -154, -805, 614, 616, -800, -247, 895, -12, -563, 424, 511, -321, -306, 463, 398, -19, -138, 197, 440, -206, -478, 489, 518, -1006, -464, 1037, 163, -1051, 293, 1009, -184, -389, 444, 508, 98, -211, -321, 222, 508, -469, -534, 801, 569, -534, -114, 574, 81, -399, -401, -148, 467, 0, -754, 131, 1032, -175, -883, 544, 930, -857, -626, 819, 97, -570, -110, 231, 105, 1, -287, 44, 357, -299, -528, 318, -5, -655, -40, 424, -295, -231, 547, -221, -678, 303, 375, -555, -121, 446, -176, -413, -75, -95, -89, -121, -290, 269, 595, -218, -345, 489, -49, -774, -157, 263, -411, -335, 439, 26, -61, 575, 334, -289, 320, 68, -603, -230, 132, -458, -429, 145, 140, 95, 280, 90, 453, 565, -153, -154, 675, 63, -875, 79, 613, -509, -330, 568, 142, -528, 245, 409, -278]
4769b78j5N42m2l42K46l9L93k83m20P93K13j083J8J285p75j248J005M70j067R8
4789e29J033k78l33K95J50k01Kj12j21L64k73k16M58j22l27K71K46p94M04N15
4809D32p83k73R94j93r21R39N77r72j09P52j30p16J40L12j45j13k16M44K73l37
4829d5l71Q11K11r92M21N63q66j71O30m43m58P29N6p28N19O53o51l68J096j01
4849D95o38OM42j5m92l69N04N42q67m98J355Q3j514N39J432r54r32J201N00j087
4869b67n8O84j84m69K45J01Or4l18M90Q5m11L6P68n63l16N83K26j015O12N43r12
4891b28J0Q51l42q28M45L90p96K31N19l34r6M12M2r6L1k19K76Q0l12j13N40n49
4913h6l85Q25p9q95N43R13j075n24J249j40r32L11Q26m67m07L34K21n1l68j35
$$ y = [-278, -293, 249, 207, -135, 111, 72, 465, 182, -238, 555, 768, -315, -297, 988, 213, -1035, -30, 440, -627, -529, 504, 226, -107, 188, 338, 137, 139, 27, -94, 270, -3, -219, 239, 117, -210, 61, 307, -487, -83, 432, -351, -624, 370, 177, -744, 195, 772, -200, -309, 443, 313, -403, -263, 49, -96, -209, -425, 19, 292, -45, -416, 395, 606, -386, 35, 598, -268, -439, 191, -252, -710, 19, 75, -653, -134, 519, -132, -500, 596, 495, -143, -137, 305, 290, -202, -571, -67, 475, -392, -890, 465, 548, -966, -427, 1005, 51, -881, 320, 820, -267, -325, 359, 175, -294, -49, 52, 58, -36, -354, 136, 221, -190, -154, 614, 51, -265, 318, 544, -471, 141, 684, -228, -218, 633, 291, -537, -92, 298, -498, -267, 252, -82, -178, 234, 276, 180, 211, -8, 268, 348, 36, -77, 463, -86, -471, 354, 275, -620, -77, 836, -239, -763, 486, 346, -586, -275, 551, 84, -323, 11, 232, 181, -187, -322]
4933c22N61J40r99L57Q49p17o29R86K74q37M36O40n43n15N29k81l72J57k2j72
4953d80L21Q2j26L71K57l89K69L34p70J05M28p49k44N15j82k44M83K01p64N91
4973IO05r53n3Q61k58o72K88N05l27o6R0J14L54o02k39O21j24q89K86Q47n48n33
4995f84J026J53q53M24O16p04k57O23k22l31J45j47J22K63k08j63N44J23o60K73
5015H3M24n78j42L11k49j06N91k96k11O94k5q76N97L32q19r5M21j43j18L40k13
5036g8K6N81k76m21M33J81p58J88L30l12q7L19m44K05M90m18m14P96J32p99Q6
5057b40O20l90k88K78l7J49J9l11RN40m18m44O53L23q12P4N39l48k85N14J02n04
5079b57L84K69m78O1J6k68L19Ln81N16L75n92j55Q08l23o32O64K14p10J16M27
$$ y = [-322, 239, 379, -620, -263, 586, -131, -760, 226, 500, -337, 99, 739, 196, -319, 210, -71, -443, -286, -308, -480, -159, -77, -203, 168, 425, 36, 305, 639, -131, -26, 402, -347, -591, -76, -258, -502, -19, 182, -582, 9, 614, -339, -392, 469, 211, -461, -173, 332, 5, -61, 29, 143, 497, -105, -344, 277, 153, -736, -450, 397, -151, -684, 342, 495, -358, 66, 682, -22, -279, 344, 122, -209, -64, -211, -89, 174, -34, -197, 347, 470, -190, 83, 507, -71, -213, 98, -151, -257, 334, 38, -173, 521, 496, -380, 217, 549, -270, -365, 56, -87, -205, 135, -78, -52, 529, 253, -168, 265, 446, -312, -124, 206, -106, -193, 126, -318, -113, 377, -41, -455, 341, 473, -326, -240, 380, -10, -298, -20, -57, 92, 111, -200, -191, 349, -69, -513, 140, 463, -349, -275, 264, -84, -369, 145, 247, -257, 127, 396, -82, -21, -5, -273, 46, 49, -532, -16, 359, -233, -388, 420, 97, -535, 129, 343, -367, -251, 176]
5100A76k57o5L91m64r7M39j82k08K89j09j06L71ro73N81N36q43k48Q94k12m78
5121b74J46K85j82O3j87j01O27jr91K48J083n72p90P58O51n31j65l2K58Q5n97
5142b19l66N66L94j056KJ092j88n23O20K18m82K78J7m78K97L19p15j53N45kn06
5163c40L04m4K84O7l38k52P99K7r95K93Q14o69m33P10K44o61R3L93j66o3k2l84
5185c39K75J90m70K91L66l73n3M88l47m31M65N5p89L26N34n50J11L88j4R7J86
5206D06l23k64O60j92q88K36N23l40o00O00O2J1o7j93M17M72o52l44P81J68r43
5227d70K85Q61p21l23O42M0o36L54Q1l62r6K14L1n8r8N6N46Q2o80L39R04p35q46
5250e90Q27M25r49k39O11J09k21J4j65M05L20p64k96R91J07j277J49J133k89p80
$$ y = [176, -81, -146, 245, -219, -316, 123, -59, -267, 22, -87, -193, 178, 169, -504, 77, 613, -230, -478, 416, 204, -274, -128, 157, -25, 38, -149, -250, 377, 376, -615, -367, 716, 144, -646, 112, 763, 232, 67, 35, 293, 378, -219, -585, -19, 375, -681, -679, 413, 225, -298, 322, 540, 58, 336, 353, -125, 172, 491, -224, -377, 168, 166, -340, -36, -80, 204, 271, -67, -319, 480, 507, -488, -195, 619, -50, -483, 227, 471, -190, -97, 296, 130, 67, 45, -339, -64, 126, -344, -53, 313, -60, -113, 375, 28, -403, 62, 117, -672, -346, 188, -362, -251, 137, 123, 220, 406, 83, -181, 479, 287, -601, -365, 158, -182, -782, -182, -120, -109, -176, -369, 48, 520, -132, -476, 305, 473, -470, -185, 676, -45, -368, 274, 314, -322, 32, 113, -249, -345, -131, -100, -158, -256, -200, 346, 428, -252, 87, 991, 256, -590, 237, 662, -287, -526, 85, 194, -27, -13, -178, 227, 547, -217, -513, 478, 585, -692, -543, 590, 301, -479]
5270d79K40N63K10n67n84R76M94j389j56J597k63j701R12J324j136q53R73N57
5288G18q86l35P10K37o01k79K68P25o45m54R82M32j122k3J096n24o80M16K49m95
5308b11J18j1k00K17L54o59K04O39k68m94L33J75k79l8J02q9O6j6l55L90J19m76
5330c79L83L22p27J05J042p19r46J012Q76j579l09J529j22j211J63J054oq37k17
5349e66Q51K97j026l73J259O7j235L37J135o21m52N91o3m55L49j05n61N73M83
5368D85q02k56Q14Ml93J3L76L4l25l38L83M27m66m35Q10J54q65K48O61o25m09
5389e05Q88q4r15P08M82p75j92O70J15l62L2J85j9n7k41J9L36m63k72O03L0n87
5411d04M84M09n78j54R73o89p63Q57K78r31PQ21k50k48J70L67n0j00l98K48L46
$$ y = [-479, -239, 324, 534, -33, -617, 359, 853, -536, -692, 905, 642, -1059, -147, 1177, 41, -812, 161, 718, -168, -503, 207, 444, -157, -436, -168, 557, -88, -542, 440, 872, -250, -273, 823, 299, -381, 35, 284, -211, -93, -104, -304, -87, 267, -392, -188, 451, 183, -311, 22, 197, -82, -120, -18, -107, -41, -57, -412, -22, 97, -379, 4, 326, -401, -296, 746, 27, -919, 93, 969, -610, -919, 610, 488, -723, -560, 494, 488, -349, -566, 285, 582, -444, -817, 442, 509, -726, -389, 746, 125, -327, 264, 201, -254, 95, -10, -571, 2, 485, -317, -573, 241, 245, -148, -135, 241, 275, -50, -388, -5, 422, -44, -479, 331, 485, -380, -132, 529, -96, -505, 383, 299, -616, 92, 574, -201, -393, 277, 392, 30, 62, 247, 228, 171, -70, -51, 285, -178, -450, 153, 183, -404, 80, 489, -89, -243, 730, 41, -722, 135, 413, -518, -511, 310, 60, -188, -18, 349, 299, 199, -199, 49, 395]
5432C95o13k9M44k18m68O71lo51M80O29r74k51J030p9r36L11P41m98k28k4L74
5453A03J07k85l12M49M15p01l13Q15j42n79K91J51k98L39J64o68K07Q22o48n08
5473e91R00K00p72R2M87m8l46j8m7L05o3o01K01M80n08q4P56k80l59O96j0p41
5495c51L30P21q44m87R16k5o54O8M88n6Rk29J35M96k96m81K03N13o09j90P76k43
5517A90n39M30K17n60L65L12m60j3M63j93l94M20j40k42K73j14j82J84J68l97
5537b12J36K50j89M1L37n47J47M76m66m84P95L7o85J99N74m07k33L07j20r8K83
5558A41j24k22K99N1o59N47J05k99M8L69m51K15L15o23k7P47k27q42M99N18n96
5579b16j92N02k73P1J46l21O2N86l30m59N88J99o93J51K31k34M9O2m48L84M75
$$ y = [395, -218, -247, 197, -21, -489, 182, 179, -472, 8, 637, -337, -588, 442, 363, -573, -262, 479, -19, -247, -271, 103, 210, -75, -387, 62, 477, -224, -537, 278, 136, -443, -152, -1, -299, 40, 204, -464, -257, 565, -83, -591, 309, 509, -263, -171, 316, 268, -78, -96, -143, 162, 99, -502, -301, 179, -329, -413, 343, 63, -296, 400, 390, -351, -21, 700, -144, -631, 285, 260, -394, -326, 162, 106, 115, -114, 21, 517, 221, -260, -57, 456, -153, -343, 433, 190, -349, 81, 298, -262, 103, 415, -45, -58, 405, 212, -182, 238, 98, -144, 129, 15, -167, 17, 185, -212, -76, 174, -15, 26, 363, -184, -37, 439, -27, -511, 284, 321, -364, -165, 409, 2, -231, 76, -44, -142, 141, 17, -205, 94, 145, -514, 33, 138, -161, -113, 256, -195, 20, 335, -288, -315, 432, 205, -637, -138, 380, -216, -408, 94, -179, -108, 38, -283, -221, 365, 35, -424, 164, 363, -330, -179, 52, -182, -133, -71, -519, -135, 340]
5600C40n43k69P08J15p36L66M02m52J05J23l45Q2L84m30k84P37j19o96L78L66
5620B32k53j43R5p0M06J3o15K74O48o39l82O94L89r72K01P78n83j82M58l54j17
5641a22K51o7k18J7M9l5L46j88l15N52J93o54K83O15p14k44O21k2o14K13J66l88
5663b75J64K64m08J52M37m29j02M56k6m95K44K52l86Q1J67k76K95J61n73K91M33
5684D27o63n4P71m94o12P48K02p11J7Q17k81n45L73M28l33k06J5K34J05n53m9
5705c64Q13k39r83P93O78r23l68R37j07q20K87O05n20M3L7l3J11J51l29J53M93
5726D15o02L4J40J48l59J23K7p2L98l24m76P22L00j015%J259l93j108O79P33n24
5747A05n86O45K51l91k63Q7M59j12o83J97R29m44n96O97K31q37K92L16l63jM46
$$ y = [340, -203, -472, 236, 351, -385, -19, 383, -69, 36, 159, -186, -104, 280, -150, -434, 303, 184, -512, -134, 232, -21, -164, -69, -139, 267, 280, -335, -61, 587, -52, -434, 260, 649, -323, -122, 656, 73, -109, 349, -5, -122, 129, 62, -156, -139, -90, -125, 221, 33, -282, 270, 463, -191, 92, 707, -7, -251, 370, 348, -266, -53, 113, -275, -111, 153, -255, -103, 334, -95, -197, 259, 233, -262, -18, 234, -152, -71, 96, -180, 115, 276, -297, -6, 427, -236, -290, 481, -13, -625, 123, 325, -386, -369, 448, 167, -378, -5, 423, 90, -116, -101, 133, 238, -315, -364, 449, 210, -773, 20, 698, -225, -593, 344, 237, -583, -296, 309, -211, -168, -131, -164, -53, 98, -231, -78, 415, -187, -153, -13, 135, -224, -101, -74, -146, 252, -72, -548, 174, 474, -541, -541, 718, 325, -783, -104, 629, 105, -481, 164, 415, 24, -239, -152, 307, 195, -488, -291, 638, 194, -402, 295, 526, -311, -19, 297, -66, -67, 379]
5768C79m18m63Q71J76q42J74N42k49m01Q9K45J41l06l65N67K16n23l05J094j99
5788D23r04L12O05m46P2O0l16J26M92o50l24R31j46p35N80M91n50m24N33K81k76
5809A35l12r9O05j18p56J23J046o00r93J158O69j364j02J324m04q26M04M53m24
5828h1j99J61K20Kl94j09M72O5n85L92N04o90l65Q90o4p39M45M17m81j14K83j42
5850a12j59L08j74o0N67m75k89N86J14o99J86P20l93m32L62n1q1j64j11L14L87
5871C44m84l74J107p2j005M79Q87q21o59Q63O6l30j61K09M2J2j57k45M68j8o63
5892e12K07N67l99k80O68O4l44J18K64k01J97j46m45O61j67q27k3R59l52p70P47
5913a4N41n18j18L59lj80o3q9L14l3o36K13O55l61m74O19L30p97L08K42n52N6
$$ y = [379, -39, -502, 369, 545, -297, -123, 419, 170, -231, -142, 103, 244, -62, -427, 140, 356, -167, -472, 622, 423, -481, -169, 436, -10, 62, 122, -194, -68, 424, -226, -550, 381, 235, -500, 80, 571, 21, -403, 130, 411, 135, -177, -276, 329, 211, -545, -422, 624, 24, -969, 189, 858, -506, -608, 716, 312, -514, -110, 343, -81, -280, -119, 101, 103, -291, -400, 72, 137, -448, -56, 448, -242, -607, 283, 219, -520, -75, 342, -139, -253, 30, -112, -271, 37, -137, -197, 370, -105, -394, 192, 306, -393, -207, 513, 120, -312, 50, -1, -82, -246, -357, -43, 344, -140, -514, 593, 521, -484, -5, 882, 61, -598, 265, 331, 1, -160, 49, 91, 103, -54, -299, 169, 151, -512, -305, 262, -137, -417, 251, 315, -29, 89, 353, 152, 349, 203, -242, 419, 252, -575, -598, 361, 9, -761, -14, 527, 9, -109, 250, 247, 67, 4, -85, 229, 196, -440, -227, 428, 67, -407, 212, 542, -255, 53, 295, -257, -201]
5935b01L36k52k30P27k59n08M26K39m88j61L72Lj20Q1o4J92jj83k4L59k22l16
5957b94M22j69n48K96L86p59K13Q11l61o58P37N74q27j2O29j85m87o9K69L57m35
5978a10n01P15L88p57q0Q72j50r35N11L84o86L8M94k69j10N41k49l88N17J19o43
5999b99j2Q15k09n42J44J98J97n84k12Q41K59j123M1J351m62j208P39J076j129
6018a19m76J000%p82J72L93j34j50J79J22L2k92pN19k77n10M41K91o64j08P91
6039D21m35m86P49K78q66L80M52n22j45M66j08m22K79J51k93j14K54Mj00j11Q3
6060h5J89j37k54M23M37q95q4J090l80j136R27M68j011k51J038j42r14N50O08
6079D41k99m48J47N63o5p75J5Q79k45j067O45P42p42m07R82Ro12J50K28l58K37
$$ y = [-201, 135, -117, -347, 380, 121, -387, 39, 278, -210, -371, 1, 4, -116, -35, -99, 93, 92, -91, -115, 244, 22, -294, 128, -41, -589, -293, 93, -666, -453, 358, -3, -661, 76, 650, -177, -189, 440, 255, -232, -301, -32, 325, -110, -611, 104, 492, -265, -345, 527, 377, -558, -47, 337, -349, -311, 183, -86, -196, 345, 96, -292, 225, 344, -299, -311, 504, 295, -247, -103, 95, 292, -292, -504, 337, 596, -527, -486, 865, 403, -805, -66, 1010, -119, -595, 405, 405, -377, -205, 188, 54, -96, 83, 205, 237, -55, -62, 457, 180, -330, 111, 402, -262, -370, 421, -14, -500, 249, 527, -339, 41, 493, -29, -174, 292, 184, -238, 41, 192, -101, -215, 39, 43, -57, -168, -85, 104, -33, -287, 136, 573, -322, -406, 684, 304, -832, 95, 563, -448, -699, 339, 197, -717, -167, 441, 142, -306, -159, 404, 339, -436, -421, 458, 213, -854, -209, 533, -209, -616, 366, 375, -237, -87, 141, -217, 20]
6100B0rn16K35M66k80k91M60L11l92j20J46K83j34n11R2N18k95q33P08P72p89
6121a59k65J059j63p62N02L35p51l5L97k41k64J92K16o9n6M4J75P9n27q2Q19k06
6143B38p29N89M87n35k17N61k56j93L84l76l25L98K98r08K86Q20k33o11K81M36
6163C95j42k59n8K99K41q27k57Q23K38q96L35Q16l81l53L43p8m22L30j38m42L65
6184f8L66o16J00M23j44k58K65P6j10j4l28R4L32j69m00M73L81m21K0M91n37j27
6206a71M98m86m20N11P5p06L69N34l66r1N45N0k51M4p7N4J6k89m9K96j38m58M90
6229b0R4n36J29O70n07k98Q17n8m98J74L28m59P0L13l17q2K58k68k94N12j79o
6251a57K91p3j28K88n7m58N16K50p37N1O68n77m20N64J11n20L02M40m07k7L24
$$ y = [20, 11, -505, -270, 196, -84, -375, 85, 396, 4, -116, 30, 313, 179, -332, -240, 278, -17, -850, -142, 630, -159, -424, 635, 472, -290, 212, 547, -204, -239, 158, -83, -347, -155, 61, -8, -64, -20, 155, 234, -293, -375, 444, 238, -491, 98, 585, 50, -167, 394, 138, -55, 329, -47, -372, 26, 324, -584, -298, 522, 289, -322, -41, 395, 253, -6, -64, 235, 476, -351, -608, 215, 453, -443, -108, 708, 327, -26, 317, 239, -183, 147, 9, -433, -68, 298, -318, -218, 205, 61, -197, 68, 144, 34, 20, -308, -214, 118, -51, -451, 22, 403, -18, 2, 493, -44, -171, 327, -159, -579, -68, 7, -699, -330, 204, -162, -253, 292, 342, 91, 135, 58, 112, 128, -161, -210, 86, -52, -510, -20, 74, -462, -333, 337, -170, -468, 349, 291, -207, -33, 295, -164, -94, 219, -98, -180, 78, -190, -484, 28, -151, -157, 134, 61, -67, 221, 164, -294, 222, 472, -265, -214, 454, -123, -543, 21, 132, -388, -86, 354, -53, -80, 244]
6272B44p7k19K49N9k36J65q7j90L04n15j6N05J54o52L68N25o40j74O37m9n52J14
6294h3K52m07J05K71k96n6K77O6j44J83j14J01k9l64n5O35l46m90O13K94o39m9
6316b75N66j39l76L27l7k64J99j01l92K71M68j95j37M23p3o1k54k79N21K91r35
6337d52j17R96j05j235N64R86o53o57Q47K49o97N2K64j0o0j5P9O6r7k15M86kp89
6360e15K74O16o84k79Q92N5q41L37P43m73l96M21l6j25m7k21K43J53k15J6K63
6381A81N6l13N1L85m84K87J57n50L9M99m52l26Q05k8n44L62M70o20k55N55p0n85
6403c80J93L84j23k56o4M61J66o21k6R43k70j055O30P71r76n98J044L30q57R7
6423b07O44k31n58M44J30k55O6J3L1j46j44L95J3m39J00O78l96q21O39P95j090
$$ y = [244, 167, -52, 197, 256, 20, 185, 98, -92, 212, -303, -319, 186, 340, -312, 56, 581, -59, -233, 404, 355, -197, -83, 169, -238, -133, 138, -158, -214, 63, 129, -15, 168, 54, 155, 126, -238, -293, 342, -4, -494, 119, 413, -226, -275, 291, 152, -224, 103, 66, -198, 1, -100, -492, -221, 247, 52, -85, 338, 265, 204, -50, -329, 192, 483, -452, -569, 427, 322, -913, -349, 637, -16, -673, 174, 423, -274, -222, 42, 32, -28, -43, 36, 102, 5, -210, 276, 274, -515, -241, 375, -309, -588, 304, 359, -482, -145, 598, 125, -271, 150, 114, -11, -58, -279, -36, 117, -98, -82, 181, 237, -76, -25, 360, -124, 163, 320, -230, -191, 308, -144, -470, 335, 307, -237, 125, 595, -25, -280, 275, 205, -380, -187, 197, 74, -182, -246, 215, 381, -240, -266, 677, 407, -648, -18, 753, -223, -821, 223, 553, -304, -207, 437, 206, -352, 92, 222, -33, 33, 46, 77, -69, -213, 182, 195, -244, -144, 534, 138, -683, -44, 751, -339]
6444c39m04J156l5p79K56O47m00k08J20j85m0L39l88j07M30J43l05j25J65M56
6464C97j92n14N6P96k73j246P42Q65q32p31J102M01j071L7O35J24n25M2K77J63
6484B53l37l09M78K20n37j29O45j34o43N45K53n64J29K60k36L0K75l65J88L71
6504C93k77n11M16M86q50o7O28m2l98o6L50K41l20m59M16P53o04p85J019M62j248
6525d63J42R19k37n95J46K46j24J29k72J07L01j38l87K47K70k06P5M2k65L3L69
6546C39m65o0N18k21l88L47L23n56J59J86k69L6L37l67j59N01J35o46J43K65l05
6567a47j36L39l26J16K72l91J79K30m0k30N40o3n42J84J21l76L6Q0k60O7N50m10
6589b07k37O43R0n62J85O39n04k66L66O1l53M7J32J74j50k57K23L38o53l29Q33
$$ y = [-339, -743, 413, 378, -401, -145, 502, 102, -106, 14, -171, -211, 128, -260, -367, 63, 206, -99, -224, -59, 397, 205, -309, -253, 543, 270, -976, -234, 631, -201, -932, 170, 571, -500, -463, 172, 296, -229, -187, 90, 253, -84, -393, 85, 305, -232, -361, 284, 150, -493, 52, 305, -259, -130, 130, -106, -76, 199, -166, 22, 393, 116, -395, 21, 507, -343, -410, 218, 176, -222, -288, 62, 303, -17, -476, -60, 693, 89, -696, 323, 785, -463, -321, 598, 361, -234, -88, 158, 34, 163, -109, -2, 299, 161, -226, 21, 291, 85, 160, 202, -63, -30, 339, -126, -186, 332, 111, -277, 70, 393, -163, -4, 182, -87, -51, 286, -81, -240, 261, 396, -250, -107, 158, -147, -283, 56, -270, -154, 118, -273, -94, 136, 96, -134, 406, 343, -199, -15, 106, -270, -234, -154, -414, -347, 203, -207, -444, 199, 289, -273, -88, 551, 47, -219, 147, 208, -145, -98, 34, 208, 58, -199, 24, 362, -291, -620, 213]
6610B13l3q46K91R24m63n92O85L14o01k28N89k5j96j2r6K0j0k1K34o8mJ31O9m09
6634a34l9M37k81m82M09M63o81m5P98l00m03M52J50m29N1N38m51l37M43nl76J1
6656b11K46L22m52l94N63M16q61k62J171j06j077M78J006p27p58R89K47p81j6
6675b07O19j96m24N7K83m2k01j38M77j60n00L87M64p09k3P34k17n57M23L49q04
6696c85J53P43o21n05P28K31q30J37O56j37o25J68Q06k80p11J85Q26l21r94N22
6716b54Q99o99q54J048N57j257L9J069m19n95N83J78n52r2N32k96j55J75L67j19
6736A55m55J93N79l12n54M68M08q32j07Q45j23j008P53M12q02J37O76k05p56N52
6756B4L18m44l16O64P2n20k14N39K21n59l66Q22M19j111J27Q30k92p24M95N37
$$ y = [213, 180, -666, -375, 549, 86, -506, 179, 493, -108, -336, 253, 228, 32, 20, -76, -56, -66, -87, 147, 79, 75, 206, 275, -134, -173, 264, -17, -499, -90, 373, -308, -353, 445, 145, -258, 194, 344, -85, -34, 504, 53, -284, 159, 154, -222, -211, 35, 357, -95, -489, 74, 490, -371, -633, 538, 432, -645, -167, 839, 112, -646, 343, 590, -191, -207, 412, 216, -208, -151, 132, 90, -111, -249, 228, 68, -432, -45, 419, -290, -313, 421, 204, -353, 70, 419, -385, -232, 511, -110, -615, 113, 344, -486, -349, 307, 170, -455, -287, 519, 239, -472, -287, 539, 218, -776, -254, 645, -54, -908, 140, 697, -560, -521, 548, 129, -466, 117, 295, -257, -349, 183, -113, -268, -93, 274, 155, -300, -107, 472, 160, -394, 74, 482, -350, -457, 388, 265, -743, 10, 422, -380, -243, 433, 228, -528, 24, 342, -102, -418, 246, 318, -202, -416, 123, 344, -215, -581, 241, 660, -451, -324, 506, 214, -510, -15, 522]
6776E22o36J31K43l96o1M52k67k06L04M06m92k93M70J03k64m83M32O86o17p30
6796f96Q43N78r72n14J359j01j020L81N97n48k25L30j9k08K47L4j09L0Q3J9j06
6817a7o2K34K07l70l12N15J72r09J63Q72m60n13P12n2n01K13L75k72k14M22l67
6838a64jK07k5n6n2J38mM8j67K5L53k26m76N82J47o99O5O50m11m26N46J71n30
6861c05J58M57k16l32K21P0r6R5q7J49J00l82l1L67j32l31M08J21l72MJ59j41
6883a16j58L16j30l5K57J23m53J94L94l47l45M10J90k87M2N0j6M9k73j03N72j32
6905B02m95K55L83l52j68L15j48r8L50j95l9L61r7o63L07N35n15l42O29J17n25
6926a83p3K26K16l07j37P3N86k15o76M59N06o64k31P69l8n47K95J36l96J65J28
$$ y = [522, -114, 17, 260, -136, -197, 255, -12, -218, 86, 492, 0, -293, 177, 280, 16, -467, -35, 651, 34, -696, 147, 725, -247, -761, 598, 497, -523, -142, 455, -93, -318, 12, -7, -215, 32, 66, -43, -13, 70, 89, -17, -79, 155, 362, -8, -320, 195, 367, -542, -379, 493, 33, -480, 232, 180, -321, -108, 267, -5, -219, 203, -164, -165, 42, 17, -39, -91, 47, 43, 91, -76, -51, 302, 76, -400, 182, 329, -370, -305, 345, -66, -492, 54, 225, -305, -147, 310, 94, -238, -17, 53, -43, 52, -35, 114, 214, -168, -199, 168, 36, -295, 113, 234, -138, -134, 25, -116, -274, 42, -88, -123, 134, 257, -196, -2, 392, 45, -300, 110, 300, 13, 55, 105, 89, 138, -135, -238, 334, 202, -293, -38, 345, -7, -175, 140, -8, -106, 244, 49, 10, 371, 274, -389, -82, 453, -62, -404, 225, 342, -183, -256, -30, 186, -121, -258, -185, 401, 186, -490, -31, 475, -189, -420, 349, 311, -236, 59, 195, -201, -36, 92]
6947I2j85n4K27n9l05L33l1q8k8NJ05K21k71j90M85Lo00K34M55m39k75N32r4l59
6971b86K16K30m32J26M27m81L5L09j02k12J75J5RL2k36m3N01k28m61M85J76p31
6993d76K28N20j98n14M26L37n96L8M27j48q9J92j38R6j1j94J62J27k25q5K90k46
7015g7j36L18M2n51M88L82o22M7O01j41n91M00J06l31KK06M2l86l6L20L28l14
7037I7k90K18L88o18k02P47k05p72N71N90p87J0O41j18n22M77J21k64j84J86%
7058H4j66j35J33L22l40j56M85K87p40nP75m12n13M31L95p76l4P03k96k02K81
7079A21J19l58J02O3j80J23m2j75K26j15j98M04R4n11K68L74l48m98P91j68n78
7100d86N18K33m07j46M11j20k59J90J72k75l2O0M6K39m23J13M64l0o28N06L52
$$ y = [92, -93, -147, 80, 21, -284, 49, 18, -70, -98, -93, 12, 233, -38, -228, 257, 260, -340, -106, 349, -90, -365, 167, 73, -286, -70, 160, -272, -146, 281, -200, -165, 144, 42, -170, 5, 20, 29, 61, -175, -218, 283, 55, -406, 79, 255, -476, -248, 272, 74, -440, -14, 323, -273, -235, 192, 44, -45, 147, 9, 105, 94, -100, 62, 189, -36, -121, 169, -77, -213, 105, 147, -404, 84, 466, -156, -109, 492, 351, -240, 160, 266, -65, -63, 143, 185, -201, -237, 83, 411, 97, -193, 25, 413, -205, -407, 340, 135, -637, -66, 524, -263, -253, 388, 270, -252, 225, 346, 82, -102, 84, 84, -82, -217, -84, 238, -102, -258, 227, 514, -226, -231, 544, 132, -381, 50, 445, -331, -365, 338, 42, -160, 121, 240, -118, -16, 47, -133, -10, -52, -227, -1, -116, -314, 90, 184, -327, -59, 315, -33, -531, 260, 92, -486, 32, 265, -142, -288, 123, 3, -256, -66, 106, -169, -201, -141, -95, 144, -279, -166, 298, 268, -360, 146, 498]
7121D98p07o3N73k16o18O36J47n67J25N32l23j7P8K3l2j28l1K00K5l63J07M78
7143C57l73k65N65Q1p61K86N66n30l66P12l8n23K27L67j75k93L85mk24m1j7pK80
7166B09m45K72K78l52k14M37R0n80L47L00m90p0M76j63l83K33K34j70j11J68j67
7187a01R1O5k16J54L43n00jL58j38k49K13O6k58J91om09L58K49n31J23N52l26
7209B8l37L84K06n32J63J27r0q6J40l52J92K36l36J03K65m3l03L59J00k65O2M8
7231F9j14n0K28k47M5J95l07j80M90j00m24M76L14n26J09L36j19l03J64N5j85
7252g4J44k37QJ63k5k91M24J49k69K11O7m93N6M17k97m49P61J63p63K76M76k12
7274B05n52M53K14l26l7m0K2J31l08n9M15K4k91K01K16l72K42P4m32n8O73l54
$$ y = [498, -209, -272, 301, 85, -533, 103, 250, -317, -192, 340, 17, 0, 78, 101, 69, -59, -90, 110, 135, -228, -121, 357, -16, -281, 284, 365, -396, -110, 456, -74, -440, 272, 234, -289, -62, 305, 130, -163, 222, 218, -6, -47, -64, -71, 209, -236, 36, 314, -38, -252, 185, 275, -305, 42, 342, -148, -218, 258, 95, -288, -55, 179, 9, -102, 66, -101, -10, 55, -161, -7, 336, -164, -165, 193, 55, -194, 19, 85, -173, 18, 12, -397, -39, 210, -321, -198, 354, 28, -309, 75, 281, -251, -88, 39, -51, -137, 3, -349, -157, 79, -257, -154, 111, 68, -235, 124, 224, -41, 21, 69, -45, -95, 133, -114, -69, 126, -181, -361, 129, 29, -395, 81, 395, -131, -22, 314, 195, -108, 56, 111, -74, 70, -167, -159, 4, -21, -312, 112, 261, -8, 203, 270, -223, -167, 250, -47, -496, 265, 428, -335, -59, 417, 205, -347, 106, 320, -6, -43, -83, -61, 70, -238, -297, 118, 142, -149, 52, 268, -104, 138, 212, -220, -278, 395, 41]
7296D1m69N94M94r94o7R12k73o49L01M71j49m87N6N09k34l12M4N79l44m78N87
7317A32K14q45J96P68l80n47O28M59p65j19P39l15n66J61J34n4k93n7O39Jk83
7338a53m2P00k97m03N09q1o03L52L12p28j55R53k03q83O36P03n73m57O80J34o85
7359b84jL41N8l22k87O37L22p91J3Q86l79p24O53M19q39j70R47m68o79Q48L74
7380E54p61j07P21j03n46J6L89l9l94j47N84J0m06K12M25m30l39Q32j48q31M18
7401i0O81o56n16R82J40j075K19Q64k38p27K69N38j83n67J59M63n7o51N37M99
7421E91p28k55P19j82o37O34K67p95J23P90m76o78O18N68o24k39M69K29o09p4
7441b89M29K02o05j44O09J17p55L05N15m70n32P51K98q90K44P48m78n63P03J6
$$ y = [41, -428, 166, 660, -334, -401, 511, 238, -411, -110, 361, 212, -275, -219, 290, 56, -256, -212, 367, 23, -455, 132, 346, -499, -303, 465, 85, -462, 166, 625, -140, -259, 480, 165, -401, -240, -106, -160, -453, -510, 129, 130, -153, -195, 505, 208, -195, 314, 233, -370, -18, 294, -434, -589, 364, 161, -722, -86, 617, 44, -413, 267, 401, -284, -285, 56, 114, -208, -495, 142, 464, -327, -314, 572, 193, -531, 122, 541, -298, -468, 479, 11, -668, 180, 554, -207, -314, 407, 304, -242, -226, 163, 124, -270, -417, 167, 177, -229, -17, 408, -22, -361, 471, 323, -508, -90, 591, -65, -581, 401, 541, -534, -315, 549, 311, -416, -147, 391, 208, -359, -200, 263, 206, -445, 92, 591, -137, -392, 327, 145, -492, 142, 409, -386, -263, 527, 51, -627, -9, 559, -65, -304, 165, 394, -215, -289, 140, 342, -263, -407, 202, 319, -436, -131, 384, -86, -618, 133, 431, -459, -215, 533, 55, -508, 195, 211]
7461B11m82J8L50l5k15Q4K72n0m02N6M96j90n97M96M24q12N6P46k96o93O49L75
7483D61o57k19P29j90n28K56L30l29j07K99J03j19j66J11M04m22l33M94K93q12
7503d02Q7O20l09m34M63K51n92K73K23l11J27J42j51j22M51q7l25K00J10j18j67
7524g1L5q5K78k96k11M83L31o52L5P72k32o26K39M12n24j60K45n5k1R8j04J58
7546D9K77j66j50L11m3l99K02o3k66J30K36l33M6M34k38j33L32p4l15K25O0m81
7568c59L97J65l26NM07j34k63J66J13k39n9%k8J64j40k45L34K06m49J80M61m6
7590C10n03K12J97m26J03J53k55L8J69k03J37K60k70p9K25m1l64L77J18l52R4
7611a00J88j30p8K22k06K69j35l64J56N97l77n75O76L36o04j23O91j71m54K8J58
$$ y = [211, -271, -253, 97, 62, -153, -69, 203, 153, -249, -193, 303, 113, -484, 12, 436, -376, -320, 426, 130, -563, 86, 461, -196, -415, 314, 124, -404, -148, 182, -147, -254, 45, 148, 29, -137, -26, 378, -44, -377, 117, 410, -402, -315, 305, -4, -438, 25, 276, -316, -43, 180, -131, -4, 138, -13, -135, 316, 229, -96, 104, 214, 96, -71, -36, -121, 157, -139, -350, 133, 464, -188, -153, 619, 387, -239, 0, 412, -112, -272, -27, -82, -103, -5, -109, 49, 326, 160, 10, 321, 278, -121, 81, 18, -248, -118, 118, -215, -169, 265, 27, -106, 226, 152, -163, 62, 122, -359, 38, 203, -123, -118, 289, 155, -108, 58, 171, -68, -127, -127, -155, 9, -131, -376, -42, 164, -285, -105, 356, 310, -193, 19, 216, -210, -107, 46, -209, -171, -2, -205, -68, 192, -78, -157, 68, 27, -337, 40, 158, -194, -100, 88, -42, -120, 102, -104, 165, 30, -334, -178, 419, 42, -533, 143, 479, -125, -248, 443, 272, -182, -154, 4]
7632DR5j05k91J56K70j10k77M72R4l87L5K89m3j50J58k91j56L51Q5n13J94L85
7654B65l16k29L18J58k70J25m5J08J02k76r3M43j58m19K70K53k49k12M04k09k4
7675e4K64j42k58L54Q9k52k03L03l7k39K07l1P0j20j2LK39k11l87N56K0l28J5
7698a54M96l07j30K75O9m71K44O4j97q1K51j92O2P1n9R9R2k15k2L38j84j60K18
7721A07k27j48K21K00m50J75L78l07k25N45j31m69K33K75l27o2J49M5P1k35J67
7742a5K62q5m32J91M15m32n32O99K12p12J99P76m18l71L07M10n45KrL6m9j08J46
7765e3K53j10k86K78J64m05J61L67l65k11M30k3m89L11L17m28j62N07k21j93K17
7786E9m0j25R0J02p3K03k43j3K46rl15Q9K02l13o3N65m38l26N74J63n89O7M62
$$ y = [4, 99, -6, -297, -141, 129, 19, -258, 214, 308, -79, -44, 245, 202, 52, 210, -81, -237, 114, 199, -314, -120, 265, -51, -280, 38, 196, -74, 51, 6, 114, 216, -60, -153, 290, 132, -287, -17, 236, -13, -225, 179, -30, -54, 210, 68, -190, 164, 253, 1, -202, 101, 64, -175, 32, 1, 71, -49, -61, -58, 181, -30, -417, 139, 159, -169, -154, 342, 35, -95, 180, 249, -222, 22, 86, -111, -192, 59, -133, -71, 0, -59, 40, 132, -83, -105, 233, 49, -111, 107, -120, -268, -47, 153, -297, -122, 256, -51, -276, 269, 138, -331, -98, 177, -150, -212, -63, -18, 53, -182, -15, 247, 162, -270, -79, 336, -96, -628, 71, 283, -429, -230, 546, 128, -243, 64, 474, -71, -69, -78, -42, -91, -199, -53, 200, 90, -196, 82, 246, -159, 2, 369, 4, -207, 223, 200, -289, 22, 339, -89, -251, 256, 35, -158, 59, 19, -106, -16, 86, 13, 216, -27, -40, 206, 197, -118, -29, 173, -140, -203, 362, -76, -402, 172, 335, -254, -187, 275]
7809B75j44k94J61J53q2o5m3Q6P1k16jK16J16l78J56J98m77N1L84l45j69M42j27
7832c2k93L22L26l87N2L9k5j57K09j67P0L4r9m9J98j60j14J55J17l14K14K83l89
7855a67J9N37m77k78N34J41n48J52K79j59j87J14O9J29j13l55K60K65k89j97L43
7876G2J12m00J03L36l34o4K83j94L1Q0Mj7Q7k2l2K5M3l08K71J53l95J8L54n3m06
7901b53K69R8lm9Oql1Q3k33L08R6l12k03M61j86l56L84n8J7QJ10j77O2J92k54
7926b9j5K61j77k27K08J70k96K05j5l2M8q7j77J52J26k79J81J80j87k91N32J52
7948D03q08L48M74m69k63M08N8l45O7J86o4o2m0K3J99j80j28L35Q7n07J94M20
7970C36n54l5L58J30m43J25L76m40n0L31r1k46J97J01k52j0K22O9k49n3K13K22
$$ y = [275, 131, -163, -2, 151, 69, 4, -39, 47, 118, -98, -99, 117, 233, -145, 11, 209, -268, -217, 167, -178, -347, 95, -32, -325, -3, 323, -64, -12, 27, 2, -155, 54, -113, -43, -9, -108, -157, 41, -119, -233, -78, 39, -275, -61, 222, -167, -148, 389, -88, -366, 168, 309, -239, -87, 192, 33, -154, -40, 29, 158, 45, -310, -50, 215, -74, -271, 72, 184, -216, -113, 223, -111, -175, 108, -86, -55, 25, 29, 12, 99, 77, 45, 70, 113, -195, 76, 229, -166, -148, 206, 153, -253, 16, 114, 111, 62, 68, 60, 29, 112, -121, 187, 283, -29, -232, 229, 43, -313, 71, 13, 30, 38, 148, -29, 33, 225, -29, -44, 217, 40, -187, 21, 191, -105, 100, 85, 53, 101, 14, -163, -11, 115, -164, 17, 197, 10, -281, 251, 403, -405, -57, 417, -52, -315, 93, 151, -194, -127, 59, -5, -67, -107, -84, 115, -65, -193, 142, 229, -278, -84, 336, -218, -253, 105, 235, -208, -83, 293, -147, -197, 134, 43, -203, -6, 95, -157, -167, 55, 124, -125, -178, 35, 257]
7992B57l16j34M64j21o06L00N34m06m43P07J64o53l4N94j31o14M09J46j47k40
8012b70K00L46j74l58K97L24m03k47N60pn20R7O13n12k83O17l3o54L31L10k78
8033d4k30M54q4q7j77K65J50j24k36M02K7o33K46N22l31n76O19L27q99J95Q16
8054F02l80o49M85O07r15k01O68L5m78N9K49J80m92j16N89ln82J02P61n46l89
8075d14M44L70p84K19N19m08k62O42k01l96K78K68k17l32M05J93l88k66M33Q1
8095A84l18k18M77K63q10J20Q02m35o20O03M49p47j4N83q2o66L38L65l33k03L21
8116E9J63l08j7L35K5l46k31N39M5p19K22P39n64l89P06J44p09P3O91l09m41K63
8138b9J61k84N3J55Kn6m0JJ42k31n0L50p0l20K10K89m68K5M33J8m75K33K31n34
$$ y = [257, -59, -193, 271, 150, -456, -156, 378, -28, -471, 236, 400, -253, -287, 307, 176, -438, -29, 117, -30, -270, -70, 276, 102, -256, 41, 365, -38, -285, 275, 268, -252, -155, 458, -54, -337, 280, 247, -407, -76, 234, -44, -274, 180, 96, 9, -168, 97, 247, 123, -113, 289, 316, -317, -71, 451, 120, -456, 163, 490, -409, -214, 602, 222, -427, 58, 665, -250, -451, 217, 252, -226, -167, 82, 262, -230, -346, 243, 240, -342, -240, 521, -25, -414, 30, 400, -384, -165, 354, -54, -316, 326, 125, -271, 7, 275, 58, -274, 131, 324, -64, -330, 103, 184, -134, -352, 125, 388, -422, -302, 500, 65, -555, 48, 497, -250, -264, 319, 237, -429, -91, 274, -59, -262, 59, 222, -86, -103, 232, 257, -89, -320, 219, 264, -455, -233, 506, -58, -447, 259, 403, -306, -233, 458, 149, -292, -29, 132, -152, -99, 56, 58, 2, -38, -37, 105, -126, -176, 174, 104, -216, -6, 283, -185, -160, 273, 291, -184, 49, 280, -254]
8162b54J42M88j99l96K93L01m40m5J12J33j88j45J81K91k26l01M44K16o97nN68
8183B73j83n43N58K44n08nM15j89
$$ y = [-254, -112, 376, 177, -219, 74, 375, -65, -110, 2, 135, -53, -198, -17, 274, 48, -253, 191, 407, -290, -295, 273, 90, -453, 105, 349, -159, -164, 251, 62]
8191F2
$$ Imaginary data points
##PAGE= N=2
##DATA TABLE= (X++(I..I)), XYDATA
0@%%%%%%%%%%%%%%%%%%kLlOqJ0j4K0k4K5l1L9m5N1o0P2q0Q9j03J17j31J44j62
41h7J84k02K20k45K72k95L16l39L63l80L85l77L45k57N7L66j315L754j1977P9453
61G0241M16613m79492m74273N61635L58820n69378k72446N53062J60553n13965
71a88630p8853M54822P2l78354N5970K97890r1846j99955J13385J13798j08971
82a0672k8323P5735m9167l2821J01301k8675j26999R8633J30725j62098j05646
93a38007K15108O3330k50853n420K68702n7950k70080J19081K49129j83108k17450
104b07518K40050J71940k85749j11169L20613L9998l38744L6796L36064j12553
114H9728l09766J83553K65340k39754k06324K76908J38167k94905o9139K94271
$$ y = [0, 0, 0, 0, 0, 0, 0, 0, 0, 0, 0, 0, 0, 0, 0, 0, 0, 0, 0, -2, 1, -2, 4, -4, 6, -8, 12, -12, 13, -18, 21, -24, 27, -33, 39, -41, 48, -55, 62, -69, 75, -87, 97, -105, 115, -130, 142, -153, 163, -176, 187, -193, 192, -185, 160, -97, -40, 326, -989, 2765, -9212, 70241, 486854, 7362, -466911, 94724, 453544, -115834, -388280, 164782, 325335, -188630, -267483, 187339, 187411, -190943, -134973, 162917, 71071, -128884, -15499, 98299, -10672, -38995, 36740, -12427, -45248, 56053, 27378, -99621, -988, 129737, -32361, -138007, 77101, 140431, -110422, -115842, 152860, 94910, -175170, -56089, 193040, 9932, -207518, 32532, 204472, -81277, -192446, 128167, 168165, -170579, -133783, 202281, 89728, -220038, -36485, 228855, -10899, -217223, 59685, 197852, -97053, -166192, 128079]
124A28079L307k78649N3775K50446j02675k13126J41857J68347j70604j18804
134a38047J83016O3306j82480q466J67486l6379j32951P4514R0220r6327m2979
145e9087R9262o048r0768M5869O8346p9128m0637J01821R431j13487K5899J20635
157H2108n8169j15728R1648J02154j23172p9854J47534M5604j65076p417J66977
168H6609l6690j57246P8798J37086j10212j02401J37107O6992j51872l0257J56058
179G3972p167j55860L9628J47879p1092j35975R7649J17440j19904r1671J37729
190C2628O3892j42869l1194J38827J24j24720K3830J00800m0999p4060M7684M6217
202D0160m6570k1265M0558K373k8750J5631J6945k9607m049L8300j4114m5910
$$ y = [128079, 131386, -147263, -93488, 156958, 54283, -158843, -16986, 151361, -19243, -138047, 44969, 108275, -74205, -82671, 84815, 48436, -84515, -10001, 80219, -16108, -59087, 40175, 34127, -56641, -10772, 57574, -21554, -62191, 39630, 49061, -64426, -38527, 82108, 23939, -91789, -141, 102013, -21159, -101013, 46521, 92125, -72951, -80368, 86609, 49919, -107327, -28529, 108557, -1655, -104056, 33051, 100043, -51829, -82086, 73972, 66805, -89055, -49427, 98452, 27360, -108615, -10966, 106474, -13430, -105101, 32628, 96520, -46349, -77543, 61284, 61408, -63312, -39482, 61318, 20319, -53741, -6057, 40160, -6410, -27675, 12883, 15256, -13494, 2137, 19082, -10525, -14574, 23726, 9612, -36298]
214c6298L2707M7847n1778m0707P1252K7810q5560q505R2296j4101r0951L5890
226b0098Q1978n3948o8308O6171N2040p3438l6544P6866K1394p8566p142P8106
238C8511o761p4160K2873O7927l6873n6534M7913L8557n6268k0725N5565K193
250B2218m9564J4006L9998k3342k6812K9257J6197l0144p336K8776q42k8985N787
263a0786K6226j2394k3544J9377J9044k4270r419K8736o52k7009J2474K0851k3572
276d938j3567K7202N66k9789R298K8826j4241k2345K0432K0157k1576j8445K1440
289C020J5779k4277j4967K6084J1586k7699n739K7838o45k3737P444J6973j1815
302a55r094J0839k40q615N781N248o762P65Q158j513o115R64N154k96o426j375
$$ y = [-36298, -3591, 44256, -7522, -48229, 23023, 50833, -34727, -43232, 49064, 34963, -55988, -20098, 61880, 7932, -60376, 5795, 57835, -15603, -52147, 24719, 46113, -32453, -39595, 38511, 31750, -42410, -19537, 48390, 11517, -45017, 2896, 41453, -14815, -35540, 20025, 22218, -27346, -13340, 26658, 3316, -23496, 5761, 21958, -8186, -15522, 13254, 12412, -16573, -10786, 15440, 3046, -20498, -1121, 17923, -6347, -15766, 12970, 12318, -14691, -2217, 18634, -4938, -18505, 8697, 9263, -20526, -11228, 17598, 3357, -18988, 1444, 21601, 25, -18420, 3020, 18799, -5478, -20445, 5639, 17225, -10474, -16213, 11625, 10980, -12757, -5313, 11660, -155, -9249, 1590, 1350, -7265, -1484, 3764, -2998, -2233, 5925, 4412, -1703, -739, 4415, 4119, -2307, -3682]
318c682Q039K42j0519J386R284n627o715Q542K230p524M898N735q704r40J0699
333G344l344r436O672P655o655n891L790M204k560p585QJ0011j92j1467L805J3087
349I446n270r704P160O184o875l327K417j69o0j366l285M424N306n164j709P984
365E992p45p287K611K817n267n33L429k344o39K172j686m61K787k527k65N695
381C749j830n231N784L032q228r23O662j921m226K318J156k64R70l536j570O664
397B606l46q229L392P573n435n304M908K691k116k65M2K084L102m796m999N925
413H33K077q405M30P595k411m334L887Q89k497K525M71k336L908J769n243J81
429f61L696l992l290L142p5j800J882K51p04K975j46k358M011J293n543J765M302
$$ y = [-3682, 4357, 4599, -5920, -4534, 4750, -877, -7592, 950, 3180, -4344, 554, 6289, -2415, -3355, 7344, 4000, -5436, 1236, 8891, 2236, -3655, 135, 4339, 1779, -5806, -5798, 4213, 4021, -7446, -3641, 9446, 4176, -5528, 1632, 7816, 941, -2386, 31, -138, -198, -1564, -4849, -425, 4881, -283, -1992, 5992, 5247, -2040, 571, 3388, -1879, -2412, 1017, -1327, -1966, 206, -1480, -1941, 846, -1681, -1946, 3749, 1919, -3312, 2472, 5504, -2724, -3647, 3015, 1094, -3132, -814, 342, 78, 1048, -2488, -4058, 2606, 2260, -5969, -2577, 4996, -439, -5743, -835, 1856, -260, -525, -483, 1601, 4703, -93, -5092, 833, 2910, -5495, -5065, 2530, 119, -4215, -328, 561, -1936, 589, 1060, -1276, 2632, 4401, -842, -661, 3035, -957, -4247, -1105, -1180, -2980, -1098, -847, -1551, 1424, 1278, -1080, 2931, 4224, -1319, 446, 4748]
446D748o379k806P500j375o741N154M803o191j659N139j017l055J621J496J3r0
462A161j256R45J552l377m71M892k971n060P071L158j0299J089J1724m414j0199
477f455P752P082q775n159O389L044m578l520L060N027k661o674M094P369n209
492G86m904P090K540n950k9J930k551J275J037n120K347P260o147o725R286M123
508F248j1227j367J1293q80j0455J365J0144j307j0486K477J3903l356j6465P180
522b933J7271j4240j8264J9099J4908k3855r023K6599L490k5988R74K3647m067
535G618k0349O470J8727o790j7258Q317J5127j1569j3122J4565Q679j6878k017
548h480J7310n371j4805J2120R431j5881k219J6840m519j5242Q911J1403j1733
$$ y = [4748, -1631, -4437, 3063, 1688, -5053, 101, 4904, -1287, -2946, 2193, 1176, -1879, -258, 1238, 1251, 1161, -95, 850, 2402, -975, -1446, 3446, 475, -4585, 2486, 5644, -4655, -3566, 8158, 3744, -6455, 1297, 8379, -396, -5555, 834, 3878, -700, -4220, -1160, 3867, 1206, -5468, -1374, 5995, 786, -4118, 2972, 5512, -438, -467, 1463, -1088, 187, 1224, -3896, -1549, 5711, -436, -7161, 2125, 6248, -4979, -6346, 4947, 4067, -6388, -5023, 5121, 3814, -6672, -4195, 9708, 6352, -10113, -2933, 14338, 98, -18166, 933, 15841, -8014, -17037, 9562, 13052, -12936, -11962, 11685, 7618, -12731, -6261, 12466, 5676, -11582, -3265, 11862, 293, -12829, 1736, 10415, -6463, -8480, 8830, 3459, -11346, 774, 10205, -5676, -7895, 8945, 4426, -10816, -1905, 9498, -2235]
561b235p280J3176M068j2830p49J2913k828j2620P531J2257j3721q817K0330K424
575A1619k7312O345L0568j8360l0332L0921K6819m0908j8637M9899R579n4532
587b4331o6N6057j0382n7529J8825N6169k7333n3517L7506M9586m6272m1445N4174
600A1442K9969n9400j6005N9441J146n4796J2145M4394k2463l1485K8253J8268
612B0909k9236m340K7325p402k3335J6997J6642k5793q848L2530j291l7675J2880
625a0637L9076k6399l4919M0939K6783n1330j2666N7652n909n9466K3569N3527
637D0220m0683m2502N5354K8158o5742j1764P2181n905p5008K4667P5311m2804
649A1483p1371O1012O1922p8900m8564R2190L0177j00342q151J01658j3952r5101
$$ y = [-2235, -9515, 3661, 7729, -5101, -5850, 7063, 4235, -8385, -854, 11403, -2318, -11135, 9195, 11619, -15693, -9348, 21220, 2860, -27472, 3449, 30268, -10640, -29277, 20622, 30201, -24331, -24397, 31660, 21278, -36251, -17426, 38743, 11410, -42107, -4601, 44985, -1287, -42732, 11442, 41411, -17989, -33994, 25447, 26593, -28203, -16058, 28336, 5873, -25612, 2641, 20909, -8327, -12667, 14658, 7256, -16079, 918, 17560, -8233, -17081, 15449, 14158, -23517, -10637, 28439, 2040, -32879, 8060, 34843, -16487, -29153, 28499, 22590, -36876, -13307, 40220, -463, -42965, 12389, 40547, -25195, -36959, 35222, 29317, -45691, -21024, 54287, 11483, -59888, 1124, 63046, -15854, -64418, 27772, 57949, -42393, -50544, 51114, 37162, -57939]
661e7939L4148Q2617m9287o4594N9019M4543o3031k5132O0738N735n4839J2322
673a5700M5624k7382l1864M0111J4434m9032N342N2504k7239m9000M8688L8502
685D4988o6869k2348P8791J803q3445K0534Q1917m0266p2882N8169N9436p1565
697a1737m3085Q0384K3924q6129m160Q5974j7512q1997L9341P2307n8911n5283
709e6884P5886L4123q6050r240Q8862j6242q4052L9722P2729n8698n6629P1818
721A5345L7448p9840j7931Q2283j638p9897K1038P2745l8828o1414N4121M4393
733D7825o5850k3574P1645J06o9710K4225O1742m5417m5617O2079K5385p2154
745b9315m023P5034j8540p3123L8081O4984n5489n3856O9646L9367p9886k1193
$$ y = [-57939, -23791, 58826, 9539, -55055, 3964, 48507, -14524, -39656, 21082, 26817, -28022, -15700, 29924, 2542, -29322, 10789, 25223, -23809, -18467, 34037, 6798, -42202, 6486, 44988, -21881, -44229, 34562, 36365, -47080, -26546, 55371, 15105, -57777, 392, 59828, -11737, -54822, 25562, 49486, -36643, -40803, 45171, 27659, -54338, -14997, 57310, -1601, -56884, 19002, 53125, -32925, -42165, 46697, 30455, -53597, -13875, 58854, 156, -56473, 15345, 52793, -27047, -44978, 37305, 35667, -44230, -23192, 49553, 10725, -50689, 3432, 47825, -18025, -41599, 30046, 30152, -39558, -15333, 46409, 992, -44625, 17454, 42839, -29315, -33338, 41696, 23156, -49967, -11886, 53098, -2391, -56247, 13399, 52766, -27120, -48313]
757d8313Q6528J868q6854J9820Q1444m0528o9426N7576N0530p0020k9120P5259
769B8764N614p3104J6672O5769l5453n2967M9758L6915o0212k0644O5798K232
781B9142o7455J6401O5295l4124n7048N1706M5027o5143k7560P3997O799p6471
793c9434J3749P1838l3863o2128M8929M7090o0041l0643O5620J3794o6344L381
805b8052O4485j7948n8299L2773M9329m4959l6633N4189K0894o0084l031N9795
817C2459j5691n4282L1978M2958m4633k8146N2178J1962n3995L850N1581j7758
829A2461m4982K9103L6661l8129k6106M4658J4434m8809j89M9978j3828m6881
841c1629K8280L9035m1529k8311N0025J3440n4272J952N3795j5820m8203K7435
$$ y = [-48313, 38215, 40083, -46771, -26951, 54493, 13965, -55461, 2115, 52645, -17375, -46495, 28764, 34378, -38726, -22054, 43715, 8262, -44705, 5053, 41968, -18244, -38888, 26910, 29142, -38313, -21912, 43383, 9259, -47789, 3917, 48944, -16199, -43759, 30238, 37037, -39434, -25685, 46153, 12290, -49838, -909, 46181, -13860, -44503, 21117, 34911, -31433, -28052, 36433, 18485, -39814, -7041, 42288, -2671, -39304, 14885, 35779, -24305, -27336, 32459, 16768, -37514, -5536, 37422, -7211, -35357, 16821, 28783, -25212, -21362, 30219, 12461, -32521, -3418, 33243, -4886, -30992, 13666, 28100, -20709, -20898, 29080, 15252, -31629, -3349, 35686, -5843, -34154, 15871, 29311, -24961, -23009, 30786, 14966, -33237, -5802]
853e802M0064l5534l0310M0414K0093m3093j0049M3467k51m1774J0804L7906k0874
866E061l0665K9934K0996l6620q855L8940m243l7663J5865L2159k5384k4813L1102
879E814J5814l3308p415L3718Q02l1647N699K8731j1641k4980J6403J9412k1333
892c931j2109K4473L394k4984O276K2753j5084j7250K2012R496k5937j561K6209
905A3757o093k4513J1632K0943j5394j6992J8403J3178k0045q905K1941L927k2849
918a1010J972K2259q822k0000J5052J5351j9983q711K3090K013k2800M438K0243
931A3092r281j7092J1232J3175j2380j0133J2786P957j2137n225J2825K560j2648
944e269R35J1448n123r151Q603N159j0703l41J0914m487q986P237N815q403k668
$$ y = [-5802, 34262, -1272, -31582, 8832, 28925, -14168, -24217, 19250, 18999, -22775, -11971, 25935, 5061, -25604, 4330, 25326, -11294, -20149, 18791, 14548, -23115, -7250, 24909, -475, -25288, 5814, 21628, -11680, -19095, 14623, 15425, -16222, -10523, 18208, 6567, -18413, -2010, 17402, -3931, -16040, 8433, 11827, -13157, -6881, 15872, 788, -16462, 5550, 15046, -10891, -12452, 13757, 7664, -16849, -5217, 15726, 332, -16660, 1743, 14921, -5124, -14029, 7912, 11839, -11010, -9038, 13221, 4399, -15601, -549, 14802, -5181, -13892, 9198, 11211, -11589, -7151, 13092, 3811, -13281, -2049, 11126, -1254, -11387, 1399, 9356, -2781, -8006, 4819, 7379, -5269, -4334, 7114, 1991, -7160, 1443, 6602, -4101, -4442, 6472, 1985, -7001, 236, 6051, -2352, -5020]
959e020P760J005n897N05M637m70l299R27K381j911k147K855j18n391K549O672
975E038o076o247J0481N504j3284k263J5028n98j4744K543J2750l680j1282K855
989c975R703j566r298J321R979q61j0346J469Q771l421p803L578N281k709k197
1004b074J688J753J190j244k816K492K909m861k802N313L09n862J715M997k445
1019B62k894L365J729k486j680J289J871j872l429K331M130l949l661O054K799
1034C859o382J29O385j655m402K539J891k717n19N38p06M59k03j696J609J172
1050C01k542L00L397j460k063L214J569k776l58J999L90r59k363m93L856r90o549
1067e527K368P798m248p027O930O846p147m746O725L604n826l920L932M173l395
$$ y = [-5020, 2740, 3745, -2152, -1647, 2990, 2520, -779, 148, 2529, 618, -1529, 1326, 1208, -4183, -1634, 5038, -1038, -7285, 3196, 8700, -4584, -6847, 8181, 7583, -7161, -4618, 8132, 4452, -6830, -3975, 5728, 4162, -5136, -3815, 6164, 5303, -5043, -3574, 5197, 1776, -6027, -2449, 2832, 123, -2074, -386, 1367, 2557, 1313, -1503, 989, 3898, -963, -3765, 1548, 1857, -4005, -2290, 2707, 262, -2632, 733, 2462, -24, -1704, -415, 1456, -416, -3845, -1514, 2616, -1333, -4994, 1060, 3859, -2523, -2394, 3991, 2336, -2066, 473, 2364, -353, -872, -334, -1040, -581, -784, -2480, -871, 301, -2241, -1941, 1456, -4, -2067, 1147, 2716, -60, -418, 1581, 1971, 1012, -1351, -1844, 2012, 1022, -5527, -3159, 4639, 391, -6636, 294, 7140, -7, -4753, 1972, 5576, -250, -4170, -238, 3935, 540]
1082E40n498L752O272m350n443N720M006n673j795M084Ok203M33n5l3J669j218
1099B14j702K687O02k879J039K284k414q30K432r20k154J377J191o00o62l48J458
1116G75K279k779l058M986K464p304j723P911m98p759J253O764j270n000P82M665
1132B488J274m739k062N688J782p060j266O639j244n809K398L676k795n63K671
1147A078k54j093J871O4j604k3L8R8k97k525J11L939j394m780L244N189l932l974
1165d244M571L322k967k648J334L153N50m947j886O738J035r021l18R226j625
1180B273q769K890P888k359n815K347O138j317o407J179O805k872p940M410O945
1195E396o616m754Q324K660p874K71O919j912n089J866K694j597k104k37J709
$$ y = [540, -4958, -1206, 5066, 716, -4727, 993, 4999, -674, -2469, 1615, 1621, -582, -149, -204, -237, 1432, 214, -1488, 1199, 1801, -1078, -39, 2245, -169, -999, 1433, 513, -1641, -264, 927, 327, -335, -683, 775, 3054, 275, -2783, 2203, 4667, -2637, -4360, 3551, 3053, -4706, -3453, 3311, 2041, -2959, -2177, 2488, 3762, -977, -3039, 2649, 4431, -2629, -3895, 2744, 1500, -4309, -1911, 1765, -1030, -1593, 1078, 824, -269, 1602, 1666, 62, 39, 77, 175, -122, -2647, -2536, 1403, 9, -4771, -1527, 3662, -270, -4244, 327, 3649, 682, -1966, -632, 2521, 3071, -1876, -3762, 2976, 4011, -5010, -5328, 3898, 2273, -6496, -3606, 4282, 1923, -3892, -1545, 4593, 3276, -3131, -1952, 4853, 1981, -5959, -1549, 5396, -1220, -5974, 2350, 5010, -2864, -2593, 4326, 2414, -2675, -809, 1885, 288, -1816, -2053, -344]
1210c44J944j723j679K853K649k323k558J406K473q40m801n21O420m1q473K320
1226c238J0462m229r494P498P407r858m635R876R7r559K867Q042n390n611P767
1241B002M916r056l495J1172K398j4265j058J6218j905j8416N243J8769q927j7033
1255a3437J1869J3982j2655j0115J1608O322q775l862N504K580j393k531j851
1268b754K365M570k966p741K950J0412l769j3956N829J7895q581j9629J3742K0272
1282A8639j8803j8673K3182J3811k7119q522K7889K237k6855L902K4898p839k1441
1295a4694J1975J7984j5453j4766J7716J0161k0581n169K2033m77k1066P453J9219
1308A4335j2652j4380J7213P312j9344q52J7622o195j5086J1121J0929j4360n598
$$ y = [-344, 1600, -123, -1802, 1051, 3700, 1377, -1181, 225, 2698, 1858, -2943, -3464, 2956, 2915, -5558, -3238, 7224, 2995, -6499, 999, 8406, -1452, -6087, 3789, 3886, -5673, -2806, 5236, -154, -5765, 2002, 6918, -2138, -5633, 5539, 7937, -6328, -7386, 8832, 6927, -11489, -6246, 12523, 3596, -13437, -1568, 12414, -241, -10356, 1252, 7574, -1201, -5063, 441, 3021, 1628, -903, -2754, -389, 4181, 1215, -6526, -3576, 6836, 3067, -10889, -5060, 12835, 4254, -15375, -1633, 18639, -164, -18837, 4345, 18156, -8963, -17485, 10404, 12641, -14214, -10312, 14586, 6747, -14694, -2719, 15265, -188, -14954, 2762, 12923, -7658, -12827, 9206, 8729, -12337, -4884, 14335, 1683, -12697, 4516, 11828, -7516, -8368, 9254, 3059, -12027, -906, 10023, -4337, -9935]
1321i935J6897J635j7238L487J7734q163j7053J2673J4822j8631j1685K2741N499
1334A2783k5992K376K6687j0103k3601J8101J9444k3668j2286K6995M906k8742
1346a3100J713K7428q402k5979J3544K3277j8551j9223K3377J4516k6372p394
1358a5166K8537l00k8064Q824K3929j7058j7518K2444Q631k5501O93K5446r486
1371E411k2731J7139J8719k3060j3498K7301P983l0544j703L2199n360l2299J2619
1384g824L0316k0213k5584K6674J8391l1370r005L2937p45l0975J0329K6294j7754
1397A471j9988K2788J2190k6152m895K7134k358k6850R531K5308j6329k1943K2620
1410B527J6836k7828r606L1399Q80l1877Q708K9590j7040k3706K4012J5773k8256
$$ y = [-9935, 6962, 8597, -8641, -5154, 12580, 4417, -12636, 37, 14859, -3772, -15457, 7284, 12783, -13209, -10833, 15854, 5751, -17850, 251, 19695, -3973, -16259, 10736, 15642, -13100, -11387, 16041, 7639, -18340, -4796, 18481, -70, -19293, 4084, 18600, -7772, -15166, 13371, 13071, -14993, -6169, 17760, 702, -16816, 5628, 14259, -11242, -10549, 14897, 5411, -17320, -181, 18538, -4522, -18020, 9281, 17264, -13280, -14983, 17216, 11856, -20443, -7824, 22492, 2279, -23305, 3369, 21760, -9610, -18615, 14322, 13577, -17398, -7069, 19225, 1471, -18517, 4271, 16461, -9691, -14586, 12548, 10190, -16660, -7129, 18179, 1850, -20093, 2527, 19363, -8465, -18071, 13328, 14208, -17669, -8961, 20629, 3589, -20117, 3895, 19668, -8588]
1423h588p674K8586j580k8345Q498K5146j4738k0571K0986J6509k4439r278K8498
1436A3010K453l0067O022K8556j5645k6196K2892J9036k9466j0540L2954K016
1448A5025l2670P572L0377j4613k6062K0271K0079k4019j4558K6221Q438k7367
1460a1306j648K7524m862k5212J2080K1093j8625j4928K2906O663k4921K169K4031
1473A4964j0367k0452J7034J4820k1908q817K3785K460k4508L475K4206q582k1858
1486a5748J4186J9699j8397j5352K2600R328k6043k749K5829n709k4385J2843
1498c898K0037j8693j3325K2983O255k3941Q31K3316p009k1430J2044J8332j6293
1511g91j4960K0220J1165k3122n988K5465k48k6270O175K4189j3044k0597J7958
$$ y = [-8588, -16262, 12324, 10744, -17601, -9103, 16043, 1305, -19266, 1720, 18229, -6210, -15488, 13010, 15463, -14604, -8582, 19974, 4329, -21867, 1025, 20061, -9405, -19945, 13009, 15025, -17645, -10073, 20304, 5691, -20371, -100, 19979, -4040, -18598, 7623, 16061, -11306, -12954, 14570, 9708, -15504, -3424, 17669, -956, -15884, 7022, 13685, -11236, -9067, 14964, 4597, -15855, 1179, 15999, -5909, -14726, 9059, 11519, -12989, -9514, 14692, 6110, -15748, -1562, 18137, -260, -15612, 6988, 16316, -9727, -12476, 13353, 7644, -16741, -3898, 16139, -2554, -15879, 7104, 13359, -10582, -9751, 13565, 6556, -14874, -2830, 15502, -791, -15751, 4469, 15634, -7488, -13476, 11989, 11741, -14529, -8354, 15835, 2791, -17806, 152]
1524A52J5089k0719p956K1441K319j9372L295J6310p071j2967R076Q656j1584
1537c331m981J2184J080j2466L680J2545q301j0340J3234P142j6936k217J8955
1550A0248l666j9397R035J6930j3685j3271J6506R248j7519m845J7409J529j6484
1563g962J593J5461m596j3960P698J1486j1233q353J3825L772j5399J944J5595
1576I871p226j3327J2139R946j5164n722J6435J639j6381J262J5066l798j3802
1589i062N299J2882o920j1182Q389R325r617o696J0328L279r691O20P674l849
1603G79m283N861P7o079M109M933p212k781R055L01j0042J394J0300k780j0812
1618g180L969J1103n653j1300P675J1128r861r517J2128P135j3373l788J3246
$$ y = [152, 15241, -5478, -13434, 8007, 10326, -9046, -5751, 10559, 3488, -9479, -403, 8253, -3331, -8312, 3872, 4952, -7514, -3834, 8711, 410, -9930, 3304, 10446, -6490, -8707, 10248, 6582, -12815, -3780, 13150, -535, -13806, 2700, 11948, -5571, -10416, 6993, 8522, -7962, -6369, 9092, 4496, -9464, -1766, 9720, -1513, -9866, 3959, 7731, -7668, -5724, 9871, 2645, -10682, 1457, 11403, -3761, -9483, 6952, 8591, -7790, -6528, 8538, 4740, -9062, -3763, 9119, 2199, -8983, -594, 8731, -886, -7582, 2746, 6025, -3666, -3046, 4628, 779, -3504, 2357, 2434, -3645, 464, 5397, -1815, -4596, 4459, 4760, -5282, -3888, 6412, 3632, -7180, -3211, 7892, 2239, -9061, -1386, 9742, -119, -9636, 2492, 9627, -3746, -7534, 5712]
1631E712r7j1717K497R051m121o237M662L977m166k010L949J183l718l34L275
1646A906j255l962K366L325m436j955O132J37n976K516N703m216l575N125J135
1661B970n033L15L712j990k252K330J132j952j19J726L7k379L8K794q16l919K087
1678a319M411l907l608N918K785o765l00P103j646o120K540M427l369l355K541
1693f64K563j956k574J634K889j476l140K523K905l072j549L216N42k726O69J324
1709A108j115M40K83j604R12J566k175j408L238L38l088R24K558j069j909N98
1725d03J354j15j952m94K440P59l330M07M524j373l999K849L137l955j951L392
1741A290J65l084j47K031K9j161n77J814J602k321j340L524P08l959N15L467j869
$$ y = [5712, 5615, -6102, -3605, 5446, 1325, -4912, -250, 3727, -439, -2449, 1500, 2683, -1035, -1369, 1906, 651, -3311, -945, 2380, -2056, -4011, 2121, 2258, -3718, -1202, 4501, 285, -3290, 1835, 2970, -2063, -1748, 1964, -26, -2278, 52, 1184, -768, -887, 839, 876, -1503, -1465, 1329, 513, -3406, -1319, 3092, -815, -4423, 1495, 4280, -2485, -2785, 4318, 2672, -3448, -908, 3519, 150, -3205, -664, 1899, -57, -2631, -997, 1892, 416, -2724, -201, 2704, -368, -1917, 1299, 1841, -885, -216, 1108, -7, 433, 716, -888, 24, 1590, -585, -1993, 1245, 1583, -1505, -581, 1977, 908, -1001, -403, 951, 836, -1116, -1610, 830, 1589, -1741, -1334, 3190, 1817, -2182, 667, 3804, -151, -2102, 1290, 1455, -1629, -1776, 255, 284, -877, -1454, 360, 1962, -359, -1699, 1825, 2533, -1426, -911, 2556, 687]
1758F87k672K058J029j681j63Q12m37N94J14j429O47J645j546j215J601N24j088
1775e20j2M65M48M49j326o44K504q5l242J215L127k854k381L744M60l658R43L091
1793A724j796k046K137J560j892j020J766J374k189j935K848J903m449j411N681
1808B255k9n815J788N547l002m018L985K284l763q74K510L6j767o8Q92L26p82
1825d95k74J276J52j313R23J147j728m54K483j227k196K187Q78l096P77K853k277
1842c84j549L881J7l780J802L271k872k852L430J861l833k300M151K417m869k629
1858d238O317K467p610r85R180p25r213K809Q258m500p218N247N111n474l849
1873d423M840L138m172k662L968K985m236k483M266J688m696p14M161n66k734
$$ y = [687, -1985, 73, 1102, -579, -742, 70, -367, 227, 341, -1088, -441, 1204, -342, -1557, 44, 568, -520, -532, -67, 381, 830, -496, -1140, 1364, 1279, -1963, -748, 2379, -475, -2856, 888, 1348, -2310, -1367, 1724, -72, -2118, 19, 1579, -313, -1333, 433, 1807, -382, -2317, 531, 2434, -2015, -3426, 2255, 2226, -3589, -1801, 3746, 744, -3274, 711, 2995, -768, -1642, 868, 904, -863, -931, -39, 287, -495, -769, 507, 659, -654, 269, 1416, -312, -766, 1717, 490, -1706, 481, 1359, -1737, -960, 1893, -384, -1933, 1948, 1965, -1815, -13, 3258, 386, -2466, 964, 2825, -1008, -3308, 843, 3260, -1609, -4238, 2079, 4546, -3064, -4049, 5131, 4406, -4807, -1998, 6260, 1760, -5458, -211, 4900, -574, -4423, 417, 3555, -617, -3279, 689, 3674, -562, -3045, 1221, 2909, -1787, -2501, 1660, 1094, -1640]
1888a640J302J109p67M49m1j478J776J612l269j216L780l4m124M05L614l46l472
1905b340K62L681N27m185l76N177N6n902J153N716k638n435L733L806m064k154
1921b983L995O06k940P9K316m00j667J53K090o01k873J533L144l143k696M695
1937A308J766n609j03O135j397n585K716M311l261l138K882K032k520j791K222
1952c2J587k065j021K856L07l061J320K720k896j996M498n6n505K218N176m388
1968c38m229N804K677o175o54O230m16n626J274N403k189n293L059M948m691m658
1984d874O326L364q011j087R175j477q954M252P715o498n906P898L113q033o79
1999c676P266r18o307K143N731l522m534M780L475o474j994P702o45q833L647
$$ y = [-1640, -338, 771, 4, 453, 412, -1066, 710, 2322, -947, -2163, 1617, 1583, -2541, -2136, 1478, 1132, -2340, -2078, 1603, 2130, -2055, -2431, 2746, 2802, -3100, -1947, 3769, 1131, -4304, -571, 3235, -829, -2983, 1012, 1618, -1322, -1243, 1073, 673, -994, -841, 1249, 648, -2225, -692, 2452, -691, -3387, 1308, 3074, -2535, -2638, 3497, 2100, -3485, -769, 3542, 281, -2857, 25, 2057, -463, -2254, -32, 1555, -510, -1531, 1325, 1632, -1429, -109, 2611, -285, -2281, 2217, 2161, -3344, -1126, 4050, -338, -4567, 1237, 3914, -2261, -2915, 3315, 2899, -2727, -1453, 3950, 1761, -3532, -473, 4475, -216, -4874, 1452, 4816, -3195, -4282, 4893, 3416, -5538, -1286, 6429, -69, -5975, 1923, 5036, -2997, -3676, 3590, 2672, -3635, -1492, 4239, 717, -3817, 963, 4438, -2036, -4030, 3672, 3027, -5806, -2159]
2014b159Q775o845p222R559M802j1078j818J1663j173j0687L564R069n413p513
2028f476O514N737p535l886Q488J920r167N46R601l715r215O988P690j0111m820
2043g441J1807J256j2634K412J1897n049j0101P316Q094q676n584R197L227r209
2057c488j268Q921j087q650L483P663o140n415Q681K671j0165J206J0476n308
2071A580r340Q767O801j1309l662J2391J04j2557K831J2147n288j0926P552J0075
2085I166r509q178J1574O301j3624l358J4698m89j4987M333J3067p928j0491J0389
2099I64P002j1616k710J1626o40j0226L728Q594n818o887P672M786r511k674J0884
2114E174q5j1783L251J2026o851j0684R824Q225j2392m964J3238J016j2545K510
$$ y = [-2159, 6616, -229, -7451, 2108, 6910, -4168, -5986, 5677, 4504, -6183, -2619, 6450, 1037, -6476, 38, 5775, -1760, -5646, 2842, 4762, -4405, -3859, 5742, 2027, -7188, -200, 7490, -2621, -7441, 4366, 5622, -7012, -4600, 7297, 2248, -7853, -537, 7557, -1119, -6703, 2494, 5721, -3488, -4756, 4165, 3078, -5572, -2089, 5574, -566, -5981, 2700, 5371, -4794, -3588, 6888, 1580, -7760, 1007, 7808, -3501, -7163, 5228, 5332, -7225, -4394, 7753, 2465, -8461, -909, 9166, -343, -8521, 3053, 9354, -4270, -7628, 7070, 6581, -8406, -4073, 8994, 1066, -9425, 964, 7966, -3650, -6360, 5266, 4626, -5600, -1872, 6722, 904, -5983, 1689, 6475, -3036, -5710, 5174, 5089, -6694, -3443, 8583, 1732, -8952, 872, 9097, -3295, -8259, 4979, 5995, -6550, -4040]
2128d040J0821n001q040O826N312p754k614Q284l71q519L061Q285n852p342R163
2143B219N834j2021l309J3821n44j5048L925J4137p757j1940J0479R263j1604
2156b545n506J2471K834j1632r3J0801k560r968M315Q434o820o923Q696M498j0372
2171d370j371J1138k148j0529N576Q753q069n904R320K962r340L43Q584k328p116
2186d499L921N374n299m200O270K312p354n71Q064j648q181M605P833p296n735
2201f404R269L052j0649M6J0565l186r083N569P497o983n446P980L542q661j914
2216d806Q871K22r488J648R609l669q843N925P716p963n603Q970K833r073p4P891
2232D166j846o118L461L942l619k130L701M37l531P54L071k151l250L457K610
$$ y = [-4040, 6781, 1780, -6260, 566, 5878, -1876, -4490, 3794, 3423, -5096, -2035, 6250, 398, -6944, 2219, 8053, -3968, -7277, 6544, 6000, -9048, -5123, 9014, 1257, -10683, -204, 9059, -2545, -8051, 4420, 7254, -4378, -4471, 6330, 3770, -6198, -1883, 6551, -269, -7192, 1504, 6002, -4370, -5741, 5397, 3249, -7280, -1704, 7049, -1020, -6924, 2396, 5358, -3982, -3639, 4945, 2617, -4499, -578, 4796, -503, -4703, 1567, 3879, -3475, -4046, 4018, 2370, -5811, -1206, 6627, -669, -6404, 2865, 5917, -4732, -4686, 5879, 2693, -6390, -821, 6676, -307, -5753, 2227, 5769, -2892, -4806, 4065, 4287, -5201, -3553, 6056, 2387, -6456, -531, 7185, -778, -6381, 2589, 5422, -3651, -3725, 4166, 2320, -3798, -337, 3605, -14, -2144, 1557, 1994, -1537, -783, 2288, 137, -3113, 344, 2954]
2247B954m832j780O738K68p487K166P689m489o667O265M737p620k714P759M31
2262C418p266J418O431k558n486L431M862m292m465N452L507o490k405P565L72
2277C494p913J610P386l709n696M980L838n480j522M881j95l796J273K706k000
2292a43j562K152R33k599l48L142l79l629J448M045l069l839M414K629n413j025
2308c243N823r95m763K546L486l266j786L652J22l372R31K939j562k754K010K814
2324B582k880k993M012K502m936k117O128Q97o396Q41O416k173n184K990L637
2339C326l124k426K345J331j798j080J196P77p39o85J355O82r81K36J175j498
2355I2o06J775j089k081K007J412k927L4L207r08k546J990J786k365j146K015
$$ y = [2954, -1878, -3658, 3080, 3348, -4139, -1973, 5716, 1227, -5440, 825, 5562, -2058, -4772, 2987, 3418, -3848, -2430, 4001, 1443, -4043, -612, 4250, -42, -4507, 945, 4452, -2038, -4443, 3122, 3494, -4419, -2809, 4577, 868, -4828, 152, 3990, -1490, -3012, 1869, 1674, -2122, -849, 1857, -143, -1705, 447, 1380, -1219, -1567, 1575, 1196, -2433, -985, 3060, -9, -3848, 566, 3195, -2218, -3243, 2580, 1585, -3178, -632, 2854, -412, -2198, 1454, 1576, -1796, -865, 2074, 512, -2242, -232, 2582, -298, -3291, 721, 3223, -1713, -3830, 2298, 3195, -3201, -2360, 4056, 1883, -3301, -311, 3326, 202, -2224, 121, 1452, -346, -1426, -230, 547, -192, -877, 478, 1160, 179, 415, 1590, 92, -514, 1261, 172, -1909, 98, 1510, -1417, -1383, 1824, 916, -1630, 360, 2146, -219, -1365, 650]
2371F50L47j886k62J454O80j407m53K479L50k933L21K759j716k585K206J784l052
2388a264k22K899m25k407J466J601j826j059J341N98j458j229J721J496k030r60
2404a758L235R66l616K4L995j423l632J987K285k703j460K030L54j271P6M63l7
2421d85L29m09j80L32N60k7K6k64P92J117j383j535K289O99l935j55L910j528
2439A53l780K935L076l273j374L845O61l244K37K476n97k679L76K347p09k469
2455b019J306K819k191k066L446J338l724k0L631j736k940K430J273k921L9K646
2471A311j039j591J643J053j731m01J559M83j631n00K026M54k612J65K889j203
2487H75k861K171K133l391r54L471q25k957K255K204k725o72K982j54k539O52
$$ y = [650, 997, -889, -1151, 303, 983, -424, -877, 1602, 1952, -981, -660, 2099, 383, -2202, 4, 1788, -1264, -1486, 1413, 988, -1419, 47, 1648, -178, -1237, 104, 702, -756, -1985, -264, 1232, -798, -1758, 1477, 2443, -1173, -1149, 2846, 1423, -2209, -222, 2063, -640, -2100, -70, 284, -987, -911, -448, -485, -156, -565, -745, -413, 147, 120, 146, -118, 674, 1791, 408, -1127, 1162, 1861, -2074, -2229, 1681, 153, -3627, -692, 2384, -889, -2263, 1582, 2243, -1001, -764, 1712, 1115, -1564, -1188, 1159, 450, -2019, -713, 2106, -85, -2151, 1295, 2633, -1091, -1111, 2520, 784, -2156, 274, 1547, -1374, -1335, 1311, 272, -1319, 324, 1377, -354, -755, 804, 1287, -344, -844, 1182, 1636, -976, -811, 2078, 875, -1986, 185, 2318, -1073, -2027, 1444, 619, -2338, -83, 2121, -604, -1276, 1706, 1552, -987, -335]
2503c35K188j105k165J012K239j367k706J741K628k567k410L583J432l725j00
2518a657L847j045k866K013J596k129o19J450l27j268M45L59j05k66k1O91K21
2535C19q02L24J250j082o06J613j64j797J081J019k261l91K510r52k376J904J770
2552A359k042r23K011R77j386j031J295J594j859k141K198J843l111j371L543
2567I56M80l378O91L044j026j850J514P89j290l25L71m28q7J91M0K33j69L69R59
2586A084r77r32J991O07l078J30L426j783l167K578K386k830j114L036J89k254
2602g08J63J508n41j297M15J011j58j371J116J455j759j004K722K43l375R53L245
2619B618k531k879L361J657l699m48L637k53k770O71K127o34k182N30K170o44
$$ y = [-335, 1853, 748, -1417, -405, 1834, 467, -2239, -498, 2130, -437, -2847, 736, 2168, -1557, -1657, 2190, 1145, -1721, 292, 1888, -241, -860, 590, 263, -1005, -560, -201, -306, -572, -593, 98, 319, -483, -159, 1091, 9, -597, 1016, 852, -945, 136, 1155, -1106, -1497, 1013, 61, -2315, -411, 1359, -683, -1606, 405, 1382, -4, -1035, 260, 1854, -5, -2146, 52, 1895, -1216, -2587, 956, 1436, -1942, -1251, 1793, 767, -1083, 431, 1220, -70, -395, -24, -452, -539, -348, -308, -75, -244, 125, 1084, 107, -825, 1166, 1773, -1305, -1175, 2251, 468, -2699, -121, 2265, -565, -1679, 1357, 1546, -708, -545, 963, 422, -875, -460, 551, 393, -978, 138, 1593, -166, -1170, 1552, 1795, -1580, -627, 2618, 87, -2792, 569, 2226, -1473, -1921, 1716, 1463, -1307, -636, 1491, 857, -1325, -795, 1375, 731]
2635G31k293J368K246k078j566K732L86l094P80K489k317j628K982L22k816J200
2651e56K456j397j575J816R03k137r29J624N49k001o35K666M37l120R25L491j785
2668G32l380L165K304m505j163M698n57m013J850L498k158k533K600J758k625
2683c29j761K430J278k970j143L469M55l627J006L828k161k926L571J669m428
2698a639J21L853j817l354K615K281l074j248L340Q89l088j92L013J85l543K90
2714a368L638j073l793K361L096l388k054M093K38m056J591L543l065j867L790
2729A686N78m020Q00L518j539l478J932L428k837l609L572L590m616k924N872
2744A953K175o684l18O896j420o389K788M905l759l301L861J659l515n60K759
$$ y = [731, -1562, -194, 2052, -26, -1592, 1140, 1526, -1568, -788, 1701, -616, -2244, 738, 1060, -1756, -556, 1900, 503, -1072, 744, 1647, -490, -1419, 205, 754, -1247, -1882, 784, 1221, -1899, -974, 2517, 732, -2648, 517, 2821, -1684, -2847, 1851, 1294, -2719, -869, 2629, 471, -2062, 538, 2296, -329, -2090, 340, 1618, -1352, -2495, 974, 1429, -2198, -1192, 2636, 475, -2451, 1120, 2789, -1639, -1518, 2335, 518, -2836, -221, 2060, -1014, -2262, 1078, 1967, -1121, -1313, 1700, 1885, -1658, -1368, 2270, 1197, -2596, -235, 2861, -527, -2581, 1512, 1750, -2306, -715, 2828, -237, -2104, 1686, 2264, -1756, -956, 2562, 1023, -2455, -523, 2905, 68, -3541, 31, 3621, -995, -3919, 1953, 4128, -2556, -2874, 4022, 2602, -3787, -999, 3906, 147, -3154, 707, 2366, -1149, -1709, 1050]
2759A050k16j954M87J816r93j213J769R14k705l3L367j506l858L032L468n071
2775a646k210N967O71o293J325N781k406m982L551L878l659l056L671K599l988
2790g97k079M219J236m749l26M985j692m567L114L494m346j617N182J39n076K118
2806g62M372l014l341L525K096m052j644L588J125l775p81M172L04m089J001M146
2822B871k106l424L266J617m070K01L666j961k743L557J325l929K11M135j230
2837A386l826K170L394k549l684L189L495m023l303M815K729o092j359O534l09
2852B567o457K260O082l877m147M928K589m873j166M302K0m167L94L583r54l538
2868b454J300L368j997k924K984K463l534j210L831o42l261J962K148k923k35
$$ y = [1050, 834, -1120, -633, 1183, 190, -1023, 746, 1660, -1045, -1078, 2289, 783, -3075, -43, 3425, -1646, -3856, 2111, 2782, -3511, -2186, 3595, 1189, -3793, -242, 3636, -23, -3079, 592, 3191, -797, -2876, 1343, 2579, -2170, -2496, 2489, 797, -3770, -656, 2838, -1508, -3125, 2057, 2196, -2880, -762, 3610, 596, -2745, 780, 2876, -1176, -2820, 768, 1893, -1882, -2663, 1509, 1813, -2276, -1275, 2871, 765, -2659, 607, 2224, -1846, -1645, 2021, 60, -2683, 874, 2199, -1730, -1519, 2616, 1386, -2440, -270, 3124, 575, -3109, 80, 3575, -448, -3751, 1064, 3793, -2299, -3658, 2876, 2567, -3890, -1630, 4452, 575, -3572, 1356, 3945, -928, -2094, 2208, 2228, -1939, -1545, 2038, 1084, -2454, -1154, 2214, 217, -2707, 277, 2740, -794, -2004, 1827, 1185, -2076, -114, 2034, -889, -1124]
2883a124L168j222k590K484J769l412p64L201l32l405K76L311n05l608J420M221
2899B888j837l882L276L612m735k585N194L44n650J272M940k747l602L829K530
2914B847l966r96L942M37l620l07L409m66m123Q47M130j664l887L081L599l731
2930d68k303M358P99l845M47K868j265j887J237L69r83K59J94l25L23M97k17l60
2948c02L78P44l03j346N73J932j361k521K345K075l542j324M349M25m452J162
2964a168L934j782l020K018K263k020j977J738J664j505j839J840J666k224j154
2979a566K779L12k767R05K329j948j675K485K17k449P42J980j176j189J274P15
2995I68n77p88L18J105l71j433N63J381j150j208J412M62j405N05J010r28j3J226
$$ y = [-1124, 2044, 822, -1768, 716, 2485, -927, -1691, 1510, 1178, -2227, -1951, 1360, 855, -2753, -1333, 2888, 1051, -2831, 445, 4057, -678, -3263, 1931, 2275, -3375, -2103, 2837, 90, -3512, 317, 2847, -1119, -2115, 1827, 2264, -1356, -1663, 1746, 1280, -2843, -1996, 2134, 470, -3417, -336, 3263, -468, -2771, 1587, 2386, -1459, -1012, 1856, 591, -1296, -59, 310, -673, -414, -220, -545, -222, 275, 58, -302, 76, 820, 517, -829, -256, 1676, 315, -2206, 139, 2214, -1328, -2652, 1697, 2122, -2330, -1168, 2766, 984, -2036, -18, 2245, 225, -1752, -14, 1650, 145, -1694, 146, 1812, -412, -1566, 1213, 1525, -1242, -337, 1992, 44, -1631, 854, 1071, -1378, -636, 1344, 168, -1021, 253, 968, 391, -397, -79, 1026, 655, -778, -215, 1166, 16, -1192, 220, 682, -723, -218, 792, -136, -149, 1077]
3013A077j034p30J523j36j843P64J217j190q40J158L99o38k40M20R18m30j115
3030g20Q69J272j800j141K582j54k827J141K483k084j857K717J266k818l90K189
3046G28M05j826p99J667J044j865j153K275J189k531m16K533l31j831Q62O64r12
3063b97M77j10r84N75J273j466j149K001O47j795k20J554L72r93m75Q78J145j152
3081B81j588J675J203k153p52K216k77j663J147O06j232M26J072j235l72J410
3097G64k52j535P43J009o26o54M61P61P8r07J8J300m19j665J043J419k126r78
3115a566K615m12k334J144J820j485r08J906L04j213n5O94L83n47q13M90R67r43
3133D7j219J284O12j372j1J097n38o8N99p57l67J773n99k195J456J896j764j528
$$ y = [1077, 43, -687, 836, 700, -1143, -379, 838, -352, -1192, -34, 365, -273, -513, -93, 825, 395, -720, 149, 1421, -379, -1520, 1062, 908, -1919, -778, 1705, -379, -2236, 481, 1747, -1071, -1461, 728, 1133, -693, -1492, 175, 1219, -646, -1799, 476, 1665, -866, -1282, 1251, 920, -911, -49, 615, -297, 180, 70, -914, -339, 934, -532, -1681, 320, 967, -828, -1048, 506, 878, -115, -590, 288, 1433, 281, -1307, 368, 1571, -582, -1334, 882, 605, -1058, 89, 695, -537, -111, 961, -274, -646, 764, 512, -1023, -280, 729, 103, -551, -90, 671, 749, -158, -140, 1160, 741, -924, 119, 1538, -588, -1566, 1049, 637, -1697, -553, 1267, -218, -1126, 780, 1084, -129, -184, 510, 893, 346, -467, 23, 990, 47, -1172, 112, 724, -648, -659, 438, -100, -168, 431, -326, -693, 1080, 481, -1714, -258, 1638, -126, -1654]
3151a654J915J202j596j068J309J290r62j904J079K134j859k192K090J659k500
3166a057q14K500J4j459N82P41n59L20J95p54K83O95j018l90Q72K9n48k14K50
3185c32M82m8r28M41J546j135j422K016Q63k719p4K726r51k283J666J583j750
3202c19n34J608J91j279j33R16Q6q54o38J378K58j683K83J924r54j745K070R80
3220A555k317m5K262p30j893J173R01j110k88N98K07r6k91k81Q98J80q80Q6P74
3239G03l62n33L04j72K46O03j263o39K213J64k845P70K994j412k737J871K168
3256B073k090j675J769J531j487j629J228K112j544k154K142J864k662j285L025
3271A218M0k781O29K101j295j174J269L96n24L4M9J79M11n11m62O10l0n79K29
$$ y = [-1654, 261, 1463, -133, -1201, 108, 1398, 436, -1468, -389, 1745, -114, -2306, -216, 1443, -1057, -1871, 629, 643, -816, -234, 507, -52, 268, 463, -291, -8, 687, -331, -721, 151, 180, -368, -582, -332, 150, 102, -826, -385, 1161, 26, -1396, 620, 1483, -1236, -1310, 1416, 465, -1818, -152, 1431, -319, -853, 755, 946, -333, -466, 450, 536, -318, -956, 422, 680, -1003, -720, 1204, 250, -1495, 575, 1555, -762, -807, 1455, 725, -1168, 5, 906, -204, -492, 106, 313, 217, -74, -355, 543, 723, -157, -71, 703, 341, -192, 112, -60, 186, 789, -474, -1113, 1100, 1264, -1581, -811, 2183, 771, -1966, -95, 2073, -17, -1692, 77, 1608, 121, -1508, -280, 1832, 288, -1866, 276, 2140, -522, -1807, 1218, 1258, -1523, -894, 1207, -88, -1262, 7, 403, -121, -87, -38, 141, 552, 41, -421, 189, 159, -420, -191]
3290a91O9k07M71j94r64J173R31k059m04K600k92k829J191K518j783j750J880
3307A60J153j537q36J063Q58p41j175O27J392q37j349J360N85j437M74J103j546
3324f83L8J908q98k118K144J341k566p26K680M52k329l54K199L58k297q21K378
3341G06R23k850n33L314k98k778J244K325j835j032J712j70j455Q88M69j422K95
3358d97J492o97j126Q78J103q56r65N97J342q00j877J149J924j880j501K518P86
3375A590k634L22K369j291j435J685L81j897O22J403j190q94J196N18j197m48
3391i00J133P64j459q82K211M38k733L19L108j102k884K086K338k880j676K884
3407G65L38k551K46J775m01j270O37J027l8r42L76P93o89p71J007L36j646O25
$$ y = [-191, -122, -329, 142, -52, -1016, 157, 1088, -971, -1375, 1225, 933, -1896, -705, 1813, 30, -1720, 160, 1313, -224, -1060, 3, 861, 120, -1055, -428, 964, 127, -1222, 138, 723, -714, -240, 863, -683, -645, 1263, 365, -1753, 391, 1732, -834, -1560, 1120, 1572, -757, -1111, 1088, 1446, -851, -1672, 706, 1629, -1221, -1754, 1560, 1262, -1516, -272, 2053, 218, -814, 898, 728, -727, 161, 630, -792, -497, 995, 298, -828, 50, 1153, 297, -668, -71, 1271, 471, -1406, -257, 1667, -213, -1714, 804, 1590, -1044, -722, 1647, 356, -1079, 606, 987, -910, -288, 1115, -75, -969, 227, 745, -452, -900, 233, 997, -462, -1344, 867, 1305, -1428, -1109, 1999, 897, -1987, 99, 2437, -443, -2119, 765, 1103, -1448, -1202, 573, 172, -1098, -461, 566, 528, -414, -38, 755, 66, -705, 302, 638, -1008, -383]
3425c83J602j878r51K558L12l244R60L062j696k661K202J990k206j565K120J395
3441A617j886j424J863J751k128j630K412J000k643k06K282o69j525J189N49j080
3457e28O54Q70j301k68J638l32j727O21J473r81j371Q94J418p11j787J158K143
3474A863j410k154K520J406l173m17L242p58l026J523K183k204j335K470P85k072
3490e57k91K056K4j978l8J980k73k451Q49K345j365k212K390J169k585k49K644
3507A458q62j993J919Q68j940r6K005p75j480R81R67j229j071Q51J097j284r91
3524a575J573J110j921k29K666n40k385J567J748k533q68K722n73k786J395K076
3540A447k220j249K469Q36k123o50K505L44k455l58K872j55l188Q85L176j526
$$ y = [-383, 1219, -659, -1610, 948, 1260, -1984, -1024, 2038, 342, -2319, -117, 1873, -333, -1898, 222, 1617, -269, -1693, 170, 1921, -207, -1837, 575, 1575, -1068, -1274, 1008, 339, -1186, 3, 552, -528, 126, 996, -305, -573, 1065, 733, -994, -373, 1100, 119, -1252, -358, 1060, 349, -1438, -280, 1863, 453, -1701, 819, 2225, -948, -1365, 1877, 1119, -1907, -384, 1799, -405, -1740, 730, 1515, -557, -848, 1208, 1232, -746, -784, 1196, 923, -1528, -679, 1666, 301, -1911, 479, 1648, -937, -1186, 1458, 596, -1397, 522, 1390, -550, -646, 1359, 584, -896, 85, 1052, -177, -1248, -397, 700, -584, -1575, -2, 1108, -813, -1042, 1624, 1084, -1301, 266, 2014, -519, -1387, 1335, 762, -2024, -629, 1447, -773, -2022, 447, 1283, -840, -1490, 1015, 1359, -1096, -1454, 1418, 1263, -1925, -1040, 2136, 610]
3556F10k758K511J718l053q45K974l96k599J312J539j298o71J333K23q27j86Q01
3573C88m5j070L6J025k49j117R33J336j281p77J975j29k031R60J552k155o88K111
3591G74k36j904J112J492j289r08J393O47j257o98J145R17j677p16K104L90k299
3608a010L17K679j268k365J950J391k536p19K277k24j931J032J396p95m95Q76
3624E75M73o86m78N07L56j024o11J416k0j689P64J812j403j236K098L92k095J62
3642f87J664p91j122J124L87o83j54N47n8l17j86K96J72p29Q5J088p50j012J414
3661B88Q33k040q4K317q57j979J291J582j898q78J827L22j405J43P24Q3k82l29
3679c42K65L16l81k36O17m84k73P92j68j159J050J230j896n23K235j2k484Q75
$$ y = [610, -2148, 363, 2081, -972, -1817, 1157, 761, -1838, -526, 1013, -285, -956, 377, 600, -227, -413, 388, 343, -727, -691, 334, 85, -1032, -99, 1237, -44, -821, 1154, 1025, -1006, -46, 1506, -649, -1337, 774, 538, -1366, -254, 1238, -51, -959, 434, 1081, -176, -874, 271, 1188, -489, -1205, 899, 1289, -1010, -693, 1986, 718, -1647, 303, 1694, -842, -1561, 716, 492, -1439, -407, 989, 194, -301, 575, 1048, 362, -116, 391, 747, -277, -888, 528, 508, -1181, -417, 1395, -8, -1244, 854, 1246, -849, -687, 977, 186, -936, 188, 575, -108, -262, 285, 227, -90, -276, 20, 192, -537, -452, 636, -114, -1126, 288, 1121, -919, -1003, 1314, 457, -1522, -231, 1351, -547, -1425, 402, 724, -681, -538, 186, 269, -13, -342, -77, 239, -142, -378, 239, -245, -518, 274, 106, -1053, -3, 1227, -669, -1192, 1043, 1031, -1453, -578]
3697e78J990j360j398J351R90j116n01O77O73n11q40O71R48q81r41J225J95j302
3715g08L80O94q01o0J194n77q20J411K36j376L81J113q85q69P60L67p64k95M20
3734a99O31k00o07O59R85j067j108J356N10j707r7J580m81r39Q15L86p59K46K34
3753B38m19L25L75q28J49Q78m79l98L51J30j89Mm24N1O12o82r42J157P22j516
3773h85J53J887l94j256Q33P74r98j72K79j41j54l16l08L61K16p15N30Q29n96
3792g3l17Q69m63q98R09O30j391K65J383n94p77P91K99o21k74J18p7N4l32m56
3812i55J029J84r24L06J174n99n96Q08q1o47L59r2o22O17N91j234L75J334o55
3831C72q57P53P00r03l00K28J51j72o99r1J127j40j249Q87J262j129o60J500M3
$$ y = [-578, 1412, 52, -1346, 5, 995, -121, -622, 55, 728, 217, -623, 48, 996, 115, -826, 399, 594, -708, -328, 366, -435, -495, 699, 122, -698, 713, 949, -427, -46, 1067, 182, -687, 73, 440, -324, -619, -199, 432, 232, -375, 284, 1269, 202, -906, 450, 960, -747, -844, 736, 255, -684, 131, 517, -242, 4, 238, -181, 144, 519, -309, -160, 718, 239, -159, 192, 322, 133, 137, -287, -236, 376, -306, -1248, -91, 631, -885, -732, 1155, 761, -495, 338, 1112, 114, -58, 221, 80, -74, -390, -698, -337, -121, -836, -306, 523, -73, -390, 479, 16, -882, 27, 657, -734, -469, 914, 320, -457, 334, 633, 12, -262, -144, -221, -167, -499, -955, 74, 258, -666, -360, 814, 215, -381, 427, 346, -301, 58, -34, -656, -39, 552, -682, -307, 1027, 372, -485, 268, 968, 65, -235, -7, 144, -28, -727, -818, 309, 169, -1080, -193, 1069, -60, -720, 780, 823]
3850H23j437O59R03q51l35R74j80p44K86kj15l25l24N97M01q01l53J426M35j546
3870e09M38J497q18r60Q16rp41K26j86k28P45O6r83M13J115o65j013R12O62n02
3890B76n59J2P99J77j247l22J535k9j872M96J735r79j112J204M71r86J89O29n65
3909a48O4N54l69k92J73J87k18m27j83P15K49j259l4K104m70j827J087J756j603
3928E9j367J375P41j360k44O79L71j49n87j4R27k2j067L17J086n09m99L71m3N2
3948A17j3o30r6J030l24j165R65J264j437n43J684l6j587M49R83n24p77O13M76
3967D49j16o11l7J161l31j400Q37J163j308j013J715L02j713M68J518p96p62J013
3985E39J30o39J37kk13p3m1r6M81k44l51Q68K8j014N74J146j137p58J385j56j214
$$ y = [823, -614, 45, 948, 97, -238, 736, 556, -188, 98, 96, -19, -344, -668, -71, 330, -471, -824, 602, 1037, -509, -71, 1426, 608, -352, 464, 455, -286, -60, -246, -474, 271, 337, -646, -233, 882, 217, -796, 116, 778, 276, -283, -271, 528, 705, -542, -864, 671, 642, -1230, -734, 1001, 22, -1090, 114, 585, -401, -212, 417, -148, -84, 470, 101, -191, -18, 169, -49, -476, -659, 56, 305, -954, -988, 1116, 646, -1181, -94, 1662, 59, -1308, 67, 808, -552, -796, -117, 254, 105, -482, -496, 431, 409, -658, -341, 745, 236, -263, 108, 65, 117, 104, -526, -622, 408, 84, -1081, -116, 1148, -289, -832, 852, 816, -771, -322, 661, 137, -640, -27, 449, 333, -278, -315, 846, 515, -885, -48, 1115, -193, -1206, 509, 811, -902, -434, 1084, 288, -474, 539, 669, 30, 167, 165, -48, -121, -162, -258, 223, -21, -372, 496, 524, -490, 84, 1230, 93, -665, 720, 564, -650]
4006f50L20P46m05m7K15k56L19M65q80n71R66j1q84J25P20J95k26k80K07R60n68
4027D60j387P97J365j591j190J876N16j957L33J790m39j180O41O89o53m62M1M97
4045A46l7p92M65R94q94p70J531N9j778O10J637j359j187J542N59j739J65J161
4063C13q4m96L25K97P7m96k43L40J85p19L1R45o41n01J228j70j065O78Q64j135
4083b67k19J169n24j105R35N02j111L97P52l05m21L17J19O1l79k69Q70Jr26J87
4103b16J438j073j208J336M67j656O4J719p88j056J312M17j080J94R26l94l97
4120ER2K90Oq27n9J071l35j280Q42J508j689q80K249R4k149N42J840j127j059
4139h66J031L93q21j43N69m0k77l3N17p8n22p0Q09m42r15J134P13j670p2J943
$$ y = [-650, -330, 416, 11, -36, 179, -77, 242, 707, -173, -744, 222, 211, -673, -548, 172, 367, 141, -139, 68, 1028, 460, -927, -130, 1235, -356, -1546, 330, 846, -1111, -778, 1012, 573, -607, 34, 723, 70, -392, -351, 146, 109, -683, -218, 776, -118, -888, 643, 702, -1076, -466, 1171, -188, -1375, 167, 726, -1013, -848, 313, 229, -267, 58, 355, 432, -64, -307, 33, 218, -501, -470, 475, -166, -667, 561, 391, -674, 4, 868, -267, -486, 683, 159, -946, -11, 491, -620, -223, 529, 224, -197, 120, 239, 300, -79, -348, 522, 523, -403, -216, 1222, 149, -1059, 277, 744, -912, -848, 871, 83, -973, 339, 756, -324, -130, 796, 402, 5, 97, 387, 393, -434, -493, 578, 243, -1037, -195, 1313, -376, -1256, 993, 1087, -1062, -520, 1320, 193, -866, 165, 558, -263, -406, 163, 123, -154, -187, 330, 252, -270, -340, 469, 27, -888, 246, 959, -711, -783, 1160]
4159A160o48j946J292J324j627n27J505o6j066K78N75k69m83K35K77rn03M01Q74
4178G77r07o08J365K00j957M70J852j440j428J966P60k026K05J717n93j061P16
4195HN52n86l60K64M23l67n98P12N41j081j66J470k58j454J020J431j928m14J829
4214A038l62j784P55J154j367m62J291o2q37M47Q26k87o41K78J112m45j394O16
4232a24J664j272j673J874J014k445l38K159k55j699R88R30q05j63M96j15k74
4249c8L08j49m23R8M30K14n32k26J067K91j551n1J762o36k209J244J735j630j199
4268a495K008M48j641L15J060m89n19M41J19j84q4P2J65m83j76Q82k4j311O35
4287b61J392j103j511J835P75k242Q4K053o54j592R04J078r56l80P41L68m48l41
$$ y = [1160, 512, -1434, -142, 1182, -445, -972, 533, 467, -599, -321, 254, -15, -498, -263, 14, 5, -498, -97, 777, -130, -738, 627, 827, -1130, -660, 1192, -248, -1676, 290, 1050, -976, -771, 946, 353, -708, 8, 560, -26, -386, -122, 301, -66, -664, 48, 589, -492, -658, 812, 554, -900, 120, 1551, -377, -791, 1038, 676, -1108, -353, 801, -566, -1028, 263, 201, -636, -189, 637, 350, -291, -13, 1099, 654, -740, -124, 1540, 268, -1405, 469, 1483, -962, -1300, 859, 604, -1095, -107, 823, 18, -145, 351, 236, -38, 270, 121, -302, -204, 226, 440, -92, -318, 749, 1040, -511, -562, 1200, 564, -1645, -401, 1334, -296, -1495, 513, 961, -680, -365, 695, 206, -313, 128, 247, 63, -21, 51, 216, -267, -443, 439, 415, -896, -261, 1131, 28, -1483, 352, 1127, -1115, -1031, 1022, 368, -1224, -320, 758, -198, -578, 163, 531, 83, -258]
4305b58K77M68m80p86P43N26j120K04J053o83n66P83j2r07N86N87q23L14J058
4324I64q26p65J123J91j307R7J030k31q18Q6P33L08r92m03J563M85k132K48J852
4343A206o97j778J167J154j340n29J311p2q35L85K68k64J87J28m3Q5k34l32N21
4362B88l30p60R29O66j249o9J444m44j020P75N23q77kM02l09R3L08r21O5J097
4382F09n31o09P57M56o71JJ01J80K11n22n96R60L20j419k4J567n01j229Q97J055
4402A012j072k74O64nm84r7P2J65J22m48N9P53m45n27P56J66j061N73O76p45k53
4423c93R05m24p65P10N7p46N56L49m54Q0M88k76k19K70m22Q3M37p03j21Q41j93
4444F0r71R30N57q97Q9Q40k99n12N86l06k68N42k50n64M19L02o40r5O39l77M9
$$ y = [-258, 19, 487, 7, -779, -36, 490, -630, -426, 627, -56, -622, 161, 149, -758, -172, 415, -408, -94, 964, 138, -627, 496, 687, -620, -523, 507, 276, -542, -456, 277, 585, -407, -810, 753, 1238, -894, -646, 1206, 509, -1269, -102, 1052, -288, -817, 494, 422, -413, -28, 240, -24, 163, 291, 248, 333, 99, -233, 288, -42, -802, 127, 793, -456, -525, 919, 475, -545, 230, 753, -124, -126, 276, -33, 60, 368, -553, -488, 609, 78, -531, 226, 682, 11, 12, 113, 293, 504, -18, -614, 346, 666, -753, -777, 790, 289, -940, -43, 1012, -60, -334, 330, 325, -159, -256, -184, -19, 103, -345, -286, 467, 22, -505, 251, 417, -644, -71, 605, -140, -393, 512, 88, -677, 33, 90, -656, -100, 249, -205, -125, 363, 87, -132, 138, -284, -201, 236, -467, -588, 253, 60, -911, 19, 576, -321, -232, 608, 309, -203, 383, 77, -191, 351, 101, -463, -44, 258, -382, -477, 162, -215, -166]
4465a66L32k46J69M91p41l52J128k84j109P64R25j203j37J063l69p25N57L73m50
4484B0p0P2K1J50l74k03O47Mj018O84R87r25n98J246Q9r69M27O31n96j56K32m35
4506a34J0M63o42k21Q35R2q01L80K82l31J90j29m15O22J83q36J51J288q04o72
4526d89J001K60j095J07M43m93l3L64m78j97Q09m06m55M95L12k07J79j41J33M07
4546E16m36p37Q27O85j386k55J440l03j200O07P32p38m2L91k11J00L3l43LN56
4566B39k06l63M52j02n6L04m09m67J092j5j229N57J447j063j200J272N51j312
4584e08k50P88J99n42j20L14N73k30q17O56R26r78o05J166L5j010L24N52o27L3
4604a21L62m32J25M67q07m3J054l50r19Q68P23j117k34Q44k16m30m1K40L92q2
$$ y = [-166, 166, -80, 89, 580, -161, -513, 615, 331, -778, -14, 911, -292, -429, 634, 265, -460, 97, 470, 20, -50, 22, 43, 193, -181, -384, 263, 267, -751, -67, 920, -5, -603, 643, 732, -237, 190, 821, 225, 69, 301, -134, -124, 339, -303, -524, 311, 403, -398, -18, 264, -67, 123, -6, -421, 201, 384, -452, -301, 987, 183, -489, 512, 772, -323, -216, 227, -266, -299, 65, -413, -610, 199, -207, -662, -167, 145, -62, 117, -24, 109, 516, 80, -657, 170, 855, -531, -786, 654, 351, -849, -242, 490, -248, -290, 101, -110, -10, 23, -320, -317, 239, 33, -330, 122, 20, -36, 268, -141, -608, 484, 469, -760, -203, 1244, 181, -1019, 253, 804, -508, -758, 30, 229, -313, -433, -119, 454, 224, -593, 63, 989, 11, -594, 572, 607, -403, -79, 473, -154, -121, 241, -191, -66, 401, -406, -449, 605, 255, -664, 204, 927, -190, -424, 420, 204, -226, -267, -27, 365, 283]
4624B83p22M92J007j127p55J186N19j479J34J534p84q86Q78K78r55J22O93j73
4642B45n43O5K63K06n80j41P76K47j268K68J478o99j209J147Q80j404l30R02R9
4661D02o76j52O5L69K55p19o2J225k83j229L44R95m96n94L06L05L11l32o07O59
4681H6Q15j124q99J651L14j641LJ619n67j016O81M08k35l43qK08L91n48l25Q10
$$ y = [283, -439, 53, 1060, -67, -822, 364, 883, -596, -462, 1072, 288, -598, 280, 558, -397, -275, 418, 245, -298, -233, 30, 236, -344, -485, 291, 538, -730, -462, 1016, 317, -892, 255, 1135, -269, -599, 303, 402, -274, -426, -361, 8, 263, -456, -518, 707, 424, -805, -461, 534, 38, -556, -250, 55, 366, 34, -573, 86, 901, -223, -1122, 529, 843, -798, -795, 824, 257, -759, -78, 330, 95, -248, -256, -48, 343, -205, -530, 280]
$$ [...]
8191c20
##END NTUPLES=NMR FID
##END=
