##TITLE=1H_CA-8647-22
 CDCl3, 8 sc, 
 19.9.2019
##JCAMPDX= 6.0         $$ Bruker NMR JCAMP-DX V2.0
##DATA TYPE= NMR FID
##DATA CLASS= NTUPLES
##ORIGIN= UXNMR, Bruker Analytische Messtechnik GmbH
##OWNER= root
$$ XWIN-NMR		Version 3.5
$$ Thu Sep 19 15:44:38 2019 Russian Standard Time (UT+4h)  she@DPX200
##.OBSERVE FREQUENCY= 200.1315
##.OBSERVE NUCLEUS= ^1H
##.DELAY= (6, 6)
##.ACQUISITION MODE= SIMULTANEOUS
##.ACQUISITION SCHEME= undefined
##.AVERAGES= 8
##.DIGITISER RES= 18
##SPECTROMETER/DATA SYSTEM= spect
##.PULSE SEQUENCE= zg30
##.SOLVENT NAME= CDCl3
##.SHIFT REFERENCE= (INTERNAL, CDCl3, 0, 15.7039)
##AUDIT TRAIL= $$ (NUMBER, WHEN, WHO, WHERE, WHAT)
$$ ##TITLE= Audit trail, XWIN-NMR		Version 3.5
$$ ##JCAMPDX= 5.01
$$ ##ORIGIN= Bruker BioSpin GmbH
$$ ##OWNER= she
$$ F:/spectra/data/she/nmr/H-F/1/audita.txt
$$ ##AUDIT TRAIL=  $$ (NUMBER, WHEN, WHO, WHERE, WHAT)
(   1,<2019-09-19 15:43:29.28 +0400>,<she>,<DPX200>,
      <created by zg, POWCHK disabled, PULCHK disabled
       configuration hash MD5:
       00 E9 B6 7A A2 85 ED C7 34 08 36 98 17 FE 4E 26
       data hash MD5: 16K
       47 FC A9 FF 5E BB EA 32 0C 30 95 D6 0A 33 13 D3>)
$$ ##END=
$$ 
$$ hash MD5
$$ DD 1A D4 0F 20 15 D4 75 51 F6 46 51 0A 8F 1A B4
##$RELAX= 
##$RELAX= 
##$RELAX= 
##$RELAX= 
##$RELAX= 
##$RELAX= 
$$ Bruker specific parameters
$$ --------------------------
##$DU= <F:/spectra>
##$EXPNO= 1
##$NAME= <H-F>
##$PROCNO= 1
##$TYPE= <nmr>
##$USER= <she>
##$AMP= (0..31)
100 100 100 100 100 100 100 100 100 100 100 100 100 100 100 100 100 100 
100 100 100 100 100 100 100 100 100 100 100 100 100 100 
##$AQSEQ= 0
##$AQ_mod= 1
##$AUNM= <au_zg>
##$AUTOPOS= <>
##$BF1= 200.13
##$BF2= 200.13
##$BF3= 200.13
##$BF4= 200.13
##$BF5= 200.13
##$BF6= 200.13
##$BF7= 200.13
##$BF8= 200.13
##$BYTORDA= 1
##$CFDGTYP= 0
##$CFRGTYP= 5
##$CHEMSTR= <none>
##$CNST= (0..31)
1 1 145 1 1 1 1 1 1 1 1 1 1 1 1 1 1 1 1 1 1 1 1 1 1 1 1 1 1 1 1 1 
##$CPDPRG= <>
##$CPDPRG1= <>
##$CPDPRG2= <>
##$CPDPRG3= <>
##$CPDPRG4= <mlev>
##$CPDPRG5= <mlev>
##$CPDPRG6= <mlev>
##$CPDPRG7= <mlev>
##$CPDPRG8= <mlev>
##$CPDPRGB= <>
##$CPDPRGT= <>
##$D= (0..31)
0 1.2 0 0 0 0 0 0 0 0.06 0 0.03 0 0 0 0 0.0002 0 0 0 0 0 0 0 0 0 0 0 0 
0 0 0 
##$DATE= 1568893408
##$DBL= (0..7)
120 120 120 120 120 120 120 120 
##$DBP= (0..7)
150 150 150 150 150 150 150 150 
##$DBP07= 0
##$DBPNAM0= <>
##$DBPNAM1= <>
##$DBPNAM2= <>
##$DBPNAM3= <>
##$DBPNAM4= <>
##$DBPNAM5= <>
##$DBPNAM6= <>
##$DBPNAM7= <>
##$DBPOAL= (0..7)
0.5 0.5 0.5 0.5 0.5 0.5 0.5 0.5 
##$DBPOFFS= (0..7)
0 0 0 0 0 0 0 0 
##$DE= 6
##$DECBNUC= <off>
##$DECIM= 24
##$DECNUC= <off>
##$DECSTAT= 4
##$DIGMOD= 1
##$DIGTYP= 9
##$DL= (0..7)
0 120 120 120 120 120 120 120 
##$DP= (0..7)
150 150 150 150 150 150 150 150 
##$DP07= 0
##$DPNAME0= <>
##$DPNAME1= <>
##$DPNAME2= <>
##$DPNAME3= <>
##$DPNAME4= <>
##$DPNAME5= <>
##$DPNAME6= <>
##$DPNAME7= <>
##$DPOAL= (0..7)
0.5 0.5 0.5 0.5 0.5 0.5 0.5 0.5 
##$DPOFFS= (0..7)
0 0 0 0 0 0 0 0 
##$DQDMODE= 0
##$DR= 18
##$DS= 0
##$DSLIST= <SSSSSSSSSSSSSSS>
$$ [...]
##$SUBNAM2= <"">
##$SUBNAM3= <"">
##$SUBNAM4= <"">
##$SUBNAM5= <"">
##$SUBNAM6= <"">
##$SUBNAM7= <"">
##$SUBNAM8= <"">
##$SUBNAM9= <"">
##$SW= 24.0689530833862
##$SWIBOX= (0..15)
0 0 2 0 0 0 0 0 0 0 0 0 0 0 0 0 
##$SW_h= 4816.95568400771
##$TD= 16384
##$TD0= 1
##$TE= 0
##$TE2= 300
##$TE3= 300
##$TEG= 300
##$TL= (0..7)
0 120 120 120 120 120 120 120 
##$TP= (0..7)
150 150 150 150 150 150 150 150 
##$TP07= 0
##$TPNAME0= <>
##$TPNAME1= <>
##$TPNAME2= <>
##$TPNAME3= <>
##$TPNAME4= <>
##$TPNAME5= <>
##$TPNAME6= <>
##$TPNAME7= <>
##$TPOAL= (0..7)
0.5 0.5 0.5 0.5 0.5 0.5 0.5 0.5 
##$TPOFFS= (0..7)
0 0 0 0 0 0 0 0 
##$TUNHIN= 0
##$TUNHOUT= 0
##$TUNXOUT= 0
##$USERA1= <user>
##$USERA2= <user>
##$USERA3= <user>
##$USERA4= <user>
##$USERA5= <user>
##$V9= 5
##$VALIST= <valist>
##$VCLIST= <CCCCCCCCCCCCCCC>
##$VD= 0
##$VDLIST= <DDDDDDDDDDDDDDD>
##$VPLIST= <PPPPPPPPPPPPPPP>
##$VTLIST= <TTTTTTTTTTTTTTT>
##$WBST= 1024
##$WBSW= 4
##$XGAIN= (0..3)
0 0 0 0 
##$XL= 0
##$YL= 0
##$YMAX_a= 28929
##$YMIN_a= -28974
##$ZGOPTNS= <>
##$ZL1= 120
##$ZL2= 120
##$ZL3= 120
##$ZL4= 120
##$ABSF1= 10
##$ABSF2= 0
##$ABSG= 5
##$ABSL= 3
##$ALPHA= 0
##$AQORDER= 0
##$ASSFAC= 0
##$ASSFACI= 0
##$ASSFACX= 0
##$ASSWID= 0
##$AUNMP= <proc_1d>
##$AZFE= 0.1
##$AZFW= 0.1
##$BCFW= 1
##$BC_mod= 2
##$BYTORDP= 1
##$COROFFS= 0
##$CY= 11.3945322036743
##$DATMOD= 1
##$DC= 2
##$DFILT= <>
##$DTYPP= 0
##$F1P= 20.1720416913024
##$F2P= 0.152960286110954
##$FCOR= 0.5
##$FTSIZE= 0
##$FT_mod= 4
##$GAMMA= 1
##$GB= 0.15
##$INTBC= 1
##$INTSCL= 1
##$ISEN= 128
##$LB= 0.24
##$LEV0= 0
##$LPBIN= 0
##$MAXI= 10000
##$MC2= 0
##$MEAN= 0
##$ME_mod= 0
##$MI= 1.114404
##$NCOEF= 0
##$NC_proc= 0
##$NLEV= 6
##$NOISF1= 3.799351
##$NOISF2= 2.8
##$NSP= 1
##$NTH_PI= 0
##$NZP= 0
##$OFFSET= 15.70392
##$PC= 1
##$PHC0= -9658.174
##$PHC1= 22.00096
##$PH_mod= 1
##$PKNL= yes
##$PPARMOD= 0
##$PSCAL= 0
##$PSIGN= 0
##$REVERSE= no
##$SF= 200.130013532006
##$SI= 16384
##$SIGF1= 3
##$SIGF2= 2
##$SINO= 400
##$SIOLD= 16384
##$SREGLST= <1H.CDCl3>
##$SSB= 0
##$STSI= 0
##$STSR= 0
##$SW_p= 3612.71676300578
##$SYMM= 0
##$S_DEV= 0
##$TDeff= 0
##$TDoff= 0
##$TI= <>
##$TILT= no
##$TM1= 0
##$TM2= 0
##$TOPLEV= 0
##$USERP1= <user>
##$USERP2= <user>
##$USERP3= <user>
##$USERP4= <user>
##$USERP5= <user>
##$WDW= 1
##$XDIM= 8192
##$YMAX_p= 0
##$YMIN_p= 0
$$ End of Bruker specific parameters
$$ ---------------------------------
##NTUPLES= NMR FID
##VAR_NAME=  TIME,          FID/REAL,        FID/IMAG
##SYMBOL=    X,             R,               I
##VAR_TYPE=  INDEPENDENT,   DEPENDENT,       DEPENDENT
##VAR_FORM=  AFFN,          ASDF,            ASDF
##VAR_DIM=   8192,          8192,            8192
##UNITS=     SECONDS,       ARBITRARY UNITS, ARBITRARY UNITS
##FACTOR=    0.0002076,     1,               1
##FIRST=     0,             0,               0
##LAST=      1.7004516,     0,               0
##MIN=       0,             -28974,          0
##MAX=       1.7004516,     28929,           0
$$ Real data points
##PAGE= N=1
##DATA TABLE= (X++(R..R)), XYDATA
$$ [...]
$$ plain form
541 534 -1052 -349 1154 46 -1147 362 1103 -688 -841 1005 539 -1139 -135 1204 -163 -1063 490
558 490 955 -666 -768 811 552 -934 -348 981 106 -995 208 895 -606 -781 818 299 -1159
575 -1159 98 1213 -620 -1045 1249 878 -1616 -470 1850 -141 -2241 413 2107 -1045 -2154 1511
591 1511 2051 -1927 -1763 2407 1408 -2830 -956 3015 250 -3175 379 2976 -1090 -2652 1597 2067
607 2067 -2005 -1446 2161 754 -2164 -153 1947 -489 -1727 914 1274 -1381 -833 1674 272 -1757
623 -1757 465 1827 -1025 -1508 1629 977 -2164 -457 2241 -401 -2247 1151 1976 -1725 -1388 2282
639 2282 777 -2561 -18 2768 -704 -2701 1535 2556 -2318 -2201 2986 1567 -3614 -798 4025
654 4025 -61 -4064 1122 4008 -1922 -3432 2771 2803 -3292 -1971 3546 1047 -3617 -171 3441 -584
$$ packed form
541E34j586P03J503j108j193J509P41j791j53J846m66j678J004J339j367r00J553
558D90M65j621j02J579k59j486N86J329q75j101J203O87j501j75J599n19j458
575a159J257J115j833m25K294l71k494J146K320j991k100K654J694l152j109L665
591A511N40l978J64M170r99m238J874L971k765l425L554K597m066j562M249M70
607B067m072N59L607j407k918K011K100k436j238K641L60k655N48K507j402k029
623a757K222J362k852m83L137o52l141J707K698k642j846L398Q25l701L37L670
639B282j505l338K543K786l472j997M236J021m874J17N187j419n181K816M823
654D025m086m003N186K886n930j510O203L2o095J321N517k499m664L446L612m025
$$ plain form
670 -584 -3003 1351 2479 -1947 -1780 2352 940 -2563 32 2563 -881 -2168 1769 1622 -2360 -777
686 -777 2769 -51 -2755 1012 2564 -1806 -2139 2340 1356 -2975 -800 3059 -141 -3192 958 3076
702 3076 -1735 -2584 2615 2102 -3172 -1187 3645 250 -3789 769 3615 -1820 -3234 2528 2433 -3311
718 -3311 -1806 3512 764 -3775 16 3665 -830 -3362 1626 2917 -2246 -2242 2772 1482 -2982 -486
734 -486 3064 -386 -2765 1259 2153 -2079 -1542 2358 461 -2733 265 2502 -1224 -2245 1925 1819
750 1819 -2420 -1089 2995 575 -3037 392 3211 -1074 -2936 1882 2443 -2638 -1881 2986 902 -3304
766 -3304 -1 3261 -883 -2892 1703 2358 -2340 -1721 2721 986 -2892 -103 3090 -447 -2708 1422
782 1422 2613 -1895 -1991 2501 1314 -2925 -631 2927 -377 -2958 1025 2453 -1786 -1948 2251 1305
$$ packed form
670e84k419M354J128m426J67M132j412l503K595K531l444j287L937j47l982J583
686g77L546k820k704L767J552m370l33M479r84m331K175L859l200l051M150K118
702C076m811q49N199n13n274J985M832l395m039M558K846n435j414N762r5n744
718c311J505N318k748m539L791L649m495k532M988J291n163MN014j290m464K496
734d86L550l450k379M024Q94m232N37L900j897l194K998K237l726j021M170j06
750A819m239J331M084k420l612L429K819m285j862M818N61n081P57M867k084m206
766c304L303L262m144k009M595O55m698O19M442j735l878K789L193l537k261M130
782A422J191m508r6M492j187m239K294L558l304k581L983J428m239j62M199r46
$$ plain form
798 1305 -2415 -438 2655 -30 -2312 876 2226 -1274 -1743 1765 1228 -2160 -715 2224 -73 -2347
814 -2347 627 2008 -1383 -1658 1843 1074 -2107 -331 2295 -227 -2093 891 1865 -1367 -1483 1671
830 1671 994 -1937 -509 2045 -18 -2025 530 1815 -1153 -1638 1467 1035 -1952 -585 2081 -44
846 -44 -2032 692 1872 -1150 -1524 1493 1046 -1759 -655 1799 183 -1768 227 1657 -594 -1447
862 -1447 954 1159 -1250 -794 1412 278 -1559 147 1419 -689 -1252 1047 895 -1304 -470 1474
878 1474 168 -1364 269 1322 -499 -1162 682 888 -905 -702 1010 437 -1014 -57 1078 -217
894 -217 -905 594 689 -829 -374 1000 18 -1018 319 933 -580 -743 798 587 -829 -285 954 181
912 181 -865 83 870 -261 -794 450 670 -611 -451 854 272 -854 83 895 -346 -812 495 578
$$ packed form
798A305l720J977L093k685k282L188J350l500m69L508n37l388J445K939k297k274
814b347K974J381l391k75L501p69l181J776K626k522j866K984R74l232j16L154
830A671o77k931J428K554k063k007K555J285k968m85L105m32k987J367K666k125
846d4j988K724J180l022l74L017m47k805J104K454j616j951J995J430k251q53
862a447K401K05k409M56K206j134j837J706J272k108n63K299j52k199Q34J944
878A474j306j532J633J053j821o63J844K06j793K03J712n73j451R57J135j295
894b17o88J499R5j518M55J374r82j036J337O14j513j63J541k11j416N44J239p73
912A81j046R48P87j131n33J244K20j281J60J305n82j126R37Q12j241m66J307Q3
$$ plain form
930 578 -666 -390 708 287 -593 -22 643 23 -508 75 421 -214 -435 203 265 -345 -150 400 0 -399
950 -399 185 316 -338 -202 400 67 -373 96 350 -116 -217 155 116 -178 -128 17 -65 -182 -60 24 -103 -99
972 -99 211 167 -178 57 466 20 -409 159 393 -346 -477 222 207 -401 -246 275 171 -196 -144 144 133 -168
994 -168 -234 79 133 -130 -71 222 167 -3 80 91 -3 -20 -80 -168 -41 -28 -206 -52 152 -37 -91 220 158 -157 -7
1019 -7 188 -92 -231 15 120 -55 -112 98 251 97 -101 140 337 -20 -242 128 186 -258 -241 100 -30 -223
1041 -223 -39 86 -16 16 77 51 110 108 20 124 164 24 17 129 34 -113 -46 -34 -110 -140 -187 -93 66 -50 -168 184
1067 184 342 -70 -117 351 244 -282 -155 235 14 -335 -165 156 69 -230 -147 217 170 -204 -102 256 60
1088 60 -244 -5 149 -102 -113 54 -50 -86 52 -24 -135 27 62 -97 -55 46 15 -15 -21 -27 35 42 -38 3 51 -62
$$ packed form
930E78j244K76J098m21q80N71O65o20n31N83L46o35k21O38O2o10J95N50m00l99
950c99N84J31o54J36O02l33m40M69K54m66j01L72l9k94N0J45q2j17J22Q4j27M
972i9L10m4l45K35M09m46m29N68K34p39j31O99j5o08J55N21j04l67N2K88j1l01
994a68o6L13N4k63N9K93n5j70Q3J1r4j7o0q8J27J3j78J54K04j89n4L11o2l15J50
1019gJ95k80j39K46J05j75n7K10J53j54j98K41J97l57k22L70N8m44J7L41j30j93
1041b23J84J25j02L2O1k6N9kq8J04M0j40pJ12r5j47O7J2p6l0m7R4J59j16j18L52
1067A84J58m12m7M68j07n26J27L90k21l49J70L21q7k99Q3L64m7l74J02L58j96
1088F0l04K39J54k51j1J67j04l6J38p6j11J62L5j59M2J01l1l0ooO2Pq0M1M8j13
$$ plain form
1114 -62 -46 62 -106 -193 77 65 -275 -61 275 17 -252 108 317 -38 -194 80 209 -63 -254 -27 195
1135 195 -96 -312 64 241 -138 -138 281 197 -139 83 242 -70 -158 84 -19 -263 -138 74 -20 -154 -14 217
1157 217 167 -94 11 318 138 -180 48 249 -24 -163 42 36 -70 -28 -125 -188 67 69 -269 -106 332 140 -230
1180 -230 83 446 130 -235 35 359 -11 -433 -53 336 -186 -490 175 383 -321 -248 479 191 -452 10
1200 10 424 -190 -451 155 235 -298 -190 308 185 -207 -8 340 30 -299 14 179 -281 -292 205 52 -379
1221 -379 93 450 -176 -298 409 236 -516 -182 413 -101 -506 95 372 -156 -208 320 228 -215 -40 281 -115
1242 -115 -388 136 232 -477 -308 562 158 -721 69 898 -196 -841 418 792 -595 -698 633 509 -662
1261 -662 -359 667 280 -552 -157 489 22 -440 5 249 -148 -121 249 -12 -139 379 237 -416 8 627
$$ packed form
1114f2J6J08j68q7K70j2l40K14L36k58k69L60K09l55j56K74J29k72j91K27K22
1135A95k91k16L76J77l79%M19q4l36K22J59l12q8K42j03k44J25K12r4j34J40K31
1157B17n0k61J05L07j80l18K28K01k73j39K05oj06M2r7o3K55Kl38J63M38j92l70
1180b30L13L63l16l65K70L24l70m22L80L89n22l04O65K08p04P3P27k88o43M62
1200A0M14o14k61O06Q0n33J08M98j23l92J99L48l10l29L13J65m60j1M97j53m31
1221c79M72L57o26j22P07j73p52L34N95n14m05O01K77n28n2N28r2m43J75L21l96
1242a15k73N24R6p09J69Q70m04q79P90Q29j094o45J259L74j387j03J331j24j171
1261f62L03J026l87q32L95O46m67m62M45K44l97K7L70k61j27N18j42o53M24O19
$$ plain form
1281 627 -225 -753 326 585 -633 -552 760 409 -762 -128 913 60 -839 158 828 -373 -817 535
1299 535 702 -696 -476 952 363 -957 -45 999 -244 -966 378 674 -674 -535 686 273 -645
1316 -645 43 728 -99 -484 406 446 -494 -306 564 45 -764 40 687 -400 -726 608 592 -770 -309 1002
1336 1002 132 -954 212 924 -479 -823 598 526 -858 -450 816 152 -920 41 928 -206 -806
1353 -806 513 768 -667 -547 832 251 -988 -40 852 -382 -835 550 526 -809 -262 905 -31 -919
1371 -919 330 894 -556 -759 815 652 -982 -481 1142 227 -1281 -14 1265 -318 -1214 618 1068
1388 1068 -802 -729 1048 497 -1028 -119 978 -229 -946 386 638 -664 -476 788 273 -814 65
1405 65 962 -203 -833 569 818 -755 -583 1000 358 -1099 -34 1104 -325 -1080 511 747 -880
$$ packed form
1281F27q52n28J079K59j218Q1J312l51j171O34J041q53q99R97O70j201m44J352
1299E35J67j398K20J428n89j320R12J044j243p22J344K96j348J39J221m13r18
1316f45O88O85q27l85Q90M0r40J88Q70n19q09Q04O47j087l26J334j6j362M61J311
1336A002q70j086J166P12j403l44J421p2j384M08J266o64j072R61Q87j134o00
1353h06J319K55j435J20J379n81j239R48Q92j234m53J385k4j335N47J167r36q88
1371i19J249N64j450k03J574j63j634N01J623r15j508J267J279j583q96J832M50
1388A068j870P3J777n51j525R09J097j207p17J332K52j302J88J264n15j087Q79
1405F5Q97j165o30J402K49j573J72J583o42j457J065J138j429p55J591K36j627
$$ plain form
1422 -880 -655 889 314 -962 37 1073 -61 -748 591 927 -575 -616 821 331 -1136 -257 933
1439 933 -304 -1123 481 900 -754 -585 1087 440 -1033 -31 1118 -245 -1062 457 903 -669 -733
1456 -733 857 582 -906 -300 1008 57 -1044 148 865 -525 -822 662 495 -860 -218 903 -105
1473 -105 -874 333 676 -636 -558 741 360 -791 -63 955 2 -806 318 836 -533 -805 567 424
1491 424 -977 -437 847 -6 -947 284 890 -430 -594 769 481 -777 -175 841 -70 -857 239
1508 239 762 -446 -681 607 545 -785 -435 815 136 -973 20 913 -268 -774 580 731 -596 -364
1526 -364 798 237 -726 -12 618 -230 -597 259 377 -403 -257 497 205 -441 82 579 -161 -475 374 382
1546 382 -546 -274 617 44 -689 143 664 -299 -524 499 434 -486 -247 557 153 -529 -28 509 -108 -479
$$ packed form
1422h80K25J544n75j276R99J036j134o87J339L36j502m1J437m90j467Q79J190
1439I33j237q19J604M19j654J69J672o47j473J002J149j363q17J519M46j572o4
1456g33J590k75j488O06J308r51j101J192P17j390k97J484j67j355O42J121j008
1473a05p69J207L43j312P8J299l81j151P28J018r53q08J124N18j369k72J372j43
1491D24j401N40J284q53r41J231O06j320j64J363k88j258O02J016r11p87J096
1508B39N23j208k35J288o2j330L50J250o79j109R93Q93j181n06J354J51j327K32
1526c64J162n61r63P14O30q48l67Q56J18p80J46P54k92o46N23M97p40l14Q49Q
1546C82r28K72Q91n73p33Q32N21r63k25J023o5r20K39Q04m04o82N01N37o17l71
$$ plain form
1566 -479 184 384 -334 -307 443 180 -498 24 571 -182 -498 392 398 -518 -293 567 110 -626 -40 562 -94
1587 -94 -542 144 499 -195 -452 262 400 -309 -307 361 197 -350 -68 296 -72 -228 147 73 -208 56 163
1608 163 -183 -132 259 54 -323 -4 311 -85 -347 84 349 -153 -386 223 398 -266 -336 387 289 -437 -181
1629 -181 432 31 -429 56 360 -126 -243 192 198 -137 -68 162 29 -181 -60 88 -72 -171 71 152 -102 -43
1651 -43 265 104 -175 94 260 -126 -175 158 72 -221 -37 171 -46 -128 85 94 -86 -51 80 27 -99 -38 121
1674 121 46 -98 85 224 -24 -93 215 151 -198 -68 182 -79 -279 34 104 -160 -131 127 97 -79 -19 124
1696 124 88 -70 -48 108 65 -122 -25 144 5 -114 49 76 -114 -49 30 -75 -79 21 -31 -65 67 33 -81 27
1720 27 99 -28 -81 24 39 -33 -68 -7 105 43 -101 30 175 -43 -172 72 96 -212 -167 89 -20 -196 -29
$$ packed form
1566d79O63K00p18K7P50k63o78N22N47p53l16Q90Or16K25Q60m57p36N86O02o56
1587i4m48O86L55o94k57P14J38p09KO68j64n47K82L64l68j56L75p4k81K64J07
1608A63l46N1L91k05l77L19L15l96k62M31K65n02k33O09J75o64p0P23r8p26K56
1629a81O13m01m60M85L04m86j17M35Ol35O9K30j33k10J21J48j60r9K42Q1k54N9
1651d3L08j61k79K69J66l86m9L33q6k93J84K08k17q2K13Rj80L5J31n3j26O1J59
1674A21p5j44J83J39k48o9L08o4l49J30K50k61k00L13P0k64K9K58l0j76O0J43
1696A24l6j58K2J56m3j87R7J69j39j19J63K7j90O5P9j05mJ00n2l4J32l4j14J08
1720B7P2j27n3J05J5p2l5O1J12o2j44J31J45k18j29K44K4l08M5K56j09j76J67
$$ plain form
1743 -29 121 18 -50 63 141 76 -42 12 135 3 -146 -2 95 -111 -135 61 10 -101 14 48 -81 -11 86 -26
1767 -26 -51 82 69 -48 -8 102 59 -39 -31 82 67 -98 -87 109 27 -179 -19 174 -71 -141 122 98 -120 -14
1791 -14 144 -15 -66 95 74 -70 -5 103 5 -113 -11 111 -6 -149 33 214 -37 -192 150 219 -176 -154
1813 -154 227 88 -246 -25 195 -49 -165 65 122 -56 -62 70 82 -26 -57 63 39 -77 -55 65 -25 -88 41
1836 41 11 -91 43 118 -116 -51 178 -6 -226 54 188 -170 -233 157 129 -247 -165 213 134 -229 -104 314 150
1859 150 -290 -61 370 28 -369 24 305 -152 -328 122 174 -188 -158 141 69 -107 -48 71 49 -64 -43 39
1881 39 27 -39 23 50 -17 9 61 -47 -42 115 14 -139 36 125 -116 -143 120 71 -179 -29 157 6 -97 50
1905 50 134 37 -47 26 107 6 -93 11 93 -47 -74 67 27 -73 28 77 -75 -16 117 -14 -98 63 99 -56 -52
$$ packed form
1743b9J50j03o8J13P8o5j18N4J23j32j49J44R7k06k4J96n1j11J15L4j29P0R7j12
1767b6k5J33j3j17M0J10m3r8QJ13j5j65J1J96q2k06J60J93k45p0K63k4k18J06
1791a4J58j59n1J61k1j44O5J08r8j18J02J22j17j43J82J81k51j55L42O9l95K2
1813a54L81j39l34K21K20k44j16K30N7j78oJ32J2j08l1J20k4j16K2J20r0o3J29
1836D1l0j02J34P5k34O5K29j84k20K80J34l58o3L90k8l76Q2L78p9l63J25M18j64
1859A50m40K29M31l42l97L93K81m57j76M50N2l62L0K99p2j76N9J19k2j13K1Q2
1881C9j2o6O2K7o7K6N2j08NJ57j01j53J75Q9k41k7K63m9k50J50J86j51j03J47
1905E0Q4r7q4P3Q1j01r9J04Q2j40k7J41m0j00J01M9j52N9J33j31q4J61L6j55M
$$ plain form
1930 -52 49 49 -17 -52 16 92 9 -112 11 145 -25 -120 38 101 -53 -83 20 49 5 -37 -13 91 60 -79 -28 105
1956 105 0 -113 11 61 -65 -27 23 -55 -45 49 -28 -56 56 70 -47 -5 85 38 -71 -20 43 2 -97 -61 74 -11
1982 -11 -145 12 149 -85 -156 148 115 -200 -64 214 -20 -220 53 181 -102 -158 105 108 -113 -94 118 64 -144
2005 -144 -56 139 -30 -183 64 147 -150 -97 239 46 -238 65 281 -104 -223 201 187 -212 -115 235 78 -211
2027 -211 -5 233 -1 -215 66 194 -131 -182 206 127 -270 -20 314 -59 -277 198 288 -244 -164 348 133
2048 133 -334 -23 347 -11 -315 58 282 -128 -275 149 222 -200 -155 262 101 -243 39 256 -124 -201 226
2069 226 106 -301 -5 288 -123 -285 199 229 -273 -169 336 148 -310 -31 394 -2 -376 100 377 -204
2089 -204 -395 250 252 -421 -244 396 65 -430 50 417 -121 -293 251 257 -241 -124 303 47 -306 0 260
$$ packed form
1930e2J01%o6l5O8P6q3j21J23J34j70r5J58O3j54l0J03K9m4m2K4J04l1j39N1J33
1956A05j05j13J24N0j26L8N0p8J0R4p7k8J12J4j17M2R0m7j09N1O3m1r9L6J35q5
1982a1j34J57J37k34p1L04l3l15J36K78k34k00K73J28k83n6K63Lk21J9K12n4k08
2005a44Q8J95j69j53K47Q3k97N3L36j93k84L03K16l85j19M24j4l99R7L50j57k89
2027b11K06K38k34k14K81J28l25n1L88p9l97K50L34l73k18M75R0n32Q0N12k15
2048A33m67L11L70l58l04L73K24m10j47M24P3m22M5M17j61l44K82K17l80p7M27
2069B26j20m07K96K93m11j62M84L0n02J04N05j88m58K79M25l96l74M76K77n81
2089b04j91O45Ko73J77O40l31m95M80L67n38j72N44Om98J17M27k56l53L06K60
$$ plain form
2110 260 -125 -300 173 245 -295 -189 369 92 -444 -3 412 -146 -410 235 331 -311 -205 369 149 -309 -10
2131 -10 305 -43 -263 105 192 -179 -138 234 75 -272 6 289 -166 -365 202 218 -391 -194 420 99 -380
2152 -380 101 506 -52 -292 264 332 -243 -226 252 110 -352 -132 271 -46 -366 76 289 -196 -231 314 209
2173 209 -324 -40 399 -8 -306 179 339 -168 -174 258 145 -267 -93 209 -40 -272 23 190 -130 -192 199
2194 199 180 -222 -58 327 4 -321 96 268 -217 -238 286 158 -277 -43 309 -16 -280 60 222 -143 -225
2215 -225 140 161 -243 -151 258 76 -290 -9 316 -61 -302 156 236 -243 -181 257 97 -237 -2 215 -63
2236 -63 -174 68 80 -132 -105 83 13 -179 -14 169 -52 -145 160 208 -171 -106 246 42 -311 -6 235 -127
2258 -127 -254 143 165 -195 -125 206 69 -191 -11 201 -31 -195 48 188 -111 -191 179 179 -219 -100 260 40
$$ packed form
2110B60l85j75M73P2n40J06N58k77n36M41M15n58k64O45R6o42J06N74k20m58K99
2131a0L15l48k20L68Q7l71M1L72j59l47K78K83m55j99N67J6o09J97O14l21m79
2152c80M81M05n58k40N56O8n75J7M78j42m62K20M03l17l20M42K13m85l5N45j05
2173B09n33K84M39m07k98M85J60n07oM32j13m12J74L02k49k32K95J67l20o2L91
2194A99j9m02J64L85l23l25M17J72m85k1N24j28m35K34L52l25k64L40J62l65q2
2215b25L65K1m04R2M09j82l66K81L25l77k41M58Q0m79O2M38j60l34K35K17k78
2236f3j11K42J2k12K7J88p0j92J65J83k21r3L05M8l79O5L52k04l53L05K41l62
2258a27j27L97K2l60P0L31j37k60J80K12k32j64K43J40k99q0L70%l98J19L60k20
$$ plain form
2280 40 -258 49 236 -84 -155 129 105 -125 -44 129 9 -85 45 86 -59 -69 85 56 -123 -37 157 -5 -188
2303 -188 46 185 -102 -135 177 117 -149 -9 174 -24 -147 61 71 -104 -60 89 22 -119 -22 105 -14 -131
2325 -131 41 149 -75 -158 126 155 -162 -97 218 86 -188 -24 166 -62 -172 -9 53 -65 -85 28 52 -3
2347 -3 -11 70 67 -22 11 51 -49 -112 2 -26 -142 -34 105 -31 -76 92 72 -81 -31 58 -18 -79 -10 27 -48 -44 26 63
2375 63 14 -7 62 74 -68 -73 61 -16 -153 -17 120 -40 -84 99 67 -92 -37 80 -27 -108 -22 45 -10 -80 24
2400 24 158 51 -37 133 199 -52 -104 111 31 -218 -95 111 -45 -152 21 82 -31 -47 62 78 22 6 49 70
2424 70 27 26 83 49 1 65 33 -115 -69 39 -125 -183 46 66 -123 -18 181 56 -84 86 151 -28 -74 49 27
2449 27 -122 -114 43 39 -94 -23 141 48 -112 42 149 -89 -138 100 71 -171 -79 101 -43 -120 53 91 -36 -22
$$ packed form
2280D0k98L07J87l20p1K84k4k30Q1J73j20r4J30M1j45j0J54k9j79Q6J94j62j83
2303a88K34J39k87l3L12o0k66J40J83j98j23K08J0j75M4J49o7j41R7J27j19j17
2325a31J72J08k24q3K84K9l17O5L15j32k74J64J90k28j10J63O2j18k0J13K4n5
2347cqQ1lq9L3M0j00o3J14k8j16J08J39j36m5J68k0j53N0Q9p6o1O9L7p5MP0L7
2375F3m9k1O9J2j42nJ34p7j37J36J37j60m4J83l2j59N5J17j07q1Q6O7n5p0J04
2400B4J34j07q8J70O6k51n2K15q0k49J23K06j56j07J73O1j13j6J09J6n6j6M3K1
2424G0m3jN7l4m8O4l2j48M6J08j64n8K29K0j89J05J99j25j40J70O5j79m6J23k2
2449B7j49QJ57mj33P1J64r3j60J54J07k38m9K38k9k42R2J80j44p7J73L8j27J4
$$ plain form
2473 -22 80 18 -50 -6 62 1 -70 25 89 -54 -108 61 31 -164 -72 102 -49 -154 44 98 -76 -17 146 59 -66
2498 -66 64 93 -53 -77 26 27 -87 -75 49 23 -121 -66 90 16 -123 40 180 -16 -79 111 89 -102 -37 92
2522 92 -12 -104 -8 17 -42 -41 10 22 19 8 48 67 6 -11 69 30 -37 39 52 -62 -49 32 -53 -91 25 31 -78 5 87 6
2552 6 -30 62 87 7 -19 36 66 -5 -103 -17 57 -49 -118 57 97 -44 -27 119 59 -58 19 58 -37 -51 -7 -27 -39 0
2580 0 9 23 22 34 60 18 -50 5 46 -64 -96 74 39 -106 -38 107 -5 -89 51 65 -44 -59 3 -10 -39 -35 3 39 15
2609 15 5 70 39 -63 -3 45 -80 -85 39 14 -126 -27 77 -31 -45 74 83 -24 -18 24 -16 -38 -34 0 30 -10 -25 61
2637 61 33 -59 -3 34 -64 -75 33 -15 -95 26 74 -24 2 113 69 -12 10 22 -36 -82 -61 -4 20 -32 -7 73 27 -47 50
2666 50 99 -47 -38 70 -8 -94 12 66 -29 5 94 34 -25 13 18 -23 -48 -34 14 -7 -44 23 96 -10 -30 108 75 -70
$$ packed form
2473b2J02o2o8M4O8o1p1R5O4j43n4J69l0j95R2J74j51j05J98N4j74N9J63q7j25
2498f6J30K9j46k4J03Jj14J2J24k6j44N5J56p4j39J63J40j96o3J90k2j91O5J29
2522I2j04r2R6K5n9JN1J2lj1M0J9o1j7Q0l9o7P6J3j14J3Q1q5l8J16Oj09Q3Q2q1
2552Fl6R2K5q0k6N5L0p1r8Q6P4j06o9J75M0j41J7J46o0j17P7L9r5j4M4k0j2L9
2580@RJ4jJ2K6m2o8N5M1j10l2J70l5j45O8J45j12q4J40J4j09j5O2j3k9ML8L6k4
2609A5j0O5l1j02O0M8j25nJ24k5j40R9J04j08j4J19Rj07OM2m0k2ML4L0m0j5Q6
2637F1k8r2N6L7r8j1J08m8q0J21M8r8K6J11m4q1K2J2n8m6K1N7K4n2K5Q0m6p4R7
2666E0M9j46RJ08p8q6J06N4r5L4Q9o0n9L8Nm1k5J4M8k1l7O7P3j06k0J38l3j45
$$ plain form
2694 -70 9 116 -58 -139 26 46 -106 -57 105 48 -70 7 96 37 -73 -13 87 -10 -108 8 96 -48 -114 72 74
2719 74 -92 -22 89 -19 -68 51 24 -48 36 48 -45 -39 58 -2 -111 -46 50 19 -103 -54 117 39 -145 5 198 -20
2745 -20 -174 98 173 -128 -140 116 60 -141 -65 79 -2 -99 -26 42 14 -35 19 70 9 -11 47 3 -73 2 42 -101 -79
2772 -79 104 -4 -155 22 144 -56 -97 138 154 -95 -46 148 56 -112 -51 108 38 -131 -55 116 -23 -158 31
2795 31 129 -81 -100 135 76 -105 45 171 -13 -46 121 79 -89 -40 53 -44 -129 -20 80 -14 -85 44 128 -34
2819 -34 -80 103 99 -121 -45 114 -29 -127 59 85 -77 -21 129 10 -70 65 78 -74 -65 68 47 -104 -86 79 21
2844 21 -153 -48 141 -10 -180 41 159 -103 -124 160 116 -125 5 178 -13 -130 25 73 -113 -143 15 33
2866 33 -136 -111 73 67 -93 -28 157 50 -116 45 113 -73 -77 82 28 -76 29 53 -56 -32 53 -31 -85 -1 26
$$ packed form
2694g0P9J07j74q1J65K0j52M9J62n7j18P7Q9n9j10O0J00r7r8J16Q8j44o6J86K
2719G4j66P0J11j08m9J19k7p2Q4J2r3OR7o0j09O5R6l1j22M9J71p8j84J50J93k18
2745b0j54K72P5l01j2K56n6k01P6J44q1r7P3O8k8m9N4N1o1k0N8m4p6P5M0j43K2
2772g9J83j08j51J77J22k00m1K35J6k49M9J94r2j68O1J59p0j69P6J71j39j35J89
2795C1R8k10j9K35n9j81J50J26j84l3J67m2j68M9R3r7q5J09J00r4p1J29Q4j62
2819c4m6J83mk20P6J59j43r8J86K6j62N6J50j19q0J35J3j52RJ33k1j51J8J65n8
2844B1j74J05J89j51j70K21J18k62k1K84m4k41J30J73j91j17J55M8j86l0J58J8
2866C3j69K5J84oj60O5J85j07j66J61O8j86mJ59n4j04J05K4j09K4Q5q4n4Q4K7
$$ plain form
2891 26 -71 -76 31 50 -33 -40 112 98 -66 -19 136 4 -151 18 118 -106 -120 130 76 -127 0 179 9 -103
2915 -103 59 120 -80 -136 36 97 -100 -131 107 124 -95 -58 187 77 -129 1 163 -23 -110 40 67 -59 -42
2938 -42 14 -3 -6 -3 -13 31 34 -8 8 45 19 7 -5 -3 27 26 -72 -35 67 -18 -115 20 104 -49 -70 93 75 -89 -17 90
2968 90 4 -65 -15 43 -7 -57 -17 55 17 -79 20 73 -43 -76 52 27 -84 -8 68 -48 -68 51 29 -37 -28 48 20 -22
2996 -22 -45 19 49 -41 -56 43 39 -69 -42 86 4 -67 20 44 0 -5 10 -12 9 -13 -55 -18 21 -23 -40 19 27 -7 15 38 22
3027 22 24 10 -16 36 13 -70 -21 52 -33 -75 45 42 -77 -20 82 8 -47 1 52 22 -43 0 74 44 -57 -8 115 37 -89
3056 -89 29 89 -33 -62 17 7 -33 -8 -11 -36 27 0 -52 14 45 1 -22 15 37 38 -1 -11 39 67 -35 -62 64 35 -98
3085 -98 -42 65 -11 -52 12 23 -11 12 3 -9 36 22 -24 -8 43 21 -7 12 17 31 22 -31 -9 57 -36 -101 11 24 -86 -70
$$ packed form
2891B6r7nJ07J9q3pJ52j4j64M7J55j32j55J69J00k24j4K50n4k03J27J79j70j12
2915a03J62O1k00n6J72O1j97l1K38J7k19L7K45j10k06J30J62j86q7J50K7j26J7
2938d2N6j7lLj0M4Lm2J6L7k6j2j2KL0jr8L7J02q5r7J35Q4j53k1J63j8j64P2J07
2968I0q6o9N0N8n0n0M0P2l8r6R9N3j16l3J28k5j11P6P6j16k0J19k2o6RP6k8m2
2996b2k3O4L0r0j5R9mj08K7J28q2p1Q7K4m4nJ5k2K1k2m2L7L9m4j7N9Ql4K2K3j6
3027B2Kj4k6N2k3q3M9P3q5m2J20lj19N7J02p4n5M8N1l0o5M3P4l0j01M9J23p8j26
3056h9J18O0j22k9P9j0m0K5lk5O3k7n2O6L1m4k3L7K2Jl9j0N0K8j02k7J26k9j33
3085i8N6J07p6m1O4J1l4K3rj2M5j4m6J6N1k2k8J9NJ4rn3K2O6r3o5J12J3j10J6
$$ plain form
3115 -70 30 -15 -49 13 33 -17 4 30 21 26 1 -9 34 0 -52 6 42 -55 -64 34 11 -65 -10 41 -11 -6 6 -14 12 34 -29 -19
3147 -19 65 45 -31 -10 50 38 -27 -34 33 51 -42 -85 43 65 -95 -84 99 51 -89 -25 109 36 -37 19 63 37 -12 2
3175 2 35 36 -30 -35 35 13 -50 -11 27 -14 1 22 -6 24 40 6 -6 50 16 -44 21 54 -41 -25 57 7 -45 22 36 -11 -33 -8
3207 -8 18 15 -37 -24 41 5 -74 11 53 -45 -51 69 45 -62 -1 61 -16 -37 13 7 -10 -18 -15 10 11 -31 -16 43 10 -51 19 42 -39
3240 -39 -24 16 5 3 -4 -34 0 42 -22 -65 40 62 -49 -47 56 33 -48 -26 19 34 -17 -56 24 73 -27 -59 69 53 -78
3269 -78 -48 53 -14 -71 1 23 -13 10 23 16 47 34 -6 17 41 -19 -12 32 4 -21 3 -1 2 32 -12 -26 46 22 -50 13 86 -17
3301 -17 -71 51 70 -34 -18 58 45 -18 -16 27 45 -18 -69 3 47 -19 -58 52 40 -33 11 27 -8 4 19 -24 -9 50 6
3330 6 -53 25 47 -17 -43 22 17 -9 -43 -27 37 10 -71 1 84 -13 -44 53 43 -46 -35 43 -22 -39 13 -13 -33 19 33 -14 1
$$ packed form
3115g0J00m5l4O2K0n0K1K6rNk5j0M3l4n2N8L6r7rR8k3p6N5N1n2NJ2k0K6K2o3J0
3147a9Q4k0p6K1O0j2o5pO7J8r3m3J28K2j60J1J83m8j40O4J34p3p3N6M4k6m9J4
3175BL3Jo6nP0k2o3L9L8m1J5K1k8L0J6l4j2N6l4o0O5L3r5J6Q2n0n2O7J4m7k2K5
3207hK6ln2J3O5l6p9Q5M2r8oJ20k4j07O1O2p7k1N0oj7qLK5Jm2J5N9l3o1P0K3q1
3240c9J5M0j1kpl0L4M2o4m3J05K2j11KJ03k3q1K2M5J5n1l9Q0M9j00l2J28j6j31
3269g8L0J01o7n7P2K2l6K3J3pL1j3m0K3K4o0PM4k8k5K4mLL0m4j4P2k4p2O3P3j03
3301a7n4J22J9j04J6P6j3o3KM3J8o3n1P2M4o6l9J10j2p3M4J6l5J2J5m3J5N9m4
3330Fn9P8K2o4k6O5nk6l4J6O4k7q1P2Q3r7l1R7j0q9J1P8o5j7N2k6k0N2J4m7J5
$$ plain form
3361 1 47 34 1 -21 4 38 -18 -64 20 55 -48 -32 73 29 -55 18 60 -33 -24 38 -7 -43 11 25 -47 -3 27 -4 -24 -8
3391 -8 20 40 -29 -28 64 44 -53 17 104 -1 -46 40 29 -73 -34 26 -37 -50 8 6 -8 24 42 27 14 37 42 17 -4 15 50
3422 50 -35 -46 50 35 -81 -32 103 7 -101 36 108 -43 -65 68 79 -32 -48 57 78 -26 -51 57 65 -55 -72
3447 -72 62 32 -66 -20 69 8 -12 38 18 8 45 1 -34 26 33 -35 -33 24 7 -39 -24 26 47 -8 -31 36 84 -38 -48 72
3477 72 45 -83 -28 68 -47 -85 38 33 -59 -19 71 19 -38 12 44 0 -62 -6 38 -30 -82 18 66 -65 -61 88 26 -97
3505 -97 1 98 -19 -56 71 51 -43 -16 50 -11 -43 -5 6 -34 -67 -13 19 -22 -30 50 62 -7 38 101 23 -12 64 23 -72 -14
3535 -14 52 -78 -95 35 19 -80 -6 93 27 -57 6 93 8 -85 4 107 3 -76 76 125 -53 -57 78 28 -123 -30 76
3562 76 -39 -87 40 51 -21 6 55 6 -27 5 25 -20 -33 0 27 -15 -17 58 62 -21 12 83 -15 -52 26 4 -86 -35 32 -51
$$ packed form
3361AM6j3l3k2K5L4n6m6Q4L5j03J6J05m4q4P3M2r3RO2m5l6N4J4p2M4L0l1k0J6
3391hK8K0o9JR2k0r7P0Q7j05m5Q6j1j02L9O0o3j3N8kj4L2J8j5j3K3Nk5k1J9L5
3422E0q5j1R6j5j16M9J35r6j08J37P2j51k2J33J1j11j6J05K1j04k5J08Qj20j7
3447g2J34l0r8M6Q9o1k0N0k0j0L7m4l5O0Po8KN7j7m6J5N0K1n5k3O7M8j22j0J20
3477G2k7j28N5R6j15l8J23nr2M0R0n2n7N0L2m4o2N6M4o8n2J00M8j31MJ49o2j23
3505i7R8R7j17l7J27k0r4K7O6o1l2L8J1m0l3N4L2m1qQ0J2o9M5O3p8l5P6m1r5N8
3535a4O6j30j7J30j6r9P4R9o6q4O3Q7q5r3Q9J03j04p9J52M9j78mJ35n0j51R3J06
3562G6j15m8J27J1p2K7M9m9l3L2K0m5j3L3K7m2kP5Mq3L3P1r8l7P8k2r0N1O7q3
$$ plain form
3592 -51 -60 50 30 -31 17 57 18 -34 1 35 -14 -44 -1 63 -4 -55 49 73 -68 -45 42 -22 -123 -35 41 -50 -46 65 53
3621 53 -19 19 59 5 -25 -8 -8 -22 -54 -27 18 -26 -45 47 51 -55 -10 64 -4 -61 28 49 -35 -15 48 12 -27 22 27 6 2 7
3653 7 0 -6 -16 8 26 -16 -14 44 25 -23 18 59 -29 -35 41 14 -65 -14 44 -16 -15 33 13 -1 22 12 8 8 3 7 2 -17 17 34 -18 -35
3689 -35 42 26 -64 -3 71 -11 -63 23 52 -32 -28 40 19 -13 -3 10 14 12 0 5 9 -2 2 -4 -41 -27 12 -19 -38 46 78 -31 -11
3722 -11 99 20 -72 5 57 -40 -81 2 20 -27 -45 14 49 8 -29 26 58 -30 -47 34 11 -48 -22 30 -6 -15 20 5 5 30 -11
3753 -11 -20 48 17 -48 -14 51 -2 -44 1 40 -5 -33 -20 5 -10 -85 -23 55 -6 -46 53 105 17 8 98 58 -49 -11 16 -36 -65
3784 -65 -31 -18 -29 -19 -2 34 10 -2 36 29 -21 -12 65 23 -29 34 72 -9 -21 33 7 -20 -19 -9 -17 -2 -21 -20 26 25 -19 29 58
3817 58 13 6 32 2 -11 -14 -28 -17 30 -6 -22 55 66 -18 4 68 11 -64 -19 -10 -56 -63 -23 -8 -11 1 16 54 27 -10 22 46 -18
$$ packed form
3592e1rJ10k0o1M8M0l9n2L5L4m9l0M3O4o7n1J04K4j41K3Q7o4j01Q8P6r1MJ11j2
3621E3p2L8M0n4l0J7%j4l2K7M5m4j9R2Mj06M5P4o8n7Q9K1q4K0O3l6l9M9Nk1mN
3653Gpoj0K4J8m2KN8j9m8M1M1q8oP6k7p9N1N8o0JM8k0j4K3j0m%nMnj9L4J7n2j7
3689c5P7j6r0O1P4q2n2Q6K9q4MO8k1l2J0J3Mkj2NMj1Mol7J4L9l1j9Q4L2j09K0
3722a1J10p9r2P7N2r7m1Q3J8m7j8N9L5m1l7N5L2q8j7Q1k3n9K6N2l6rL5j5%K5m1
3753a1rO8l1o5L4O5n3m2M5L9m5k8J3K5j5p5O2P8o1m0R9N2q8rR0m0j07L8K7n2k9
3784f5L4J3j1J0J7L6k4j2L8pn0RP7m2n2O3L8q1j2N4k6k7JJ0qJ5j9JM6jm4M8K9
3817E8m5pK6l0j3lj4J1M7l6j6P7J1q4K2O4n7p5M5Rm6pM0J5lJ2J5L8k7l7L2K4o4
$$ plain form
3850 -18 -31 60 39 -41 26 48 -24 -47 -2 -18 -54 -51 -29 1 1 -26 0 72 32 -22 56 67 -6 -33 26 3 -40 -31 -17 -9 -1 -28 -20
3883 -20 43 45 -21 10 66 4 -33 6 7 -22 -4 -15 -1 18 -9 -15 20 23 -35 14 43 -26 -20 53 31 -25 30 57 -15 -31 9 9 -34
3916 -34 -42 -3 42 -3 -30 28 94 -4 -40 48 74 -38 -38 57 18 -38 -13 18 6 -3 -18 -9 48 24 -12 27 61 21 8 15 15 -2 -8
3949 -8 -29 -24 28 -9 -35 19 48 -5 0 59 21 -27 11 18 -10 -9 9 -3 6 3 -18 19 -3 -29 -8 18 -28 -29 28 -5 -37 20 23 -2 18
3984 18 29 0 -14 9 -8 -47 -16 -6 -29 -21 11 7 29 18 5 46 33 -33 -14 26 -30 -48 6 23 -8 17 27 3 -2 12 -25 -21
4016 -21 -6 -11 -27 12 26 10 23 31 2 27 14 -36 -11 30 -37 -45 14 11 -23 8 31 2 15 28 9 18 15 -5 -11 8 -5 8 24 -5
4050 -5 -7 43 25 -34 20 53 -32 -42 26 13 -40 5 43 18 19 32 26 16 4 -24 7 -2 -36 -14 34 -1 -14 45 25 -34 12 34 -27
4083 -27 -32 13 -5 -45 5 19 -7 -16 10 3 17 14 -2 26 5 -20 12 24 -27 -25 39 -28 -44 11 17 -34 -11 27 -20 -23 19 17 -14 16
$$ packed form
3850a8j3R1k1q0O7K2p2k3M5j6l6LK2L0%k7K6P2m0n4P8J1p3k7N9k3m3RJ4QQk7Q
3883b0O3Ko6L1N6o2l7L9Jk9J8j1J4J9k7oL5Ln8M9K9o9OP3k2n6N5K7p2j6M0%m3
3916c4qL9M5m5k7N8O6r8l6Q8K6j12%R5l9n6K5L1j2rj5RN7k4l6L9L4m0j3P%j7o
3949hk1NN2l7k6N4K9n3NN9l8m8L8Pk8JJ8j2Rlk1L7k2k6K1K6m6jN7l3l2N7Lk5K0
3984A8J1k9j4K3j7l9L1J0k3QL2mK2j1j3M1j3o6J9M0n6j8N4J7l1K5J0k4nJ4l7M
4016b1J5nj6L9J4j6J3Qk9K5j3n0K5M1o7qN9ll4L1K3k9J3J3j9Rlk0oJ9j3J3J6k9
4050ekN0j8n9N4L3q5j0O8j3n3M5L8k5JJ3oj0j2k8L1rl4K2M8l5j3N9k0n9M6K2o1
4083b7nM5j8m0N0J4k6rK6pJ4lj6K8k1k5L2J2n1KO4o7j6N5On1K3L8m7lM2kl1L0
$$ plain form
4117 16 27 9 9 15 2 6 -20 -30 -10 -28 -61 17 36 -31 -30 65 38 -63 12 58 -27 -37 32 35 -35 -16 19 13 -23 -16 15 24 -32 -8
4151 -8 42 22 -23 28 59 -39 -31 64 25 -61 6 55 -13 -17 33 25 -11 -15 6 3 -3 -11 13 33 3 8 42 3 -16 30 10 -53 2 56 -24
4186 -24 -64 47 41 -50 -8 51 3 -30 2 32 2 -26 2 16 -2 -33 1 29 -11 -17 52 23 -31 41 66 -31 -36 52 0 -86 -9
4217 -9 30 -43 -41 29 19 -28 -10 33 20 -10 3 67 44 -27 2 72 -15 -83 22 34 -100 -61 43 7 -65 0 38 -15 -11 10
4247 10 0 -14 -3 -5 -7 -19 -7 21 -7 -32 15 29 -43 -30 49 5 -80 5 60 -38 -63 44 41 -32 -2 29 4 -5 14 27 3 -9
4279 -9 4 -2 -14 -27 19 17 -38 4 63 -26 -71 21 31 -82 -38 71 28 -69 17 70 -7 -38 22 33 -4 -24 9 22 -24 -23 27
4310 27 22 -37 -12 49 -16 -46 28 30 -44 2 47 -1 -10 42 22 -14 20 12 -26 -21 28 8 -20 -17 24 29 -33 -17 49 45 -39 6 84 10
4344 10 -60 16 47 -54 -45 38 9 -41 8 27 -13 -11 14 15 -15 -20 -6 13 -18 -41 26 20 -40 -4 55 -9 -46 26 34 -37 -9 26 -18
$$ packed form
4117A6J1j8%Oj3Mk6j0K0j8l3P8J9o7JR5k7j01P5M6q5j0O9Lp0J9L5ol6PL1Rn6K4
4151hN0k0m5N1L1r8QR5l9q6O7M9o8mN0ql6mK1loqK4K0l0NL4l9j9M6k0o3N5N4q0
4186b4m0J11or1M2N9m8l3L2L0l0k8K8J4j8l1L4K8m0oO9k9n4P2K5r7nQ8n2q6P7
4217iL9p3KP0j0m7J8M3j3l0J3O4k3p1K9P0q7o8J05J2j34L9J04l6p2O5L8n3MK1
4247A0j0j4J1kkj2J2K8k8k5M7J4p2J3P9m4q5Q5N5r8k5J07lp3L0L1k5rJ9J3k4j2
4279iJ3oj2j3M6kn5M2N9q9m5R2J0j13M4J09m3r7Q6N3p7l1O0J1l7k0L3J3m6JN0
4310B7nn9K5O1o5l0P4Kp4M6M5m8rN2k0l6L4ql8NM9k0k8LM1No2J6O6mq4M5P8p4
4344A0p0P6L1j01RQ3k9n0M9J9m0KK5Jl0nJ4J9l1k3O7oo0L6N9o4l7P2Qp1K8L5m4
$$ plain form
4377 -18 -14 14 -12 -32 13 2 -15 -1 14 7 -2 -9 1 26 -17 -47 25 38 -44 -36 60 19 -37 -2 40 -13 -17 15 8 -5 -5 -15 1 13
4411 13 11 -13 18 -3 -10 17 5 -3 28 34 -19 8 32 -27 -27 26 19 -45 9 49 6 -9 31 13 -10 -8 1 14 -3 -16 6 36 -7 -25
4445 -25 33 43 -2 -1 51 21 -2 32 21 -6 19 4 -20 -2 8 -19 -13 14 -8 4 22 -11 -3 37 -4 -23 27 19 -6 7 41 8
4477 8 -18 10 -9 -19 11 -1 -9 19 3 -31 -3 13 -30 -8 18 -21 -31 12 13 10 23 29 9 32 11 -28 4 7 -35 -19 19 -18 -42
4510 -42 4 15 -14 -12 -9 4 11 -8 -8 42 38 -21 -6 66 10 -35 36 45 -27 -29 8 -2 -28 -30 -18 -15 -12 -21 -13 30 12 -2 23 31 3 16 19
4547 19 -13 0 38 -7 -2 16 28 -13 5 7 -14 -5 -3 -22 1 29 -13 -18 18 38 -8 -1 6 12 17 -16 -9 37 26 -41 11 78 1 -53 14
4582 14 51 -38 -24 6 14 -28 -21 12 31 -2 -20 23 58 5 -9 40 47 -26 -13 14 -5 -31 -4 5 3 1 -11 1 30 5 -24 24 33 -19
4616 -19 -16 24 7 -16 9 20 -2 -3 -8 1 23 -16 -28 35 22 -41 -2 64 -6 -45 26 38 -45 -11 35 16 -21 -8 15 7 -36 -37 33
$$ packed form
4377a8MK8k6k0M5j1j7J4J5prpJ0K5m3l0P2J3q2QR6m1n6L5M2n3mL2pj3%j0J6J2
4411A3kk4L1k1pK7j2qL1On3K7K4n9%N3po4N4M0m3j5M0j8k3KRJ3j7j3K2L0m3j8
4445b5N8J0m5JN2l0k3L4j1k7K5j5k4J8J0k7OK7k2J2J8l3QM0m1j9N0qk5J3L4l3
4477Hk6K8j9j0L0j2qK8j6l4K8J6m3K2K6l9j0M3JlJ3Ok0K3k1l9L2Lm2J6L8l7k4
4510d2M6J1k9KLJ3Pj9%N0mn9J5P2n6m5P1Rp2kL7j0k6kJ2LLrQM3j8j4K5Qk8J3L
4547A9l2J3L8m5NJ8J2m1J8Kk1RKj9K3K8m2nL6K0m6PPONl3PM6j1o7N2O7p7n4O7
4582A4L7q9J4L0Qm2PL3J9l3j8M3L5n3j4M9Pp3J3K7j9k6K7Rkkj2J2K9k5k9M8Rn2
4616a9LM0j7k3K5J1k2jnRK2l9j2O3j3o3L9O6p0l9P1J2q3L4M6j9l7J3K3qm3jP0
$$ plain form
4649 33 29 -41 -11 69 25 -58 8 57 -8 -46 7 11 -15 -17 -12 11 16 -15 -21 34 24 -35 -11 41 4 -17 7 25 17 -5 6 20 41 -9
4683 -9 -31 32 37 -35 -7 36 15 -14 12 18 4 8 20 0 25 12 -11 -5 9 -10 -10 5 14 7 26 12 -7 30 10 -37 -1 12 -16 -16 20
4718 20 13 8 21 17 -1 7 -21 -33 -1 3 -26 1 36 3 -1 35 31 -2 11 6 -11 -7 -9 -21 5 14 -10 15 50 1 -3 25 26 -9 7 10 -27
4755 -27 -24 -1 -27 -14 3 -17 -12 22 12 -21 5 11 -15 -18 17 3 9 13 1 23 25 -31 -16 22 -35 -73 -9 15 -33 -28 30 31 -3 23 41
4790 41 21 7 -4 -9 9 -5 -24 17 16 -15 1 26 -5 -2 14 8 -6 34 11 -26 21 34 -16 -9 30 20 -28 -5 23 -4 -13 -2 9
4823 9 10 -31 0 49 21 -26 6 43 -14 -40 16 10 -33 -29 15 -8 -3 22 28 17 16 14 12 23 3 -11 -2 -14 -12 -1 -7 -9 4 7 -31 -9 42
4860 42 -1 -13 39 36 -28 5 40 -11 -35 -11 -9 -23 -25 -1 2 2 -4 10 26 -21 -18 31 2 -43 18 46 -24 -32 27 4 -58 -22 11 -33
4894 -33 -50 15 6 0 -3 21 32 15 -3 18 28 -23 -23 18 11 -34 -2 22 -15 -23 27 8 0 14 15 0 15 12 -11 -1 25 4 -8 9 19
$$ packed form
4649C3mp0L0Q0m4q3O6M9o5l8N3Mk6kNK3Nl1oN5j0n9K4N2l7k1K4J8qk2J1J4K1n0
4683ik2O3Np2K8M3k1k9K6Oj4MJ2k0K5j3k3OJ4j9%J5RpJ9j4j9L7k0m7L6J3k8%L6
4718B0pnJ3mj8Qk8j2L2Mk9K7L5l3mL6ml3J3nj7Mkj2K6Rk4K5L5m9mK8Jl5J6Ll7
4755b7LK3k6J3J7k0NL4j0l3K6Ok6lL5j4OMj2K2Kn6J5L8n7l8O4K4m8NN8Jl4K6J8
4790D1k0j4j1nJ8j4j9M1jl1J6K5l1LJ6oj4M0k3l7M7J3n0PL9j0m8K3K8k7rJ1J1
4823IJm1L1M9k8m7L2L7n7k6N6om3MM4k3NK5Oj1jkkJ1k0j4Rj2KJ1okJ3Ll8K2N1
4860D2m3j2N2lo4L3L5n1k4K4Kj4kK4L%oJ4J6m7LM9k9m5O1K8p0qN9k3o2L6L3m4
4894c3j7O5rolK4J1j7j8K1J0n1%M1pm5L2K4l7qN0j9qJ4Jj5J5lk3J0K6k1j2J7J0
$$ plain form
4929 19 22 5 -12 13 27 -23 -17 31 9 -23 15 60 -5 -22 32 15 -43 -27 9 -19 -42 -1 37 17 14 31 56 24 -7 16 28 -25
4961 -25 -36 4 -8 -58 -4 25 -1 -4 37 18 9 19 6 -4 4 10 -25 4 17 -17 3 11 0 4 -15 -17 -8 5 -46 -28 20 20 -22 27 45
4996 45 2 -7 33 1 -27 -15 -2 -23 -28 -12 10 12 12 9 35 13 -29 -13 2 -27 -45 11 8 -17 12 32 15 11 24 -2 -15 -2 -10 -10 16
5031 16 -2 -4 18 16 -6 17 16 4 5 19 -11 -7 7 -4 -9 12 22 -1 22 22 1 17 19 -8 -14 8 -2 -19 -4 6 4 22 3 -1 17 14
5067 14 -24 -20 30 14 -11 15 28 15 12 17 7 22 -4 -14 6 6 -21 0 34 -5 -18 26 17 -10 21 31 -8 -1 37 7 -15 17 8 -9
5101 -9 -9 -7 -2 1 4 -6 21 23 -14 14 29 -27 -31 25 -3 -35 6 7 -26 -21 21 -1 -18 -1 5 0 -5 -3 -6 5 11 -10 5 15 -6 -7 -5 -9 -14 5
5141 5 -34 -30 4 9 -38 9 53 4 0 30 26 3 -3 -13 -18 -10 -19 -39 4 8 -4 -1 34 6 22 12 -10 8 26 -17 -22 43 28 -23 2 58
5177 58 4 -27 1 16 -18 -15 8 2 9 7 18 35 7 -26 30 16 -41 1 42 -14 -43 34 38 -1 13 49 44 19 2 5 29 -13 -39 -17
$$ packed form
4929A9Lj7j7K5J4n0OM8k2l2L8M5o5j7N4j7n8J6L6k8k3M1L8k0lJ7K5l2l1K3J2n3
4961b5j1M0j2n0N4K9k6lM1j9rJ0j3j0QOl5K9J3l4K0Qj1Mj9kRJ3n1J8M8%m2M9J8
4996D5m3rM0l2k8J2J3k1nJ6K2K%lK6k2m2J6J5k9j8N6lk5K9K0j7mJ3k6j3J3q%K6
5031A6j8kK2kk2K3jj2JJ4l0MJ4j1nK1J0k3K3%k1J6Kk7oK2j0j7J5J0kJ8j9mJ8l
5067A4l8MN0j6k5K6J3j3lNj0J5k6j0K0%k7K1L4l9j3M4rk7L1J0l9PL8l0k2L2rj7
5101i%KNLLj0K7Kl7K8J5n6mN6k8l2M1Jl3NM2k2j7J7OnnKlJ1Ok1J5J0k1jKmnJ9
5141El9ML4Nm7M7M4m9mL0mk3oj0nQrk0M3Mj2LL5k8J6j0k2J8J8m3nO5j5n1K5N6
5177E8n4l1K8J5l4LK3oPkJ1J7k8l3N6j4n7M2M1n6k9P7Ml9J4L6nk5j7LK4m2k6K2
$$ plain form
5211 -17 10 -35 -45 3 18 2 25 36 31 29 14 7 14 17 -8 -7 35 12 -19 1 32 -29 -30 10 -22 -34 -21 7 8 -8 11 36 43 -4 -12
5246 -12 43 11 -51 -10 22 -12 -47 4 19 3 2 23 27 12 -18 -20 9 21 -28 -28 17 15 -22 -4 20 12 13 -10 -2 29 5 -36 10 33
5280 33 -16 -18 20 23 -35 2 23 -9 -27 24 17 -11 5 9 25 26 6 29 37 1 -15 24 4 -39 -21 6 -2 -13 23 9 -10 10 23 -2
5314 -2 8 11 7 22 19 -2 -3 23 8 -8 6 8 -6 2 6 5 20 10 -10 24 24 -38 -7 32 -1 -27 34 40 -27 -32 21 3 -18 -11 5 23 -10
5351 -10 -7 15 30 -19 -4 21 7 -17 14 16 -9 -4 17 -15 -11 19 9 -22 12 29 -14 4 17 8 -1 5 -16 -1 8 -9 -13 18 13 -7 12
5386 12 4 -20 -6 4 -33 1 26 -17 -25 30 32 -19 8 24 5 -13 -3 -8 -9 -10 -9 1 27 11 6 29 15 -12 19 4 -30 -7 25 -8
5420 -8 -9 29 17 4 22 29 5 16 31 -15 -15 4 10 -10 2 8 9 13 -4 26 31 -4 -11 29 35 -31 -9 25 13 -16 3 33 -6 3 10 -3 7
5457 7 3 -31 -9 16 -10 -10 9 14 -1 12 5 -2 23 12 -9 12 26 -10 -3 33 0 -8 17 0 -25 4 2 -27 -5 24 9 -3 12 20 29 11
$$ packed form
5211a7K7m5j0M8J5j6K3J1nkj5pPLk5JM2k3l1K0L1o1jM0l2j2J3K8Jj6J9K5Pm7q
5246a2N5l2o2M1L2l4l5N1J5j6jK1Mj5l0kK9J2m9%M5kl7J8K4qJk3QL1k4m1M6K3
5280C3m9kL8Ln8L7K1l2j8N1pk8J6MJ6Jk0K3Ql6j6L9k0m3J8K7qj1L6j4j9K0J3k5
5314bJ0LmJ5lk1jK6j5j6J4Kj4QMjJ5j0k0L4%o2L1L9l3k6O1Oo7nN3j8k1PJ6J8l3
5351a0LK2J5m9J5K5j4k4L1Kk5NK1l2ML0j0l1L4J7m3J8J3rrOk1J5Rj7mL1nk0J9
5386A2qk4J4J0l7L4K5m3qN5Kn1K7J6j9j8J0njjJJ0K6j6nK3j4k7L1j5l4K3L2l3
5420hjL8j2j3J8Pk4J1J5m6%J9Ok0J2OJMj7L0Nl5pM0Oo6K2L4j2k9J9L0l9RPj3J0
5457Gml4K2K5k6%J9Nj5J3ppK5j1k1K1J4l6PL6l3qK5j7k5K9kk9K2K9j5j2J5QRj8
$$ plain form
5493 11 -5 11 23 -2 -27 9 -5 -23 -20 22 -6 -27 17 12 -12 9 9 -8 6 15 -10 -8 15 0 4 9 0 -6 14 16 -8 9 15 -10 -9 4
5529 4 -18 10 3 -18 8 35 -1 -14 25 23 -7 3 32 8 1 14 19 7 -4 6 12 11 6 2 23 4 -16 18 29 -12 6 28 20 -18 17
5564 17 25 7 25 22 -3 16 14 0 16 27 -6 5 15 11 -14 15 19 10 -4 -4 0 12 16 -31 8 18 -2 -17 6 13 -14 12 16 -8 0 15
5600 15 10 9 17 -1 7 13 8 6 13 -7 -13 13 10 -24 -6 16 7 -11 10 5 2 -7 3 -4 10 -10 -17 25 24 -8 -16 28 10 -15 0 18 -7 -4 -5 -17
5640 -17 -5 -10 -5 -5 16 2 -5 10 2 11 24 0 -6 13 30 -19 -6 18 -16 -25 1 15 -5 2 6 -9 0 11 -5 22 12 3 8 27 3 7 23
5677 23 11 -15 14 17 -9 12 27 -3 -14 20 -18 -16 4 10 -33 2 30 -5 -21 15 21 2 -6 18 22 1 -18 9 49 -5 -32 31 25 -39
5711 -39 -2 38 3 -26 11 24 5 1 16 14 22 3 -2 9 10 -5 5 7 -11 18 14 -7 -20 27 2 -25 21 32 -24 -16 30 21 -23 -6 31
5746 31 -7 -25 -2 10 -5 -15 -10 26 -5 -22 4 27 -7 -18 25 1 -8 8 11 -11 3 21 -17 -2 26 16 -21 7 22 2 -12 9
$$ packed form
5493A1j6J6J2k5k5L6j4j8LM2k8k1M4nk4K1%j7J4Rk5KK3j5MNroK0Kk4J7Ok5JJ3
5529Dk2K8pk1K6K7l6j3L9kl0J0K9k4pJ3Nj2j1J0OjnmK1j9k0L4J1m1J8K2ql8L5
5564A7Qj8J8lk5J9kj4J6J1l3J1J0mk5K9Mrj4%MJ2Mm7L9J0k0j5K3Pk7K6Mk4QJ5
5600A5njQj8QOnkPk0oK6ll4J8K2rj8K1nlrJ0pJ4k0pM2jl2qM4j8k5J5J8k5Ljj2
5640a7J2nN%K1j4pJ5qRJ3k4oJ9J7m9J3K4l4rK6J4k0PMj5RJ1j6K7j0rNJ9k4MJ6
5677B3j2k6K9Lk6K1J5l0j1L4l8KK0Om3L5K8l5j6L6Oj9qK4Mk1j9K7M0n4k7O3oo4
5711c9L7M0l5k9L7J3j9mJ5kQj9nJ1Jj5J0Kj8K9mk1j3M7k5k7M6J1n6QM6rm4J7L7
5746C1l8j8K3J2j5j0NL6l1j7K6K3l4j1M3k4rJ6Lk2J4J8l8J5K8j0l7K8J5k0j4K1
$$ plain form
5778 9 22 18 -21 3 40 7 -25 21 52 -6 -29 25 25 -26 -1 10 4 -5 21 4 2 21 5 -15 5 20 5 -6 5 13 11 -8 -13 17 12
5813 12 -35 -8 25 -19 -26 30 34 -15 0 41 5 -21 8 18 -19 -8 17 11 0 -20 11 26 -4 -7 26 23 -27 11 43 -1 -12 15 28
5846 28 -19 3 27 -6 -2 15 -5 0 2 6 8 9 0 2 15 -2 -2 9 -9 -5 0 3 -22 -2 28 1 -5 29 19 -9 12 36 6 -16 24 -2 -36
5883 -36 0 -2 -17 1 1 9 8 0 -1 13 8 -4 24 25 2 14 35 12 -16 18 4 -37 -7 4 -19 -28 14 4 -14 -4 23 13 9 10 13 11 6
5920 6 -24 4 12 -26 -20 30 20 -3 9 7 0 0 2 -15 -3 12 -29 -12 28 -9 -18 26 8 -20 -5 20 11 4 -4 12 21 14 -5 25 30 -18 -10 13
5958 13 -11 -24 5 7 -5 1 32 2 18 30 24 -1 12 17 7 -16 -4 -1 -7 -9 -8 8 -2 -7 3 14 -11 -17 19 -5 -15 12 23 -17 -4
5993 -4 24 6 -25 17 36 -22 -31 15 17 -11 -14 10 11 -20 -8 25 13 -34 -3 41 -7 -39 19 23 -14 -13 13 0 -21 14 10 -11 3 8 -7
6028 -7 2 6 -1 -4 -14 2 2 -8 -10 18 8 -30 -13 34 7 -28 6 36 -33 -6 30 13 -22 19 15 -23 1 26 13 -10 15 17 26 -7 -7 31
$$ packed form
5778IJ3ml9K4L7l3l2M6L1n8k3N4%n1K5J1orK6j7kJ9j6k0K0J5j5j1J1Qkj9nL0n
5813A2m7K7L3m4pN6Mm9J5M1l6k6K9J0l7J1K5oj1k0L1J5l0lL3ln0L8L2m4j1K7J3
5846B8m7K2K4l3MJ7k0NKMKJrKJ3j7%J1j8MNLk5K0L0k7oL4j0k8K1K4l0k2M0k6l4
5883c6L6kj5J8%QjqjJ4nj2K8Jk3J2K1k3k8L4j4m1L0J1k3rM2j0j8J0K7j0mJLkn
5920Fl0K8Ql8ON0j0k3J2kp%Kj7J2J5m1J7M0l7rM4j8k8J5K5rpqJ6Rpj9L0Nm8QK3
5958A3k4j3K9Kj2OL1l0J6J2ok5J3Nj0k3J2LokJJ6j0nJ0J1k5oL6k4j0K7J1m0J3
5993dK8j8l1M2J9n8rM6Kk8lK4Jl1J2L3j2m7L1M4m8l2N8Ml7JK6j3k1L5mk1J4Nj5
6028gRMplj0J6%j0kK8j0l8J7M7k7l5L4L0o9K7L6j7l5M1ml8K4K5j3k3K5KRl3%L8
$$ plain form
6064 31 23 -15 16 38 -4 -18 40 13 -35 -2 26 0 -20 21 22 1 6 34 16 8 -8 13 -1 -17 -4 3 9 -16 23 22 -12 -9 23 2
6098 2 -35 16 16 -30 -3 30 -14 -22 19 43 -5 -16 21 14 -18 -24 -5 15 -14 -7 21 25 -17 3 49 12 -6 4 9 -30 -7 6 -17 -17 4
6133 4 -14 -23 0 8 -3 -14 -2 0 -1 -12 8 17 10 -6 26 18 -33 1 34 -24 -35 14 3 -44 -18 46 6 -17 9 25 8 -11 -5 22 1
6168 1 -37 3 13 0 -12 17 35 1 3 21 -10 -12 13 -7 -24 3 12 -18 1 33 20 1 18 19 1 -2 2 8 1 -9 10 35 16 3 23
6203 23 6 -19 -7 21 -15 -34 14 4 -24 -4 38 14 -3 35 32 4 10 12 19 -7 -21 -9 15 -12 -22 20 3 -22 3 29 0 -9 29
6236 29 4 -16 5 12 -11 1 10 1 -6 -10 -11 -5 -2 2 1 11 5 8 22 19 -4 23 12 -15 -13 1 -24 -25 0 0 -17 -7 12 2 7 6 12 -2 22 3
6276 3 7 -3 -9 -11 -1 -3 -16 14 4 -9 17 19 -11 -2 13 1 -13 9 11 -20 -18 7 -11 -9 2 13 6 9 7 7 11 -10 -16 30 9 -23 16 17 -2
6315 -2 -16 2 -1 -16 -13 -10 2 -11 -17 -10 22 25 -7 20 27 17 -10 0 4 -7 -10 -15 -19 18 -5 -22 11 29 -11 -10 31 16 2 -1 -1 0 -13 -15 -2
$$ packed form
6064C1ql8L1K2m2j4N8k7m8L3K8k6k0M1Jk1NK8j8qj6K1j4j6J3POk5L9jl4LL2k1
6098Bl7N1%m6K7L3m4qM1K4m8j1L7pl2oJ9K0k9PK8Mm2K0M6l7j8J0Nl9K3J3k3%K1
6133Dj8rK3Qj1j1J2Kjj1K0Rpj6L2qn1L4L3n8j1M9j1m7K6O4m0k3K6J6j7j9OK7k1
6168Al8M0J0j3j2K9J8l4KJ8l1kK5k0j7K7Rl0J9L2j3j9J7Jj8lMOpj0J9K5j9j3K0
6203B3j7k5J2K8l6j9M8j0k8K0M2k4j7L8lk8OKPk6j4J2K4k7j0M2j7k5K5K6k9rL8
6236B9k5k0K1Pk3J2RrpmjOLMjJ0oLJ4lk3K7j1k7KJ4k5jK5%j7J0J9j0NjOj4K4j9
6276CMj0okJ0kj3L0j0j3K6Kl0RJ5j2j4K2Kl1KK5j8KJ1J1pLk%Mk1oM6k1l2L9Jj9
6315bj4J8lj5LLJ2j3oPL2Ll2K7Pj0k7J0Mj1lnmL7k3j7L3J8m0JM1j5j4l%Jj3kJ3
$$ plain form
6354 -2 25 19 -12 8 2 -21 -14 12 -9 -36 14 30 -5 8 37 16 -15 2 11 -9 -9 -22 4 9 -14 -5 24 11 -18 10 25 -8 -11 7 -7
6389 -7 -29 -13 -1 -10 0 24 -5 -2 13 8 -1 1 -13 -10 -10 -11 -6 2 -4 6 5 -1 -1 30 6 -27 1 22 -18 -42 30 30 -30 -9 41 6 -25 8
6427 8 20 -3 -39 -2 18 -6 -19 2 38 -5 -31 34 27 -39 -17 32 -3 -41 6 25 -8 -6 11 20 8 -12 5 23 5 -7 -11 11 -6
6460 -6 -8 8 5 16 19 -10 -9 32 7 -47 1 34 -15 -39 13 45 -14 -19 17 20 -4 -12 20 15 -2 -8 15 12 -20 -8 13 -15 -27 17 7 -18
6496 -18 -7 10 -7 -13 4 7 -14 0 7 -10 -8 0 -18 -13 6 -8 6 -7 -13 -5 7 -11 6 31 1 -26 22 34 -8 -11 17 4 -10 -2 7 3
6532 3 1 11 7 11 1 3 10 11 -4 5 11 7 3 9 -11 -8 21 8 -24 13 22 8 -10 17 17 -8 8 7 4 9 -5 -4 6 9 -4 8 15 2 -2 6 0 2 16
6575 16 18 3 24 24 -1 2 2 -28 -15 -3 -25 -19 11 1 -8 13 23 1 7 22 18 10 -3 0 6 3 4 -4 8 -4 -4 6 -9 -21 -12 3 -27 -20 18
6614 18 -5 -7 16 20 -8 1 5 -9 -11 8 2 -2 -4 4 7 -3 -7 0 11 -5 -6 13 4 -23 -6 21 -13 -4 30 11 -7 18 19 -10 -4 16 5 -13 0
$$ packed form
6354bK7ol1K0ok3PK6k1k7N0J6l5J3K9k1l1J7Rk0%j3K6Nk3RK9j3k9K8J5l3lJ8j4
6389gk2J6J2rJ0K4k9LJ5nrKj4L%jNQoJ0jo%L1k4l3K8K1m0k4P2%o0K1N0l5l1L3
6427HJ2k3l6L7K0k4j3K1L6m3k6O5po6K2M9l5l8M7J9l3KJ7Rj2k0J7J8j8j2mK2j7
6460fkJ6lJ1Lk9JM1k5n4M8L3m9k4N2L2n9nL6Lk4qL2nj7oK3ll2J2K1k8j2M4j0k5
6496a8J1J7j7oJ7Lk1J4Pj7KQj8NJ9j4J4j3oQJ2j8J7K5l0k7M8J2m2lK8j3j4QRm
6532CkJ0mMj0KPJj5ROmmOk0LK9j3l2L7Rj4j8K7%k5J6jlNj4JJ0Lj3J2Pj3mQoKJ4
6575A6Kj5K1%k5L%l0J3J2k2OL0j0rK1J0k2OJ5mqj3LOlJqJ2j2%J0j5j2RJ5l0PL8
6614A8k3kK3Mk8RMj4kJ9omkQLj0mPJ1j6jJ9rk7J7K7l4RL4j9j8K5Jk9OK0j1j8J3
$$ plain form
6653 0 8 -3 -13 0 0 -5 -9 -2 14 -23 -25 20 30 -18 -9 45 9 -23 10 27 -16 -17 21 6 -16 -13 1 -11 -15 2 6 -3 -17 9 19 -21 -10
6690 -10 35 3 -34 14 41 -18 -10 25 3 -31 11 31 -18 -17 14 16 -21 -10 27 18 -13 -7 21 13 -20 -5 32 -10 -38 -1 22 -28 -10
6723 -10 27 -3 -21 16 13 -26 -6 18 -2 -14 4 20 -12 -13 13 17 -9 -25 11 25 -17 -14 33 1 -33 7 32 -12 -27 26 23 -41 -7
6756 -7 25 1 -17 10 20 -7 -22 3 22 -16 -12 19 28 -21 -18 22 -5 -25 8 10 -15 -12 20 -3 -29 9 3 -23 -11 25 4 -27 -8 17
6790 17 -15 -25 -9 30 -1 -36 0 30 -12 -39 23 19 -17 -5 25 -9 -24 11 0 -25 8 24 -4 -15 9 12 -7 -14 17 18 -7 -9 20
6823 20 18 -19 -5 38 13 -20 15 23 -13 -14 17 -1 -15 2 21 -5 3 17 2 -8 1 13 6 -3 0 4 6 -18 -1 29 -24 -21 20 5 -28 -4
6859 -4 12 -6 -11 13 11 -10 -6 11 8 -6 6 -5 -5 -18 -9 9 -2 -16 6 15 -21 -12 19 -4 -15 13 9 -18 6 23 -7 -13 9 4 -1 -6 3 9
6897 9 1 -3 -4 1 -8 -36 3 1 -20 -8 5 2 -18 -1 8 -24 1 11 3 3 0 -13 -4 17 -6 -9 13 18 -9 -2 2 3 10 3 -1 23 14 -10 11 20 6 -12
$$ packed form
6653@Qj1j0J3%nmPJ6l7kM5J0m8RN4l6l2L3J7m3jL8j5k2LJ4j2mJ7Mrj4K6J0m0J1
6690a0M5l2l7M8K7n9QL5k2l4M2K0m9JL1Kl7J1L7rl1OK8ql3J5L7m2k8L7K3n0J8
6723a0L7l0j8L7ll9K0K4k0j2J8J6l2jK6Mk6j6L6J4m2LM7l2l4M0K5m4j5N3lo4L4
6756gL2k4j8K7J0k7j5K5J9l8ML1Rm9LM0k7k0L3Kk5LL2k3k6L8ok6J2L6k1l1J9K5
6790A7l2j0J6L9l1l5L6L0m2k7O2ml6J2L0l4j5L5j1k5L3J6k8j1K4Lj9pL1Jk5kK9
6823B0kl7J4M3k5l3L5Ql6jL1j8j4J7J9k6QJ4j5j0RJ2prLMKk4J7L0n3LM1j5l3K4
6859dJ6j8nK4kk1MJ7lj4J2j1%j3RJ8j1j4K2Rl6RL1k3j1K8mk7K4J7l0oK2nnnRO
6897IqmjNrk8L9kk1J2J3lk0J7Rl2K5J0q%lj3RK1k3lK2Nk7PMJPpmK4rk4K1Rj4j8
$$ plain form
6939 -12 6 8 -11 -5 16 -3 -4 12 7 -2 11 6 3 6 9 6 10 6 -3 24 15 -19 0 25 -8 -20 20 25 -1 -9 9 5 -7 -8 -5 14 7 -10 6 20
6979 20 3 -8 12 13 -7 4 24 7 -1 12 2 -2 5 -4 -4 24 -4 -1 24 10 -2 -7 1 -3 -5 10 6 -3 8 -4 1 2 -1 -9 13 15 -13 -1 16
7018 16 -3 -14 6 5 -2 -9 9 3 0 2 -4 -1 -3 -5 17 2 -11 -9 8 -5 -10 21 17 -7 -5 27 8 -11 9 13 -1 6 3 10 20 9 3 11 4 0 -8 -5
7060 -5 -8 -14 14 1 -10 23 -10 -15 10 6 -15 -7 12 -1 -13 0 17 -2 1 7 6 -4 2 -8 8 -5 -20 1 23 -11 -15 31 7 -23 11 27
7096 27 -7 3 14 7 -2 -2 2 -1 -5 -5 0 15 5 -9 8 1 -4 -1 3 7 18 24 11 -1 20 3 -15 16 4 -12 -8 1 -3 -15 0 0 -10 -7 -6 24
7136 24 -1 -6 -3 10 -10 -20 13 17 -18 -6 19 5 -12 10 19 -8 0 7 -2 -6 5 -3 5 5 5 4 12 -9 1 11 -10 -15 0 5 -8 6 26 -10
7174 -10 -7 22 2 -15 4 -1 -16 -4 4 -10 -8 2 -9 4 -3 -3 -3 11 3 -10 5 -1 -6 -8 16 -13 -2 13 -9 -10 7 9 -11 13 2 1 14
7211 14 4 3 12 16 -5 11 8 -7 -3 12 1 -6 20 17 1 6 3 6 7 4 -7 12 11 1 -12 9 9 -21 -6 0 -5 -17 13 15 5 5 3 0 22 -8
$$ packed form
6939a2J8Kj9OK1j9jJ6nrJ3nlLLlMmrK7rl4J9K5l3j2M0Nk6qJ8mj2jLJ9pj7J6J4
6979B0j7j1K0Jk0J1K0j7qJ3j0mPr%K8k8LK5j4j2nQmkJ5mrJ1j2NJlqK2Kk8J2J7
7018A6j9j1K0jppJ8olKoLkkK2j5j3KJ7j3nL1mk4KL2j9j9K0Mj4PlPJ0j1oQpmqL
7060eloK8j3j1L3l3nK5mk1QJ9j3j2J3J7j9LOjj0Oj0J6j3j5K1K2l4mM6k4l0L4J6
7096B7l4J0J1pr%Mlm%NJ5j0j4J7pnLMMJ1Oj3j2K1j7j8L1j2j6MRmj2J5%j0LJL0
7136B4k5nLJ3k0j0L3Ml5J2K5j4j7K2Rk7QPrmJ1qQ%%jQk1J0J0k1nJ5Nj3J4K0l6
7174a0LK9k0j7J9nj5J2Qj4KJ0j1J3p%%J4qj3J5onkK4k9J1J5k2jJ7Kk0K4j1jJ3
7211A4j0jRMk1J6lj5MJ5j1pK6lj6NlLJlj1J9jj0j3K1%l0J5Onj2L0Kj0%klK2l0
$$ plain form
7251 -8 -14 1 -8 -29 -18 -2 0 -9 -2 -8 7 2 -10 -6 5 -9 -27 2 20 -15 -12 11 0 -14 -11 11 -4 -8 -6 0 -5 -17 -14 7 1 -14 1 20 -7
7290 -7 -16 16 0 -25 10 13 -24 -8 17 3 -13 5 6 -2 -12 9 -2 -4 -18 2 9 -8 -18 10 11 -25 -2 16 -4 -15 23 16 -12 14 29
7325 29 2 -18 15 9 -8 -5 -2 9 -16 -20 5 14 -17 -2 30 28 -6 11 21 2 -3 20 -2 -33 4 21 -14 -12 23 5 -21 4 20 3
7359 3 -26 -8 16 -11 -29 -1 23 -2 -22 -1 11 -19 -15 32 -2 -22 13 9 -31 -12 21 -2 -23 2 7 0 -17 -1 9 -9 -25 7 16
7392 16 -11 -9 34 15 -29 8 20 -22 -28 15 7 -46 2 27 -7 -14 15 20 -12 -29 17 17 -9 -21 7 17 -9 -11 28 8 -25 4 13 -25
7426 -25 -13 19 -8 -20 10 19 -25 -12 20 8 -25 1 29 -2 -12 -6 2 2 -34 7 13 -7 -25 22 20 -25 3 25 -7 -27 6 1 -14 -1
7460 -1 20 -18 -8 -2 11 9 -8 13 5 -10 1 17 12 -14 -10 20 5 -34 21 13 -32 -25 24 -2 -35 -5 16 -13 -22 3 13 -2 -8 19 20 -9
7496 -9 -9 19 15 -19 -8 17 0 -31 12 17 -14 -14 17 2 -16 -4 5 2 -5 3 4 -2 1 6 22 10 -2 -4 -16 -6 -6 3 -20 -15 4 -1 -11 16 11 -14
$$ packed form
7251hoJ5rk1J1J6KrPoJ5nj2MJ1j4j8K9J8l5LK3j1j4LK2j5mKOnj2LK1oj5J5J9k7
7290grL2j6k5L5Ll7J6K5j4j6J8Jqj0K1j1kj4K0Pj7j0K8Jl6K3J8k0j1L8pk8K6J5
7325B9k7k0L3oj7LLJ1k5mK5Rl1J5L2kl4J7J0j9nK3k2l1L7J7l5KL5j8k6K5J6j7
7359Ck9J8K4k7j8K8K4k5k0K1J2l0MM7l4k0L5mm0J9L3k3k1K5Npj7J6J0j8j6L2R
7392A6k7KM3j9m4L7J2m2oM3qn3M8K5l4pK9Nl2j7M6%k6j2K8J0k6kL9k0l3K9Rl8
7426b5J2L2k7j2L0Rm4J3L2j2l3K6K8l1j0OQ%l6M1Ok0j8M7km5K8K2l2k0L3nj5J3
7460aK1l8J0OJ3kj7K1qj5J1J6nk6ML0j5l9N5qm5PM9k6l3L0K1k9rK5J0j5oK7Jk9
7496i%K8ml4J1K5j7l1M3Nl1%L1j5j8J2RlpQJoLNJ6j2j2kj2J0%Rk3NJ9nj0K7nk5
$$ plain form
7536 -14 -7 16 2 -20 -1 -11 -4 -4 -2 -3 2 13 -1 11 -11 -5 4 -12 -31 -14 3 -21 -20 14 7 -11 -10 19 8 -7 4 2 10 5 -3 8 14 7 -4
7575 -4 7 7 -13 -7 -13 0 -11 -19 -1 -15 -3 1 6 19 28 -2 3 23 -4 -9 -13 -12 -2 5 -13 6 0 0 -19 5 7 0 2 14 -3 -12 8 -4 -6 -8 10
7616 10 -7 3 10 -12 1 3 -5 14 4 2 6 15 5 -9 2 4 -12 -6 10 -5 -4 11 -3 -10 21 4 -3 7 1 -7 -3 3 -16 12 3 -8 -16 3 -9
7655 -9 -5 -5 7 -4 -6 -4 -2 12 4 -20 -4 8 -8 -16 8 17 -10 -16 -9 4 1 -6 -6 10 7 -11 -3 10 7 -9 6 -6 -15 -4 -2 -6 -2 -7 -7 -4 -2 1 -7 13
7699 13 5 -2 3 2 -14 7 11 -14 -2 8 -16 -12 -6 1 -5 -1 1 0 -13 6 -4 8 1 3 -16 -9 -15 -17 5 4 1 4 21 -15 3 7 -4 -8 9 -12 -12 2
7741 2 4 -7 -2 4 -10 -9 2 -14 -13 -5 -17 -9 0 -3 7 -1 1 -12 -3 -9 -15 -16 -15 -20 -17 -2 -5 -9 1 -8 -17 -2 2 -13 -28 3 -16 -18 -5 4 1 -2 -1 2 -1 -12
7787 -12 -5 6 -6 -11 -3 17 -6 -9 4 10 1 2 10 -16 8 -4 1 -6 7 -7 -7 5 7 -8 4 7 -2 -4 -4 -13 -13 -10 3 4 9 -13 -9 16 5 -11 0
7828 0 -10 -30 -16 -9 -14 -9 -5 21 5 6 -12 -4 2 -9 -14 -4 -6 -12 -3 1 2 -7 8 -7 -5 -5 -4 -10 6 10 -13 -5 6 -2 -13 -4 3 -12 6 3 -9 -5 3 -7
$$ packed form
7536a4PK3j4k2J9j0P%KjNJ1j4J2k2ORj6j9J7J7k4JL4pj8JK9j1j5J1kQnqJ1Opj1
7575dJ1%k0OoJ3j1qJ8j4J2MNJ3Rl0NK0k7nmJJ0Pj8J9o%j9K4KpKJ2j7rK0j2kkJ8
7616A0j7J0Pk2J3KqJ9j0kMRj0j4J1Kj6OJ6j5JJ5j4pL1j7pJ0oqMOj9K8rj1qJ9j2
7655iM%J2j1kKKJ4qk4J6J2j6qK4Rk7oPJ3lp%J6lj8QJ3lj6J5j2rJ1KmMn%LKLqK0
7699A3qpNjj6K1Mk5J2J0k4MOPoMKjj3J9j0J2pKj9PokK2jlLJ7l6J8Mj1mJ7k1%J4
7741BKj1NOj4JJ1j6JQj2QRlJ0qKj3RoojJnLJ5lmJ0rrJ5Mj5j5L1j9kJ3RllJLlj1
7787a2PJ1j2nQK0k3lJ3OrJQk6K4j2NpJ3j4%J2Kj5J2Lrk%r%LJ3JNk2MK5j1j6J1
7828@j0k0J4PnNMK6j6Jj8QOj1nJ0koRMJrJ5j5K%JoJ6Mk3QJ1qj1RPj5J8lj2MQj0
$$ plain form
7872 -7 -2 7 -14 -4 4 -4 -16 -3 -6 -10 -12 -7 -20 -14 -4 -13 4 16 5 -1 -1 -1 -7 -6 -6 -9 -2 2 -13 -3 -1 -8 -4 -7 0 -5 4 7 -9 10 -3 -4 2 4 -13 -12
7918 -12 4 -14 -2 14 -16 -1 10 1 -3 -7 7 -3 -9 5 -9 -4 2 -18 -14 -1 -5 -18 3 -1 -14 -11 7 -15 -12 -1 3 -5 -1 1 -15 -12 -4 -16 -7
7957 -7 -10 -10 -7 -2 -10 0 5 -7 -9 8 5 -10 10 2 -14 -10 20 7 -8 -1 4 -5 -7 -1 -2 -2 -5 -7 10 -8 -8 0 2 -22 0 15 -14 6 12 -7 -22 -4
7999 -4 -2 -5 -16 18 3 -7 1 1 -3 -7 -7 -3 3 -24 -3 0 -4 -19 5 15 -16 -15 21 11 -29 1 -3 -16 -14 -1 -2 -15 1 -7 -16 -20 -6 7 -5 -5
8039 -5 4 8 14 -18 1 -3 -14 -2 3 -8 -8 6 6 -23 -5 11 -14 -32 8 2 -20 -14 6 2 -25 -12 -2 -10 -30 -7 18 -6 -8 6 13 -22 -20 8
8077 8 -1 -13 16 18 -17 -13 17 11 -3 9 24 -3 -13 -6 7 7 -10 3 16 -5 -6 -3 11 -22 -9 17 10 -13 5 23 -13 -10 4 4 -13 7
8113 7 -2 -4 -1 6 10 -8 -4 1 -2 -5 -8 7 -6 -22 -1 13 -22 -35 21 9 -31 -4 9 -10 -14 -3 10 -14 -7 8 0 -14 -13 9 9 -18 2 11 3
8152 3 -8 8 20 -9 -3 7 1 -18 -2 8 -7 0 7 -7 4 10 -1 1 2 8 9 0 -5 5 14 -14 -17 3 -10 -22 11 10 -6 -19 10 14 -4 -8 13
$$ packed form
7872gNRk1J0Qqj2J3lmkNj3OJ0rJ7J2j1o%%oJ%lPMj5J0KpMlPnRLj6J9j3jOKj7J
7918a2J6j8J2J6l0J5J1rmmJ4j0oJ4j4NOk0MJ3mj3K1mj3LJ8k2LJ1MqMKj6LQj2R
7957gl%LNqJ0Nj2kJ7lj5K0qj6ML0j3j5PNrkOj%lkJ7j8%QKk4K2J5k9K0Oj9j5J8
7999dKlj1L4j5j0Q%mm%MOk7K1Lmj5K4J0l1JL6j0m0L0mj3KJ3jj3J6qrmJ4J3j2%
8039eRMOl2J9mj1J2Nj1%J4%k9J8J6k5j8M0ok2OK0mk7J3J0qk0K3K5k4kJ4Pl5KK8
8077Hrj2K9Kl5ML0oj4J2J5k7j0PJ3%j7J3J3k1jLJ4l3J3K6pk3J8J8l6LJ4%j7K0
8113GrkLPMj8MNlllJ5j3j6K1J4l5j3N6j2m0K7J3j9mJ1J3k4PJ5qj4JK2%k7K0Rq
8152Cj1J6J2k9OJ0oj9J6J0j5PPj4J1Oj1KJOJrnJ0Rk8lK0j3j2L3jj6j3K9Mj8mK1
8191A3
$$ Imaginary data points
##PAGE= N=2
##DATA TABLE= (X++(I..I)), XYDATA
$$ plain form
0 0 0 0 0 0 0 0 0 0 0 0 0 0 0 0 -1 8 -8 8 -8 8 -8 16 -16 16 -17 24 -24 31 -32 38 -41 48 -51 57 -65 73 -81 89
38 89 -100 111 -122 137 -151 167 -184 205 -228 254 -283 318 -357 406 -467 542 -638 769 -961 1262
58 1262 -1807 3110 -12299 330 28929 -9968 -24248 11295 23663 -13371 -17248 14839 15019
71 15019 -14866 -9742 13710 6334 -12882 -3064 9447 -118 -7400 2107 3873 -2765 -427 3150
85 3150 -3058 -2356 5194 306 -7450 2091 8406 -4514 -8329 7219 7454 -9269 -5602 11400 3750
100 3750 -12178 -951 12815 -1896 -12807 4691 12073 -7198 -10216 9906 8094 -11921 -5652
113 -5652 12626 2124 -13240 853 12553 -3738 -11054 6424 9381 -7858 -6555 9578 4511
126 4511 -9819 -1860 9815 -626 -9329 2770 8332 -4475 -6659 5814 4518 -6974 -2823
$$ packed form
0@%%%%%%%%%%%%%%jRj6J6j6J6j6K4l2L2l3M1m8N5o3P0p9Q9r9J08j22J38j54J70
38H9j89K11k33K59k88L18l51L89m33M82n37O01o75P63q73J009j180J407j730K223
58A262l069M917j5409J2629K8599l8897j4280L5543J2368l7034l877L2087J80
71A5019k9885N124K3452p376j9216R818J2511r565p282R507J766o638K338L577
85C150o208P02P550m888p756R541O315j2920l815J5548K35j6723L667J7002p650
100C750j5928J1227J3766j4711j0911J7498P382j9271l018K0122j812k0015O269
113e652J8278j0502j5364J4093J1700j6291p316J7478K957j7239J303J6133n067
126D511j4330P959J1675j0441q703J2099N562j2807k184J2473j296j1492M151
$$ plain form
139 -2823 6705 474 -6084 1662 5278 -2699 -3246 3992 1773 -4086 217 4012 -1898 -3590 2974
154 2974 2233 -4587 -1466 5136 -24 -5549 1710 5783 -3112 -5104 4895 4427 -5911 -2859 6836
169 6836 951 -7648 257 6883 -2557 -6670 3934 5795 -4952 -4391 6083 3311 -6561 -1862 7002
184 7002 629 -6920 673 6386 -2250 -6058 2937 4729 -3819 -3509 4145 2162 -4002 -858 3490
199 3490 -199 -2625 1061 1663 -1583 -794 1598 -366 -1675 1306 1647 -1849 -1012 2690 385 -3436
215 -3436 96 3491 -1196 -3519 2226 3332 -2911 -2547 3634 1699 -3985 -746 4046 -167 -3819
230 -3819 990 3479 -1587 -2877 2277 2516 -2527 -1856 2758 1014 -3077 -375 3035 -241 -2469 1296
246 1296 2280 -1584 -1455 1937 644 -2057 -25 1789 -643 -1559 973 1129 -1196 -632 1583 600 -1322
$$ packed form
139b823R528o231o558P746L616p977n47P238k219n859M303L795n910j692O564
154B974p41o820L121O602n160n525P259M073q895j992R999m68j0338L052R695
169F836n885q599P905O626r440m113J0604J861j0747N61J0474k772r872M699Q864
184G002o373p549P593N713q636l808Q995J792q548L10P654j983o164L144M348
199C490l689k426L686O02l246P89K392j964j309K981L41l496Q37L702k305l821
215c436L532L395m687k323N745J106o243L64O181j935n684L239M792m213l652
230c819M809K489n066j290N154K39n043O71M614j744m091K702L410l276k228L765
246A296R84l864J29L392j293k701K032J814k432r16K532J56k325N64K215r83j922
$$ plain form
263 -1322 0 1481 -357 -1522 543 1096 -1113 -900 1302 427 -1317 322 1564 -466 -941 1159
279 1159 710 -1479 -660 1082 -183 -1498 116 1351 -163 -1055 531 1165 -567 -1071 642 806 -828
296 -828 -554 929 300 -735 167 703 -255 -298 415 -153 -735 -104 41 -651 -443 329 210 -285 -15 494
316 494 305 -233 -21 535 237 -376 11 358 -319 -512 112 -18 -502 21 325 -341 -344 306 41 -479 -19
337 -19 446 164 -89 137 408 254 -215 -203 260 89 -505 -283 249 -72 -347 105 319 98 165 177 12 83
359 83 -52 -383 -194 88 -163 -196 255 226 -34 183 261 19 108 200 19 15 93 -80 -95 8 -182 -181 103 -49
383 -49 -225 113 227 -93 -14 274 156 42 118 23 75 218 -75 -201 242 217 -318 -180 219 -46 -338 -130
405 -130 61 42 -35 -93 133 370 28 -167 249 257 -271 -189 164 -106 -303 -38 -58 -201 -37 -8 -157 36 170
$$ packed form
263a322J322J481j838j165K065N53k209K13K202q75j744J639J242k030m75K100
279A159m49k189Q19J742j265j315J614J235j514q92J586O34j732n04J713J64j634
296h28K74J483o29j035R02N36r58m3P13n68n82O31J45o92K08P72j19m95K70N09
316D94j89n38K12N56k98o13L87L47o77j93O24j30m84N23L04o66lO50k65n20M60
337a9M65k82k53K26K71j54m69J2M63j71n94K22N32l21k75M52K14k21O7J2j65P1
359H3j35l31J89K82k51l3M51k9k60K17P8k42Q9R2j81mP8j73j5J03j90JK84j52
383d9j76L38J14l20P9K88j18j14P6r5N2J43k93j26M43k5n35J38L99k65k92K08
405a30J91j9p7n8K26K37l42j95M16Qn28Q2L53k70j97K65k0j43J64K9j49J93J34
$$ plain form
428 170 16 87 253 134 42 51 -84 -112 -103 -307 -271 24 -113 -297 122 235 -205 -56 349 6 -260 172 214
451 214 -205 -107 231 70 -153 -57 78 25 -206 -202 93 50 -275 -18 332 -53 -236 304 163 -429 -30 385
473 385 -254 -447 340 328 -384 -159 514 258 -307 -45 497 209 -427 -150 480 9 -674 -64 496 -286 -569
494 -569 375 431 -353 -38 564 91 -248 235 243 -211 -45 265 6 -168 154 255 -115 -221 167 158 -430 -323
516 -323 369 22 -642 133 811 -232 -552 793 670 -811 -319 1027 67 -1110 124 1003 -391 -1013
534 -1013 463 817 -708 -829 753 640 -949 -442 1115 206 -1164 161 1142 -541 -993 838 706
551 706 -1084 -353 1181 -41 -1165 306 986 -625 -894 708 632 -887 -475 942 212 -1040 10
568 10 930 -432 -881 695 547 -1001 -106 1221 -333 -1143 926 942 -1491 -751 1686 122 -2092 272
$$ packed form
428A70j54P1J66j19r2Rj35k8Rk04L6K95j37j84M19J13m40J49M05l43k66M32M2
451B14m19R8L38j61k23R6J35n3k31MK95m3l25K57L50l85j83N40j41n92L99M15
473C85o39j93P87j2p12K25O73k56n65K62N42k88o36K77O30m71o83O10N60p82k83
494e69R44N6p84L15O02m73l39M83Qm54J66L10k59j74L22J01l70j06L88rn88J07
516c23O92l47o64P75O78j043l20J345j23j481M92J346r60j177J234Q79j394o22
534a013J476L54j525j21J582j13j589N07J557r09j370J325R81j683m52J831j32
551G06j790P31J534j222j124J471O80j611k69J602p6j519M12J417p30j252J050
568A0R20j362m49J576j48j548Q95J327j554q10K069J6k433P40K437j564k214K364
$$ plain form
586 272 2182 -689 -2091 1310 2139 -1702 -1929 2157 1569 -2654 -1188 2939 608 -3129 61 3108
602 3108 -726 -2821 1385 2410 -1802 -1750 2122 1115 -2178 -445 2090 -174 -1833 738 1541 -1115
618 -1115 -1025 1574 602 -1700 112 1820 -748 -1727 1322 1243 -1939 -721 2261 60 -2220 839 2188
635 2188 -1411 -1679 2036 1106 -2435 -394 2697 -328 -2758 1112 2632 -1938 -2410 2670 1930 -3295
651 -3295 -1178 3886 418 -4065 598 4067 -1549 -3783 2345 3111 -3100 -2435 3438 1505 -3612 -609
667 -609 3564 -217 -3250 960 2746 -1686 -2156 2171 1366 -2477 -450 2594 -463 -2420 1318 1895
683 1895 -2108 -1240 2582 339 -2822 503 2630 -1500 -2425 2038 1724 -2707 -1100 3046 359 -3097
699 -3097 610 3197 -1304 -2838 2184 2364 -2927 -1712 3398 698 -3790 218 3679 -1360 -3514
$$ packed form
586B72J910k871j402L401Q29l841k27M086n88m223J466M127k331l737L190L047
602C108l834k095M206J025m212N2L872j007l293J733K535k264j659K571Q03k656
618a115R0K599r72k302J812J708k568r79L049p9l182J218K982k201k280L059J349
635B188l599k68L715r30l541K041L091l025k430L870J520m570m72N080p40n225
651c295K117N064l468m483M663L469n616k234O128P66o211O65N873j933n117L003
667f09M173l781l033M210J786m432m70M327q05l843K027L044l057j957L738N77
683A895m003Q68L822k243l161L325K127m130r25M463l14m431J607M146k687l456
699c097L707K587m501j534N022J80n291J215N110k700m488M008L461n039k154
$$ plain form
714 -3514 2154 2824 -2976 -2147 3460 1324 -3635 -335 3780 -370 -3480 1273 3185 -1930 -2576 2528
730 2528 1873 -2910 -1004 3035 15 -2986 795 2439 -1746 -1901 2232 1020 -2551 -50 2715 -679
746 -679 -2326 1668 2145 -2132 -1407 2786 868 -3029 -109 3120 -780 -3161 1435 2676 -2310 -2191
762 -2191 2847 1421 -3153 -423 3342 -407 -3078 1335 2671 -2010 -2021 2611 1416 -2773 -492 3066
778 3066 -143 -2910 930 2649 -1731 -2401 2138 1587 -2802 -1029 2934 109 -2973 722 2750 -1390
794 -1390 -2163 2107 1711 -2299 -820 2600 228 -2504 441 2229 -1171 -2082 1458 1424 -2043 -1041
810 -1041 2164 285 -2349 345 2202 -1001 -1833 1653 1409 -1967 -687 2229 43 -2233 546 1956
826 1956 -1178 -1716 1506 1219 -1848 -771 1981 218 -2075 246 1900 -880 -1770 1302 1356 -1710
$$ packed form
714c514N668O70n800Q29N607k136m959L300M115m150l110M753J912n115o46N104
730B528o55m783J906M039l020l001L781J644m185j55M133j212l571K501K765l394
746f79j647L994M77m277P25M193j918l897K920L229l900k381M596J241m986J19
762b191N038j426m574K730L765l749k671M413J336m681j1M632j195m189K281L558
778C066l209k767L840J719m380o70M539n51m389J773L963k825l082L695K028m140
794a390p73M270l96m010J479L420k372k732K945J788l400r11L540l4l467J002
810a041L205j879k634K694J857l203q32L486k44l376J280K916k186k276K779J410
826A956l134n38L222k87l067J077K752j763k293K321J654k780q90L072N4l066
$$ plain form
842 -1710 -778 2078 295 -2047 405 1966 -943 -1722 1335 1298 -1660 -851 1797 417 -1792 21
858 21 1733 -400 -1559 786 1296 -1110 -981 1351 551 -1504 -46 1525 -409 -1340 914 1112 -1159
875 -1159 -661 1445 340 -1425 56 1346 -404 -1254 582 1022 -782 -793 986 601 -995 -228 1063
892 1063 -69 -994 416 819 -730 -554 936 201 -1018 164 1009 -437 -819 717 683 -823 -429
909 -429 909 216 -928 -69 858 -167 -839 346 744 -541 -567 753 366 -877 -146 861 -243 -896
927 -896 411 691 -579 -475 708 347 -648 -154 596 -13 -630 -30 412 -192 -475 184 333 -286 -218 384
947 384 71 -413 82 346 -274 -275 386 127 -406 8 361 -127 -329 102 115 -221 -163 50 -2 -99 14 133
969 133 38 7 222 204 -154 -32 316 -49 -484 7 352 -314 -474 262 331 -304 -201 372 250 -195 -127 187
$$ packed form
842a710R32K856j783k342K452J561k909p79L057l7k958Q09K648j380k209J813
858B1J712k133j159K345N10k406J29K332q00k055J458J571j934r31K254J98k271
875a159M98K106j105j765J481J290j750q50J836M40j804j1J779l85j596P67J291
892A063j132r25J410M03j549J76J490p35j219J182Q45j446l82J536l4j506L94
909d29J338o93j144Q59R27j025o72J185L98j285k6J320l87j243P31J007j104o53
927h96J307K80j270J04J183l61r95M94P50o09o17O00M42o04k83O59J49o19O8O02
947C84l13m84M95K64o20jO61k59n33M14L53m88k02M31J3l36N8K13n2r7J13J19
969A33r5l1K15j8l58J22L48l65m35M91L45o66j60P36O9o35J03N73j22m45O8L14
$$ plain form
991 187 138 -151 -161 154 245 -46 -60 244 158 -103 -55 25 -83 -117 -93 -126 -9 60 -73 38 244 68 -81 171
1015 171 143 -181 -72 164 -55 -228 67 209 1 -67 144 237 32 -162 3 185 -122 -363 3 130 -268
1036 -268 -255 153 107 -149 44 214 62 23 99 56 43 53 -51 -6 54 -85 -139 -5 -58 -207 -125 -43 -96 -94 -48 39
1062 39 165 85 -50 199 322 -89 -235 189 139 -410 -279 196 43 -325 -109 245 131 -161 -93 241 176 -204
1084 -204 -126 229 79 -266 -51 187 -69 -149 68 18 -70 58 37 -90 46 105 -51 -62 79 52 -20 -1 9 40
1108 40 38 -46 -28 44 -46 -69 45 -30 -126 107 144 -142 -17 326 79 -228 75 312 -68 -244 59 184 -96 -255
1132 -255 -4 219 -29 -226 115 333 -45 -149 261 198 -196 -65 172 -132 -253 42 22 -201 -52 187 91
1153 91 -40 82 252 167 -103 -48 222 59 -284 -84 188 -72 -263 -19 64 -101 -62 -46 -94 105 152 -143 -37
$$ packed form
991A87m9k89j0L15R1k91j4L04q6k61M8Q0j08l4K4l3J17O9j33J11K06j76j49K52
1015A71k8l24J09K36k19j73K95J42k08o8K11R3k05j94J65J82l07k41L66J27l98
1036b68J3M08m6k56J93J70j52l9P6m3j3J0j04M5O0j39n4J34n3j49Q2Q2n3KM6Q7
1062C9J26q0j35K49J23m11j46M24n0n49J31M75j53l68K16L54j14k92O8L34o5l80
1084b04P8L55j50l45K15K38k56q0K17n0q8J28k1j27J36N9j56j1J41k7p2J9J0L1
1108D0kq4J8P2r0k3J14p5r6K33L7k86J25L43k47l07L03K37l80j76L03J25k80j59
1132b55K51K23k48j97L41K18l78j04M10o3l94J31K37l04j21K95k0k23J49K39r6
1153I1j31J22J70q5k70N5K70j63l43K00K72k60j91K44Q3j65L9J6m8J99M7k95J06
$$ plain form
1176 -37 362 190 -231 15 359 -1 -368 -103 228 -97 -461 -83 339 -85 -417 214 465 -224 -301 415 216
1197 216 -481 -116 412 -126 -450 168 342 -216 -181 339 210 -249 -115 242 -29 -380 -75 200 -191 -264 255
1218 255 207 -257 53 452 -113 -386 274 245 -504 -242 450 35 -448 149 485 -102 -241 272 233 -274 -170
1239 -170 220 -71 -370 91 307 -288 -250 568 290 -599 -18 850 -106 -875 308 817 -517 -743 630
1258 630 636 -642 -428 681 319 -629 -230 518 81 -466 8 376 -40 -145 265 104 -178 215 198 -449
1278 -449 -170 498 -145 -742 249 681 -465 -542 751 525 -737 -253 861 79 -908 37 819 -281 -831
1297 -831 462 774 -616 -595 836 427 -981 -249 936 -143 -1041 305 816 -536 -610 728 463 -640
1315 -640 -88 708 -69 -622 204 421 -501 -449 471 127 -704 -23 738 -202 -690 514 704 -659 -449 893
$$ packed form
1176c7L99j72m21K46L44l60l67K65L31l25l64L78M22m24l32O31K51o89p7P16j99
1197B16o97L65N28n38l24O18J74n58L5N20j29m59J34L57k71l51L05K75l91p3N19
1218B55m8m64L10L99n65k73O60k9p49K62O92m15m83N97L36n87j39N13l9n07J04
1239a70L90k91k99M61K16n95L8Q18k78q89N81Q68r56p69J183N09j334k26J373
1258F30Oj278K14J109l62r48L99P48m37n47M74L68m16j05M10j61k82L93j7o47
1278d49K79O68o43n97R91M32j146p7J293k26j262M84J114p82r87R45P82j100n50
1297h31J293L12j390K1J431m09j408P32J185j079q98J346N11j352p4J338k65j103
1315f40N52P96p77n53Q26K17r22N2R20l44q31O81P61r40m88J204J90j363K10J342
$$ plain form
1335 893 215 -1012 5 905 -409 -931 503 659 -745 -503 852 321 -837 -25 959 -101 -857
1352 -857 367 801 -613 -696 731 378 -960 -176 918 -175 -842 509 712 -662 -371 902 151
1369 151 -884 199 913 -435 -821 707 719 -909 -575 1057 363 -1208 -127 1288 -127 -1224 504
1386 504 1184 -688 -889 941 608 -1071 -324 1000 -80 -975 323 799 -507 -526 783 438 -754
1403 -754 -88 906 -106 -917 374 820 -683 -750 856 450 -1099 -234 1079 -185 -1140 409 916 -708
1421 -708 -684 946 544 -842 -57 1096 -2 -903 322 791 -680 -871 590 365 -1070 -383 1002
1438 1002 -36 -1009 451 1089 -557 -700 978 533 -1073 -244 1064 -152 -1129 327 963 -573 -815
1455 -815 767 662 -899 -466 935 145 -1071 6 954 -364 -871 602 680 -760 -364 897 60
$$ packed form
1335H93o78j227J017R00j314n22J434J56j404K42J355n31j158Q12R84j060p56
1352h57J224M34j414q3J427l53j338P84J094j093o67J351K03j374K91J273p51
1369A51j035J083P14j348l86J528J2j628L34J632o94j571J081J415j415j097J728
1386E04O80j872k01J830l33j679P47J324j080q95J298M76j306j9J309l45j192
1403g54O66R94j012q11J291M46j503o7J606m06j549Q65J313j264r55J549N07j624
1421g08K4J630m02j386P85J153j098r01J225M69j471j91J461k25j435O87J385
1438A002j038r73J460O38j646j43J678m45j606Q29J308j216r77J456O36j536k42
1455h15J582j05j561M33J401p90j216J077R48j318n07J473P8j440L96J261q37
$$ plain form
1472 60 -888 230 801 -467 -603 725 490 -738 -173 888 27 -903 114 772 -508 -896 501 565
1490 565 -794 -422 961 284 -833 230 1006 -306 -696 619 535 -795 -357 805 31 -882 145
1507 145 807 -336 -723 521 608 -693 -497 798 300 -874 -21 988 -112 -805 468 794 -572
1524 -572 -547 690 267 -812 -160 638 -147 -608 246 514 -295 -296 492 259 -465 -51 507 -135 -551 251
1544 251 397 -485 -357 586 150 -659 61 689 -212 -577 399 475 -500 -364 523 182 -567 -101 498 -61
1564 -61 -524 132 430 -258 -349 390 257 -478 -87 526 -133 -547 272 439 -469 -374 524 185 -613 -82 587
1585 587 -32 -549 126 530 -172 -480 229 428 -273 -362 330 254 -357 -143 324 -12 -280 98 149 -179 -15
1606 -15 195 -115 -157 215 95 -297 -20 334 -29 -337 91 369 -118 -354 204 398 -243 -369 334 304 -424
$$ packed form
1472F0r48J118N71j268j36J328k35j228N65J061q61r30J017O58j280l88J397O4
1490E65j359L72J383o77j117J063P76j312l90J315q4j330M38J162p74r13J027
1507A45O62j143l87J244Q7j301J96J295m98j174Q53J009j100o93J273L26j366
1524e72K5J237m23j079O52P98p85m61Q54K68q09jP88k33p24M14N58o42m16Q02
1544B51J46q82J28R43m36q09P20O28r01l65R76P6r75J36Q87l41p49M66N99n59
1564f1m63O56K98o88r1P39j33p35L91O13o59m14Q19J67r08R5Q98l39p98N31O69
1585E87o19n17O75M04p02l08P09J99p01q9O92p6o11K14M67l36k68L78N1l28J64
1606a5K10l10m2L72j20l92K77L54l63l08M28K78m87k36N58J94o41j26P03l0p28
$$ plain form
1627 -424 -238 444 112 -434 16 426 -75 -278 187 227 -161 -133 136 39 -185 -51 140 10 -106 104 220
1648 220 -36 -60 212 84 -206 -3 190 -126 -250 124 115 -217 -67 209 -1 -128 83 130 -74 -68 79 40
1670 40 -80 -18 124 59 -89 44 178 -47 -173 85 91 -247 -166 144 -48 -268 41 190 -87 -101 157 131 -81
1693 -81 -45 110 44 -95 -77 76 40 -141 -73 110 -14 -159 -3 64 -104 -101 53 -22 -62 57 33 -29 67 75 -71
1718 -71 -3 90 -32 -94 21 58 -18 -48 18 87 25 -109 -16 119 -68 -216 22 105 -162 -150 157 88 -114 43 214
1743 214 77 -40 64 125 30 -91 -44 72 -30 -165 -32 104 -59 -116 94 76 -81 31 116 -22 -9 100
1765 100 16 -49 85 93 -59 -17 90 31 -67 -48 41 38 -97 -86 112 61 -144 -26 172 -26 -147 106 147 -103 -52
1790 -52 138 -2 -105 49 75 -106 -55 87 7 -122 -22 112 11 -132 9 182 -48 -223 80 190 -176
$$ packed form
1627d24J86O82l32n46M50M10n01k03M65M0l88K8K69r7k24J34J91j30j16K10J16
1648B20k56k4K72j28k90K03J93l16j24L74rl32J50K76k10j27K11M7k04OJ47l9
1670D0j20O2J42o5j48J33J34k25j26K58Ol38Q1L10j92k20L09J49k77j4K58k6k12
1693h1L6J55o6j39J8J53l6j81O8J83j24j45J56O7j68LJ54p5m0J19k4o2R6Qj46
1718g1O8R3j22o2J15L7p6l0O6O9o2j34R3J35j87j48K38Q3k67J2L07o9k02J57J71
1743B14j37j17J04O1r5j21M7J16j02j35J33J36j63n7K10j8j57J12Q5j38J3J09
1765A00q4o5J34Qj52M2J07n9r8J9Q9lj35J1J98n1k05J18J98j98j21K53M1k50N1
1790e2J90j40j03J54K6j81N1J42q0j29J00J34j01j43J41J73k30j75L03J10l66
$$ plain form
1811 -176 -209 197 112 -250 -63 220 -19 -193 43 155 -54 -87 70 72 -66 -76 35 42 -88 -59 63 4 -80 47
1835 47 59 -80 16 94 -76 -87 133 6 -230 15 194 -145 -221 167 168 -193 -129 247 177 -196 -102 302 146 -290
1859 -290 -120 315 25 -401 -32 317 -112 -341 145 265 -146 -153 192 144 -107 -43 97 46 -51 -33 63 41 -31
1882 -31 13 57 0 -4 47 -29 -48 64 29 -135 4 132 -82 -145 117 129 -127 -31 199 50 -113 25 120 0 -94
1907 -94 -9 69 -18 -103 -24 72 -38 -82 61 50 -58 14 73 -59 -50 99 21 -100 26 86 -60 -76 50 52 -47 -66 3
1934 3 74 10 -115 -29 113 -22 -153 23 106 -60 -93 23 77 0 -38 -9 58 38 -95 -56 82 1 -130 -7 73
1959 73 -59 -55 39 -13 -51 53 18 -49 55 71 -59 -33 60 -1 -93 -36 23 3 -76 -43 80 33 -109 19 160 -38
1985 -38 -148 128 133 -179 -93 210 29 -226 45 202 -79 -170 116 141 -103 -101 108 73 -144 -83 133 16 -164
$$ packed form
1811a76l3M06q5l62J87K83k39j74K36J12k09l3J57Kj38j0J11Pj30K9J22n9q4J27
1835D7J2j39R6P8j70j1K20j27k36K45J79l39p6L88Jl61O4L76p0l73R4M04j56m36
1859b90J70M35k90m26L69L49m29k29M86J20m11pL45m8k51O4J40n1r7J8R6k2p2
1882c1M4M4n7mN1p6j9J12l5j64J39J28k14o3K62J2k56R6K30j49j63J38R5j20r4
1907i4Q5P8q7q5P9R6j10m4J43j1j08P2N9j32RJ49p8j21J26O0j46j6J26Kr9j9O9
1934CP1o4j25Q6J42j35j31J76Q3j66l3J16N4p7l8K9O7k0j33L9J38q1j31J23Q0
1959G3j32MR4n2l8J04l5o7J04J6j30K6R3o1r2N7N9k0p9L3J23m7j42J28J41j98
1985c8j10K76Nl12Q6L03j81k55K71J57k81r1K86K5k44KK09l5k17O1K16j17j80
$$ plain form
2008 -164 47 188 -91 -116 209 103 -222 18 270 -84 -245 150 201 -216 -141 220 83 -221 -45 219 -3
2029 -3 -230 27 209 -92 -196 160 157 -226 -75 297 -7 -294 144 291 -215 -224 292 155 -349 -94 310 -8
2051 -8 -357 19 286 -105 -271 134 253 -160 -188 234 122 -254 -58 243 -101 -259 150 134 -276 -64 295
2072 295 -61 -300 170 275 -213 -187 306 142 -335 -93 328 -9 -406 3 333 -186 -438 203 297 -338 -244
2093 -244 428 179 -409 20 450 -69 -339 208 280 -266 -215 247 66 -328 -59 278 -80 -294 155 268 -242
2114 -242 -217 338 149 -400 -40 445 -64 -402 219 380 -253 -251 355 185 -339 -87 307 -27 -277 69 236
2135 236 -134 -173 212 104 -272 -52 277 -97 -334 191 307 -273 -190 446 194 -367 45 473 -60 -400 155
2156 155 281 -295 -334 205 132 -335 -125 311 38 -310 70 346 -112 -256 281 246 -305 -114 366 14 -363
$$ packed form
2008a64K11J41k79k5L25j06l25K40K52l54j61L95N1m17P5L61j37l04J76K64k22
2029ck27K57J82l01j04L56ll83J51L72l04k87M38J47n06rN16j37n04K55M04l18
2051hl49L76K67l91j66M05J19m13k8M22j12l76J96L01l44j58M09j6m10K12L59
2072B95l56k39M70J05m88K6M93j64m77K42M21l37l97M09L30n19k52O41R4o35R4
2093b44O72k49n88M29M30n19k70N47P2n46N1M62j81l94K69L37l58k14M49J13n10
2114b42K5N55j89n49L60M85n09l38O21J61o33KO06j70n24K52L94l34k50L46J67
2135B36l70l9L85j08l76K20L29l74k37N25J16n80Q3O36k52n61M12M28n33l40N55
2156A55J26n76l9N39p3m67K10M36k73l48L80K76m58j44N37l5n51J91M80l52l77
$$ plain form
2177 -363 90 316 -195 -282 195 120 -305 -157 193 16 -258 27 233 -65 -181 175 187 -213 -117 254 11
2198 11 -344 25 291 -179 -261 243 201 -273 -116 288 -2 -319 4 228 -131 -241 148 187 -193 -157 249 110
2220 110 -273 -31 325 -43 -325 121 273 -207 -214 238 135 -255 -61 207 -46 -224 36 115 -96 -112 112
2241 112 70 -116 24 187 16 -124 125 179 -167 -176 193 63 -301 -40 272 -56 -241 134 227 -163 -127 212
2263 212 95 -196 -37 205 4 -194 43 198 -75 -199 135 180 -201 -137 240 77 -262 13 246 -60 -197
2284 -197 112 139 -146 -76 127 27 -102 18 82 -64 -81 63 47 -109 -49 135 26 -172 22 185 -75 -161
2306 -161 140 137 -177 -91 154 -23 -191 29 111 -105 -96 82 20 -126 -26 114 1 -120 40 143 -52 -170
2328 -170 89 155 -139 -133 181 69 -240 -76 146 -61 -169 20 116 -39 -39 73 83 -4 -4 35 43 -53 -53 0 -64 -120
$$ packed form
2177c63M53K26n11q7M77p5m25J48L50j77k74K85K06k98j16L56J2m00R6L71k43
2198A1l55L69K66m70q2N04m2m74J57M04k90l17L23K24l59j10L89L9l80L6M06j39
2220A10l83K42L56l68k82M46J52m80pM52j03l90J94K68k53j78K60P9k11j6K24
2241A12m2j86J40J63j71j40K49N4l46rL69j30l64K61L12l28j85L75R3l90L6L39
2263B12j17k91J59K42k01j98K37J55k73j24L34M5l81O4L77j63l39K75K33l06j37
2284a97L09K7k85P0K03j00j29J20O4j46j7J44j6j56O0J84j09j98J94J63k60q6
2306a61L01ll14Q6K45j77j68K20Q2k16RJ78o2j46J00J40j13j21J60J03j95j18
2328a70K59O6k94OL14j12l09J64K22k07j08J89R6j55%J12J0q7%L9Qr6%N3o4n6
$$ plain form
2354 -120 0 41 -69 -1 129 35 -59 69 83 -79 -49 69 -26 -81 22 52 -15 -14 54 67 10 -28 6 30 -73 -99
2380 -99 51 26 -103 5 144 -14 -92 80 75 -122 -65 87 6 -95 7 95 24 -28 57 159 47 -77 36 91
2404 91 -133 -199 33 29 -197 -96 148 22 -110 53 164 20 -29 72 90 2 -13 26 38 -9 -14 6 -19 -60 -23 -36
2430 -36 -140 -90 36 -40 -106 103 170 -56 -9 193 66 -128 16 108 -89 -160 -9 18 -108 -88 70 85 -59 -16
2454 -16 135 52 -138 -22 123 -78 -177 65 71 -160 -84 138 0 -89 67 121 -47 -59 62 20 -63 -25 40 -12 -74
2479 -74 -5 58 -57 -109 20 51 -122 -57 136 15 -125 65 150 -42 -45 138 54 -112 -4 49 -91 -118 23 32 -70
2504 -70 -48 57 53 -69 -34 128 77 -77 39 169 -20 -137 65 83 -139 -81 85 -16 -97 3 61 -10 -20 54
2528 54 58 39 12 28 42 -9 -42 14 21 -67 -18 26 -54 -65 49 -10 -60 51 84 -29 14 106 29 -57 28 57 -33 -56 -16 5
$$ packed form
2354a20J20M1j10O8J30r4r4J28J4j62L0J18r5n5J03L0o7JO8J3n7l8L4K4j03k6
2380i9J50k5j29J08J39j58p8J72nj97N7J52q1j01J02Q8p1n2Q5J02j12j24J13N5
2404I1k24o6K32mk26J01K44j26j32J63J11j44m9J01J8q8j5L9J2m7nK0k5m1L7j3
2430c6j04N0J26p6o6K09O7k26M7K02j27j94J44R2j97p1J51K7j26K0J58J5j44M3
2454a6J51q3j90J16J45k01r9K42Ok31P6K22j38q9J56N4j68j2J21m2q3L8O5n2o2
2479g4O9O3j15n2J29L1j73O5J93j21j40J90Q5j92lJ83q4j66J08N3j40k7J41Rj02
2504g0K2J05mj22L5J62n1j54J16J30j89j17K02J8k22N8J66j01q1J00N8p1j0P4
2528E4Mj9k7J6J4n1l3N6Pq8M9M4q0j1J14n9n0J11L3j13M3R2p7q6Q5K9r0k3M0K1
$$ plain form
2558 5 -47 -105 -37 71 -7 -79 64 131 -50 -57 88 42 -106 -22 36 -49 -80 -4 10 -15 26 41 40 22 8 17 -7 -69 -56 21
2588 21 -47 -96 54 63 -93 -36 117 7 -96 17 71 -60 -69 32 14 -31 -4 44 57 19 -13 16 11 -81 -45 14 -51 -82
2616 -82 54 49 -77 0 129 22 -31 76 67 -41 -46 7 -13 -30 -6 28 50 -1 -19 46 32 -64 -26 37 -32 -54 62 45
2644 45 -42 40 120 11 -18 69 20 -79 -43 -11 -44 -61 -9 27 46 8 30 94 38 -45 11 58 -60 -69 43 17 -76 9 82
2673 82 -19 -18 71 19 -61 -44 -8 -44 -45 0 29 22 3 20 82 -7 -42 48 47 -99 -66 72 -50 -160 26 88 -73 -32 117
2702 117 54 -68 -9 80 1 -93 -30 83 -1 -109 4 98 -19 -115 72 96 -89 -39 91 12 -71 30 38 -47 1 39
2728 39 -50 -69 43 11 -87 -26 85 34 -71 -16 132 68 -116 -2 190 3 -204 47 163 -131 -172 110 94 -140
2752 -140 -72 120 40 -77 4 96 61 -22 20 67 11 -45 6 5 -69 -1 51 -55 -68 100 46 -110 33 195 -14 -109
$$ packed form
2558En2n8O8J08p8p2J43O7j81pJ45m6j48Q4N8q5l1P6J4k5M1J5jj8j4Rk4o2J3P7
2588B1o8m9J50Rj56N7J53j10j03J13N4j31rJ01j8m5K7M8J3l8l2K9nr2L6N9o5l1
2616h2J36nj26P7J29j07n3J07rj08nN3k0j7K4L4K2n1j8O5j4r6L8O3o9k2J16j7
2644D5q7Q2Q0j09k9Q7m9r9L6L2l3j7N2L6J9l8K2O4n6q3N6M7j18rJ12k6r3Q5P3
2673H2j01JQ9n2q0J7L6l6jM5K9pj9J7O2q9l5R0jj46L3J38j22j10J86O2j61M1J49
2702A17o3j22N9Q9p9r4O3J13q4j08J13R4j17r6J87K4j85N0J30p9q3J01Qq5M8L8
2728C9q9j9J12l2r8O1J11n1j05N5J48o4j84J14J92j87k07K51J16k94m1K82j6k34
2752a40O8J92q0j17Q1R2l5q3M2M7n6n6N1jp4O8N2j06j3J68n4j56J43J62k09r5
$$ plain form
2778 -109 132 139 -111 -101 94 37 -145 -73 102 33 -138 -50 129 7 -142 41 165 -18 -82 126 107 -102 2
2801 2 162 -28 -118 56 27 -143 -88 61 -22 -95 5 101 18 -58 61 123 -33 -107 64 86 -114 -79 106 3 -129
2826 -129 46 123 -64 -33 105 1 -111 9 73 -75 -90 55 39 -105 -63 88 43 -108 -47 151 28 -154 27
2849 27 192 -60 -134 135 127 -149 -58 138 -37 -199 -20 68 -100 -124 52 89 -57 -40 113 123 -49 -25 158 36
2873 36 -116 -1 108 -59 -118 75 56 -72 0 81 -49 -56 48 -4 -88 8 39 -20 -23 66 84 -6 -15 100 86 -73 -64
2900 -64 94 -5 -167 -9 124 -47 -111 136 126 -120 -18 156 -10 -151 20 112 -81 -135 62 111 -57 -78 114
2923 114 151 -86 -86 146 73 -172 -47 136 -31 -151 18 73 -63 -70 31 27 -6 -4 -11 24 26 -12 -21 12 1 -26 -10 -9 6
2952 6 5 -56 -48 56 14 -89 27 116 -32 -88 86 69 -103 -46 88 -3 -85 -14 43 11 -51 -12 61 26 -58 6 75 -37
$$ packed form
2778a09K41Pk50J0J95n7j82P2J75o9j71Q8J79j22j49J83J24j83o4K08j9k09J04
2801BJ60j90r0J74k9j70N5J49q3p3J00R6q3p6J19O2j56p4J71K2k00L5J85j03j32
2826a29J75P7j87L1J38j04j12J20O4j48j5J45j6j44M2J51m5j51O1J98j23j82J81
2849B7J65k52p4K69qk76R1J96j75j62J79Q8j68k4J76L7j46J7J53J0j72K4J83j22
2873C6j52J15J09j67n9J93j9j28P2Q1j30pJ04n2q4R6L1n9lQ9J8r0rJ15j4j59R
2900f4J58r9j62J58J33j71o4K47j0k46J02J74j66j41J71R2j93n4J97M9j68k1J92
2923A14L7k37%K32p3k45J25J83j67j20J69N5j36pJ01ml3KpL5Kl8rL3j1k7J6JJ5
2952Fjo1QJ04m2j03J16Q9j48n6J74j7j72N7J34r1q2P1N7l2o2L9P3l5q4O4O9j12
$$ plain form
2980 -37 -80 49 51 -84 -12 81 -17 -60 49 56 -37 -17 50 24 -33 -22 23 40 -28 -56 53 59 -49 -33 93 35 -57 15 57
3009 57 -4 -16 12 -11 -1 6 -26 -1 34 2 -17 52 43 -3 19 41 19 10 0 -32 8 16 -62 -30 54 -2 -51 42 69 -50 -22 86
3041 86 22 -63 7 65 2 -43 -9 52 41 -54 -31 75 4 -112 -17 69 -43 -82 12 23 -28 -7 6 -4 28 12 -29 -7 51
3070 51 16 -30 13 45 7 -18 -38 11 27 -58 -84 25 36 -99 -40 77 19 -53 16 38 4 9 23 -7 27 27 -29 -11 46 4
3100 4 -23 2 14 4 -11 -48 -33 27 -32 -95 10 50 -48 -35 77 43 -35 32 78 17 -14 37 19 -8 -23 -10 15 -16 -54 -10
3130 -10 43 -29 -61 52 48 -44 -6 55 13 0 14 -2 17 48 1 -16 56 43 -49 -17 51 14 -42 -30 14 28 -29 -69 26 81
3160 81 -51 -69 107 92 -76 -24 113 35 -61 6 65 9 -30 -26 5 9 -48 -55 20 18 -32 -15 37 -14 -16 28 13 1 19 -1 -24
3191 -24 35 11 -55 5 49 -29 -40 60 25 -58 0 42 -18 -34 1 14 10 -26 -15 48 18 -60 10 71 -17 -50 54 28 -69 -35
$$ packed form
2980c7m3J29Kj35P2R3r8m3J09Pr3K0O7k6n7J1M5J7o8k8J09Oj08J6J26n8r2P2M2
3009E7o1j2K8k3J0Pl2K5L5l2j9O9rm6K2K2k2rj0l2M0Qp8L2Q4n6m9R3K7j19K8J08
3041H6o4q5P0N8o3m5L4O1j1r5K3J06p1j16R5Q6j12l9R4J1n1K1J3j0L2j6m1K2N8
3070E1l5m6M3L2l8k5k0M9J6q5k6J09J1j35N9J17n8p2O9K2l4NJ4l0L4%n6J8N7m2
3100Dk7K5J2j0j5l7J5O0n9o3J05M0r8J3J12l4p8O7M6o1l1N1j8k7j5J3K5l1l8M4
3130a0N3p2l2J13mr2L8O1m2j3J4j6J9L1m7j7P2j3r2L2O8l7n6J2M4J4n7m0R5N5
3160H1j32j8J76j5j68N2J37p8r6O7N9n6l9ML1Mn7pP5kn0J7N2n1kM4j5j2J8k0k3
3191b4N9k4o6O0M4p8j1J00l5q3N8M2o0j6L5J3ml6J1O3l0p8P0O1q8l3J04k6r7L4
$$ plain form
3221 -35 60 -9 -56 14 27 -23 -12 5 18 18 -19 -16 33 15 -49 -2 37 -23 -38 15 11 -12 -2 -6 13 48 5 -55 35 83 -41 -42
3253 -42 73 46 -47 -36 37 32 -28 -29 31 61 -26 -64 49 68 -80 -47 74 21 -48 22 60 -7 10 32 18 14 37 -14 -7 29
3283 29 -27 -45 6 1 -33 -10 9 -4 10 -8 -13 34 27 -39 0 68 -14 -63 46 59 -32 -23 55 26 -41 -22 5 25 -22 -67 8 57
3315 57 -31 -40 56 45 -29 -22 35 -14 -15 11 -25 -8 44 6 -50 20 50 -42 -61 6 15 -24 -47 -11 43 1 -50 6 89 -2 -67 36
3347 36 36 -68 -56 22 -27 -50 18 15 -27 18 35 -14 -14 27 25 -19 -35 -6 14 -19 -47 28 58 -15 -32 71 50 -62 -11 54 -32
3378 -32 -43 24 -2 -43 31 41 -15 -4 44 20 -4 -5 30 33 -17 -19 56 44 -48 -9 73 -5 -82 13 37 -81 -30 47 -5 -24 54
3409 54 60 -3 29 35 6 2 18 -8 -23 -31 -10 11 -31 -50 27 40 -78 -34 91 27 -106 16 115 -24 -85 57 79 -49 -55
3438 -55 47 53 -47 -73 23 52 -61 -76 46 61 -61 -30 77 25 -40 13 12 -24 -2 -5 -40 5 26 -47 -42 30 32 -38 -18 38
$$ packed form
3221c5R5o9m7P0J3n0J1J7J3%l7LM9j8o4M7L9o0j5N3mk3J0mJ9L5m3o0R0M8j24j
3253d2J15k7r3J1P3no0jO0L0q7l8J13J9j48L3J21n3o9P0L8o7J7K2j4mK3n1PL6
3283B9n6j8N1nl4K3J9j3J4j8nM7po6L9O8q2m9J09J3r1RP8k9o7J9K7K0m7m5P5M9
3315E7q8rR6j1p4PN7m9jK6l6J7N2l8n6P0L0r2j9O7Rl9k3L6N4m2n1N6Q3r1o5J03
3347C6%j04J2P8m9k3O8lm2M5J7m9%M1km4j6K9K0l3k8P5L0p3j7J03k1j12N1O5q6
3378c2j1O7k6m1P4J0n6J1M8k4k4jL5Ln0kP5j2r2L9Q2p8p7R5K4j18N1P7n2j9P8
3409E4Oo3L2Ok9mJ6k6j5qK1K1m2j9P7J3j18M4J25o4j33J22R9j39o1J42K2j28o
3438e5J02Oj00k6R6K9j13j5J22J5j22L1J07n2o5N3jl6K2ll5M5K1p3NP2Kp0K0N6
$$ plain form
3468 38 33 -4 -32 22 44 -37 -63 38 26 -95 -50 69 -24 -69 37 62 -39 -9 76 13 -50 -5 30 -26 -57 -14 38 -7
3496 -7 -51 36 82 -38 -62 94 67 -89 1 91 -15 -63 60 59 -50 -36 30 -8 -67 -10 20 -26 -26 15 61 26 -5 63 76
3525 76 -13 2 73 -2 -70 1 -7 -96 -42 45 -45 -73 69 65 -47 0 106 36 -73 12 86 -2 -73 7 97 -9 -83 33
3553 33 87 -68 -110 60 31 -125 -53 88 -11 -71 48 69 -30 -13 42 -4 -53 -21 4 -13 -39 9 44 6 -11 40 55 -36
3581 -36 -28 29 -33 -91 -5 5 -76 -32 60 -3 -22 59 64 -25 -6 63 -7 -55 -18 22 -16 -40 8 56 -3 -56 14 44 -64 -76 39
3612 39 5 -92 3 105 -1 -10 71 66 -13 -7 29 -21 -57 -40 -14 -20 -42 9 33 15 -19 38 55 -29 -33 66 4 -68 26 48 -35 -23
3644 -23 43 19 -18 15 22 -14 -9 6 8 -3 -4 5 24 2 -20 41 33 -37 2 52 -24 -60 27 20 -55 -11 60 7 -19 30 24 -11 2 16
3678 16 -4 0 8 9 -4 -19 10 22 -14 -40 32 47 -67 -19 66 6 -73 29 67 -25 -37 36 11 -30 -5 14 6 -7 6 -6 4
$$ packed form
3468C8nl7k8N4K2q1k6J01j2j21M5J19r3m5J06K5j01L0Q5o3o3M5L5n6l1M3N2m5
3496gm4Q7M6j20k4J56k7j56R0R0j06m8J23jj09J4O6l8n9N7L0m6%M1M6l5l1O8J3
3525G6q9J5P1p5o8P1qq9N4Q7r0k8J42mj12M7J06p0j09Q5P4q8p1Q0R0j06p4J16
3553C3N4j55m2J70k9j56P2J41r9o0J19K1r9J7N5m6m9L2K5j7k6M8L5l8j7N1J5r1
3581c6QN7o2n8Q6J0q1M4R2o3j9Q1Nq9J9O9p0m8L7M0l8k4M8M8n9n3P0L0j08j2J15
3612C9l4r7R5J02j06rQ1np9OL6n0l6J7K6ok2N1K4j8l4N7J7q4mR9o2p2R4K2q3J2
3644b3O6k4l7L3Pl6NJ5Kj1jRJ9k2k2O1qp0L9N0p6l6Q7pp5M4P1n3k6M9ol5J3J4
3678A6k0MQJj3j5K9J2l6k6P2J5j14M8Q5o0p9J02L8r2j2P3k5m1K5J9qj3J3j2J0
$$ plain form
3709 4 -23 -17 -13 -20 -26 27 4 -24 38 54 -29 -36 63 15 -92 -21 51 -37 -70 10 51 2 -24 26 46 -4 -43 2 36 -29 -63 29 29
3742 29 -44 -2 42 11 -11 15 12 -5 21 -3 -26 10 33 -42 -17 46 8 -42 7 38 -20 -38 -16 16 15 -40 1 88 48 -22 71
3773 71 113 -12 -41 57 11 -109 -61 14 -43 -42 4 35 27 22 40 54 32 -8 13 29 -17 -14 46 29 -40 9 43 -24 -43 7 -3
3804 -3 -42 -25 -6 -14 5 12 -1 43 38 -1 9 41 6 -26 -7 -4 -32 -25 -14 1 35 1 -15 49 44 -41 -33 26 -30 -77 -37 4 -33 -37 29
3839 29 47 24 24 19 41 8 -34 1 24 -22 -43 40 19 -58 -29 23 -45 -64 -19 2 -35 -17 19 46 59 17 28 76 43 -49 6
3870 6 37 -36 -73 11 6 -51 -30 9 22 22 9 6 54 52 -15 0 44 0 -50 1 6 -22 -10 5 15 20 1 -8 21 19 -11 -1 27 6 -11
3905 -11 46 24 -24 5 36 -30 -55 16 19 -9 -19 28 43 30 -21 8 74 -10 -69 21 69 -49 -64 41 24 -42 -11 24 10 -13
3935 -13 -9 9 38 10 -17 8 46 -3 -55 -13 -7 -26 -11 -11 -4 28 15 -27 27 47 -14 -21 36 8 -40 2 23 -18 -10 11 4 -1 6 -11 -1
$$ packed form
3709Dk7OMpoN3k3k8O2J6q3pR9m8j07P1P2q8l3Q0M1m9k6N0K0n0l9M5L4o5l4R2%
3742B9p3M2M4l1k2K6lj7K6k4k3L6K3p5K5O3l8n0M9L1n8j8K2L2jn5M1Q7m0p0R3
3773G1M2j25k9R8m6j20M8P5n7JM6L1qnJ8J4k2m0K1J6m6LO0j7o9M9L4o7j9N0j0
3804cl9J7J9qJ9Pj3M4nl9J0L2l5l2J9Lk8PJ1J5L4l4j6O4nq5QN9n6m7M0M1l7mO6
3839B9J8k3%nK2l3m2L5K3m6k1Q3k1p7K9N2o8j9M5K1l7J8L6K7J3m2J1M8l3r2N5
3870FL1p3l7Q4nn7K1L9J3%j3lM8ko7J5M4m4n0N1Nk8J2J5J0Nj9rK9kl0J0K8k1j7
3905a1N7k2m8K9L1o6k5P1Lk8j0M7J5j3n1K9O6q4n9R0M8j18j5J05j7o6L1L5j4k3
3935a3MJ8K9k8k7K5L8m9n2M2Oj9J5%PL2j3m2N4K0o1pN7k8m8M2K1m1QK1pnPj7J0
$$ plain form
3970 -1 17 -17 -9 25 -12 -24 22 17 -29 9 41 -9 -4 21 -11 -32 -9 -14 -45 -7 13 -7 11 34 31 19 4 -4 4 12 -40 -30 23 -2 -31
4005 -31 18 35 -4 7 30 -1 -2 8 -20 -26 22 9 -3 32 33 15 29 22 -11 -4 -5 -51 -23 22 -21 -38 29 32 -17 2 38 17 -2 12
4039 12 -8 -13 5 -17 -19 8 8 18 18 5 -10 27 10 -38 -5 39 -32 -43 31 28 -32 4 58 29 0 -4 8 -4 -20 -37 -11 18 -9
4072 -9 -10 50 15 -13 31 18 -41 -15 25 -35 -36 30 9 -25 12 37 -4 2 33 13 0 0 5 -1 1 -11 -12 30 -27 -30 21 -9 -58 1 30
4107 30 -21 -7 42 12 -10 28 18 4 23 33 -2 -13 -1 -13 -36 -19 -33 -6 9 -26 29 54 -7 -18 71 35 -57 -3 61 -17
4137 -17 -57 25 38 -28 -20 21 22 -12 -5 16 39 -16 -12 43 17 -38 5 57 -34 -53 47 24 -63 18 67 -4 -38 31 24 -15 -16 13 11
4170 11 9 19 18 25 1 -1 17 -4 -31 14 22 -45 -16 55 -15 -52 34 51 -49 -21 51 10 -44 -1 33 -8 -31 -15 19 5 -21 -2
4202 -2 45 -3 -14 28 18 -43 -8 36 -52 -53 38 -12 -76 -8 48 -10 -48 40 36 -25 -11 32 19 -6 -4 19 12 -54 -18 39 -33 -96 1
$$ packed form
3970aJ8l4QL4l7j2M6nm6L8L2n0NK5l2k1K3nl1L8K0k0J8K3lj2j5qQQn2J0N3k5k9
4005c1M9J7l9J1K3l1jJ0k8oM8j3j2L5Jj8J4pl3Pjm6K8M5m3j7O7Lm9J9L6k1j9J4
4039A2k0nJ8k2kK7%J0%j3j5L7j7m8L3M4p1j1P4lo0L6N4k9k9mJ2j2j6j7K6K9k7
4072ijO0l5k8M4j3n9K6M0o0jO6k1l4L7K5m1OL1k0j3%NoKj2jM2n7lN1l0m9N9K9
4107C0n1J4M9l0k2L8j0j4J9J0l5j1J2j2k3J7j4K7J5l5N5K5o1j1Q9l6r2N4O4p8
4137a7m0Q2J3o6QM1Jl4PK1K3n5MN5k6n5M3N2r1j9J00k3q7Q1M9p1l4O9pl9jK9k
4170A1kJ0jPk4kJ8k1k7M5Qo7K9P1p0l7Q6J7j00K8P2m1n4M3L4m1k3J6L4j4k6J9
4202bM7m8j1M2j0o1L5M4q8jR1n0o4O8N6n8l8Q8mo1J4M3j3k5KK3po6L6N7p2o3R7
$$ plain form
4235 1 33 -56 -60 68 39 -41 6 62 3 -28 15 11 11 2 -5 6 -8 10 12 7 -14 8 29 -36 -42 47 20 -74 -6 77 -13 -54 58 60
4269 60 -25 -8 59 28 -21 -1 7 -3 -8 -2 6 -12 0 32 23 -26 7 51 -14 -72 33 69 -52 -34 87 46 -52 5 72 1 -44
4300 -44 17 25 -17 -29 7 31 -21 -21 21 32 -32 -21 49 0 -51 18 50 -30 -13 60 4 -28 27 2 -38 -1 26 -25 -16 22 -2 -37
4332 -37 -5 13 18 -26 -20 42 43 -44 -25 51 -6 -79 0 63 -31 -46 46 30 -32 -6 54 -10 -22 5 6 0 -17 -4 12 -17 -22 35 45
4365 45 -29 -25 43 -4 -40 -1 47 -32 -23 30 -8 -24 8 5 -20 14 20 -8 10 28 15 -4 -3 10 8 -20 -30 13 38 -17 -28 52 29
4398 29 -41 18 51 -6 -21 18 17 -7 14 4 -9 14 4 -14 9 18 -3 14 17 3 10 18 -27 3 34 -11 -48 38 25 -46 -1 42 3
4431 3 -29 22 11 -24 -15 11 4 4 -11 5 39 6 -24 23 38 -11 -1 45 11 -18 5 19 -31 -13 2 -24 -2 13 -2 -12 14 8 3
4464 3 22 -1 -5 18 3 -28 8 18 -16 -12 33 -3 -21 -6 -7 -18 2 -2 -2 18 7 -12 -4 6 -29 -5 24 -8 -3 33 19 12 30 14 -7
$$ packed form
4235AL2q9mJ28k9q0M7N6n9l1M3m%rpJ1j4J8Knk1K2K1o5oQ9k7r4O8Q3r0m1J12K
4269F0q5J7O7l1m9K0Qj0nOQj8J2L2rm9L3M4o5n8J05L6j21J8J21m1r8N7O7p1m5
4300d4O1Qm2j2L6K4n2%M2J1o4J1P0m9n1O9L2q0J7P3n6l2N5k5m0L7K7n1RL8k4l5
4332c7L2J8Nm4OO2Jq7J9P6n7p3P9O3r4j5R2j6o2K6O0o4j2K7Joj7J3J6k9nN7J0
4365D5p4MO8m7l6L9M8p9RN3l8j6L2lk5L4Ok8J8J8j3j9JJ3kk8j0M3K5n5j1Q0k3
4398B9p0N9L3n7j5L9jk4K1j0j3K3j0j8K3Rk1J7Lj4PQm5L0L1m5l7Q6j3p1M5M3l9
4431Cl2N1j1l5RK6p%j5J6L4l3l0M7J5m9J0M6l4k9K3J4n0J8J5k6K2J5j5j0K6on
4464CJ9k3mK3j5l1L6J0l4MM5l6j8J5jj1K0m%K0j1j9QJ0l5K4K9l2NL6j4pJ8j6k1
$$ plain form
4499 -7 12 -1 -30 -20 19 -25 -16 21 6 -27 7 31 -16 -14 26 27 20 3 4 47 28 -21 6 53 8 -62 7 39 -38 -44 10 0 -27 0
4533 0 11 5 21 20 14 51 28 4 25 34 -9 -10 16 -13 -15 27 -3 -19 18 9 -32 -13 9 -16 1 9 -9 2 46 8 -21 16 32 -7 -12
4568 -12 10 14 -5 -28 -9 49 29 -44 -15 48 4 -64 2 45 -28 -45 12 24 -18 -12 20 44 21 -24 13 47 0 -44 11 10 -53 -30
4600 -30 14 -16 -29 -5 7 -3 7 -3 -14 15 11 -23 0 22 -7 -12 39 5 -27 11 9 -9 -23 -7 9 8 -9 -11 29 41 -35 -12 61
4633 61 -5 -58 20 53 -38 -33 42 14 -30 -5 19 7 -31 -17 43 42 -18 -2 70 26 -51 -6 38 -8 -46 7 25 -15 -23 17 19 16 -9
4666 -9 -15 36 28 -40 -11 39 -2 -33 12 23 5 -16 -10 6 19 -15 -29 14 24 -27 -16 48 5 -32 9 22 -6 8 14 -2 7 -6 -13 -20
4700 -20 15 0 0 30 4 -4 16 9 -26 -5 -4 -34 -14 16 -11 -14 15 12 -8 8 9 -28 -4 -19 -37 -6 1 -11 6 33 19 -18 16 5
4734 5 -31 -18 -6 -5 -18 -7 -18 12 19 -5 5 37 -5 -15 15 14 -29 -15 11 -17 -19 7 0 -1 35 14 -1 34 18 -19 9 25 -5 -22
$$ packed form
4499gJ9j3k9J0L9m4RL7j5l3L4K4m7KM0Jpj7JM3j9m9K7M7m5p0O9L2p7oN4j0k7K7
4533@J1oJ6joL7k3k4K1Rm3jK6k9kM2l0j6L7rm1J9K2k5J7Qj8J1M4l8k9L7J6l9n
4568a2K2Mj9k3J9N8k0p3K9O3m4o8O6M3p3j7N7J2m2OL2K4k3m5L7L4m7m4N5jo3K3
4600c0M4l0j3K4J2j0J0j0j1K9ml4K3K2k9nN1l4l2L8kj8j4J6J6jj7kM0J2p6K3P3
4633F1o6n3P8L3r1NP5k8m4K5K4j2l8J4O0jo0J6P2m4p7M5M4m6l8N3J8m0qM0Klk5
4666ioN1qo8K9N0m1l1M5J1j8k1OJ6J3l4j4M3J0n1J1O4m3l7M1J3k8J4Oj6Rj3pp
4700b0L5j5%L0k6qK0pl5K1Jl0K0L0k7lK9lk0J6Jl7K4j5j8L1Pj2J7K7j4l7L4j1
4734El6J3J2Jj3J1j1L0Pk4J0L2m2j0L0jm3J4K6k8kK6pjL6k1j5L5j6l7K8J6l0j7
$$ plain form
4768 -22 10 16 7 8 5 2 19 -31 -39 14 -16 -47 9 41 -12 -18 49 40 -4 7 23 8 -10 -22 -7 6 2 -31 8 25 -16 -2 9 4 -16
4803 -16 15 7 -10 25 14 -17 0 32 -15 -25 21 10 -31 -12 9 -8 -30 -6 22 16 -7 -15 33 12 -43 -13 35 -29 -56 7 26 -34
4835 -34 -4 40 6 10 29 18 8 23 -15 -5 -7 -10 -16 -12 -5 -14 10 -12 -6 15 31 -11 12 53 0 -20 27 33 -33 -28 27 -20 -36 7 10 -3
4871 -3 -7 19 23 9 4 23 31 0 -8 31 29 -32 -19 41 -23 -43 30 12 -63 -12 39 -9 -19 38 48 9 7 26 27 -1 -16 -7 12 -20 -42
4906 -42 11 16 -22 -2 32 3 -10 32 22 0 18 16 -8 -5 30 -3 -5 26 21 -2 2 28 6 -1 -10 15 8 -18 -21 32 21 -21 28 40 -16
4941 -16 -47 22 15 -49 -31 27 -2 -14 27 39 19 12 9 17 -1 -44 -33 10 -29 -63 24 19 -21 -8 42 31 -7 38 22 -6 -7 11 -17
4974 -17 8 9 -17 -4 14 -14 -10 7 -2 6 -10 -5 -6 12 7 -11 35 35 2 5 42 -8 -27 16 -16 -37 -13 20 -2 -4 19 14 9 6 -3 14 -7
5011 -7 -39 -26 13 -8 -19 26 36 5 10 30 5 -2 11 -9 -31 12 3 0 25 21 6 20 26 1 12 22 -5 -10 13 5 -13 18 21 -4 17
$$ packed form
4768b2L2OrJllJ7n0qN3l0l1N6L2n3oO7rm4J1J6j5j8j2J5J3ml3L9J7m1J4J1nk0
4803a6L1qj7L5j1l1J7L2m7j0M6j1m1J9K1j7k2K4K8ok3qM8k1n5L0M8o4k7O3J9o0
4835c4L0M4l4MJ9j1j0J5l8J0kloMPrK4k2OK1J6m2K3M1n3k0M7Oo6NN5m7j6M3Lj3
4871cmK6Mj4nJ9Ql1qL9ko1J3O0o4k0P3j8p5N1N1m8j0N7J0l9kJ9Jk8j5RJ9l2k2
4906d2N3Nl8K0L4k9j3M2j0k2J8kk4LL5l3kL1nk3MK6k2prK5pk6lN3j1m2M9J2n6
4941a6l1O9po4J8N8k9j2M1J2k0plQj8m3J1M3l9l4Q7nm0J3N0j1l8M5j6k8jJ8k8
4974a7K5Jk6J3J8k8MJ7rQj6NjJ8nj8M6%l3LL7n0j9M3l2k1K4L3k2kK3nnlrJ7k1
5011gl2J3L9k1j1M5J0l1NK0k5pJ3k0k2M3rlK5mj5J4Ok5J1J0k7nK3qj8L1Lk5K1
$$ plain form
5046 17 20 10 11 23 -1 -12 16 -2 -29 16 8 -16 0 22 6 11 12 -17 5 11 -9 -28 10 9 -15 20 28 -4 -6 0 -17 -11 -2 -16 -2 13
5082 13 -1 -3 28 6 -4 18 21 -11 -12 27 -16 -21 25 9 -21 3 12 -8 -19 15 13 16 12 9 14 8 -16 -4 15 -15 -24 20 3 -23 6 33
5118 33 -11 -12 31 17 -10 3 8 5 3 -1 2 14 9 -17 5 5 -8 -12 2 -18 11 19 -15 -6 43 39 -6 28 45 17 -15 15 11 -18 -32 -19 -19
5155 -19 -6 -1 -9 29 33 8 9 14 15 11 0 -8 7 19 -22 -23 28 25 -34 -5 42 0 -42 8 12 -12 -11 14 13 8 7 18 18 -9 -14 17 7 -40 -16
5194 -16 44 2 -35 29 50 -3 -23 23 21 -19 -36 -25 -7 -20 -41 -13 29 0 -18 42 46 12 9 25 23 5 -4 -18 0 -1 -15 -23 10 1
5228 1 -37 -11 0 -28 -33 21 -1 -24 13 30 23 10 9 19 21 -16 -29 20 -5 -57 -27 34 -4 -36 18 44 -5 -21 18 19 -3 -10 -17 11
5262 11 11 -8 -25 28 28 -18 -2 28 24 -6 -9 5 34 8 -36 3 37 -13 -22 22 24 -34 -16 39 -3 -28 5 25 7 -5 23 33 17
5295 17 -5 4 18 -17 -37 -3 0 -38 -16 33 10 -5 22 27 -8 12 24 2 1 13 -7 -4 8 -5 -3 15 -1 -26 5 1 -11 6 27 9
$$ packed form
5046A7Lj0JJ2k4j1K8j8k7M5qk4J6K2j6NJk9K2Ok0j9L8jk4L5Ql2kOj7ORj4J4J5
5082A3j4kL1k2j0K2Ll2jL9m3nM6j6l0K4Rk0j1L4kLmlNok4J2J9l0rM4j7k6K9K7
5118C3m4jM3j4k7J3NlkmLJ2nk6K2%j3mJ4k0K9Ql4RM9mm5L4J7k8l2L0mk9j4J3%
5155a9J3NqL8Mk5JNJmj1qJ5J2m1jN1ln9K9M7m2m2N0Mk4JK5jnjJ1%k7nL1j0m7K4
5194a6O0m2l7O4K1n3k0M6km0j7J1J8j3k1K8M2k9j8O0Ml4lJ6kj8rj4J8jj4qL3r
5228Al8K6J1k8nN4k2k3L7J7pj3jJ0Kl7j3M9k5n2L0O1l8l2N4K6m9j6L9Jk2ppK8
5262A1%j9j7N3%m6J6L0ml0lJ4K9k6m4L9L4n0rM4Kn8J8N5m2k5L3K0j8j2K8J0j6
5295A7k2RJ4l5k0L4Ll8K2M9k3j5K7Nl5K0J2k2jJ2k0LJ2j3KJ8j6k5L1mj2J7K1j8
$$ plain form
5329 9 14 4 2 12 11 -18 -11 34 -1 -36 28 42 -21 -30 21 21 -21 -22 23 17 -4 -13 12 28 -8 -16 15 7 -24 -4 11 -4 -13 13 -2 -13 20
5366 20 13 -18 -4 19 -4 -10 2 0 -10 0 -14 6 14 1 1 18 19 -12 13 17 -15 13 23 -21 3 41 13 -20 19 42 -9 -9 25 -10
5400 -10 -18 -2 13 -1 7 1 14 26 25 -7 29 12 -16 6 15 -22 -12 20 13 1 29 13 -6 10 22 -9 2 17 -6 -8 14 8 -8 0 13
5435 13 22 14 4 15 21 11 -21 14 34 -21 -12 41 18 -14 15 19 -8 -12 1 -15 -4 1 -8 -5 15 -3 -11 9 12 1 5 4 -12 13 0 -16 -10
5472 -10 9 -9 -17 11 3 -16 -3 -6 -18 9 18 0 1 31 9 -10 14 20 -10 0 -9 -3 14 -19 -26 9 17 -19 -2 36 11 -13 21 22 -4 6
5508 6 20 0 6 18 -17 -8 10 9 -8 10 19 -3 5 7 -12 0 12 -18 -2 7 -4 -2 13 -5 -10 20 11 -18 8 19 -10 -9 20 10 -20 11
5544 11 2 -14 -10 5 3 5 -3 1 28 8 -3 5 27 -11 -8 25 10 -20 15 21 0 -11 5 -4 16 8 -9 12 19 -6 -15 19 16 -15 -10 11 -5 -16
5582 -16 -8 -13 16 4 -22 -8 10 -9 -33 6 11 -16 -10 10 8 -9 14 4 -6 9 2 -14 -5 6 -11 -3 -2 -25 -3 5 -12 -11 13 11 -15 0
$$ packed form
5329INj0kJ0jk9PM5l5l5O4J4o3rN1%m2jM5ok1rK5J6l6qL1ql1K0J5j5rK6j5j1L3
5366B0pl1J4K3k3oJ2kj0J0j4K0Qj3%J7Jl1K5Ml2K8J0m4K4L8k8l3L9K3n1%L4l5
5400a0qJ6J5j4QoJ3J2jl2L6j7k8K2Rl7J0L2pj2K8j6j9J6J2l1J1J5k3kK2oj6QJ3
5435A3Rqj0J1Oj0l2L5K0n5RN3k3l2K9Mk7mJ3j6J1NrLK0j8qK0Lj1Mjj6K5j3j6O
5472a0J9j8qK8qj9J3lj2K7Rj8JL0k2j9K4Ol0J0rOJ7l3pL5Ql6J7L8k5k4L4Jk6J0
5508FJ4k0OJ2l5RJ8jj7J8Rk2QKj9J2J2l0J6Rj1KJ5j8nL0rk9K6J1k9JK9j0l0L1
5544A1rj6MJ5kKqMK7k0j1QK2l8LL3j5l0L5Ok1j1J6rK0qj7K1Pk5rL4ll1NK1j6j1
5582a6QnK9j2k6J4J8j9k4L9Nk7OK0kj7K3j0j0J5pj6RJ1j7QJk3K2Qj7JK4kk6J5
$$ plain form
5618 0 24 -10 -6 3 12 12 -15 -21 0 29 -10 -21 26 7 -35 -15 10 -12 -23 -6 3 -5 0 -10 3 15 5 -4 21 9 -10 20 7 -13 4
5653 4 19 -15 -12 19 4 -31 13 15 -7 -8 10 7 -1 14 6 2 19 -5 3 16 -6 -6 19 24 -24 8 7 -18 -14 14 -9 3 11 -6 -12 11 16 -5
5691 -5 11 30 2 -16 17 15 -6 -19 10 7 2 -16 4 29 0 -28 14 15 -33 -35 44 17 -34 -1 21 -4 -9 9 5 -3 -14 -14 -5 9 -5 6
5727 6 -3 -1 -1 0 -14 -16 23 8 -24 10 35 -11 -20 30 15 -33 -10 37 -11 -37 -6 20 -2 -34 -13 27 7 -23 -3 29 -13 -25 13 5
5761 5 -9 4 19 -8 -5 22 -16 -15 29 16 -17 -3 34 -6 -19 0 31 16 -15 -2 25 22 -18 0 44 -3 -32 18 23 -20 -9 32 4
5794 4 -13 0 9 -1 17 14 -15 3 12 -1 -9 -5 5 -2 -6 -13 17 12 -37 -15 33 1 -17 26 35 -27 -9 34 11 -33 1 16 -18 -26 6 5 -3
5831 -3 -21 2 16 -3 -15 13 15 -25 -10 31 8 -21 18 16 -23 -8 4 -7 -7 -2 6 -20 0 -13 -10 3 -6 -14 -3 -10 -26 -8 -2 -10 -5 22 -7
5868 -7 8 20 14 -16 21 11 -24 -13 6 -23 -36 0 -7 -28 -9 20 3 11 7 -1 7 8 -6 3 24 4 7 27 -5 6 10 -2 -23 -9 0 -37
$$ packed form
5618@K4l4MRR%k7oK1K9l9j1M7j9m2K0K5k2j1J7RqNj0J3J2j0rK5j2j9L0j3k0J7
5653DJ5l4LL1j5l5M4Kk2jJ8lqJ5qmJ7k4QJ3k2%K5Nm8L2jk5MK8k3J2Qj7oK3Nk1
5691eJ6J9k8j8L3kk1j3K9lnj8K0K5k9k8M2Jm8kP9k7n1L3K2k5nJ8mqj1%RJ4j4J1
5727FrK%Jj4kL9j5l2L4K5m6rN0j5m8K3M7m8k6L1K6k2l2K1M0k0l0K0L2m2j2L8q
5761Ej4J3J5k7LK7l8JM4j3l3J4L7m0j3J9L1j5l1J3K7lm0J8M4m7k9N0Nm3J1M1k8
5794Dj7J3Rj0J8lk9J8Rj3qMJ0pmpL0nm9K2M8l2j8M3Ro2J8M3k3m4L4J5l4qL2jq
5831cj8K3J4j9j2K8Km0J5M1k3k9L9kl9J5J2j1%NQk6K0j3LJ3rqJ1pj6J8OqNK7k9
5868gJ5J2ol0L7j0l5J1J9k9j3L6pk1J9K9j7QmqQJj4RK1k0LK0l2J1Mj2k1J4Rl7
$$ plain form
5904 -37 -14 14 -10 -11 30 23 1 17 28 11 2 -8 -5 7 5 -21 -10 22 -8 -5 20 4 -16 1 9 -5 -1 -9 -21 -3 3 -19 -9 31 7
5939 7 -22 16 25 -12 -17 6 12 5 10 17 11 -9 -18 -9 7 -27 -29 -6 -10 -26 17 17 2 15 29 18 3 17 9 -4 -20 -10 -15 -31 -11 -1 -2 -7 11
5978 11 19 12 -7 4 10 -12 -5 4 4 -24 9 22 -16 -11 23 -13 -33 3 22 -29 -20 17 8 -9 -14 10 30 -5 0 10 15 -23 -21 28 0 -39 10
6015 10 35 -21 -12 27 12 -18 8 15 -2 0 3 -5 -3 3 -3 -9 -14 4 13 2 -13 8 17 -18 -2 24 5 -36 6 25 -23 -19 26 -4 -21 5 22
6052 22 -19 -3 14 19 -18 -4 12 11 -2 -5 28 10 -24 -4 36 -11 -42 17 20 -38 -12 34 -1 -22 16 21 -11 -11 12 3 -21 -12 -3 3 -9
6087 -9 -2 17 10 -8 5 9 -16 -5 20 -11 -31 1 12 -25 -14 38 1 -35 17 32 -19 -32 -8 6 -24 -20 1 19 -12 -13 24 25 -15 -6
6121 -6 16 -6 -36 0 7 -33 -20 0 -14 -18 19 3 -12 7 12 -8 2 9 12 3 -5 -9 14 0 -16 15 15 -30 -14 18 -4 -37 19 28 -21 -3
6157 -3 48 18 -9 -2 24 1 -20 -8 13 -10 -30 -12 27 15 -12 17 23 -5 -15 3 0 -27 4 -8 -11 13 25 -5 -7 28 11 -11 2
$$ packed form
5904c7K3K8k4jM1pk2J6J1j7rj0LJ2kk6J1L2l0LK5j6k0J7Qj4Mqj2J8Ok2J0M0k4
5939Gk9L8Rl7nK3OpNPok0rRJ6l4kK3mj6M3%j5J3J4j1j5J4qj3j6J0nj6K0J0jnJ8
5978A1Qpj9J1Ok2PR%k8L3J3l8NL4l6k0L6J9n1RL7rj7nK4K0l5NJ0Nl8KM9k8l9M9
6015A0K5n6RL9j5l0K6Pj7KLqKOoonJ8Rj1j5K1Rl5J6K6j9m1M2J9m8MM5l0j7K6J7
6052B2m1J6J7Nl7J4J6jj3lL3j8l4K0M0m7l1N9Ln8K6M6l5k1L8Nl2%K3rk4RROj2
6087iPJ9pj8J3Mk5J1K5l1k0L2J1l7J1N2l7l6N2J5n1j3K4J4l0MK1J8l1jL7Jm0R
6121fK2k2l0L6Pm0J3K0j4mL7j6j5J9Nk0J0PLrqmK3j4j6L1%m5J6L2k2l3N6Rm9J8
6157cN1l0k7PK6k3k1J2K1k3k0J8L9j2k7K9Ok8j0J8lk7L1j2lK4J2l0kL5j7k2J3
$$ plain form
6190 2 18 -1 1 12 15 9 -9 0 17 -3 0 -9 4 -27 -13 9 -18 -22 14 21 -9 11 32 10 -12 14 21 -19 -20 -12 0 -20 -19 -5 6 -10 -18
6227 -18 20 7 -18 -4 34 -1 -21 16 7 -23 1 11 -28 -19 0 -5 -10 -10 -6 -8 11 13 -4 22 8 -1 -2 5 -11 10 6 -18 -6 12 -7 -24
6263 -24 10 14 -9 -9 24 0 -5 9 8 -16 9 4 -12 5 -7 -5 10 7 -5 12 16 4 23 18 3 -3 20 8 -4 9 9 -9 -14 12 4 -2 17
6300 17 14 3 -7 -15 6 10 -3 -15 13 10 -14 0 25 -11 -18 16 16 -14 -12 -9 2 3 -1 -1 24 18 2 1 17 -1 -28 -3 -6 -17 -5 -7 -5 28
6338 28 16 -1 14 40 4 -15 8 3 -17 -25 6 3 -7 -5 -1 21 2 -16 -7 9 -22 -4 17 -5 -16 12 27 1 -10 27 25 -20 3 10
6372 10 -6 -30 -11 15 11 2 3 37 19 -17 12 25 -16 -23 15 -4 -24 8 10 3 15 31 -1 0 6 6 -6 3 -7 -10 7 -2 0 8 17 10 5 12 -10
6411 -10 10 -3 -16 -8 18 -2 -18 41 39 -5 -4 41 1 -26 -8 25 -3 -23 -6 21 11 -38 2 28 -1 -38 32 18 -48 -21 44 6
6443 6 -40 10 40 -18 -24 14 13 -21 -15 -1 12 -3 -12 14 15 1 -1 8 6 5 12 -11 -13 10 5 -38 -3 29 8 -27 15 38 -3 -14 14 12 -5
$$ packed form
6190BJ6j9KJ1Loj8RJ7k0LrJ3l1J4K2k7mL6Pl0K0K1k2k2K6Pm0jQJ2k0JJ4J1j6q
6227a8L8j3k5J4L8l5k0L7rl0K4J0l9RJ9nn%MkJ9Kj7K6j4rjPj6K1mk4J2J8j9j7
6263b4L4Mk3%L3k4nJ4jk4K5nj6J7j2KJ5lj2J7Mj2J9nj5oK3j2j2J3%j8nK6qoJ9
6300A7lj1j0qK1Mj3j2K8lk4J4K5l6pL4%l0KLJ1Jm%K5oj6jJ6j8k7K5lj1J2kKL3
6338B8j2j7J5K6l6j9K3nk0qL1lj0KMK2j9j8RJ6l1J8K1k2j1K8J5k6j1L7km5K3P
6372A0j6k4J9K6mrJL4j8l6K9J3m1pL8j9k0L2KpJ2J6l2JO%j2Rj0lJ7rKQRpnPk2
6411a0K0j3j3QK6k0j6N9km4JM5m0k7J8L3k8k0J7K7j0m9M0K6k9l7P0j4o6K7O5l8
6443Fm6N0L0n8oL8jl4OJ4J3j5rK6Jj4kRkjPk3kK3nm3L5L2k1l5M2K3m1j1K8kj7
$$ plain form
6480 -5 -18 8 12 -22 -22 0 15 -18 -9 11 -7 -26 7 8 -24 -3 23 -3 -17 12 4 -10 3 12 -8 -2 1 -2 2 8 6 11 6 0 21 16 -15 -5 26
6519 26 -6 -24 18 27 -11 -28 21 7 -16 -8 19 7 4 2 8 15 9 1 5 5 5 9 4 -10 -2 6 -9 -20 16 26 -9 -13 38 -1 -28 1 18 -6
6557 -6 -9 6 2 19 -6 -9 3 5 -10 -4 22 -1 -11 7 9 1 16 15 3 5 7 -14 -13 -11 -21 -15 1 -16 -8 32 18 2 18 24 0 -13 1 -1 -7
6596 -7 -4 -2 -4 -5 -6 -2 9 -1 -5 2 -7 -21 -4 15 -2 4 32 3 -18 2 15 -13 -17 5 -8 -18 -3 -2 -7 -3 10 6 5 0 -4 6 -13 -19 5 -6
6636 -6 -9 -7 25 3 1 26 8 -5 17 19 -12 -22 7 8 -13 3 18 6 -11 6 14 0 -12 14 15 -14 -27 20 23 -12 -7 44 6 -28 6
6671 6 30 -17 -25 15 -5 -20 -6 5 -12 0 8 12 -3 -8 4 6 -13 -6 28 -1 -27 0 25 -15 -20 29 9 -34 -10 32 -4 -23 24 20 -12
6706 -12 -12 22 10 -11 -15 19 8 -22 -14 25 -3 -23 6 35 -22 -19 20 3 -23 1 15 -18 -8 7 1 -24 9 14 -11 -18 1 0 -3 -27 5
6741 5 18 -22 -30 22 10 -42 -10 32 -12 -19 16 37 -25 -29 34 -5 -20 6 29 -16 -13 0 30 -9 -19 13 27 -15 -8 27 -3 -17 6
$$ packed form
6480ej3K6Ml4%K2J5l3RK0j8j9L3Jl2K1K6k6j4K9qj4J3Rk0OLlMOkNnoK1nl1J0L1
6519B6l2j8M2Rl8j7M9j4k3QK7j2lkOPoqM%%Mnj4QQj5j1L6J0l5mN1l9k7K9J7k4
6557flJ5mJ7k5lJ2Kj5OK6k3j0J8KqJ5jj2KKk1JKj0OJ6j7QM0j4j6J6Ok4j3J4ko
6596gLKkjjMJ1j0mPrj4J7J9j7OK8k9k1K0J3k8mK2j3j0J5JnMJ3mjnmJ0j9oK4j1
6636flKL2k2kK5j8j3K2Kl1j0K9Jk1J6J5j2j7J7Qj4j2K6Jk9j3M7Ll5NN1l8l4L4
6671FK4m7qM0k0j5J4J1j7J2QMj5nJ2Kj9PL4k9k6K7K5m0nM9k0m3K4M2l6j9M7ml2
6706a2%L4j2k1mL4j1l0QL9k8k0K9K9n7LL9j7k6K4J4l3J0J5ok5L3Nk5pJ9jlk4L2
6741EJ3m0qN2j2n2L2M2m4pL5K1o2mO3l9j5K6K3m5LJ3L0l9j0L2J4m2PL5l0j4K3
$$ plain form
6774 6 32 -20 -8 28 8 -19 15 16 -8 -19 14 10 -17 -5 19 2 -22 -1 27 14 -28 13 27 -20 -30 7 10 -26 -16 13 -7 -28
6806 -28 18 10 -19 -7 29 11 -4 13 10 5 -22 11 34 -15 -16 13 14 -19 -8 17 -1 -31 0 16 -18 -19 21 14 -15 1 19 -9 -3 7
6840 7 10 0 0 5 6 -15 -11 8 3 -14 5 22 -15 -13 18 18 -11 -1 24 -1 -18 7 20 -8 5 0 8 0 -6 3 -3 -9 -3 4 -7 -14 -1 7 -7 -12 16
6881 16 1 -11 10 17 -6 -3 26 9 -18 10 16 -13 -1 -5 6 -2 -4 10 15 -3 -14 6 28 -12 -10 24 12 -21 11 17 -13 9 8 1 -1 2 -2
6918 -2 -3 12 6 -15 9 10 -2 5 4 4 9 -3 -8 14 18 -11 -2 27 -4 -10 10 12 -6 -15 17 6 0 11 2 -1 4 2 1 6 8 6 16 -7 -4 21 17 -12 -8
6961 -8 21 -2 -19 -2 8 -1 -14 14 4 3 0 -1 12 5 -8 -1 20 15 -12 14 21 -14 -4 -2 0 -9 3 -7 2 2 -6 3 16 -2 -9 5 9 -9 -6 7
7001 7 -11 -5 4 6 -12 -3 -1 -18 6 -2 -12 -4 4 -5 6 10 -4 -7 17 17 -6 1 9 0 2 -4 -7 -7 6 -3 8 6 1 -2 23 12 -20 8 19 -11 -5 14 2
7044 2 -11 10 16 8 8 7 10 20 18 1 -1 1 -8 -3 5 -4 -14 14 4 -4 22 6 -2 9 16 -6 -16 17 5 -19 13 17 3 -6 -11 -14 3 -16 -11 12 3
$$ packed form
6774FK6n2J2L6k0k7L4Jk4j1L3mk7J2K4j7k4K1K8j3m2M1J4m7j0L7Ll6J0K9k0k1
6806b8M6qk9J2L6j8j5J7lnk7L3K3m9jK9Jl3J1K5j8l0L1J6l4jM0pk9J6J8k8OJ0
6840GLj0%NJk1MJ9nj7J9J7l7KL1%k9J0K5k5j7K5J3k8J3nQqoRooOPj1pJ3Qj4nK8
6881A6j5j2K1Pk3LK9j7k7K8Ok9J2mJ1qkJ4Nj8j1K0K2m0KL4j2l3L2Ol0K2jpkLm
6918bjJ5ok1K4Jj2Pj%Nj2nK2Mk9RK9l1oK0Kj8rL2j1oJ1rlNkjNKkJ0k3LK5mk9M
6961hK9k3j7J7J0rj3K8j0jljJ3pj3PK1nk7K6Pl5J0KKrJ2j0R%qRJ3j8pJ4Mj8LJ3
7001Gj8ORKj8RKj7K4qj0QQrJ1Mj4lK4%k3PQrKol%J3rJ1knlK5j1l2K8J1l0OJ9j2
7044Bj3K1Oq%jLJ0kj7kKrNQrj0K8j0qK6j6qJ1Pk2j0L3j2k4L2Mj4rnlJ7j9NK3r
$$ plain form
7085 3 -18 8 24 -13 2 17 10 -17 4 12 -8 -18 0 2 -19 -1 9 -1 -3 7 -11 5 2 -18 -4 15 -7 1 2 -10 1 -4 3 -3 11 -3
7121 -3 -13 2 7 -25 -16 6 0 -7 9 18 3 -4 -6 6 -1 -8 -10 19 7 -9 12 17 -5 -7 37 7 -20 -1 17 -11 -5 10 4 1 8 14 5 14 6 9 7 -4
7163 -4 -3 14 5 -8 9 11 -7 -5 21 -7 -15 -1 13 -12 0 9 -11 -9 16 12 1 8 5 -3 7 4 4 18 -7 -10 -3 -9 -25 -5 10 -4 -2 14 8 -5
7203 -5 -5 16 2 7 9 1 -4 11 -1 -13 -14 -2 -5 -1 0 -13 -11 6 -14 -4 11 2 0 3 0 -3 7 6 1 4 3 -13 -6 1 -23 -13 11 15 5 3 15 6 11
7246 11 -21 -7 8 -5 -15 2 6 -15 -9 11 -1 -1 2 4 3 12 -5 -15 9 9 -12 2 29 7 -2 7 14 -17 -7 4 2 -7 -10 10 10 -12 -9 21
7284 21 27 -19 -10 15 -2 -12 5 3 -12 -5 15 3 -7 29 23 -19 13 4 -11 -10 4 3 -10 -20 4 15 1 -18 -3 12 -3 -3 29 0 -16
7319 -16 20 24 -8 -2 32 1 -34 -1 13 -9 -21 7 9 -10 -8 17 29 0 -7 16 18 -20 -11 14 -21 -24 3 2 -20 9 31 -1 -14 30 11
7354 11 -17 -17 33 13 -19 -7 12 10 -17 -6 9 12 -20 10 15 -25 -19 15 -7 -30 4 16 -9 -13 19 6 -22 -8 18 2 -16 9 5 -3
$$ packed form
7085Ck1K6J6l7J5J5pk7K1Qk0j0J8Kk1J8J0j0kJ0j8J6lk0J4J9k2QJj2J1nPoJ4j4
7121cj0J5Nl2RK2opJ6Rj5pkJ2ppkK9j2j6K1Nk2kM4l0k7J9J8k8OJ5olPOrRqLkj1
7163dJJ7rj3J7Kj8KK6k8qJ4J4k5J2Rk0KK5mj1PlqJ0l%J4k5lPoj6K0J5j4KJ6oj3
7203e%K1j4NKqnJ5j2j2jJ2lMJj3KJ7k0J0J5rkLllJ0jnLjj6PPk4J0K4Mj0kJ2rN
7246A1l2J4J5j3j0J7Mk1OK0j2%LKjRj7j0K4%k1J4K7k2rRPl1J0J1krlK0%k2LL0
7284B1Om6RK5j7j0J7kj5PK0j2j0L6om2L2rj5JJ4jj3j0K4J1j4j9J5J5j5%L2k9j6
7319a6L6Ml2OL4l1l5L3J4k2j2K8Kj9KK5J2k9pK3Kl8RK5l5lK7jk2K9K2l2j3M4j9
7354A1k8%N0k0l2J2J9kk7J1J5Ll2L0Nm0OL4k2k3L4J2k5mL2j3k8J4K6j6j8K5mq
$$ plain form
7388 -3 -14 3 19 -4 -8 21 12 -20 -14 11 -4 -31 1 14 -34 -3 30 -2 -31 17 28 -4 -16 -3 26 -18 -16 13 10 -19 -14 27 1 -26
7422 -26 -3 7 -25 -7 22 5 -33 7 36 -6 -7 24 21 -11 -10 13 -3 -26 -10 17 3 -24 0 15 -8 -26 15 26 -10 3 28 3
7454 3 -22 10 18 -12 -5 12 -8 -9 1 1 2 -6 15 3 1 -5 8 11 -17 -7 16 -1 -39 18 18 -17 -17 29 1 -39 -5 12 -18 -35 17 15 -3
$$ packed form
7388cj1J7J6k3mK9rl2OK5j5k7L2J3m8L1L3l2k9M8J1l2j2J3K9m4KK9lk9NM1k6k7
7422b6K3J0l2J8K9j7l8M0K9m2jL1ll2JK3j6k3J6K7j4k7K4J5k3j8M1J1l6J3K5k5
7454Ck5L2Ql0PJ7k0jJ0%JqK1j2koJ3Lk8J0K3j7l8N7%l5%M6k8m0L4J7l0j7N2kj8
$$ [...]
8191E
##END NTUPLES=NMR FID
##END=
