##TITLE=1H_CA-8647-21
 CDCl3, 8 sc, 
 19.9.2019
##JCAMPDX= 6.0         $$ Bruker NMR JCAMP-DX V2.0
##DATA TYPE= NMR FID
##DATA CLASS= NTUPLES
##ORIGIN= UXNMR, Bruker Analytische Messtechnik GmbH
##OWNER= root
$$ XWIN-NMR		Version 3.5
$$ Thu Sep 19 15:49:02 2019 Russian Standard Time (UT+4h)  she@DPX200
##.OBSERVE FREQUENCY= 200.1315
##.OBSERVE NUCLEUS= ^1H
##.DELAY= (6, 6)
##.ACQUISITION MODE= SIMULTANEOUS
##.ACQUISITION SCHEME= undefined
##.AVERAGES= 8
##.DIGITISER RES= 18
##SPECTROMETER/DATA SYSTEM= spect
##.PULSE SEQUENCE= zg30
##.SOLVENT NAME= CDCl3
##.SHIFT REFERENCE= (INTERNAL, CDCl3, 0, 15.7039)
##AUDIT TRAIL= $$ (NUMBER, WHEN, WHO, WHERE, WHAT)
$$ ##TITLE= Audit trail, XWIN-NMR		Version 3.5
$$ ##JCAMPDX= 5.01
$$ ##ORIGIN= Bruker BioSpin GmbH
$$ ##OWNER= she
$$ F:/spectra/data/she/nmr/H-F/1/audita.txt
$$ ##AUDIT TRAIL=  $$ (NUMBER, WHEN, WHO, WHERE, WHAT)
(   1,<2019-09-19 15:47:49.32 +0400>,<she>,<DPX200>,
      <created by zg, POWCHK disabled, PULCHK disabled
       configuration hash MD5:
       00 E9 B6 7A A2 85 ED C7 34 08 36 98 17 FE 4E 26
       data hash MD5: 16K
       FD 2A 0F EA 88 26 E7 30 1B 54 91 5B 02 E1 F5 21>)
$$ ##END=
$$ 
$$ hash MD5
$$ D7 57 DD 3E 36 87 0C B7 CE 8A EF 32 E4 1D D5 9F
##$RELAX= 
##$RELAX= 
##$RELAX= 
##$RELAX= 
##$RELAX= 
##$RELAX= 
$$ Bruker specific parameters
$$ --------------------------
##$DU= <F:/spectra>
##$EXPNO= 1
##$NAME= <H-F>
##$PROCNO= 1
##$TYPE= <nmr>
##$USER= <she>
##$AMP= (0..31)
100 100 100 100 100 100 100 100 100 100 100 100 100 100 100 100 100 100 
100 100 100 100 100 100 100 100 100 100 100 100 100 100 
##$AQSEQ= 0
##$AQ_mod= 1
##$AUNM= <au_zg>
##$AUTOPOS= <>
##$BF1= 200.13
##$BF2= 200.13
##$BF3= 200.13
##$BF4= 200.13
##$BF5= 200.13
##$BF6= 200.13
##$BF7= 200.13
##$BF8= 200.13
##$BYTORDA= 1
##$CFDGTYP= 0
##$CFRGTYP= 5
##$CHEMSTR= <none>
##$CNST= (0..31)
1 1 145 1 1 1 1 1 1 1 1 1 1 1 1 1 1 1 1 1 1 1 1 1 1 1 1 1 1 1 1 1 
##$CPDPRG= <>
##$CPDPRG1= <>
##$CPDPRG2= <>
##$CPDPRG3= <>
##$CPDPRG4= <mlev>
##$CPDPRG5= <mlev>
##$CPDPRG6= <mlev>
##$CPDPRG7= <mlev>
##$CPDPRG8= <mlev>
##$CPDPRGB= <>
##$CPDPRGT= <>
##$D= (0..31)
0 1.2 0 0 0 0 0 0 0 0.06 0 0.03 0 0 0 0 0.0002 0 0 0 0 0 0 0 0 0 0 0 0 
0 0 0 
##$DATE= 1568893668
##$DBL= (0..7)
120 120 120 120 120 120 120 120 
##$DBP= (0..7)
150 150 150 150 150 150 150 150 
##$DBP07= 0
##$DBPNAM0= <>
##$DBPNAM1= <>
##$DBPNAM2= <>
##$DBPNAM3= <>
##$DBPNAM4= <>
##$DBPNAM5= <>
##$DBPNAM6= <>
##$DBPNAM7= <>
##$DBPOAL= (0..7)
0.5 0.5 0.5 0.5 0.5 0.5 0.5 0.5 
##$DBPOFFS= (0..7)
0 0 0 0 0 0 0 0 
##$DE= 6
##$DECBNUC= <off>
##$DECIM= 24
##$DECNUC= <off>
##$DECSTAT= 4
##$DIGMOD= 1
##$DIGTYP= 9
##$DL= (0..7)
0 120 120 120 120 120 120 120 
##$DP= (0..7)
150 150 150 150 150 150 150 150 
##$DP07= 0
##$DPNAME0= <>
##$DPNAME1= <>
##$DPNAME2= <>
##$DPNAME3= <>
##$DPNAME4= <>
##$DPNAME5= <>
##$DPNAME6= <>
##$DPNAME7= <>
##$DPOAL= (0..7)
0.5 0.5 0.5 0.5 0.5 0.5 0.5 0.5 
##$DPOFFS= (0..7)
0 0 0 0 0 0 0 0 
##$DQDMODE= 0
##$DR= 18
##$DS= 0
##$DSLIST= <SSSSSSSSSSSSSSS>
$$ [...]
##$SUBNAM2= <"">
##$SUBNAM3= <"">
##$SUBNAM4= <"">
##$SUBNAM5= <"">
##$SUBNAM6= <"">
##$SUBNAM7= <"">
##$SUBNAM8= <"">
##$SUBNAM9= <"">
##$SW= 24.0689530833862
##$SWIBOX= (0..15)
0 0 2 0 0 0 0 0 0 0 0 0 0 0 0 0 
##$SW_h= 4816.95568400771
##$TD= 16384
##$TD0= 1
##$TE= 0
##$TE2= 300
##$TE3= 300
##$TEG= 300
##$TL= (0..7)
0 120 120 120 120 120 120 120 
##$TP= (0..7)
150 150 150 150 150 150 150 150 
##$TP07= 0
##$TPNAME0= <>
##$TPNAME1= <>
##$TPNAME2= <>
##$TPNAME3= <>
##$TPNAME4= <>
##$TPNAME5= <>
##$TPNAME6= <>
##$TPNAME7= <>
##$TPOAL= (0..7)
0.5 0.5 0.5 0.5 0.5 0.5 0.5 0.5 
##$TPOFFS= (0..7)
0 0 0 0 0 0 0 0 
##$TUNHIN= 0
##$TUNHOUT= 0
##$TUNXOUT= 0
##$USERA1= <user>
##$USERA2= <user>
##$USERA3= <user>
##$USERA4= <user>
##$USERA5= <user>
##$V9= 5
##$VALIST= <valist>
##$VCLIST= <CCCCCCCCCCCCCCC>
##$VD= 0
##$VDLIST= <DDDDDDDDDDDDDDD>
##$VPLIST= <PPPPPPPPPPPPPPP>
##$VTLIST= <TTTTTTTTTTTTTTT>
##$WBST= 1024
##$WBSW= 4
##$XGAIN= (0..3)
0 0 0 0 
##$XL= 0
##$YL= 0
##$YMAX_a= 448267
##$YMIN_a= -409967
##$ZGOPTNS= <>
##$ZL1= 120
##$ZL2= 120
##$ZL3= 120
##$ZL4= 120
##$ABSF1= 10
##$ABSF2= 0
##$ABSG= 5
##$ABSL= 3
##$ALPHA= 0
##$AQORDER= 0
##$ASSFAC= 0
##$ASSFACI= 0
##$ASSFACX= 0
##$ASSWID= 0
##$AUNMP= <proc_1d>
##$AZFE= 0.1
##$AZFW= 0.1
##$BCFW= 1
##$BC_mod= 2
##$BYTORDP= 1
##$COROFFS= 0
##$CY= 11.3945322036743
##$DATMOD= 1
##$DC= 2
##$DFILT= <>
##$DTYPP= 0
##$F1P= 20.1720416913024
##$F2P= 0.152960286110954
##$FCOR= 0.5
##$FTSIZE= 0
##$FT_mod= 4
##$GAMMA= 1
##$GB= 0.15
##$INTBC= 1
##$INTSCL= 1
##$ISEN= 128
##$LB= 0.24
##$LEV0= 0
##$LPBIN= 0
##$MAXI= 10000
##$MC2= 0
##$MEAN= 0
##$ME_mod= 0
##$MI= 1.114404
##$NCOEF= 0
##$NC_proc= 0
##$NLEV= 6
##$NOISF1= 3.799351
##$NOISF2= 2.8
##$NSP= 1
##$NTH_PI= 0
##$NZP= 0
##$OFFSET= 15.70392
##$PC= 1
##$PHC0= -9736.595
##$PHC1= 21.60096
##$PH_mod= 1
##$PKNL= yes
##$PPARMOD= 0
##$PSCAL= 0
##$PSIGN= 0
##$REVERSE= no
##$SF= 200.130013532006
##$SI= 16384
##$SIGF1= 3
##$SIGF2= 2
##$SINO= 400
##$SIOLD= 16384
##$SREGLST= <1H.CDCl3>
##$SSB= 0
##$STSI= 0
##$STSR= 0
##$SW_p= 3612.71676300578
##$SYMM= 0
##$S_DEV= 0
##$TDeff= 0
##$TDoff= 0
##$TI= <>
##$TILT= no
##$TM1= 0
##$TM2= 0
##$TOPLEV= 0
##$USERP1= <user>
##$USERP2= <user>
##$USERP3= <user>
##$USERP4= <user>
##$USERP5= <user>
##$WDW= 1
##$XDIM= 8192
##$YMAX_p= 0
##$YMIN_p= 0
$$ End of Bruker specific parameters
$$ ---------------------------------
##NTUPLES= NMR FID
##VAR_NAME=  TIME,          FID/REAL,        FID/IMAG
##SYMBOL=    X,             R,               I
##VAR_TYPE=  INDEPENDENT,   DEPENDENT,       DEPENDENT
##VAR_FORM=  AFFN,          ASDF,            ASDF
##VAR_DIM=   8192,          8192,            8192
##UNITS=     SECONDS,       ARBITRARY UNITS, ARBITRARY UNITS
##FACTOR=    0.0002076,     1,               1
##FIRST=     0,             0,               0
##LAST=      1.7004516,     0,               0
##MIN=       0,             -409967,         0
##MAX=       1.7004516,     448267,          0
$$ Real data points
##PAGE= N=1
##DATA TABLE= (X++(R..R)), XYDATA
$$ [...]
$$ plain form
1461 -984 -6022 2090 4992 -3517 -3638 4776 2315 -5104 -368 5255 -1333 -4777 2907 3863 -4031 -2459
1477 -2459 5091 1327 -5387 9 5166 -1885 -5645 2210 4071 -4266 -3988 4781 2647 -5081 -556
1492 -556 6334 174 -4867 2499 4890 -3401 -3716 4041 1581 -5369 -876 4788 -1194 -4788 2575
1507 2575 4326 -3410 -3283 4609 2412 -5343 -1322 5897 29 -5785 1700 5975 -2647 -4809 4100
1522 4100 3918 -4869 -2758 4910 886 -5172 -4 4525 -1179 -3614 2404 3188 -2493 -1692 3249 890
1538 890 -3319 83 2985 -1478 -2913 2213 2170 -3049 -1133 3782 325 -3627 1078 3602 -1901 -3019
1554 -3019 2571 2054 -3263 -1345 3184 288 -3170 492 2910 -1258 -2436 2032 1965 -2573 -1027 3193
1570 3193 251 -3473 786 3436 -2016 -3246 2782 2464 -3706 -1926 4027 985 -4225 -204 4237
$$ packed form
1461i84n038Q112K902q509j21Q414k461p419M736N623o588l444P684R56p894J572
1477b459P550l764o714N396N157p051l760P855J861q337K78Q769k134p728M525
1492e56O890o160n041P366K391q291l15P757k460o950M493N664n982l594P363
1507B575J751p736J27P892k197p755M021P219n868n814P485M275q622k162Q909
1522D100j82q787K111P668m024o058N168M529n704k435O018P84n681Q01M941k359
1538H90m209L402K902m463j435N126m3n219J916M915l457l952M705K524n503j118
1554c019N590n17n317J918M529k896l458L662K418m168j178M468o7m538J546M220
1570C193k942l724M259K650n452j230O028l18o170J780N953l042n210M021M441
$$ plain form
1585 4237 -374 -3855 1001 3698 -1387 -3297 1706 2793 -1954 -2344 2035 1479 -2181 -956 1658
1600 1658 198 -1160 360 484 -504 356 499 -916 -331 1446 -2 -1889 345 1991 -698 -2218
1616 -2218 967 2192 -1241 -2157 1667 2121 -1994 -1895 2324 1335 -2688 -893 2649 292 -2432 385
1632 385 2198 -708 -1516 1060 1061 -1258 -763 1060 87 -1240 162 1343 -307 -845 1098 1328 -913
1649 -913 -742 1386 428 -1803 -300 1361 -431 -1463 495 1085 -502 -564 776 625 -385 -61 403
1666 403 151 -108 38 78 44 199 269 -204 -275 448 283 -931 -576 915 -20 -1617 -77 1382 -332
1685 -332 -1294 896 1479 -469 -760 1039 920 -921 -698 706 413 -1014 -576 790 332 -985 -128
1702 -128 876 -181 -973 162 517 -558 -506 402 241 -187 109 368 44 96 93 -68 -33 63 -217 -257 14
$$ packed form
1585D237m611l481M856K697n085j910N003J087m747l90M379n56l660J225K614
1600A658j460j358J520J24r88Q60J43j415N85J777j448j887K234J646k689j520
1616b218L185J225l433r16L824M54m115R9M219r89m023J795L542k357k724K817
1632C85J813k906q08K576Jk319M95J823r73j327J402J181j650n38J943K30k241
1649i13J71K128r58k231J503J661j792j032J958N90j587o2J340j51j010L24M64
1666D03k52k59J46M0l4J55P0m73p1P23j65j214L55J491r35j597J540J459j714
1685c32r62K190N83j948k91J799j19j841K23J404k93j427M38J366m58j317Q57
1702a28J004j057p92J135L55j075N2R08j61m28K96K59l24N2lj61L5R6k80m0K71
$$ plain form
1723 14 56 -103 -241 6 222 -164 -513 90 366 -541 -674 574 389 -816 -74 1069 293 -613 382 1006
1743 1006 -145 -647 290 366 -650 -924 129 269 -745 -621 672 443 -828 21 1174 175 -854
1760 -854 474 1031 -446 -517 705 524 -585 -233 599 107 -607 -195 460 -59 -595 -74 596 -70 -444
1779 -444 341 488 -235 -112 415 -76 -191 355 3 -318 396 421 -527 -223 811 98 -980 11 1043
1798 1043 -147 -1151 194 1215 -478 -1366 561 1361 -941 -1394 1173 1314 -1541 -961 1765 651
1814 651 -1728 -267 1655 -63 -1491 313 1271 -391 -1008 525 833 -626 -631 560 375 -785 -245
1831 -245 768 -3 -641 366 388 -555 -190 511 -385 -596 505 142 -789 91 780 -437 -747 745 712
1850 712 -938 -556 1181 528 -1347 -342 1591 35 -1992 6 1742 -761 -2200 821 1855 -1294
$$ packed form
1723A4M2j59j38K47K16l86l49O03K76r07j33J248j85j205P42J143p76r06R95O24
1743A006j151n02R37P6j016k74J053J40j014J24J293k29j271Q49J153r99j029
1760h54J328N57j477p1J222j81j109L52Q32m92p14M12O55n19n36N21O70o66l74
1779d44P85J47p23J23N27m91j15N46l52l21P14K5r48L04J034p13j078R91J032
1798A043j190j004J345J021j693q88J927Q00k302m53K567J41k855N80K726j114
1814F51k379J461J922j718j428J804R58j662o17J533L08j459nJ191j85j160N40
1831b45J013p71o38J007K2r43L65P01q96k11J101l63r31Q80O89j217l10J492l3
1850G12j650L82J737o53j875J005J933j556k027J998J736k503j439L021J034l149
$$ plain form
1866 -1294 -1488 1771 1368 -1642 -719 1907 537 -1681 -113 1575 -127 -1345 406 1230 -629 -1079
1882 -1079 818 641 -1080 -361 1100 -84 -1053 531 976 -746 -536 1010 288 -979 165 1041 -133
1899 -133 -703 520 705 -582 -430 591 173 -755 -169 645 -190 -709 410 591 -647 -333 998 112
1917 112 -991 466 1054 -729 -759 1113 707 -1204 -442 1345 135 -1500 -39 1465 -239 -1519
1933 -1519 502 1584 -629 -1541 882 1257 -1207 -1076 1410 768 -1237 -330 1337 37 -1049 145
1949 145 874 -338 -708 324 407 -438 -187 478 -19 -484 149 531 -383 -524 732 407 -927 -56 1094
1968 1094 -154 -1142 259 844 -737 -999 701 627 -865 -393 969 372 -797 -40 897 -41 -864 278
1986 278 867 -573 -756 695 478 -975 -198 1046 -150 -997 425 874 -694 -663 880 449 -964
$$ packed form
1866a294j94L259m03l010R23K626j370k218J568J688j702j218J751Q24j859m50
1882a079J897j77j721P19J461j184r69J584M45j722K10J546p22j267J144Q76j174
1899a33n70J223J85j287J52J021m18r28N86Q14q35n19J119J81j238L14J331q86
1917A12j103J457N88j783l0J872m06j911P62J787j210j635J461J504j704j280
1933a519K021J082k213r12K423L75k464J31K486o42k005R07J667j300j086J194
1949A45P29j212l70J032Q3q45K51O65m97m65O33L82r14j41J256l25j334Q71J150
1968A094j248r88J401N85j581k62J700p4j492M72J362n97j169P57R37r38q23J142
1986B78N89j440j83J451k17j453P77J244j196q47J422M49j568L1J543m31j413
$$ plain form
2003 -964 -266 966 46 -1043 238 1199 -301 -980 761 1177 -890 -956 1223 536 -1457 -356 1470
2020 1470 -107 -1335 397 1166 -658 -927 815 630 -863 -389 932 222 -872 242 1033 -324
2036 -324 -793 734 639 -1071 -436 1290 -20 -1425 415 1378 -765 -1237 1016 928 -1279 -671 1366
2053 1366 536 -1177 -81 1311 -2 -1143 318 1000 -677 -850 884 457 -1112 -61 1233 -350
2069 -350 -1076 908 1024 -1256 -660 1550 353 -1645 24 1656 -411 -1701 503 1360 -1030 -1494
2085 -1494 1038 1042 -1267 -666 1575 472 -1356 229 1489 -515 -1112 1012 783 -1360 -435 1304 -368
2102 -368 -1604 447 1264 -981 -1220 1259 1111 -1406 -678 1904 513 -1937 -23 1923 -452 -1931
2118 -1931 794 1745 -1125 -1235 1499 1028 -1497 -530 1355 -117 -1440 216 906 -624 -654 857 346
$$ packed form
2003i64O98J232r20j089J281R61j500o79J741M16k067o6K179o87j993J101J826
2020A470j577j228J732P69j824k69J742j85j493M74J321p10j094J114P91j357
2036c24m69J527r5j710O35J726j310j405J840R63k143m72K253q8k207O08K037
2053A366q30j713J096J392j313j141J461O82j677j73J734m27j569J051J294j583
2069c50p26J984J16k280N96K210j197j998J669J632k067j290K204Q57k390m64
2085a494K532Mk309O01K241j103j828J585J260k004n97K124k29k143R25J739j672
2102c68j236K051Q17k245k39K479j48k517P28K582j391k450J914J946k375j479
2118a931K725R51k870j10K734m71k525R67J885j472j323J656O90j530l0J511n11
$$ plain form
2135 346 -935 -1 1025 -408 -947 866 952 -1141 -495 1821 447 -1660 307 2083 -590 -1866
2151 -1866 913 1398 -1584 -1456 1359 604 -1811 -481 1673 162 -1451 496 1769 -442 -916 1138
2167 1138 1040 -1288 -605 1446 -89 -1670 429 1480 -888 -1251 1222 876 -1552 -630 1464 207
2183 207 -1484 179 1401 -296 -992 853 1083 -686 -539 1000 242 -1241 -83 1002 -593 -899
2199 -899 1011 775 -1108 -269 1350 -214 -1495 395 1270 -949 -1196 1030 748 -1198 -561 1368 433
2216 433 -1323 34 1447 -220 -1412 528 1205 -999 -1067 1135 569 -1345 -307 1235 -237 -1172
2232 -1172 464 1009 -684 -708 812 343 -885 -62 938 74 -624 405 777 -569 -698 643 240
2249 240 -1147 -239 1002 -212 -1082 537 964 -670 -620 1027 476 -996 -166 930 -96 -966 281
$$ packed form
2135C46j281R34J026j433n39J813Q6k093O46K316j374k107J967J776k673j276
2151a866K779M85k982J28K815p55k415J330K154j511j613J947J273k211m74K054
2167A138r8k328O83K051j535j581K099J051k368l63K473l46k428R22K094j257
2183B07j691J663J222j697o96J845K30j769J47J539p58j483J158J085j595l06
2199h99J910k36j883Q39J619j564j281J890Q75k219k47K226k82j946O37J929r35
2216D33j756J357J413j667j192J940O77k204o8K202n66j914J038J542j472r35
2232a172J636N45j693k4J520m69j228Q23J000q64o98J029L72j346j29J341m03
2249B40j387R08J241j214q70J619M27j634N0J647n51j472Q30J096j026q70J247
$$ plain form
2266 281 829 -427 -727 626 515 -769 -441 836 167 -820 231 1009 -359 -732 663 566 -929 -369
2284 -369 948 192 -858 164 910 -353 -701 418 582 -504 -455 713 386 -704 -129 753 26 -644
2302 -644 365 620 -447 -571 482 164 -702 -83 585 -145 -372 314 251 -363 -105 414 61 -357 196
2321 196 467 -314 -554 455 346 -663 -359 735 247 -929 -41 873 -198 -913 388 788 -455 -562
2339 -562 603 593 -428 -209 587 236 -527 -203 305 -259 -653 -59 197 -207 -147 532 224 -217 187 509
2359 509 -262 -454 400 132 -493 -169 330 -77 -328 73 358 -33 -100 62 141 -149 -233 -76 39 -229 -68
2380 -68 165 -106 -148 269 140 -317 25 503 -104 -444 216 306 -289 -323 428 411 -251 -150 359 194 -642 -509
2402 -509 204 31 -734 -148 686 244 -376 399 795 7 -253 427 403 -333 -333 136 41 -352 -181 229 153 -221
$$ packed form
2266B81N48j256l00J353j11j284L28J277o69r87J051P78j368l73J395r7j495N60
2284c69J317p56j050J022P46j263l48J119J64j086M9J168l27j090N75Q82p27o70
2302f44J009K55j067j24J053l18q66O19O68p30k27O86o3o14K58N19l53m18N53
2321A96K71p81k40J009j09j009L04J094m88j176Q88R14j071p15J301M00j243j07
2339e62J165j0j021K19P96l51p63L24N08n64l94N94K56m04O0O79l08m41M04L22
2359E09p71j92Q54k68o25L24M99m07k51M01K85l91o7J62P9k90q4J57J15k68J61
2380f8K33k71m2M17j29m57L42M78o07l40O60R0n95l4P51j7o62J01N09j65q36J33
2402e09P13j73p65N86Q34m42o20P75L96p88k60O80k4p36%M69r5l93J71M10p6l74
$$ plain form
2424 -221 -92 67 -162 -304 68 168 -95 132 542 24 -68 376 227 -276 -37 279 -143 -473 -2 109
2444 109 -329 -309 213 223 -88 58 329 142 -243 -22 247 -172 -422 169 210 -477 -235 584 85 -455 364
2465 364 793 -113 -368 335 250 -633 -449 291 104 -446 -173 398 -57 -570 3 474 -122 -349 408 392 -321
2486 -321 -13 488 26 -361 200 322 -400 -317 189 -160 -479 0 239 -87 -111 226 316 -199 -134 407 141
2507 141 -240 162 536 -230 -547 223 254 -631 -397 640 161 -609 141 691 -93 -420 348 546 -172 -352
2527 -352 279 205 -335 -278 189 117 -313 -12 302 -73 -240 218 190 -226 161 449 -83 -165 368 119 -442 -73
2549 -73 440 -87 -418 162 339 -237 -429 154 334 -249 -252 419 409 -263 -94 554 97 -504 63 429 -277
2570 -277 -503 286 223 -357 18 528 191 -195 117 303 -186 -389 76 96 -464 -298 348 159 -414 -43 494
$$ packed form
2424b21J29J59k29j42L72J00k63K27M10n18r2M44j49n03K39L16m22l30M71J11
2444A09m38K0N22J0l11J46K71j87l85K21K69m19k50N91M1o87K42Q19m99n40Q19
2465C64M29r06k55P03q5q83J84P40j87n50K73N71m55n13N73M71n96k27P57j6p13
2486c21L08N01m62l87N61J22p22Q3N06l49l19M79K39l26k4L37R0n15O5N41k66
2507A41l81M02L74p66l17P70L1q85K34J037m79p70P50N50p84l27P68J98p18j80
2527c52O31p4n40N7M67p2m30L01L14l75j67M58k8m16L87K88n32q2N33k49n61L69
2549g3N13n27l31N80J77n76j92N83J80n83lO71j0o72J69O48m57o01N67L66p06
2570b77k26P89o3n80L75N10l37l86L12J86m89k03M65K0n60J66O46j89n73L71N37
$$ plain form
2591 494 -14 -343 244 438 -303 -353 277 102 -392 -52 306 -54 -189 181 113 -269 -209 221 -31 -372 10
2612 10 313 -163 -364 327 524 -326 -212 607 277 -600 -182 410 -239 -697 69 431 -187 -252 390 300 -254
2633 -254 -155 252 125 -417 -59 353 -95 -305 299 462 -279 -104 561 152 -566 -14 292 -425 -510 254 335
2654 335 -222 1 463 209 -183 50 288 -26 -292 100 176 -250 -297 266 85 -333 80 527 -100 -300 362
2675 362 232 -471 -181 415 -8 -402 173 426 -192 -293 286 365 -326 -236 364 91 -612 -222 551 64 -538
2696 -538 259 806 -167 -532 410 409 -596 -401 459 134 -488 -183 420 127 -386 26 387 24 -185 57
2716 57 198 -160 -241 102 -12 -294 149 89 -317 20 427 -202 -431 326 481 -326 -286 503 379 -529 -294
2737 -294 488 254 -644 -239 577 53 -780 -95 660 -89 -597 328 500 -268 -267 392 165 -275 44 173 -213
$$ packed form
2591D94n08l29N87J94p41n0O30j75m94L40L58l60j35L70o8l82O0M30k52l41L82
2612A0L03m76k01O91J97q50J14Q19l30q77M18N92o49m58P66L62o18o5O42r0n54
2633b54R9M07j27n42L58M12m48k10O04J63p41J75O65m09p18N52L06p17q5P64Q1
2654C35n57K23M62k54l92K33K38l14k66L92P6m26m7N63j81m18M13M47o27k00O62
2675C62j30p03K90N96m23l94N75K53o18j01N79P9o91R0O00k73p03L90P73m87o02
2696e38P97N47r73l65R42jj005J95Q60l25o22L05O03k93n13M12L61l63k09K42
2716E7J41l58q1L43j14k82M43o0m06L37M07o29k29P57J55q07M0P89j24r08K35
2737b94P82k34q98M05Q16n24q33O85P55p49n08R25J72p68JO59k27m40L19J29l86
$$ plain form
2758 -213 -146 183 -80 -437 -50 321 -88 -369 239 575 -150 -414 474 572 -462 -369 546 233 -705 -275 526
2779 526 -114 -652 63 496 -117 -265 304 334 -130 -82 358 138 -201 115 286 -197 -236 295 182 -446 -19
2800 -19 564 -125 -660 190 466 -410 -365 561 408 -368 -129 607 130 -477 -27 404 -58 -440 113 372 -191
2821 -191 -321 368 253 -316 17 475 -103 -444 183 108 -527 -135 371 -90 -484 171 518 -161 -300 409
2841 409 471 -267 -307 427 223 -600 -207 555 14 -664 56 546 -367 -609 361 310 -534 -208 571 194 -275
2862 -275 218 543 26 -214 227 349 -223 -349 122 31 -468 -218 338 -40 -328 205 313 -263 -151 380
2882 380 8 -393 202 283 -271 -239 408 164 -413 -27 409 -11 -335 94 369 -305 -464 198 294 -451 -289
2903 -289 600 261 -515 -13 606 -112 -505 302 403 -392 -256 447 155 -440 29 540 136 -392 105 419
$$ packed form
2758b13O7L29k63l57L87L71m09k81O08L36p25k64Q88R8j034R3R15l13r38M30Q01
2779E26o40n38P15M33o13j48N69L0m64M8M40k20l39L16J71m83l9N31j13o28M27
2800a9N83o89n35Q50K76q76M5R26j53p76K39P36m77o07M50M31m62l82N53K59n63
2821a91j30O89j15n69L33M58n78l41O27p5o35L92N06m61l94O55L47o79j39P09
2841D09O2p38m0P34k04q23L93P62n41o78P20M90r13k42R70n1q44L26P79l77m69
2862b75M93L25n17k40M41J22n72j26M71r1m99K50N56l78k88N33J08n76J12N31
2882C80l72m01N95Q1n54L2O47k44n77L86M36m20l24M29K75o74j59O62R6p45J62
2903b89Q89l39p76N02O19p18l93Q07J01p95J36P03k92n95M69N11m04n28M97L14
$$ plain form
2923 419 -228 -576 211 362 -492 -327 525 269 -421 -35 484 2 -269 216 226 -126 -40 190 -75 -102 101
2944 101 132 -161 -95 202 39 -300 -60 348 38 -341 147 342 -211 -305 357 199 -358 -134 355 -78 -314
2965 -314 75 187 -215 -181 174 105 -116 -1 294 9 -266 24 240 -130 -256 182 214 -330 -187 368 41
2986 41 -434 73 360 -96 -313 99 205 -200 -212 160 77 -164 -145 131 116 -179 -108 107 109 -93 -52 143 -109
3009 -109 -133 -3 25 19 75 -31 -107 172 108 -179 -62 195 71 -219 -33 123 -53 -148 -15 115 -16 -154 66
3032 66 234 74 -62 125 252 -45 -84 180 49 -156 11 92 -44 -43 55 -11 -34 2 51 -26 7 -94 -34 42 -81
3057 -81 -11 79 64 -51 105 112 -71 10 144 1 -82 66 27 -171 -49 23 -27 -39 -74 -64 57 -3 -92 26 163
3082 163 43 -66 159 151 -31 -11 28 68 39 -69 -128 10 66 -149 -243 63 74 -163 -84 163 73 -90 -72 69
$$ packed form
2923D19o47l48P87J51q54J65Q52k56o90L86N19m82k71M85J0l52Q6K30k65k7K03
2944A01L1k93O6K97j63l39K40M08l10l79M88J95n53r4O62j58n57K24M89m33k36
2965c14L89J12m02L4L55o9k21J15K95k85k75K90K16l70j26M38L2n44J43N55l27
2986D1m75N07K87m56k17M12J06m05j2L72q3k41J9K76j5k95P1K15Kk02M1J95k52
3009a09k4J30K8oN6j06p6K79o4k87J17K57j24k90J86J56j76r5J33J30j31j38K20
3032F6J68j60j36J87J27k97l9K64j31k05J67Q1j36JR8o6k3L6M9p7L3j01O0P6j23
3057h1P0R0j5j15J56Pj83Q1J34j43q3J48l9j98J22P2n0j2l5J0J21o0q9J18J37
3082A63j20j09K25qj82K0L9M0k9j08n9J38N6k15r4L06J1k37P9K47r0j63J8J41
$$ plain form
3106 69 168 -8 -129 117 284 -35 -180 91 148 -124 -152 -14 -4 -83 -136 -116 23 27 -145 -112 204 115 -208 -20
3130 -20 182 46 -110 23 163 25 -58 -18 41 109 -139 -158 183 60 -221 -67 239 -23 -179 11 227 -18
3152 -18 -103 3 187 68 -135 -3 290 100 -185 12 325 -29 -189 64 166 -14 -119 1 124 -33 -123
3173 -123 -110 84 87 -124 -33 225 85 -81 6 190 -7 -77 -42 -21 49 -98 -86 52 108 -115 -71 133 36 -105
3197 -105 98 67 -126 -19 173 7 -82 36 92 -94 -49 104 130 -61 -76 117 188 -93 -198 95 145 -252 -179
3220 -179 214 84 -279 -50 219 -27 -98 57 29 50 -82 -46 78 55 -90 -35 89 15 -64 15 25 10 -3 -13
3244 -13 -64 112 113 -185 -113 183 30 -233 -12 213 -155 -197 82 121 -51 -96 12 131 -83 -112 62 177 -65
3267 -65 7 219 99 -70 76 49 -64 -26 59 -158 -198 183 36 -230 -71 258 -6 -320 60 346 19 -288
$$ packed form
3106F9R9j76j21K46J67l19j45K71N7k72k8J38J0p9n3K0J39Mj72L3L16q9l23J88
3130b0K02j36j56J33J40j38q3M0N9O8k48j9L41j23k81J54L06k62j56J90K16k45
3152a8q5J06J84j19k03J32K93j90k85J97L13l54j60K53J02j80j05J20J23j57r0
3173a23J3J94Lk11R1K58j40j66Q7J84j97p0L5K1P0j47J2J38N6k23M4K04r7j41
3197a05K03l1j93J07J92j66q9J18N6j86M5J53K6j91j5J93P1k81j05K93N0l97P3
3220a79L93j30l63K29K69k46p1J55k8K1j32L6J24k3j45N5J24p4p9P9J0j5j3j0
3244a3n1J76Jk98P2K96j53k63K21K25l68m2K79L9j72m5J08J19k14k9J74J15k42
3267f5P2K12j20j69J46k7j13L8Q5k17m0L81j47k66J59L29k64l14L80K86l27l07
$$ plain form
3289 -288 59 364 11 -387 74 423 -180 -414 177 353 -285 -166 325 142 -208 -93 160 24 -189 -14
3309 -14 151 -19 7 3 141 55 82 7 -22 -54 45 -84 -132 60 239 -49 -208 257 164 -174 -215 242 94 -263
3333 -263 -55 307 -3 -198 -31 238 27 -185 40 167 -100 -263 121 102 -213 -29 125 -104 -154 203 164
3354 164 -280 -95 320 -32 -346 62 254 -187 -322 177 348 -193 -229 218 353 -220 -295 237 145 -428 -175
3375 -175 313 65 -285 116 241 5 -29 84 -12 -144 89 -1 -187 -80 99 17 -207 -77 137 -43 -283
3396 -283 -36 223 -54 -228 155 317 -181 -154 333 175 -251 36 197 -159 -277 139 70 -270 -42 186 47
3417 47 -320 -6 404 -19 -272 221 482 -192 -339 374 307 -441 -272 437 53 -459 -3 473 -25 -303 155
3438 155 280 -110 -233 126 190 -112 -127 138 85 -131 -51 93 -48 -129 110 62 -203 118 243 -102 -125 260
$$ packed form
3289b88L47L05l53l98M61L49o03k34N91J76o38J19M91j83l50J15K53j36k13J75
3309a4J65j70K6mJ38q6K7p5k9l2R9j29m8J92J79k88j59M65r3l38m1M57j48l57
3333b63K08L62l10j95J67K69k11k12K25J27k67j63L84j9l15J84J54k29n0L57l9
3354A64m44J85M15l52l14M08J92m41j35M99J71n41l6M47J35n73p5N32r2n73K53
3375a75M88k48l50M01J25k36l4J13r6j32K33r0j86J07J79q2k24J30K14j80k40
3396b83K47K59k77j74L83J62m98K7M87j58m26K87J61l56j18M16o9l40K28K28j39
3417D7l67L14M10m23k53M93K61o74j47P13o7p48J69P09l84n12M56M76m98k78M58
3438A55J25l90j23L59O4l02j5K65n3k16Q0J44j41q1K39m8k65L21J25l45k3L85
$$ plain form
3460 260 162 -256 -54 237 -69 -253 -24 170 -116 -298 28 212 -234 -225 254 141 -232 -16 416 0 -301
3481 -301 114 312 -275 -254 262 32 -328 -25 355 5 -205 151 341 -35 -299 165 235 -278 -301 169 145
3502 145 -416 -205 338 -64 -295 87 222 -92 -122 298 168 -118 66 165 -88 -130 105 115 -106 -157 44 -35
3524 -35 -238 -128 154 -104 -301 84 269 -95 -59 340 155 -196 59 301 -137 -319 149 160 -303 -160 252
3545 252 62 -176 -87 338 34 -265 39 337 -103 -322 208 309 -226 -148 372 137 -278 -2 242 -104 -222
3566 -222 214 172 -121 -89 234 19 -252 62 152 -114 -208 113 175 -261 -172 266 95 -256 16 362 9 -59
3588 -59 344 218 -201 -83 236 -123 -405 -9 93 -151 -186 205 187 -114 13 275 102 -296 -72 229 -80
3609 -80 -291 187 284 -149 -107 308 96 -284 13 140 -222 -296 145 143 -134 -69 274 111 -211 38 331 -6
$$ packed form
3460B60r8m18K02K91l06j84K29J94k86j82L26J84m46RM79j13l73K16M32m16l01
3481c01M15J98n87K1N16k30l60L03L80l50k10L56J90l76k64M64P0n13k3M70k4
3502A45n61K11N43m02k31L82J35l14l0M20j30k86J84R9k53m2K35J0k21n1K01p9
3524c5k03J10K82k58j97L85J85l64L6L99j85l51K55K42m38j82M68J1m63J43M12
3545B52j90k38Q9M25l04k99L04K98m40k19N30J01n35P8N20k35m15K76K44l46j18
3566b22M36m2k93L2L23k15k71L14R0k66r4L21O2m36Q9M38j71l51K72L46l53o8
3588e9M03j26m19J18L19l59k82L96J02k44l5L91j8l01J27K62j73l98K24L01l09
3609h0k11M78R7m33M2M15k12l80K97J27l62p4M41kk77O5L43j63l22K49K93l37
$$ plain form
3631 -6 -223 101 261 -235 -256 273 127 -314 -77 260 -29 -266 136 227 -134 -188 90 77 -163 -9 152 -31
3653 -31 -109 85 154 -99 -84 139 142 -208 -87 286 43 -255 146 358 -18 -212 164 191 -182 -130 77 11 -140
3676 -140 4 57 4 -13 32 38 -51 -67 99 -14 -106 21 170 -148 -73 180 83 -293 -87 214 -78 -244 61 198
3700 198 -72 -109 155 99 -130 -55 36 12 -101 1 137 -9 -38 127 167 -198 -80 203 -29 -322 32 322
3722 322 -118 -142 295 277 -195 -133 203 75 -238 -169 178 46 -259 -79 166 58 -206 8 249 -55 -62 143
3744 143 138 -124 -113 -50 -87 -88 -31 -94 -83 109 121 -10 44 124 29 -38 30 32 -9 -85 25 129 2 -147 -8 90 -211
3771 -211 -193 59 -143 -231 10 139 1 29 296 219 -77 5 212 69 -201 -106 160 -13 -275 -34 208 -123
3793 -123 -257 126 231 -174 -161 242 167 -216 -97 201 62 -250 -68 134 35 -82 17 61 85 -117 -21 33 -125
$$ packed form
3631fk17L24J60m96k1N29j46m41K37L37k89k37M02R1l61n4K78j3k40J54J61j83
3653c1p8J94O9k53J5K23Ll50J21L73k43k98M01K12l76j94L76K7l73N2K07o6j51
3676a40J44N3n3j7M5Oq9j6J66j13r2J27J49l18P5K53r7l76K06L01k92j66L05J37
3700A98k70l7K64n6k29P5R1k4j13J02J36j46k9J65M0l65J18K83k32k93L54K90
3722C22m40k4M37j8m72O2L36j28l13O9L47j32l05J80K45j08k64K14K41l04pK05
3744A43nk62J1O3l7jN7o3J1J92J2j31N4Q0r5o7O8Km1p6J10J04j27j49J39R8l01
3771b11J8K52k02q8K41J29j38K8K67p7k96Q2K07j43k70R5K66j73k62K41K42l31
3793a23j34L83J05m05J3M03p5l83J19K98j39l12J82K02r9j17R9M4K4k02R6N4j58
$$ plain form
3816 -125 -172 -9 43 -19 24 65 45 59 -16 -163 -94 51 -149 -159 98 215 3 14 287 227 -26 -16 62 11 -199
3841 -199 -155 33 9 -267 -105 193 -2 -232 100 285 -189 -162 203 233 -99 2 163 161 -152 -145 116 -63 -204
3864 -204 -141 70 -33 -163 -52 100 -79 -172 82 77 -46 59 148 36 -19 52 -40 -114 -111 -88 -80 -80 -18 24 84 40 62
3891 62 137 36 -93 -66 -28 -76 -84 59 -31 -23 53 36 -34 8 44 -61 -41 147 -8 -87 73 92 -35 -127 -10 54 -107
3918 -107 -198 -33 122 -62 -143 81 275 -37 -195 138 102 -128 -86 254 96 -131 -15 100 -42 -204 -65
3939 -65 74 -118 -96 55 162 9 -10 145 57 -137 -8 167 -125 -195 113 104 -149 -38 137 46 -64 -87 41
3962 41 132 16 -39 125 168 -83 -101 98 43 -141 -108 88 42 45 -39 5 136 15 -218 -56 122 -36 -260 9
3986 9 256 -33 -139 79 204 -109 -124 -23 60 -141 -226 31 134 -42 -77 186 101 -252 -16 156 -90 -227
$$ packed form
3816a25m7J63N2o2M3M1k0J4p5j47O9J45k00j0K57J17k12J1K73o0k53J0P8n1k10
3841a99M4J88k4k76J62K98j95k30L32J85m74K7L65L0l32J01J61kl13PK61j79j41
3864b04O3K11j03j30J11J52j79r3K54nj23J05Q9j12n5P1r2p4LK3Q%O2M2O0m4K2
3891F2P5j01j29K7L8m8qJ43r0QP6j7p0M2L6j05K0J88j55p9J60J9j27r2J17O4j61
3918a07r1J65J55j84q1K24J94l12j58L33l6k30M2L40j58k27J16J15j42j62J39
3939f5J39j92K2J51J07j53j9J55q8j94J29J75k92p0L08rk53J11J75r1j10k3J28
3962D1R1j16n5J64M3k51j8J99n5j84L3J96m6Lq4M4J31j21k33J62J78j58k24K69
3986IK47k89j06K18J25l13j5J01Q3k01q5K57J03j76l5K63q5l53K36J72k46j37
$$ plain form
4008 -227 26 109 -145 -71 134 103 -53 -31 157 15 -145 -117 174 58 -143 33 146 -78 -171 85 147 -70
4030 -70 -77 106 26 -78 -86 16 -7 -54 -134 -32 43 -4 1 55 158 -27 -40 14 -103 -80 -121 -60 80 110 24 -27 225
4057 225 113 -119 -35 112 -122 -141 -44 107 -18 -106 125 193 -43 -124 30 67 -199 -80 129 113 -104 -17 297
4080 297 -53 -177 75 199 -132 -172 125 119 -156 -96 88 3 -159 -142 120 82 -122 -1 223 134 -63 1 149
4103 149 -46 -110 -92 68 9 28 -12 -79 88 25 -91 -61 48 -41 -134 -7 165 31 -21 84 190 23 -149 -29
4127 -29 123 -121 -152 95 198 -149 -110 178 59 -277 23 171 -98 -162 82 161 -93 -166 86 32 -126 -185 89
4150 89 37 -160 14 199 36 -92 111 168 -79 -115 75 -33 -151 -5 43 -36 -33 68 47 -59 -15 20 -3 -109
4174 -109 39 139 -1 -82 131 206 -93 -159 93 15 -144 38 233 -48 -66 151 182 -115 -48 143 6 -77 -29
$$ packed form
4008b27K53Q3k54P4K05l1j56K2J88j42j60K8K91j16k01J76J13k24r3K56O2k17
4030g0pJ83q0j04qJ02k3m7q0J02P5m7NN4J03j85j3N4j17K3m1O1J40L0q6n1K52
4057B25j12k32Q4J47k34j9R7J51j25q8K31O8k36q1J54L7k66J19K09j6k17Q7L14
4080B97l50j24K52J24l31m0K97ok75O0J84q5j62J7K62l8k04J21K24q9j97O4J48
4103A49j95o4J8J60n9J9m0o7J67o3j16L0J09q9r3J27J72j34n2J05J06j67j72J20
4127b9J52k44l1K47J03l47L9K88j19l36L00J48k69o4K44P9k54p3K52n4j58n9K74
4150H9n2j97J74J85j63j28K03N7k47l6J90j08j18J46M8p9LJ01k1j06M4L5k3j06
4174a09J48J00j40q1K13P5k99o6K52p8j59J82J95k81j8K17L1k97O7J91j37q3M8
$$ plain form
4197 -29 56 -3 -108 33 37 -68 -215 -4 63 -86 79 192 8 -43 195 238 -162 -63 204 -11 -291 -10 173
4220 173 -77 -121 109 154 -93 -185 49 104 -172 -178 218 181 -105 45 250 15 -144 76 105 -106 -156 139 -54
4243 -54 -154 46 65 -42 -80 43 68 -67 -65 86 44 -149 -10 201 35 -208 -33 111 -100 -116 226 122 -93
4266 -93 33 166 -81 -142 -92 35 -96 -61 6 15 43 7 51 48 -2 -4 26 -102 -10 187 69 -149 156 254 -121 -198
4292 -198 180 67 -289 -167 217 91 -237 -10 208 46 -143 -49 224 76 -197 53 261 -65 -111 85 133
4313 133 -113 -39 72 -91 -94 112 -4 -119 31 136 -36 -65 -17 71 -34 -92 70 58 14 -29 51 126 -55 -125
4337 -125 30 -7 -128 37 126 -60 55 173 -47 -145 62 84 -119 -92 193 5 -37 57 209 48 -55 -29 111
4360 111 -3 -67 74 180 -45 -105 199 91 -138 -25 112 -96 -171 77 141 -99 -22 149 43 -127 -17 27
$$ packed form
4197b9Q5n9j05J41Mj05j47K11O7j49J65J13j84n1K38M3m00R9K67k15k80K81J83
4220A73k50m4K30M5k47r2K34N5k76oL96l7k86J50K05k35j59K20K9k11n0K95j93
4243e4j00K00J9j07l8J23K5j35KJ51m2j93J39K11j66k43J75J44k11j6L42j04k15
4266i3J26J33k47o1N0J27j31L5O7RK8l6M4ln0kL0j28R2J97j18k18L05R8l75p7
4292a98L78j13l56J22L84j26l28K27K18j62j89R4K73j48k73K50K08l26m6J96M8
4313A33k46P4J11j63lK06j16j15J50J05j72k9M8Q8j05n8J62j2m4m3Q0P5j81p0
4337a25J55l7j21J65Q9j86J15J18k20r8K07K2k03K7K85j88m2R4J52j61j03K6J40
4360A11j14o4J41J06k25o0L04j08k29J13J37k08p5K48O4k40P7J71j06j70J10M4
$$ plain form
4382 27 -78 -134 -36 63 23 -118 67 161 -29 -159 96 38 -163 -17 103 -60 57 95 57 -30 -45 -31 44 -11 -34
4407 -34 7 118 82 -43 62 81 -66 -35 -88 -44 -18 -86 -65 9 186 12 -115 47 124 -134 -147 129 134 -19 -6
4432 -6 124 116 -70 -92 89 80 -136 -102 167 49 -75 -52 187 -31 -127 46 -21 -119 -83 51 57 -79 13 153 14
4457 14 11 3 44 25 -55 10 73 -16 -68 47 69 -111 -124 29 -61 -121 92 67 12 27 66 54 75 -15 -49 -70 46 -59
4485 -59 14 122 7 -22 34 -25 -134 -58 -14 -156 -79 -82 -7 62 89 -30 -15 120 15 -121 80 155 -47 -70 67
4510 67 47 -98 -29 -58 50 -155 -158 92 79 -91 -79 152 95 -151 -30 152 -98 -91 97 94 45 22 146 100 -52
4535 -52 -59 4 -39 -113 -93 98 50 -77 -30 168 20 -118 11 120 -79 -90 3 51 7 93 94 81 67 -122 -84 21
4561 21 17 -63 -3 0 -19 -44 16 94 -64 -78 -3 111 71 -45 54 242 97 -168 31 212 13 -177 91 119 -32
$$ packed form
4382B7j05n6R8R9m0j41J85R4j90j30K55n8k01J46J20j63J17L8l8q7j5J4P5n5k3
4407c4M1J11l6j25J05J9j47L1n3M4K6o8K1P4J77j74j27J62P7k58j3K76Nj53J3
4432fJ30qj86k2J81rk16L4K69j18j24K3K39k18r6J73o7r8L6J34Oj36R2J40j39
4457A4lqM1j9q0O5O3q9n2J15K2j80j3J53r0o0K13k5n5J5L9j2K1r0l4k1J16j05
4485e9P3J08j15k9N6n9j09P6M4j42P7lP5O9K7j19J5J35j05j36K01P5k02k3J37
4510F7k0j45O9k9J08k05lK50j3j70J2K31n7k46J21J82k50PJ88lm9k3J24m6j52
4535e2pO3m3p4K0J91m8j27M7J98j48j38J29J09j99j1R3M8m4Q6Jj3j4j89L8J05
4561B1mq0O0Lj9k5O0P8j58j4P5J14m0j16R9J88j45k65J99J81j99j90K68K8j51
$$ plain form
4586 -32 -79 104 143 -52 -133 -6 63 -77 -87 64 68 14 58 168 78 -25 18 0 -115 -73 37 32 -82 27 -11 -10
4612 -10 1 -60 -6 -41 -24 -35 103 34 -26 6 27 -38 -83 -47 31 -22 4 -84 27 177 23 -149 52 196 -103 -172
4638 -172 135 116 -136 -88 129 129 -79 -82 36 -6 -103 -134 111 165 -86 2 185 4 -153 26 65 1 -18 -9 1 -54
4664 -54 26 -19 -27 33 -7 -114 -34 -32 2 -22 -38 -12 67 7 -60 23 85 -57 -152 38 94 -16 58 37 9 117 9 -104
4692 -104 3 37 -97 -53 149 119 54 67 65 52 -21 -108 52 65 -36 -84 121 163 -18 -25 215 77 -182 -54 18
4717 18 -14 -45 -21 51 37 50 1 67 106 -56 -16 19 31 -23 20 82 -15 -14 40 -60 26 77 -19 -44 -1 17 -77 -49 -23 -3
4747 -3 -52 -22 38 21 73 -43 122 87 -33 1 9 27 -136 -84 -12 -52 -24 26 37 33 10 -10 13 29 -15 18 38 72 -36
4776 -36 17 128 -42 -59 -30 -69 -90 -43 -41 -25 -77 -16 -34 43 -18 -29 59 35 -1 32 99 3 -18 -35 -48 -22 -74 -36 -15 74
$$ packed form
4586c2m7J83L9j95q1J27O9j40j0J51Mn4M4J10r0j03M3j8j15M2J10nj14J09l8J
4612a0J1o1N4l5J7j1J38o9o0L2K1o5m5L6P8n3K6q8J11J50j54j72K01J44k99o9
4638a72L07j9k52M8K17%k08lJ18m2r7l1K45N4k51Q8J83j81j57J79L9o4j9RJ0n5
4664e4Q0m5qO0m0j07Q0KL4k4j6K6P9o0o7Q3O2j42r5J90N6j10P4k1k8J08j08j13
4692a04J07L4j34M4K02l0o5J3kj3p3q7J60J3j01m8K05M2j81pK40j38k59J28P2
4717A8l2l1K4P2j4J3m9O6L9j62M0L5J2n4M3O2r7JN4j00Q6N1r6k5M3J8r4K8K6K0
4747cm9L0O0j7N2j16J65l5j20L4QJ8j63N2P2m0K8N0J1mk3k0K3J6m4L3K0L4j08
4776c6N3J11j70j7K9l9k1M7KJ6n2O1j8P7o1j1Q8k4l6L3O7r6k1j7j3K6n2L8K1Q9
$$ plain form
4806 74 27 42 70 124 14 -44 -15 49 -39 -76 42 50 38 -7 85 14 24 -26 84 20 -83 -13 62 83 -12 85 88 -106 -86
4835 -86 9 -56 -154 -73 2 -27 30 49 55 59 74 -20 16 -25 -71 38 33 -19 -98 11 -1 -46 -27 9 4 -55 49 45 43 17 58 58
4867 58 94 -14 -2 -26 -59 -32 -63 -22 70 -70 -20 1 104 22 -52 34 110 -67 -49 158 76 -119 -96 118 -29 -134
4893 -134 -127 66 -74 -102 -38 98 44 -117 10 40 31 -138 39 119 -20 -62 100 13 -135 -20 42 -42 -107 -19 71
4918 71 93 79 28 23 46 -35 -75 -43 -66 -153 7 20 23 49 43 64 84 5 -58 19 22 -59 -107 102 110 -55 -75 76 -63 -126
4948 -126 -13 22 -15 -38 61 27 -7 25 26 113 61 42 119 83 -60 -72 -2 -4 -130 -22 -26 -41 34 32 41 51 62 64 52 42 28
4979 28 -84 35 -108 -108 12 85 23 47 148 57 -83 -56 17 -138 -16 -33 -1 22 -24 31 43 109 15 -10 22 -74 -76
5006 -76 -10 -1 -12 106 53 -5 69 74 -74 -60 12 -105 -36 -24 6 -101 17 33 5 4 17 100 71 -28 63 56 89 -77 -24
$$ packed form
4806G4m7J5K8N4j10n8K9O4q8l7J18Qj2m5R2p1J0n0J10o4j03P0P5K1r5R7Lj94K0
4835h6R5o5r8Q1P5k9N7J9OMJ5r4L6m1m6J09nn2p9J09j2m5J9L6nn9J04mkk6M1%
4867E8L6j08J2k4l3K7l1M1R2j40N0K1J03q2p4Q6P6j77J8K07q2j95K3K14j47j05
4893a34PJ93j40k8O4J36n4j61J27L0rj69J77Q0j39m2J62q7j48J15O2q4o5Q8R0
4918G1K2j4n1nK3q1m0L2k3q7J60J3LK6oK1K0p9o3P7Lq1m8K09Qj65k0J51j39o3
4948a26J13L5l7k3R9l4l4L2JQ7n2j9P7l6j43j2P0kj26J08mj5P5kRJ0J1Kj2j0j4
4979B8j12J19j43%J20P3o2K4J01r1j40K7P3j55J22j7L2K3m6N5J2O6r4k5L2r6k
5006g6O6Rj1J18n3n8P4Nj48J4P2j17O9J2L0j07J18J6k8jJ3Q3k9r9R1pL3j66N3
$$ plain form
5035 -24 46 4 -17 2 122 53 42 62 64 -45 -28 -59 -30 -65 -26 8 36 -5 74 158 58 -48 43 0 -77 -74 -3 -14 -36
5064 -36 49 10 -66 4 37 -87 -75 39 13 -4 6 91 3 -24 -43 55 31 -31 -37 53 25 -137 52 106 -10 -45 79 90
5092 90 -101 16 137 -28 29 146 82 29 -17 -25 13 -76 -87 38 67 -57 12 149 68 -55 9 27 -7 -16 -9 20 32
5119 32 42 -11 -53 9 42 -160 -68 121 101 -83 18 170 62 -73 -53 95 -2 -188 -96 190 -23 -216 25 124
5143 124 -120 -151 14 53 -80 -14 39 46 51 -26 107 148 -10 -64 20 23 -24 -85 52 59 -18 17 38 69 -5 -32 -31 48 -15
5172 -15 -127 -3 99 63 -116 45 114 -61 -43 109 137 -8 5 68 25 -88 -115 41 90 -126 -43 54 32 -85
5196 -85 32 107 -58 -40 73 70 -99 -33 104 37 4 38 92 111 -24 -119 -28 -8 -195 -101 56 -50 -33 91 109 99
5222 99 -21 11 23 102 -43 -73 59 41 -68 -45 83 79 -155 9 66 -34 -95 4 90 33 -8 -14 91 0 -87 83
$$ packed form
5035b4P0m2k1J9J20o9j1K0Kj09J7l1K9l5L9L4K8m1P9Q4j00j06R1m3p7LP1j1k2
5064c6Q5l9p6P0L3j24J2J14k6j7J0Q5q8k7j9R8k4o2oR0k8j62J89N4j16l5J24J1
5092I0j91J17J21j65N7J17o4n3m6qL8q9j1J25K9j24O9J37q1j23O4J8l4rPK9J2
5119C2J0n3m2O2L3k02R2J89k0j84J01J52j08j35K0J48r7j86R2K86k13j93K41R9
5143A24k44l1J65L9j33O6N3PNp7J33M1j58n4Q4Lm7o1J37Pp7L5K1L1p4k7JP9o3
5172a5j12J24J02l6j79J61O9j75J8J52K8j45J3O3m3j13k7J56M9k16Q3R7k2j17
5196h5J17P5j65J8J13lj69O6J37o7l3L4N4J9j35r5R1K0j87R4J57j06J7J24J8j0
5222I9j20L2J2P9j45l0J32j8j09K3J28mk34J64N7j00o1R9Q6n7m1oJ05r1q7J70
$$ plain form
5248 83 102 -79 27 104 -7 -94 -59 128 -45 -46 8 -11 -2 6 18 -24 -2 28 -18 -29 -87 -77 68 -25 14 38 112 37 46
5277 46 64 -14 -62 25 -72 -46 75 63 -98 7 101 -63 -63 42 -7 -47 -30 92 54 -58 -26 108 9 -88 -64 52
5303 52 46 -145 10 76 15 -167 -37 34 -6 -84 43 70 3 57 52 -16 41 13 -49 -30 2 34 -35 -53 50 56 11 23 74
5332 74 32 20 -102 75 101 -74 -40 135 3 -72 14 -24 -87 -3 58 -14 -30 16 -1 13 -2 52 30 -36 2 18 -10 -74
5360 -74 -7 39 12 -61 42 55 -109 16 77 -22 -42 64 51 -17 -24 16 32 -76 -36 36 -52 -63 38 73 66 14 4 73
5388 73 -27 9 24 25 -38 31 71 -84 -90 91 37 -112 -11 77 68 -17 60 41 -59 -32 -67 83 4 -9 104 72 -9 27
5416 27 10 -11 -24 44 -44 -138 13 59 -84 -88 80 76 -54 18 16 16 -114 -5 -38 -28 -98 -5 96 -2 -16 13 49 -11 -64
5445 -64 62 30 -33 85 111 -44 62 143 46 -92 -5 92 26 -53 -1 8 2 -36 28 93 -29 -40 23 23 -86 -45 35 25
$$ packed form
5248H3J9j81J06P7j11q7L5J87j73jN4j9RQJ2m2K2L0m6j1n8J0J45r3L9K4P4p5R
5277D6J8p8m8Q7r7K6J21j2j61J05R4j64%J05m9m0J7J22l8j12L2J34r9r7K4J16
5303E2oj91J55O6o1j82J30P1m0p8J27K7o7N4no8N7k8o2J9L2L2o9j8J03Om5J2N1
5332G4m2j2j22J77K6j75L4J75j32p5Q6l8o3Q4O1p2j6M6j7J4j5N4k2o6L8J6k8o4
5360g4O7M6k7p3J03J3j64J25O1r9k0J06j3o8pM0J6j08M0P2q8j1J01L5pn2j0O9
5388G3j00L6J5Jo3O9M0j55oJ81n4j49J01Q8rq5P7j9j00K7l5J50p9j3J13l2q1L6
5416B7j7k1j3O8q8r4J51M6j43mJ68mj30P2k%j30J09l3J0p0R3J01r8j4K9L6o0n3
5445f4J26l2o3J18K6j55J06Q1r7j38Q7R7o6p9N2Rol8O4O5j22j1O3%j09M1Q0j0
$$ plain form
5473 25 27 -5 -84 20 -11 -42 -99 41 21 -85 -6 94 -52 -24 50 40 -22 -75 50 95 31 16 98 86 -16 -131 48
5500 48 106 -32 -96 121 -30 -123 -46 61 -40 -111 -21 51 -24 -67 -43 19 -15 -61 81 51 24 -87 16 74 -22 -46
5526 -46 45 6 -43 14 32 36 -60 -68 -15 14 -18 -113 23 62 4 -74 70 97 -85 -152 -7 101 -59 -57 93 119 1 -148
5554 -148 46 106 -106 -103 85 55 -115 -18 67 44 -31 8 21 85 -14 -13 63 70 -53 33 57 -3 -18 33 -37 -24 -76 31
5582 31 13 -29 33 -8 -6 -31 -44 -51 33 14 -51 6 60 -91 -73 65 74 -69 -37 29 -16 -40 -17 56 106 31 -69 35 143
5611 143 -52 -64 49 42 -115 -8 47 -23 33 -29 58 48 -49 -79 9 57 -82 -39 99 -8 -103 63 65 3 -9 16 -1
5638 -1 -57 -12 40 6 -16 -31 22 60 -1 -61 50 5 8 32 66 -39 16 12 48 -18 35 29 -46 7 30 -53 26 3 -36 4 -7
5669 -7 -8 -82 57 66 3 -33 -40 39 20 -32 16 50 66 -56 -46 93 30 -40 7 131 -46 -53 -7 69 -66 23 61 36 -26 -43
$$ packed form
5473B5Kl2p9J04l1l1n7J40k0j06P9J00j46K8P4j0o2n3J25M5o4j5Q2j2j02j15J79
5500D8N8j38o4K17j51r3P7J07j01p1R0P2p5m3K4O2l4m6J42l0k7j11J03N8r6k4
5526d6R1l9m9N7J8Mr6qN3K9l2r5J36L9n8p8J44K7j82o7J45J08j60KJ50K6j18j49
5554a48J94O0k12LJ88l0j70R7Q5k3p5L9J3O4r9JP6Pj23Q6K4o0j5N1p0J3n2J07
5582C1j8m2O2m1Kk5j3pQ4j9o5N7N4j51J8J38Rj43L2O6m5k4K3P3N0p5j00J04J08
5611A43j95j2J13pj57J07N5p0N6o2Q7j0r7l0Q8M8j39M3J38j07r5J66Ko2j2K5j7
5638an6M5N2l4k2j5N3L8o1o0J11m5LK4L4j05N5mL6o6N3op5N3K3q3P9k3l9M0j1
5669gjp4J39Ro3l6pP9j9n2M8L4J6j22J0J39o3p0M7J24j77pM6P6j35Q9L8k5o2j7
$$ plain form
5699 -43 -6 66 -42 -83 24 24 -41 37 93 -9 -31 13 9 -59 48 13 -48 65 53 -26 -1 82 55 -49 30 70 25 -51
5727 -51 -5 94 3 -46 22 169 12 -152 88 141 -86 -152 127 78 -120 -51 123 45 -88 -21 82 42 -52 -39 78
5752 78 21 -69 -17 61 23 -3 -57 27 -6 -15 33 -40 34 -4 -81 -49 33 -66 -98 -11 82 -61 -146 -13 26 -15 -1 26 42 -28
5782 -28 -38 57 48 -70 26 96 -70 -123 50 136 -110 -67 124 68 -162 40 155 -82 -120 42 119 -106 -65 65 186
5807 186 -70 -148 33 25 -94 -72 86 50 -94 62 73 38 -42 -20 17 10 2 -68 19 37 8 -96 27 41 -11 -43 -15
5834 -15 42 13 -35 -8 50 13 -45 21 92 -7 -117 160 87 -57 23 148 26 -67 26 62 -7 -30 73 61 -28 -15 -28
5861 -28 54 -7 10 23 10 -44 -48 6 -41 -34 38 101 29 36 65 31 16 22 -30 -7 36 -58 -99 43 14 -123 -75 44 36 -78 17
5892 17 127 47 -89 -25 45 -6 -46 50 139 -2 -91 43 130 -7 -62 49 106 -66 -58 -20 18 -14 -43 3 23 54 -30
$$ packed form
5699d3L7P2j08m1J07%o5P8N6j02k2M4mo8J07l5o1J13j2p9K5Q3k7j04P9M0m5p6
5727e1M6R9r1m9O8J47j57j64K40N3k27o6K79m9j98O9J74p8j33O7J03m0r4J3J17
5752G8n7r0N2P8l8k6n4Q4l3rM8p3P4l8p7L2Q2r9l2Q7R3j43q5J33L9m1J4K7J6p0
5782b8j0R5rj18R6P0j66n3J73Q6k46M3J91n6k30K02J15k37l8J62P7k25M1J30J21
5807A86k56p8J81qj19K2J58l6j44J56J1l5q0K2L7pqp0Q7J8k9j04J23J4n2l2K8
5834a5N7k9m8K7N8l7n8O6P1r9j10K77p3j44Q0J25j22r3R3L6o9k3J03j2q9J3j3
5861b8Q2o1J7J3j3n4mN4m7PP2O3p2PK9l4j5On2K3M3r4m1J42k9j37M8J19qj14R5
5892A7J10q0j36O4P0n1m0R6Q9j41q9J34Q7j37n5J11N7j72QL8L8l2k9M6K0L1q4
$$ plain form
5919 -30 31 52 -79 -68 -14 -8 36 -21 9 82 30 -22 -39 65 3 -126 -37 77 11 -154 -41 37 -10 -84 37 -14 -17 1
5947 1 94 51 -71 -20 98 44 -51 94 73 -40 -53 96 24 -73 -88 28 -76 -105 62 120 -58 6 85 89 -15 52
5973 52 82 -60 -72 -25 51 -35 -64 59 3 -24 15 53 -15 -48 69 8 -156 -39 114 -67 -160 51 146 -130 -91 93
5999 93 194 -129 -74 54 106 -117 -84 113 39 -158 -16 127 -31 -66 54 61 -71 64 44 -40 -42 14 29 -9 64
6024 64 89 -36 -3 61 69 -123 -25 89 44 -104 -22 101 -3 -91 49 154 -18 -69 94 87 -160 -60 108 -21
6048 -21 -178 -22 120 -68 -193 71 64 -74 -57 68 58 -121 -21 109 19 -177 1 108 -52 -92 33 87 -54
6071 -54 -27 101 48 -72 -8 -1 -71 4 10 -22 90 43 68 -22 16 108 -17 -143 -21 127 -76 -76 81 123 -62 -131 145
6098 145 125 -137 -81 90 5 -159 -54 149 -6 -91 43 93 0 -107 84 48 -41 -78 24 51 -80 62 153 -20
$$ packed form
5919c0O1K1j31J1N4OM4n7L0P3n2n2j7J04o2j29Q9J14o6j65J13P8m7p4J21n1lJ8
5947AR3m3j22N1J18n4r5J45k1j13j3J49p2r7j5J16j04k9J67N8j78O4P9Mj04O7
5973E2L0j42j2M7P6q6k9J23n6k7L9L8o8l3J17o1j64J17J53j81r3K11R5k76L9J84
5999I3J01l23N5J28N2k23L3J97p4j97J42J43j58l5J20Pj32J35k0q4kN6J5l8P3
6024F4K5j25L3O4Qj92R8J14m5j48Q2J23j04q8J40J05j72n1J63pk47J00J68j29
6048b1j57J56J42j88j25K64pj38J7J25j0j79J00J30r0j96J78J07j60m0J25N4j41
6071e4K7J28n3j20O4Pp0P5Ol2J12m7K5r0L8R2j25j26J22J48k03%J57M2j85o9K76
6098A45k0k62N6J71q5j64J05K03j55q5J34N0r3j07J91l6q9l7J02K7j31J42R1j73
$$ plain form
6122 -20 -67 85 65 -87 -27 28 -35 -91 -30 -7 -40 13 70 -6 14 68 32 -25 -11 53 61 -29 -36 107 38 -145 46 77 -61
6151 -61 -129 57 83 -144 -76 82 -10 -100 -47 49 -63 -114 -10 77 -42 -114 -1 48 -114 -45 3 58 -65 -45 91
6176 91 11 -40 43 89 -107 34 54 -30 -48 -36 -11 0 117 -7 8 -3 57 12 -29 25 49 26 -40 16 39 -7 -4 -2 66
6205 66 -66 -40 99 4 -74 -28 145 -4 -46 49 155 48 -29 0 16 -2 -99 -49 14 -62 -89 7 17 -53 -1 42 4
6232 4 4 45 13 5 24 -44 -73 25 44 -85 -85 -9 123 15 -16 -3 24 -27 -32 50 3 -4 26 55 -9 -39 -42 29 -27 -86 5 44
6264 44 -74 -40 -5 62 -56 -11 108 -12 -25 -38 -1 -26 -17 -55 17 -86 -43 -17 47 -46 24 3 19 -17 53 8 -42 -22
6292 -22 15 -73 -51 -36 -36 -91 2 1 -14 -24 2 68 48 20 8 31 76 -36 -19 82 -88 -14 25 2 -72 106 32 -100 45
6321 45 39 51 -48 -18 27 29 -37 6 98 90 -35 -26 82 -69 -88 -81 -13 -100 -66 43 111 -48 -89 41 38 48 -63 -71 4 12 18
$$ packed form
6122b0m7J52k0j52O0N5o3n6O1K3l3N3N7p6K0N4l6n7J4O4Qr0pJ43o9j83J91L1j38
6151f1o8J86K6k27O8J58r2r0N3R6j12n1J04Q7j19p2J13M9j62O9M8N5j23K0J36
6176I1q0n1Q3M6j96J41K0q4j8J2K5J1J17j24J5j1O0m5m1N4K4k3o6N6K3m6LKO8
6205F6j32K6J39r5p8M6J73j49m2R5J06j07p7K9J6j8r7N0O3p6k7R6J0p0N2M3l8
6232D%M1l2qJ9o8k9R8J9j29%P6J32j08l1J3K7n1nQ2m7pL0K9o4l0lP1n6n9R1L9
6264D4j18L4L5O7j18M5J19j20j3j3L7k5Rl8P2j03M3K6O4r3P0k1J6l6P0m5n0K0
6292b2L7q8K2J5%n5R3jj5j0K6O6k0k8j2K3M5j12J7J01j70P4L9k3p4J78p4j32J45
6321D5oJ2r9L0M5Ko6M3R2qj25RJ08j51j9PO8q7L4J09O8j59m1J30lJ0j11qP5QO
$$ plain form
6352 18 48 11 29 10 112 53 15 94 6 -29 64 -5 -63 57 22 -98 -17 87 0 -75 -12 93 -22 15 9 69 -21 -51
6380 -51 31 83 -36 -21 71 44 -52 24 65 63 -111 72 -30 -24 -12 98 45 -47 -5 81 -45 -70 23 72 -13 -28 31 34 -15
6409 -15 -60 57 66 5 5 79 -12 -20 21 65 15 20 26 -14 -64 101 15 -54 -50 56 -7 -124 67 56 79 -90 -24 101 -9
6438 -9 -32 16 92 -60 -28 88 37 -27 -7 69 -30 -22 35 -69 -27 51 29 43 -10 6 28 13 -36 -14 189 -47 -48 113 87
6467 87 -50 -70 91 -39 -13 10 62 16 4 37 23 -11 55 4 44 78 -5 82 32 97 32 37 1 3 35 -60 -17 99 100 -49
6497 -49 -30 118 30 -80 35 48 -49 -145 6 70 -9 -28 8 44 -60 -38 52 36 -106 -13 33 45 -43 -17 84 -7 -3
6524 -3 -75 -1 79 -5 -46 -109 48 56 -41 -3 13 39 -49 -19 41 12 32 -25 67 -28 -96 -17 21 2 -56 -13 18 -55 28 74 -40
6555 -40 1 -14 20 -53 -90 16 -9 -75 -6 -32 8 36 55 -15 7 -25 -17 42 -36 8 22 -14 -15 -1 25 -18 0 -18 -65 -17 22
$$ packed form
6352A8L0l7J8j9J02n9l8P9q8l5R3o9n8J20l5j20Q1J04q7p5O3J05j15L7oO0r0l0
6380e1Q2N2j19J5R2k7r6P6M1kj74J83j02OJ2J10n3r2M2Q6j26k5R3M9q5j5N9Lm9
6409a5m5J17Ro1%P4r1qM1M4n0NOm0n0J65q6o9MJ06o3j17J91j1K3j69O6J25j10
6438ik3M8P6j52L2J16n1o4K0P6r9QN7j04M2P8k2J4n3J6K2j5m9K2K03k36jJ61k6
6467H7j37k0J61j30K6K3N2m6j2L3j4l4O6n1M0L4q3Q7n0O5o5Nl6KL2r5M3J16Jj49
6497d9J9J48q8j10J15J3r7r6J51O4p9j9L6L6j04K2R0j6j42R3M6J2q8K6J01r1M
6524cp2P4Q0q4m1o3J57Qr7L8J6K6q8L0O0k9K0n7R2r5o8P9L8j9n8M3L1p3Q3M6j14
6555d0M1j5L4p3l7J06k5o6O9k6M0K8J9p0K2l2QN9p8M4J4l6jJ4K6m3J8j8m7M8L9
$$ plain form
6586 22 -43 -36 13 42 -19 45 170 48 -13 10 45 23 -63 -55 56 27 -87 -16 43 39 -46 33 73 -82 -39 45 83 -89 -2
6615 -2 -16 34 39 5 -53 16 36 1 -65 53 44 3 -46 20 68 -33 -24 8 99 -140 -73 60 17 -108 9 120 -8 -72
6643 -72 104 56 -19 -20 131 108 -102 -47 75 10 -100 67 28 -60 -135 63 39 -89 -87 43 17 -51 61 142 11 -111
6669 -111 56 21 -69 40 88 -56 -59 12 -14 -51 -120 70 -13 -126 23 97 26 -96 83 97 -27 -88 89 11 -107
6694 -107 -5 182 -46 -137 67 67 -73 -108 114 10 -115 -58 54 42 -114 18 138 -16 -77 58 140 -11 -25
6717 -25 83 122 -67 28 145 -22 -79 -33 81 -58 -14 75 -7 -61 51 76 -89 -4 21 108 -70 -16 81 -29 -108
6742 -108 8 121 -74 -44 120 72 -159 -28 144 11 -123 27 125 -14 -120 24 80 -44 -67 84 36 -105
6764 -105 1 91 -1 -48 7 104 -48 25 23 44 -29 -1 81 -50 9 -7 25 -106 3 118 34 8 23 79 -64 -15 -13
$$ packed form
6586B2o5PM9K9o1O4J25j22o1K3L5k2q6QJ11k9j14P1N9mq5P9M0j55M3Q4L8j72Q7
6615bj4N0Nl4n8O9K0l5o6J18rm1m9O6M8j01RL2R1k39O7J33m3j25J17J11j28o4
6643g2J76m8p5jJ51k3k10N5J22o5j10J67l9q8p5J98k4j28KJ30k6o8J12Q1j31j22
6669a11J67l5r0J09M8j44lP1k6l7o9J90q3j13J49P4p1j22J79J4j24o1J77p8j18
6694a07J02J87k28r1K04%j40l5K22j04j25N7J12j2j56J32J20j54o1J35Q2j51j4
6717b5J08L9j89R5J17j67n7M6J14j39M4Q9q2n4J12K5j65Q5K5Q7j78N4R7j10p9
6742a08J16J13j95L0J64m8k31J31J72j33j34J50R8j39j06J44N6j24k3J51m8j41
6764a05J06R0r2m7N5R7j52P3kK1p3K8Q2j31N9j6L2j31J09J15q4k6J5N6j43M9K
$$ plain form
6791 -13 33 -5 -48 32 -7 -95 23 38 -30 19 54 95 -89 -7 118 17 -69 56 102 -3 -48 17 52 -23 -88 68 50
6818 50 -39 -36 44 35 -113 -39 72 -88 -78 38 73 -91 -58 23 -33 -17 22 -47 -83 29 98 -21 -33 12 65 -10 30 68
6846 68 20 -48 -17 26 43 -113 -47 122 39 -100 27 86 -47 -29 55 58 -23 32 -31 54 11 18 6 7 24 -29 17 13 -33 22
6876 22 -25 -41 30 -38 -31 33 53 23 -27 74 38 -43 10 59 38 -64 59 82 -3 35 20 36 -18 -40 -3 9 -40 -43 15 -22
6906 -22 -33 -4 -12 18 -38 37 -4 -116 -2 25 -25 -43 10 48 -50 -41 16 29 0 -43 -30 -28 42 -12 23 -6 -48 -9 7 6 4 35
6938 35 -12 -6 23 28 -9 -13 -51 6 22 32 -35 -24 35 54 25 -23 12 26 -10 -15 7 78 47 -56 -20 57 -62 -51 23 -8 -38
6969 -38 16 72 -6 -36 78 0 9 69 53 33 1 -29 -20 -22 -44 36 17 36 -12 -29 26 -4 23 8 -38 41 50 -37 -24 35 40 -53
7001 -53 5 69 -5 -5 55 64 3 26 31 18 -3 -23 78 67 -107 -102 76 80 -37 -97 -22 67 -19 -56 75 -11 -102 -14 10 12 -49
$$ packed form
6791a3M6l8m3Q0l9q8J18J5o8M9L5M1j84Q2J25j01q6J25M6j05m5O5L5p5o5J56j8
6818E0q9LQ0rj48P4J11j60J0J16L5j64L3Q1n6J6L9o9l6J12O9j19j2M5N3p5M0L8
6846F8m8o8L1M3J7j56O6J69q3j39J27N9j33J8Q4Lq1N5o3Q5m3Pj2JJ7n3M6mm6N5
6876B2m7j6P1o8PO4K0l0n0J01l6q1N3M9k1j02J23K3q5L8j5J6n4k2L7J2m9lN8l7
6906b2j1K9qL0n6P5m1j12J14K7n0j8N3L8r8RN7J3k9m3J3KP0n4L5k9m2L9J6jkL1
6938C5m7OK9Nl7ml8N7J6J0o7J1N9J9k9m8L5J4l6nK2P1l1j03L6P7j19J1P4l1l0
6969c8N4N6p8l0J14p8RO0j6k0l2l0Rkk2Q0j9J9m8j7N5l0K7j5m6P9Rq7J3N9Nr3
7001e3N8O4p4%O0Ro1K3Nj3k1k0J01j1j74NJ78Mj17o0P5Q9q6l7J31q6r1Q8K4Ko1
$$ plain form
7032 -49 -52 -40 29 -29 -63 -12 27 -33 4 24 16 -2 -45 -38 -23 -5 -8 -9 45 57 -33 -14 27 20 -11 20 24 -9 17 -16 15 28 22 17 -27
7067 -27 20 28 46 51 -29 4 13 -6 -30 -25 33 -56 -4 -35 -32 24 -34 35 -17 -4 -30 -6 -5 -19 -56 52 50 -76 9 52 5 -39 18
7100 18 -15 -43 -2 41 25 -17 26 -35 -2 -23 -11 -35 -41 -28 15 51 -33 40 9 -49 8 25 36 28 -24 -1 -54 -33 35 -33 27
7131 27 -40 26 77 -6 21 18 -28 -56 15 20 8 -40 -19 26 -38 -70 35 63 -8 83 79 11 23 9 79 15 15 -11 11 -10 -58 -48
7163 -48 57 -43 38 56 -22 27 2 23 -3 0 44 56 -102 -50 29 -11 -64 -19 15 -47 45 -65 -73 51 -68 13 8 9 5 -63
7193 -63 -35 -95 -58 0 -13 79 37 -21 22 12 24 -111 -31 -1 -15 -33 -78 -33 -17 7 -63 41 64 -15 9 34 28 13 11 43
7223 43 13 5 84 -25 -1 9 -29 31 1 -95 -89 42 -29 -71 12 42 -35 9 -48 33 -20 -25 73 11 43 27 -10 -16 -47 -87 41
7254 41 16 -35 -15 -27 -36 -2 34 42 -34 -4 -82 -19 18 16 -80 -37 4 -17 -27 17 65 -3 32 85 -5 -50 -6 -9 8 -69 8 59
$$ packed form
7032d9lJ2O9n8l4N1L9o0L7K0qj8m3PJ5J8ljN4J2r0J9M1pl1L1Ml3K6l3L1J3onm4
7067b7M7QJ8Nq0L3Rj9k4NN8q9N2l1LN6n8O9n2J3k6K4Jj4l7J08kj26Q5M3m7m4N7
7100A8l3k8M1M3j6m2M3o1L3k1J2k4oJ3M3L6q4P3l1n8N7J7J1qn2K3n3K1O8o8O0
7131B7o7O6N1q3K7lm6k8P1Nj2m8K1M5o4l2J05K8p1R1mo8J2j4P0o4%k6K2k1m8J0
7163d8J05j00Q1J8p8M9k5K1k6LM4J2j58N2P9m0n3M5L4o2R2j10qJ24j19Q1nJmo8
7193f3K8o0L7N8j3R2m2n8M3j0J2j35Q0L0j4j8m5M5J6K4p0J04K3p9K4K5oj5kL2
7223D3l0qP9j09K4J0l8O0l0r6OJ31p1m2Q3L0p7M4n7Q1n3nR8o2L2j6l7ol1m0J28
7254D1k5n1K0j2rL4L6Qp6L0p8O3L7kr6M3M1k1j0M4M8o8L5N3r0m5M4lJ7p7P7N1
$$ plain form
7286 59 56 3 52 45 -43 -52 62 49 -83 29 51 -12 -46 -3 54 29 -100 28 53 -39 -64 -42 -8 -13 -11 120 29 -22 28 37
7316 37 21 -19 -26 -36 -30 -26 51 -76 4 38 -30 -113 -22 31 -53 -33 -40 46 -64 -103 68 13 -16 11 118 -7 -95 41 24
7345 24 -29 -96 71 61 -31 52 89 4 -26 19 79 -51 -47 61 12 -17 2 46 70 -104 30 88 6 -27 59 96 -36 -45
7373 -45 72 -2 -55 -49 112 -48 -20 128 38 -81 -52 33 -3 -34 22 39 -26 3 63 28 -25 -50 89 -3 -104 -34 96
7400 96 -1 -104 8 83 -28 -60 113 72 -40 8 56 11 -50 60 -2 -12 -82 35 38 -20 -7 22 -17 -52 42 34 -87
7427 -87 -107 49 87 -136 -46 78 17 -53 61 31 -57 -22 81 22 -39 -2 56 27 -63 -42 44 -24 -79 49 41 -136 -17
7454 -17 73 19 -89 25 73 -26 -30 62 22 -70 37 59 87 -118 28 108 46 -1 3 122 -45 -24 77 -1 -65 44 54
7481 54 -32 -40 48 7 -81 -61 82 21 -65 42 62 -12 -60 60 -6 -36 -40 38 32 -44 -34 -3 -29 -38 77 3 -19 10 53 41
$$ packed form
7286E9ln3M9pq8rJ14j3j32J12K2o3l4M3N7k5j29J28K5r2k5K2L4nKJ31r1n1N0R
7316C7j6m0pj0OMP7j27Q0L4o8q3R1N3q4K0pQ6j10l9J71n5k9K7J07j25q8J36j7
7345B4n3o7J67j0r2Q3L7q5l0M5O0j30MJ08m9k9J9M4K4j74J34N8q2l3Q6L7j32r
7373d5J17p4n3OJ61j60K8J48r0j19K9Q5l6l1N6J7o5K9O0l5n3k5J39r2j01P0J30
7400I6r7j03J12P5j11l2J73m1j12M8M8m5o1J10o2j0p0J17Ln8J3K9l9l5R4qj21
7427h7k0J56L8k23R0J24o1p0J14l0q8L5J03n9o1L7N8k9r0K1Q6o8n5J28qj77J19
7454a7R0n4j08J14M8r9mR2m0r2J07K2K8k05J46Q0o2m7MJ19j67K1J01p8o4J09J0
7481E4q6qQ8m1q8K0J43o1q6J07K0p4m8J20o6l0mP8op6J0L1k6rJ15p4k2K9M3j2
$$ plain form
7511 41 -12 -64 81 -1 28 -13 -8 7 1 3 11 -41 32 72 -33 -57 6 -25 4 -56 0 27 -26 -13 55 36 -25 13 -8 -41 -20
7542 -20 46 -20 -17 5 11 35 -56 14 -43 -42 7 61 23 -146 28 90 -31 -4 49 40 6 6 54 14 -7 -17 8 -47 -40 -91 -40 16
7574 16 -33 30 -15 52 -35 -13 69 -23 -13 44 66 -25 51 3 36 55 86 49 -50 -49 -39 -12 -26 10 -44 22 61 -41 31 11
7604 11 -48 -72 -1 -2 -19 -89 -79 31 -18 -7 25 49 6 -43 71 61 -10 -23 -3 27 -28 -100 -26 22 32 -31 -17 51 93 -13
7634 -13 -40 104 27 -11 14 104 22 -36 -55 47 35 49 -79 -5 -2 -31 -13 4 15 -65 14 -34 4 -8 32 -73 -26 -11 37
7663 37 -20 -34 -10 -30 -22 -64 -7 48 2 3 -1 -32 32 18 4 -41 -1 47 2 -16 -25 45 -4 30 95 -19 34 54 34 -19 7 12
7695 12 -14 57 3 -43 63 -46 -5 40 6 -13 -10 36 -26 -21 -2 -11 -5 -75 -17 42 17 -31 56 7 -102 -78 26 10 -56 -51 49
7726 49 50 5 48 30 37 29 16 15 -2 -5 -5 25 60 -88 -9 55 25 48 -36 39 22 -5 -36 -28 -10 -18 24 -27 59 28 10 48 39 31 -13
$$ packed form
7511D1n3n2J45q2K9m1NJ5oKQn2P3M0j05k4O3l1K9o0N6K7n3J3O8j9o1L8k1l3K1
7542b0O6o6LK2OK4r1P0n7JM9N4l8j69J74O2j21K7N3rl4%M8m0k1j0K5n5Pn1N1N6
7574A6m9O3m5O7q7K2Q2r2J0N7K2r1P6m8L3J9L1l7r9JJ0K7j4L6n4O6L9j02P2k0
7604A1n9k4P1jj7p0J0J10m9J1L2K4m3m9J14j0p1j3K0L0n5p2P4M8J0o3J4O8M2j06
7634a3k7J44p7l8K5R0q2n8j9J02j2J4j28P4Lk9J8J7J1q0P9m8L8j2M0j05M7J5M8
7663C7n7j4K4k0Qm2N7N5m6Jml1O4j4j4m5M0M8m5j8rP0m9L4O5j14N3K0k0n3K6N
7695A2k6P1n4m6J06j09M1M5l4j9LM6o2NJ9rOp0N8N9k5m8Q7m9j09K4J04j6o6NJ00
7726D9Jm5M3j8Pqj3jj7l%L0L5j48P9O4l0K3q4P5j7k7l1QJ8qM2n1Q6l1j8L8rqm4
$$ plain form
7761 -13 3 32 -13 30 58 19 27 45 19 5 -12 -40 -15 41 -57 -43 -5 -39 -25 52 30 -40 24 30 20 28 0 -7 43 8 -104 9
7793 9 23 10 -14 -25 -58 33 30 9 -5 34 4 29 6 -32 4 -58 78 26 -40 58 19 -67 37 -43 0 -34 -27 6 -50 30 27
7824 27 25 -7 16 -71 -18 -36 -15 12 4 -2 -16 66 -19 -25 -44 -11 -47 -48 -17 1 28 7 -47 43 65 11 16 42 47 -48 24 46 10 -55
7858 -55 28 32 -29 -13 37 -20 57 4 -57 97 39 12 -49 50 -8 -70 19 45 -49 -9 -30 -10 27 -85 22 30 -24 18 40 75
7888 75 3 10 -26 -34 3 -24 -5 22 30 -1 -14 -92 -27 -19 -27 60 0 -25 27 30 -50 -26 -19 -53 18 -37 -38 -43 -26 -9 11 52 -59 68
7922 68 16 -40 25 -26 -1 -21 -62 34 28 14 17 16 -54 -27 18 -46 -23 -55 12 28 45 7 -26 53 -39 -24 3 42 -46 9 -5 -9
7954 -9 -44 -25 35 -6 -61 -74 -2 -5 -5 28 37 -1 5 84 3 -82 39 49 -9 4 47 80 28 19 33 -10 -24 68 -62 9 28 20 -8
7987 -8 -57 49 -2 -25 1 16 6 28 26 109 -65 -24 -58 23 30 -38 -31 13 -53 -53 44 -32 -11 9 -7 0 18 -20 43 -24 -12 54
$$ packed form
7761a3J6K9m5M3K8l9QJ8k6j4j7k8K5N6r8J4L8l4J4P7k2p0O4Oj0Qk8pN0l5j12J13
7793IJ4j3k4j1l3R1lk1j4L9l0K5k3l8L6o2J36n2o6R8l9q6J04q0M3l4PL3n6Q0l
7824B7kl2K3q7N3j8K1K7qoj4Q2q5oj9L3l6jL1J8K7k1n4R0K2n4NK6Nr5P2K2l6o5
7858e5Q3Mo1J6N0n7P7n3o1J54n8k7o1R9n8o2Q9K6r4M0k1K0L7j12J07Qn4M2K2L5
7888G5p2Pl6qL7k7J9K7Ql1j3p8O5QqQ7o0k5N2Lq0K4Pl4P1n5jnJ7J7K0M1j11J27
7922F8n2n6O5n1K5k0m1R6oj4Ljp0K7M5o4K3l2O7J6J7l8l3P9r2J5K7L9q8N5j4m
7954il5J9O0m1n5j3P2l%L3Rl8OP9q1q5J21J0n8J3M3L3n2rJ4m3j4R2j30P1J9qk8
7987hm9J06n1k3K6J5j0K2kQ3j74M1l4Q1Po8PM4o6%R7p6K1K0j6PJ8l8O3o7J2O6
$$ plain form
8019 54 25 -42 -31 -18 29 -21 72 -10 -40 27 38 20 -56 -10 104 -39 -16 46 6 -23 26 80 -12 -22 -18 86 -45 -56 -33
8048 -33 36 49 -26 56 27 -32 7 40 10 -63 74 -9 -17 -22 12 -53 -27 2 10 7 5 -17 26 -50 -49 -1 20 -66 -23 -14 -24 -57 58
8081 58 86 6 -21 49 59 -62 -25 34 -7 25 62 52 25 -14 54 18 -25 -15 21 34 -24 -31 32 -12 -102 15 71 -34 -22
8110 -22 3 10 -33 -14 46 -49 -74 -29 6 -10 3 -38 -10 -45 -43 86 -30 -69 2 -18 -47 -38 54 34 -24 22 -6 -10 32 -2 8
8141 8 12 22 73 18 -35 61 45 -41 -26 12 45 24 -40 96 124 0 -76 59 60 -61 -3 82 28 46 56 -5 -39 11 38 43
8171 43 -41 17 106 -78 -31 12 63 -46 -39 30 1 -42 3 48 31 -19 -23 23 4 63
$$ packed form
8019E4k9o7J1J3M7n0R3q2l0O7J1j8p6M6J14j43K3O2m0k9M9N4r2j0MJ04j31j1K3
8048c3O9J3p5Q2k9n9L9L3l0p3J37q3qnL4o5K6K9Qlkk2M3p6JM8K1q6M3Rj0l3J15
8081E8K8q0k7P0J0j21L7N9m1L2L7j0k7l9O8l6m3J0L6J3n8pO3m4r0J17N6j05J2
8110b2K5Pm3J9O0r5k5M5L5j6J3m1K8l5KJ29j16l9P1k0k9RR2k0n8M6k8mM2l4J0
8141HMJ0N1n5n3R6j6q6J5L8L3k1o4J36K8j24p6J35Jj21N8Q5n4J8J0o1l4N0K7N
8171D3q4N8Q9j84M7M3N1j09PO9k9m3M5M5j7n0mM6j9N9
8191F3
$$ Imaginary data points
##PAGE= N=2
##DATA TABLE= (X++(I..I)), XYDATA
$$ plain form
0 0 0 0 0 0 0 0 0 0 0 0 0 0 0 0 0 0 0 0 0 0 0 4 -4 4 -4 5 -10 12 -13 15 -17 21 -25 27 -31 37 -41 48 -53 59 -66 75 -80
43 -80 88 -98 108 -115 125 -133 140 -142 138 -126 98 -36 -95 364 -969 2579 -8376 63443 432482
62 432482 10068 -409967 80209 399176 -98317 -344966 138288 288157 -161575 -237863
72 -237863 163933 171905 -163364 -121671 142610 66107 -117023 -23914 83792 -6988 -41606
83 -41606 25813 -2369 -33488 44200 29775 -73856 -6636 104033 -17747 -118730 47304
94 47304 121839 -76824 -109423 110992 95564 -133699 -70175 148476 32737 -163645 2658
105 2658 168389 -36827 -156864 78069 140259 -116860 -121396 139113 83811 -161939 -46306
116 -46306 174743 11918 -168549 32554 165481 -59869 -142955 89527 117941 -114046
$$ packed form
0@%%%%%%%%%%%%%%%%%%%%%MqQqRj5K2k5K8l2L8m6N2n8O8p8Q9j01J12j25J41j55
43h0J68j86K06k23K40k58K73k82K80k64K24j34n9M59j333L548j0955P1819L69039
62D32482m22414m20035M90176L18967m97493k46649M83254J49869m49732p6288
72b37863M01796P972l35269M1693K64281p6503j83130R3109J07706r0780l4618
83d1606O7419k8182l1119P7688j4425j03631O7220J10669j21780j00983J66034
94D7304P4535j98663l2599K20415j5428k29263O3524K18651j15739j96382J66303
105B658J65731k05216j20037K34933O2190k57119m536K60509n5302k45750J15633
116d6306K21049j62825j80467K01103J32927k25350q3086K32482K8414k31987
$$ plain form
126 -114046 -96035 120914 61409 -128379 -30708 128317 4182 -118083 18624 96092 -45211
137 -45211 -78421 57950 55938 -57284 -21280 62589 1085 -52015 18432 33547 -38667 -19666
149 -19666 44783 -3080 -51148 20214 47036 -40473 -41252 56740 31427 -67761 -14800 77701
161 77701 -1733 -79259 23396 78838 -41307 -70566 55528 50700 -76480 -39689 80232
172 80232 17764 -81221 8526 86285 -22301 -76714 40352 65330 -58231 -55811 68439
183 68439 41433 -75950 -25421 79204 7420 -80895 6441 74332 -20824 -64277 32811 53155
195 53155 -38012 -37075 41881 24294 -38454 -10418 32069 -2813 -26899 8812 16074 -13937 -2674
208 -2674 21613 -4058 -20221 13853 15190 -28161 -14548 34394 8157 -36470 6207 44031
$$ packed form
126a14046J8011K16949n9505j89788R7671J59025j24135j22265J36707P7468j41303
137d5211l3210J36371k012j13222L6004Q3869o1504n3100P0447J5115p2214J9001
149a9666O4449m7863m8068P1362K6822q7509p79R7992k5313r9188N2961R2501
161G7701p9434p7526J02655N5442j20145k9259J26094m828j27180L6791J19921
172H0232o2468r8985Q9747P7759j08586n4413J17066K4978j23561K420J24250
183F8439k7006j17383N0529J04625p1784q8315Q7336O7891r5156m3453R7088K0344
195E3155r1167R37P8956j7587o2748K8036M2487l4882k4086L5711P262l0011J1263
208b674K4287k5671j6163L4074J337m3351J3613M8942k6237m4627M2677L7824
$$ plain form
220 44031 -12825 -41682 21466 34627 -32662 -29857 37322 21369 -39351 -10334 42433 3643
232 3643 -39047 6340 36758 -14623 -34221 18727 26068 -25282 -18150 31731 13857 -29196 -2322
245 -2322 28869 -7436 -28654 10521 20363 -16801 -13654 20775 8845 -20350 -3005 18518 -2907
258 -2907 -16887 7641 15957 -8914 -11257 11867 6743 -15540 -5211 13449 -1268 -13427 5721
271 5721 12009 -7313 -5528 12293 3381 -11722 533 8111 -9031 -12204 6110 5981 -9038 -1945
285 -1945 14213 5136 -10263 -784 10504 -3328 -13733 2270 11431 -4148 -8029 8635 8280
298 8280 -8087 -5412 6657 -96 -9189 -1709 3339 -3496 -4519 2046 2551 -541 1386 3966 1960
313 1960 -414 861 2065 -378 -1344 1813 1725 -2616 -2220 493 -2863 -5073 322 1895 -1856 964
$$ packed form
220D4031n6856k8857O3148J3161o7289K805O7179j5953o0720K9017N2767l8790
232C643m2690M5387L0418n1381j9598N2948P341n1350P132M9881j7874m3053K6874
245b322L1191l6305k1218L9175R842l7164L147L4429j1930k9195J7345K1523k1425
258b907j3980K4528Q316k4871k343K3124n124k2283J0329J8660j4717j2159J9148
271E721O288j9322J785J7821q912j5103J2255P578j7142l173J8314j29j5019P093
285a945J6158r077j5399R479J1288j3832j0405J6003R161j5579l881J6664l55
298H280j6367K675J2069o753r093P480N048o835j023O565N05l092J927K580k006
313A960k374J275J204k443r66L157q8m341L96K713l356k210N395J573l751K820
$$ plain form
329 964 5340 525 -3091 1547 2353 -2945 -2119 3719 3737 -293 -522 2854 2499 -2793 -4303 770 1560
346 1560 -4160 -3657 2989 2816 -1735 464 4591 2639 -718 -1278 -814 -1009 -2608 -3566 -64 3327 1059
363 1059 -11 3624 3339 -1436 -1524 991 -150 -1386 29 685 406 -266 -1580 -1398 -217 -1505 -1979
380 -1979 712 1411 -312 1015 2713 1117 446 1554 537 -825 -478 -1264 -1640 54 -212 -1469 762
397 762 1667 -1538 -2321 76 -527 -2256 -664 1456 1983 1748 894 866 1466 -645 -3031 -1182 180 -2098
415 -2098 -1953 889 341 -1110 421 715 -674 251 806 -400 271 1484 526 318 1233 350 -901 -1040
433 -1040 -1951 -2520 -1585 -1447 -1106 1348 2068 924 1729 2151 -374 -968 507 -821 -1524 1246 1269 -991
451 -991 501 2179 -682 -2286 41 413 -1809 -1725 598 1470 -69 -549 2001 2669 -1116 -1733 1927
$$ packed form
329I64M376m815l616M638Q06n298Q26N838J8m030k29L376l55n292j510N073P90
346A560n720N03O646j73m551K199M127j952l357n60M64j95j599r58L502L391k268
363A059j070L635k85m775q8K515j141j236J415O56k79o72j314J82J181j288m74
380a979K691O99j723J327J698j596o71J108j017j362L47p86l76J694k66j257K231
397G62R05l205p83K397o03j729J592K120N27k35q54k8O00k111k386J849J362k278
415b098J45K842n48j451J531K94j389R25N55j206O71J213r58k08R15q83j251j39
433a040r11n69R35J38L41K454P20j144Q05M22k525n94J475j328p03K770K3k260
451i91J492J678k861j604K327L72k222Q4K323Q72j539m80K550O68l785o17L660
$$ plain form
468 1927 373 -4026 -749 3707 -360 -2490 3362 4090 -2150 -2054 2907 1130 -3387 -1165 3055 1211
484 1211 -2725 -984 2538 -331 -4338 -941 3154 -399 -2348 2933 4125 -634 -250 2884 526
499 526 -1958 -253 -190 -1575 -132 375 -1133 372 2296 -506 -2585 355 1223 -3055 -3658 2021 3614
516 3614 -1869 -1656 6204 4975 -5274 -3147 7069 930 -10265 -1105 9517 -2047 -10263 3934
530 3934 9519 -5925 -9061 6388 6842 -8269 -5934 8757 4895 -8582 -2223 10172 1178 -9797
544 -9797 939 8631 -4294 -8481 5667 6255 -6827 -3221 8065 886 -8027 327 5533 -3583
558 -3583 -5150 4025 3790 -3530 -873 4581 -357 -4127 1330 2035 -4252 -1184 5707 -795 -6108 5207
574 5207 7883 -8067 -7056 11510 4114 -16733 -2739 18332 -1443 -19572 6955 22246 -9310
$$ packed form
468A927j554m399L277M456m067k130N852P28o240R6M961j777m517K222M220j844
484A211l936J741L522k869m007L397M095l553j949N281J192m759L84L134k358
499E26k484J705O3j385J443N07j508J505J924k802k079K940Q68m278o03N679J593
516C614n483K13P860j229j0249K127J0216o139j1195R160J0622j1564q216J4197
530C934N585j5444l136J5449M54j5111K335J4691l862j3477O359J2395q994j0975
544i797J0736P692j2925m187J4148N88j3082L606J1286p179q913Q354N206r116
558c583j567R175k35p320K657N454m938l770N457P05o287L068O891o502n313J1315
574E207K676j5950J011J8566p396k0847J3994K1071j9775j8129K6527J5291l1556
$$ plain form
587 -9310 -20370 14055 19005 -18755 -18318 21165 15111 -23811 -10780 26911 7315 -27541 -2577
600 -2577 26649 -3136 -25221 7567 22185 -10271 -16458 13579 12047 -13915 -6886 12869 1525
613 1525 -11295 2441 8661 -5185 -4371 8509 1199 -9389 3004 8808 -8737 -8785 11846 5540
627 5540 -14743 -121 18422 -3418 -17253 9616 15196 -15849 -12588 19495 7011 -22507 -125
640 -125 24930 -6103 -25094 12639 23094 -20290 -21117 26257 16926 -31203 -10516 36250 4328
653 4328 -38431 2887 37824 -11714 -37245 17471 32109 -23493 -26132 27918 20098 -28903 -12507
666 -12507 28344 4827 -27046 711 22790 -6012 -17042 10976 11637 -13199 -4781 13280 -3636
679 -3636 -13402 9360 9401 -15463 -4228 19988 -1715 -21769 8624 20893 -15993 -18901 21398
$$ packed form
587i310j1060L4425M950l7760M37L9483o054l8922J3031L7691j9596l4856K4964
600b577K9226k9785k2085L2788J4618l2456o187L0037j532k5962P029J9755j1344
613A525j2820J3736O220j3846Q14J2880p310j0588J2393N804j7545m8K0631o306
627E540k0283J4622J8543k1840j3835K6869N580l1045L261L2083j2484k9518K2382
640a25K5055l1033j8991L7733J0455m3384q27M7374r331m8129K0687M6766l1922
653D328m2759M1318L4937m9538k5531N4716J4638n5602k639N4050p820m9001J6396
666a2507M0851k3517l1873K7757K2079k8802j1030K8018O61k4836Q418J8061j6916
679c636r766K2762M1k4864J1235K4216k1703k0054L0393J2269l6886k908M0299
$$ plain form
692 21398 14444 -25279 -7335 29550 2141 -29520 5668 28732 -13775 -27480 19150 21929
704 21929 -26090 -16316 30756 9118 -33444 -846 33672 -8240 -32424 16045 28828 -21684
716 -21684 -21636 28475 16705 -29797 -8369 31014 816 -30658 5029 26894 -11719 -22844 16529
729 16529 17095 -19892 -10409 20993 2262 -21077 4682 18190 -10820 -12238 17688 7785 -19146
742 -19146 873 21413 -7641 -20370 14366 17341 -20436 -13221 24844 7476 -28496 -2280
754 -2280 28576 -5869 -29499 11472 26602 -17371 -21385 23817 17087 -25756 -8632 27863 1084
767 1084 -27397 5969 24186 -12555 -19398 18443 14473 -21618 -8119 23000 191 -25056 4289
780 4289 21878 -11945 -19923 17166 16060 -20485 -9500 24055 4022 -24186 3231 23601 -8715
$$ packed form
692B1398o954l9723J7944L6885k7409l1661L5188K3064m2507j3705M6630K779
704B1929m8019R774M7072k1638m2562L2598L4518m1912k4184M8469J2783n0512
716b1684M8N0111j1770m6502K1428L9383l0198l1474L5687K1865l8613j1125L9373
729A6529N66l6987R483L1402j8731k3339K5759J3508k9010j418K9926r903k6931
742a9146K0019K0540k9054j2729L4736K975l7777P215L8065j7368l5972K6216
754b280L0856l4445k3630M0971J5130m3973m014M5202o730m2843J7124L6495k6779
767A084k8481L3366J8217l6741o843L7841l970l6091J3499L1119k2809k5247K9345
780D289J7589l3823p978L7089j106l6545J0985L3555k0033k8208K7417K0370l2316
$$ plain form
793 -8715 -19801 14509 15764 -18120 -10557 19233 3176 -21514 681 18624 -7529 -17216 11909
806 11909 13850 -15138 -8917 18464 4256 -19381 1610 19583 -6584 -16847 12324 14089 -15850
819 -15850 -9605 17691 3148 -19832 804 17884 -6430 -15881 11072 13374 -13353 -8873 15872
832 15872 4403 -17287 -387 16690 -4380 -15000 9499 13392 -12028 -8634 15323 4305
844 4305 -16915 -95 16070 -5262 -14804 9388 12553 -11823 -8615 14192 4987 -15240 -1572
857 -1572 14850 -2279 -13863 5981 12640 -8255 -9542 11005 6502 -12564 -2903 13011 -877
870 -877 -12160 4988 10898 -7535 -8097 9667 4760 -11430 -2374 10920 -1019 -10366 3932 9887
884 9887 -5160 -7364 7445 5555 -8758 -3705 8740 501 -8871 2086 8115 -4180 -5996 6383
$$ packed form
793h715j1086L4310J255l3884P563K9790j6057k4690K2195J7943k6153r687K9125
806A1909J941k8988O221K7381j4208k3637K0991J7973k6167j0263K9171J765k9939
819a5850O245K7296j4543k2980K0636J7080k4314r451K6953K302k6727M480K4745
832A5872j1469k1690J6900J7077k1070j0620K4499L893k5420L394K3957j1018
844D305k1220J6820J6165k1332r542K4192L165k4376L208K2807r205k0227J3668
857a572J6422j7129j1584J9844O659k0895j287K0547m503j9066R661J5914j3888
870h77j1283J7148N910j8433n62J7764m907j6190R056J3294j1939r347J4298N955
884I887j5047k204J4809j890j4313N053J2445q239r372J0957O029j2295j816J2379
$$ plain form
898 6383 3755 -7625 -1306 7557 -1406 -7017 3860 6042 -5335 -4418 6242 2276 -7520 -1212
912 -1212 7035 -999 -6929 2985 6737 -4184 -5280 5734 3364 -7435 -2140 7193 -483 -7168
926 -7168 2804 6970 -3755 -5134 5193 3518 -6358 -3036 5392 743 -5909 64 5761 -493 -4470
941 -4470 2163 4373 -2656 -3519 3023 2026 -3754 -983 3568 -91 -2945 1175 2014 -1906 -1417 1412
957 1412 -6 -1566 348 1161 -350 -25 1173 339 -404 730 1086 -627 -698 1457 563 -2475 -1067
974 -1067 2232 -665 -3898 470 3634 -1211 -2979 2962 4102 -1923 -2245 3139 2235 -2991 -2300 2126
990 2126 1584 -2190 -1420 2542 1960 -1890 -1316 1897 421 -2642 -1219 1143 -96 -1101 358 1428
1006 1428 915 165 164 753 559 -852 -973 632 123 -1434 17 1555 -163 -1087 997 1254 -1004 -1172
$$ packed form
898F383k628j1380O319Q863q963n611J0877K182j1377R17J0660l966r796O308
912a212Q247q034n930R914L752j0921j096J1014k370j0799N295R333p676o685
926g168R972M166j0725j379J0327j675r876L322Q428m649o652N973N697o254l977
941d470O633K210p029q63O542r97n780K771M551l659k854M120Q39l920M89K829
957A412j418j560J914Q13j511L25J198q34p43J134L56j713p1K155q94l038J408
974a067L299k897l233M368L164m845j768N941J140o025l22N384r04n226O91M426
990B126n42l774P70L962n82l850N74L213j476l063J423K362j239j005J459J070
1006A428n13p50jN89j94j411j21J605n09j557J451J538j718r24K084K57k258j68
$$ plain form
1024 -1172 698 614 -1464 -1622 593 884 -1602 -1733 1662 1748 -1574 -627 3034 1785 -1667 -240 2181
1041 2181 132 -2289 -883 819 -286 -1954 -951 1093 437 -1726 -891 1453 257 -1799 -193
1056 -193 1805 631 -702 529 1898 1008 -858 -891 714 229 -2496 -2011 1137 429 -2326 -572 2517
1073 2517 961 -1500 43 2227 523 -1612 -495 1586 400 -1944 -722 1757 151 -2171 -123
1088 -123 1894 -263 -1434 824 1509 -257 -388 637 483 -339 -514 -195 126 -245 -521 204 477 -371
1106 -371 -105 713 -77 -697 318 579 -328 -89 642 408 239 89 -151 198 350 -729 -911 502 490
1125 490 -868 -416 1005 584 -429 -255 759 857 -356 -757 885 1129 -1043 -1129 1062 366 -2032 -849
1143 -849 1388 -155 -1407 825 2023 65 -639 1259 1545 -838 -1594 578 817 -2097 -2143 1344 1146
$$ packed form
1024a172J870q4k078j58K215K91k486j31L395Q6l322R47L661j249l452J427K421
1041B181k049k421J406J702j105j668J003K044o56k163Q35K344j196k056J606
1056a93J998j174j333J231J369q90j866l3J605m85k725M85L148p08k755J754L089
1073B517j556k461J543K184j704k135J117K081j186k344J222K479j606k322K048
1088a23K017k157j171K258O85j766j31J025j54q22j75L19L21l71k76P25K73q48
1106c71K66Q18p90o20J015K61r07K39P31k34j69j50k40L49J52j079j82J413j2
1125D90j358M52J421m21j013J74J014R8j213m01J642K44k172q6K191o96k398J183
1143h49K237j543j252K232J198j958p04J898K86k383p56K172K39k914m6L487j98
$$ plain form
1160 1146 -2417 -1225 2637 817 -2607 -306 2693 380 -1974 205 2388 607 -1480 -327 1737
1175 1737 448 -2216 -1299 1046 -27 -2263 -1172 1144 701 -1027 -668 1309 1731 -530 -1320 1418
1191 1418 1996 -1499 -2019 1566 1275 -2503 -1491 2074 689 -2018 -79 2358 400 -1607 76 1517
1207 1517 -707 -2160 -19 1228 -997 -1315 1521 1464 -912 51 2008 58 -1614 275 835 -1313
1223 -1313 -1161 854 724 -502 -133 1111 981 -474 -845 335 714 -1151 -1612 697 1329 -911 -1273
1240 -1273 1455 2227 -537 -1705 1233 2641 -1232 -3119 1347 3194 -2339 -3778 2604 3596 -2987
1255 -2987 -3115 3607 3054 -3218 -2483 3148 2237 -2985 -2252 2521 2090 -2029 -1822 2159 2144 -1388 -1774
1272 -1774 791 1363 -778 -2375 -595 1982 631 -2682 -464 3839 1170 -3490 82 4264 -692
$$ packed form
1160A146l563J192L862j820l424K301K999k313k354K179K183j781k087J153K064
1175A737j289k664R17K345j073k236J091K316m43j728L59J977M22k261p90K738
1191A418N78l495n20L585k91l778J012L565j385k707J939K437j958k007J683J441
1207A517k224j453K141J247k225l18K836n7k376R63J957j950j672J889N60k148
1223a313J52K015j30j226L69J244j30j455l71J180L79j865m61K309O32k240l62
1240a273K728P72k764j168K938J408l873j887M466J847n533j439O382R92o583
1255b987j28O722n53o272P35N631r11n222P33M773m31m119K07L981j5l532l86
1272a774K565N72k141j597J780K577j351l313K218M303k669m660L572M182m956
$$ plain form
1287 -692 -4596 818 3539 -2207 -3747 2315 2923 -2727 -2165 3356 1659 -3611 -826 3643 -440 -3959
1303 -3959 1309 3687 -2321 -2886 3581 2374 -3863 -1047 4166 -280 -4118 785 3071 -2236 -2922
1318 -2922 2152 1692 -2708 -734 3075 220 -2517 1348 2833 -1835 -2093 2766 1140 -3895 -544
1333 -544 3685 -1267 -4099 2344 3656 -3306 -2464 4559 1815 -4564 -190 5006 -657 -4650 1719
1348 1719 3976 -2908 -3717 3236 2359 -4244 -1536 4535 293 -4212 1694 4396 -2461 -2871 4137 1901
1364 1901 -4866 -283 5039 -1701 -5088 3000 4304 -4597 -3516 5660 2440 -6442 -991 7145 -83
1379 -83 -7004 1905 7282 -3058 -6414 4461 5239 -5802 -4148 6005 2052 -6447 -303 6115 -981
1394 -981 -4572 3107 4039 -3513 -2129 4241 430 -4868 391 4010 -2676 -4350 3472 3118 -4826 -2006
$$ packed form
1287f92l904N414K721n746j540O062O08n650N62N521j697n270K785M469m083l519
1303c959N268K378o008n65O467j207o237K816N213m446l838M903K286n307o86
1318b922N074m60m400J974L809k855k737L865J485m668k58M859j626n035L351
1333e44M229m952k832O443J312o962Q42P023k744o379M374N196n663l993O369
1348A719K257o884q09O953q77o603K708O071m242m505N906K702o857m10P008k236
1364A901o767M583N322o740l387Q088J304q901J081R176l220q882N451Q136p228
1379h3o921Q909N377j0340l356J0875P78j1041J654J0153l953q499O144O418p096
1394i81l591P679R32p552J384O370l811n298N259L619o686j674P822l54p944K820
$$ plain form
1410 -2006 5916 874 -6019 1237 6423 -2444 -5357 4392 4526 -5200 -2777 6009 1049 -6292 144
1425 144 5283 -2649 -5737 2867 3638 -4978 -2952 5709 1867 -5505 933 7017 -1504 -5650 3955
1440 3955 4890 -5685 -4147 5908 1554 -7423 -372 6944 -1583 -6432 3356 5744 -4375 -4472 5253
1455 5253 2936 -6180 -1853 6067 95 -5990 1662 5691 -2650 -4198 4301 3101 -5005 -1377 5235
1470 5235 -521 -5096 2190 4433 -3536 -3276 4508 1809 -5450 -867 5041 -1161 -5510 2026 5000
1485 5000 -3050 -3814 4934 3789 -4498 -1306 6005 446 -5741 1005 4699 -3235 -4698 3456 2458
1500 2458 -4882 -1256 5219 -18 -4601 2033 4786 -2835 -3731 4147 2937 -5009 -1760 5687 742
1515 742 -5782 871 5977 -2189 -5581 3254 4281 -4655 -3498 4814 1742 -5071 -363 4995 -477
$$ packed form
1410b006P922n042o893P256N186q867k913R749J34r726K423Q786m960p341O436
1425A44N139p932l088Q604P71q616K026Q661l842p372O438O084q521m146R605
1440C955R35j0575J538J0055m354q977P051P316q527m849R788K388j0119r7R725
1455E253k317r116M327P920n972o085P652M029q341j548Q499j200q106L628O612
1470E235n756m575P286K243p969K60P784k699p259M583N908o202m349P536K974
1485E000q050p64Q748j145q287L192P311n559o187O746L694p934j463Q154r98
1500B458p340L626O475n237m583O634K753p621q96P878j210p946L249P447m945
1515G42o524O653N106q166l392Q835J027q936J157Q312l072o813M708N358n472
$$ plain form
1530 -477 -3958 1988 3533 -2437 -2425 2727 1164 -3456 -515 3158 -804 -3063 1894 2658 -2569 -1570
1546 -1570 3553 758 -3756 348 3532 -1662 -3409 2117 2425 -2990 -1724 3164 819 -3204 112
1561 112 3090 -815 -2647 1635 2258 -2374 -1613 2879 633 -3468 131 3390 -1441 -3405 2385 2901
1577 2901 -3327 -2213 3936 1409 -4141 -491 4324 -94 -4049 657 3823 -1257 -3485 1491 2986
1592 2986 -1878 -2577 1949 1895 -2051 -1261 1949 610 -1402 158 877 -356 -9 555 -676 -425 1249
1609 1249 143 -1673 157 1939 -479 -2050 859 2308 -1039 -2161 1504 2139 -1886 -2054 2159
1624 2159 1581 -2511 -1144 2707 615 -2526 71 2364 -554 -1885 905 1269 -1189 -927 1186 445
1640 445 -1040 124 1462 -79 -966 723 1104 -1062 -1241 995 478 -1741 -528 1552 -19 -1345
$$ packed form
1530d77l481N946J545n970J2N152j563m620K941L673l962k259M957P64n227R99
1546a570N123k795m514M104L184n194j747N526L08n415J266M888k345m023L316
1561A12K978l905j832M282O23m632P61M492k246m101L599L259m831j964N790N16
1577B901o228J114O149k527n550L650M815m418l955M706L166n080k228M976J495
1592B986m864o99M526n4l946P90L210j339k012J560P19j233L47N64j231K51J674
1609A249j106j816J830J782k418j571K909J449l347j122L665O35m025j68M213
1624B159n78m092J367L851k092l141K597K293k918j331K790L64k458K62K113p41
1640D45j485J164J338j541q87J689L81k166j79K236n17k219J213K080j571j326
$$ plain form
1656 -1345 601 1419 -366 -693 823 640 -580 -279 315 23 -293 -79 52 -85 58 80 -263 -447 181
1675 181 137 -838 -590 946 251 -1221 39 1661 14 -1259 766 1490 -696 -1212 763 674 -1103
1692 -1103 -970 654 393 -985 -573 895 435 -918 -276 970 45 -1028 163 816 -372 -488 651
1709 651 421 -251 49 358 -3 -159 -65 -236 -139 1 -163 -140 128 168 22 -105 102 157 -113 -421 121 404
1731 404 -263 -449 684 710 -473 -126 1086 318 -828 132 744 -485 -972 73 358 -642 -719 326
1749 326 610 -370 -377 925 866 -545 -78 1187 165 -951 224 922 -509 -797 549 486 -696 -423
1767 -423 596 132 -636 -230 475 75 -549 7 675 48 -452 252 445 -314 -227 361 47 -294 134 60
1787 60 -310 128 367 -484 -426 641 183 -889 -126 1045 -109 -1086 242 1147 -371 -1305 475 1307
$$ packed form
1656a345J946Q18j785l27J516j83j220L01N94k92l16K14J31j37J43K2l43j84O28
1675A81m4r75K48J536o95j472J260J622j647j273K025P24k186n16J975q9j777
1692a103J33J624k61j378M12J468m60j353O42J246r25j073J191O53j188j16J139
1709F51k30o72L00L09l61j56R4j71R7J40j64K3K68M0j46j27K07N5k70l08N42K83
1731D04o67j86J133K6j183L47J212p68j146R60O12j229m87J045K85j000p7J045
1749C26K84r80pJ302n9j411M67J265j022j116J175O98j431k88J346o3j182K73
1767d23J019m64p68M06P05m00o24N56O68o27n00P04J93p59Q7N88l14l41M28p4
1787F0l70M38K39q51N8J067m58j072P63J171j154r77J328R05j518r34J780Q32
$$ plain form
1805 1307 -797 -1471 1024 1387 -1346 -1148 1586 808 -1778 -510 1690 105 -1540 205 1350 -436
1821 -436 -1165 400 797 -704 -825 604 553 -638 -277 820 126 -631 267 441 -521 -288 467 -159 -638
1840 -638 440 339 -640 -44 814 -212 -763 655 823 -830 -704 1004 567 -1354 -550 1368 129
1857 129 -1916 -102 1860 -396 -1900 883 2145 -978 -1549 1741 1497 -1717 -1004 1790 542 -1793
1873 -1793 -236 1607 -90 -1479 272 1313 -499 -1130 718 854 -930 -479 1184 223 -1077 359
1889 359 1090 -678 -677 918 474 -1025 -41 1118 -170 -782 343 594 -591 -672 418 267 -682 -232
1907 -232 725 52 -666 293 720 -439 -406 893 199 -1013 178 1024 -566 -991 895 753 -1215 -571
1925 -571 1262 229 -1502 -69 1432 -86 -1512 337 1540 -613 -1542 730 1417 -1028 -1254 1253
$$ packed form
1805A307k104o74K495L63k733J98K734p78k586J268K200j585j645J745J145j786
1821d36p29J565L97j501j21J429n1j191L61J097o94p57Q98J74r62K33P55o26m79
1840f38J078j01r79N96Q58j026n51J418J68j653J26J708m37j921Q04J918j239
1857A29k045J814J962k256j504K783J262l123n71L290k44l214P13K794j248k335
1873a793J557J843j697j389J751J041j812o31J848J36j784M51J663r61j300J436
1889C59P31j768JJ595m44j499R84J159j288o12J125K51j185q1J090j51r49M50
1907b32R57o73p18R59M27j159L3J299o94j212J191Q46j590m25J886j42j968O44
1925e71J833j033j731J433J501j518j426J849J203k153r29K272O87k445k26K507
$$ plain form
1941 1253 945 -1388 -558 1296 184 -1320 -26 955 -332 -789 285 533 -326 -317 332 196 -422 25
1959 25 563 -295 -483 607 453 -785 -255 976 -91 -1235 162 1040 -585 -935 762 893 -660
1976 -660 -440 891 446 -835 -188 849 21 -908 121 854 -442 -825 699 651 -781 -330 1054 44
1994 44 -1075 338 1032 -507 -751 805 586 -894 -351 1084 211 -987 145 1151 -182 -1000 482
2011 482 1028 -912 -1068 1035 695 -1372 -388 1472 98 -1419 341 1295 -561 -1070 762 784 -798
2028 -798 -431 952 333 -817 18 961 -271 -918 475 622 -969 -586 1148 207 -1344 214 1422
2045 1422 -636 -1403 908 1108 -1105 -771 1341 691 -1257 -270 1248 -111 -1317 192 995 -596
2061 -596 -976 795 700 -1094 -239 1256 -186 -1191 650 1065 -1128 -897 1320 387 -1685 -148 1570
$$ packed form
1941A253l08k333Q30J854j112j504J294R81j287m57J074K48q59RO49j36o18M47
1959B5N38q58j88J090j54j238N30J231j067j144J397Q78j625l50J697J31j553
1976f60K20J331m45j281O47J037q28r29J029P33j296l83J524m8j432M51J384j010
1994D4j119J413O94j539k44J556k19j480N43J435q73j198J132J006j333q18J482
2011D82N46j940j56K103l40k067R84J860j374j517J760R54j856n09J832K2j582
2028g98L67J383o19j150Q35R43j232o47J393J47j591L83J734r41j551J558J208
2045A422k058p67K311K00k213L34K112o50j948R87J518j359j206J509Q03j591
2061e96l80J771r5j794Q55J495j442j005J841M15k193K31K217r33k072J537J718
$$ plain form
2078 1570 -272 -1737 404 1495 -711 -1357 1108 1407 -1002 -757 1521 517 -1500 -137 1469 -428
2094 -428 -1368 718 817 -1293 -693 1243 -27 -1474 369 1448 -712 -1139 1268 1266 -1375 -850 1729
2111 1729 584 -1871 -253 1948 -233 -1972 650 1978 -878 -1526 1344 1100 -1597 -811 1451 87
2127 87 -1425 220 1203 -442 -774 785 606 -830 -104 1046 -197 -932 684 1043 -930 -692 1462
2144 1462 536 -1800 -126 1746 -631 -2103 597 1451 -1371 -1445 1516 1099 -1531 -472 1909 495
2160 495 -1344 402 1663 -431 -1311 794 935 -1426 -934 1296 175 -1645 94 1555 -713 -1391
2176 -1391 1122 1051 -1360 -722 1536 449 -1431 138 1528 -177 -1125 609 918 -794 -894 818
2192 818 281 -1251 -163 1075 -247 -962 769 853 -1085 -485 1219 34 -1520 278 1399 -622
$$ packed form
2078A570j842j465K141J091k206o46K465K99k409K45K278j004k017J363J606j897
2094d28r40K086R9k110O00J936j270j447J843J079k160m27K407kk641N25K579
2111A729j145k455J618K201k181j739K622J328k856o48K870k44k697P86K262j364
2127H7j512J645R83j645l32J559j79j436P26J150j243p35J616L59j973K38K154
2144A462r26k336J674J872k377j472K700Q54k822p4K961m17k630J059K381j414
2160D95j839J746J261k094q80K105J41k361M92K230j121j820J739J461k268o78
2176a391K513p1k411O38K258j087j880J569J390j705r48J734L09j712j00J712
2192H18n37j532J088J238j322p15J731Q4j938O00J704j185j554J798J121k021
$$ plain form
2208 -622 -1144 943 1040 -1114 -615 1345 533 -1338 -165 1422 -193 -1452 397 1286 -679 -1167 1052
2225 1052 741 -1298 -386 1367 2 -1148 432 1139 -514 -818 767 545 -829 -203 920 81 -850
2242 -850 161 618 -612 -838 541 459 -863 -191 1103 130 -888 459 1071 -574 -821 850 583
2259 583 -1065 -403 929 -16 -967 171 989 -277 -696 490 582 -649 -447 826 415 -769 58 986
2277 986 -297 -950 503 691 -703 -438 941 259 -960 2 856 -281 -792 409 713 -454 -507 529
2295 529 433 -678 -206 720 64 -790 192 595 -431 -717 450 304 -628 -76 686 12 -440 193 380
2314 380 -361 -154 441 93 -403 90 394 -325 -625 275 383 -558 -366 711 267 -909 -186 867 -111
2333 -111 -928 300 928 -411 -628 521 507 -580 -366 472 85 -613 -339 260 -105 -413 113 506 68
$$ packed form
2208f22n22K087R7k154M99J960q12j871J173J587j615j259J849Q89j965m88K219
2225A052l11k039R12J753j365j150J580P07j653l04J585k22j374O26J123q39r31
2242h50J011M57j230k26J379q2j322O72J294r73j018J347O12j645k47J671k67
2259E83j648O62J332r45r51J138Q18j266m19J186R2j231K02J273m11j184Q27R28
2277I86j283o53J453J88j394K65J379o82j219R62Q54j137n11J201L04j167n3J036
2295E29r6j111M72R26o56q54R82M03j026k86J167j46r32N52P62o74m52O33J87
2314C80p41K07N95l48m96M93L04p19l00R00J08r41J92J077m44j176P23J053r78
2333a11q17J228O28j339k17J149j4j087K14Q38l87o98K74N99l65l08N26L93m38
$$ plain form
2352 68 -73 443 250 -391 -69 273 -321 -511 254 228 -446 -186 428 103 -261 96 350 -32 -232 -31 100
2373 100 -92 -284 31 163 -54 -2 322 91 -103 191 136 -209 -32 427 -9 -381 147 447 -212 -322 334
2394 334 336 -320 -297 150 80 -587 -469 389 329 -324 68 864 408 -404 272 701 -94 -595 124 208 -548 -542 94
2417 94 65 -336 -146 228 169 -174 -123 160 -50 -176 111 295 27 110 389 -48 -309 157 85 -462 -233 277
2439 277 -161 -513 0 302 -77 -147 357 319 -72 -125 182 6 -346 -140 250 -62 -407 153 329 -274 -195
2460 -195 639 261 -467 109 578 -368 -735 81 173 -586 -441 385 238 -387 -125 537 148 -441 69 588
2480 588 -9 -340 300 488 -332 -211 402 -12 -484 16 245 -449 -445 272 15 -334 94 523 96 -68 313
2501 313 259 -205 -149 216 122 -348 -8 341 -292 -630 157 377 -407 -256 722 352 -541 53 659 -77 -491
$$ packed form
2352F8j41N16j93o41L22L42n94j90P65k6o74K60O14l25l64L57K54l82k00K01J31
2373A00j92j92L15J32k17N2L24k31j94K94n5l45J77M59m36l72N28L00o59j10O56
2394C34Ko56K3M47p0o67J18Q58o0o53L92P96m56q12O76M29p95n01P19Q4p56OO36
2417I4k9m01J90L74n9l43N1K83k10j26K87J84k68Q3K79m37k61M66p2n47K29N10
2439B77m38l52N13L02l79p0N04l8l91n3L07j76l52K06L90l12l45N60J76o03P9
2460a95Q34l78p28N76M69r46l67Q16R2p59J45Q26j47o25K62O62l89n89N10N19
2480E88n97l31O40J88q20J21O13m14m72N00K29o94MP17k57l49M28M29m27j64L81
2501C13n4m64N6L65r4m70L40L49o33l38P87K20p84J51R78l70q93N94O06p36m14
$$ plain form
2522 -491 201 503 -325 -495 164 166 -340 -256 283 259 -230 -71 328 9 -215 208 229 -154 83 331 -109 -339
2544 -339 184 33 -466 -206 405 -2 -447 91 362 -190 -456 230 439 -197 -245 420 397 -307 -357 417 124
2565 124 -609 -111 378 -200 -570 238 389 -256 -43 531 85 -436 -11 175 -289 -512 105 233 -208 -194
2585 -194 470 317 -399 -143 549 76 -470 144 438 -327 -429 288 203 -361 -21 338 -22 -299 57 123 -190
2606 -190 -168 207 35 -205 12 400 36 -339 163 508 -252 -418 418 261 -657 -323 409 -105 -493 279
2626 279 586 -62 -230 333 340 -379 -273 235 58 -325 -94 342 22 -296 191 459 -305 -233 391 36 -679
2647 -679 -145 382 -162 -340 482 484 -108 -28 394 137 -400 -130 247 -139 -376 -17 237 -140 -256 285 275
2668 275 -241 77 517 -101 -423 166 205 -448 -221 509 104 -404 145 446 -159 -434 165 299 -373 -418 275
$$ packed form
2522d91O92L02q28j70O59Kn06Q4N39k4m89J59L99l19k24M23K1l83K37K48m40k30
2544c39N23j51m99K60O11m07m45N38K71n52k66O86K09o36m8O65k3p04n0P74k93
2565A24p33M98M89n78l70Q08J51o45K13N74m46n21M25J86m64k23O17J28m41J4
2585a94O64j53p16K56O92m73n46O14K94p65j02P17q5n64L40L59l60k77L56O6l13
2606a90K2L75j72k40K17L88l64l75N02L45p60j66Q36j57r18L34P32n14l88P72
2626B79L07o48j68N63Pp19J06N08j77l83K31M36l20l18M87K68p64P2O24l55p15
2647f79N34N27n44j78Q22Kn92Q0M22k57n37K70L77l86k37L59K54l77j16N41j0
2668B75n16L18M40o18l22N89L9o53K27P30m05n08N49L01o05k75N99J34o72m5O93
$$ plain form
2689 275 183 -467 -225 614 179 -481 197 690 -211 -658 223 420 -576 -400 561 294 -410 -123 470 66
2709 66 -410 -131 359 -23 -355 21 134 -169 -228 165 93 -185 120 145 -214 -116 411 -42 -382 318 574 -352
2731 -352 -479 371 349 -533 -377 530 236 -530 -297 613 180 -639 -22 791 84 -559 244 655 -262 -412
2751 -412 303 215 -365 -69 177 -124 -257 216 62 -246 26 420 50 -286 203 535 -148 -487 333 506
2771 506 -461 -583 436 240 -776 -323 600 68 -584 183 664 -19 -281 266 367 -182 -144 230 29 -318
2791 -318 -63 249 -216 -350 312 171 -382 -199 479 -90 -595 154 633 -196 -372 518 475 -374 -261 444
2811 444 69 -574 -214 433 -96 -478 69 442 -165 -363 333 302 -353 -82 333 -187 -504 170 246 -356 -186
2832 -186 522 111 -384 216 562 -142 -441 266 347 -389 -499 314 143 -628 -296 503 89 -651 14 619
$$ packed form
2689B75r2o50K42Q39m35o60O78M93r01m47Q81J97r96J76R61k67p04K87N93m04
2709F6m76K79M90l82l32L76J13l03n9L93p2k78L05K5l59R8N27m53l40P00K56r26
2731c52j27Q50k2q82J56R07k94p66K33R10m33q19O17Q13p07o43Q03M11r17j50
2751d12P15q8n80K96K46l01j33M73j54l08K72L94l70l36M89L32o83l39Q20J73
2771E06r67j22J019j96j016M53R23n32o52P67M81o83k62N47J01n49L8L74k01l47
2791c18K55L12m65j34O62j41n53J83O78n69n05P49M79q29j76Q90m3q49J13P05
2811D44l75o43L60O47n29l82N47L73o07j98O96l1o55K71M15n20l17O74P6o02J70
2832a86P08m11m95O00L46p04k99P07Q1p36j10Q13j71p71L32P99m14p40O65O05
$$ plain form
2852 619 -204 -556 388 576 -318 -183 662 300 -356 79 347 -82 -345 11 92 -362 -379 117 153 -324 -104
2873 -104 488 115 -229 247 362 -188 -279 360 28 -409 117 357 -187 -250 357 202 -343 -36 410 26 -456
2894 -456 6 324 -210 -476 179 422 -231 -305 517 280 -546 -132 572 -96 -548 207 405 -357 -286 454 246
2915 246 -366 -92 568 10 -454 -58 391 -233 -533 141 413 -325 -352 476 322 -342 -82 496 4 -371
2935 -371 59 188 -206 -132 124 -38 -204 82 62 -154 -95 103 66 -163 0 258 22 -283 118 407 -172
2956 -172 -404 192 193 -345 -221 358 35 -434 -44 244 -85 -112 240 177 -163 -14 227 24 -272 39 256
2977 256 -90 -277 175 262 -300 -223 375 113 -394 -70 420 -143 -377 156 267 -198 -241 160 162 -194 -183 202
2999 202 128 -112 -176 194 102 -142 -65 160 -17 -119 63 78 -19 38 51 -146 70 125 -106 -131 162 -18 -192
$$ packed form
2852F19q23l52R44J88q94J35Q45l62o56M35K68m29k63L56Q1m54j7M96L6m77K20
2873a04N92l73l44M76J15n50r1O39l32m37N26K40n44o3O07j55n45L07M46l84m82
2894d56M62L18n34k66O55K43o53p4Q22k37q26M14P04o68m52P55J98p62P1P40k08
2915B46o12K74O60n58m64L96M49o24l00O74K72p38k7Q28j54o64K60N78m92l75
2935c71M30J29l94P4K56j62j66K86k0k16N9J98l7k29J63K58k36l05M01K89n79
2956a72k32N96Jn38J24N79l23m69L90K88l29k7L52o3l40J49K41k03k96L11K17
2977B56l46j87M52Q7n62P7N98k62n07L24M90n63k34N33J11m65m3M01Kl56J1L85
2999B02p4k40o4L70r2k44P7K25j77j02J82J5r7N7J3j97K16N5k31k5K93j80j74
$$ plain form
3022 -192 -50 142 -9 -146 -29 200 86 -61 11 182 50 -200 12 167 -29 -157 104 13 -204 -70 139
3043 139 -94 -66 28 55 -41 28 93 16 -12 43 25 20 64 1 100 -58 -108 -29 124 -169 -144 90 1 -127 13 112 -130
3070 -130 -116 53 30 -66 -47 21 63 36 -36 59 160 106 -80 59 120 -94 -169 32 0 -147 -57 -126 -7 133 -123
3095 -123 -174 157 144 -166 -83 90 76 -134 -12 190 69 34 -81 34 219 -4 -254 50 105 -143 -246 29
3117 29 21 -123 -63 32 100 58 -2 -11 236 134 -107 -1 244 63 -126 -30 176 -6 -120 -102 122 112 -210 -128 143
3142 143 146 -248 -60 199 64 -148 90 227 -44 -120 104 146 78 -151 -13 199 18 -204 -29 243 -7 -296
3164 -296 19 130 -59 -159 129 91 -53 -89 19 160 89 -115 6 158 132 -115 -56 131 -102 -115 -44 43 51
3187 51 -98 -32 86 128 -76 -49 184 17 -151 32 124 -86 -39 99 2 -115 65 80 -56 -14 82 46 -34 -125
$$ packed form
3022a92J42J92j51j37J17K29j14j47P2J71j32k50K12J55j96j28K61r1k17J34K09
3043A39k33K8R4K7r6O9O5p7k8N5j8nM4o3R9j58n0P9J53k93K5K34q9j28J40R9k42
3070a30J4J69k3r6J9O8M2k7p2R5J01n4j86J39O1k14p5K01l2j47R0o9J19J40k56
3095a23n1L31j3l10Q3J73j4k10J22K02j21l5j15J15J85k23k50L04N5k48j03K75
3117B9qj44O0R5O8m2o0rK47j02k41J06K45j81j89R6K06j82j14J8K24j0l22Q2K71
3142A43Ll94J88K59j35k12K38J37k71p6K24M2o8k29J38K12j81k22J75K72k50k89
3164b96L15J11j89j00K88l8j44l6J08J41p1k04J21J52k6k47N9J87k33j3P1Q7Q
3187E1j49O6J18M2k04K7K33j67j68J83R2k10M7J38r7j17J80J5j36M2R6l6q0r1
$$ plain form
3211 -125 18 148 -168 -240 100 108 -246 -116 230 79 -216 42 190 10 -159 2 112 -20 -78 -3 66 -3
3233 -3 -48 -68 110 110 -79 67 63 84 79 -43 -54 66 87 -158 -102 234 6 -305 -17 260 -60 -222 117 199 -42
3258 -42 -67 88 101 -37 -89 94 218 -29 -155 141 49 -92 -75 76 -117 -104 67 -84 -147 169 108 -209 -20
3281 -20 283 36 -246 37 363 -49 -365 43 279 -86 -462 -34 342 -118 -342 218 387 -279 -256 294 182
3302 182 -266 -204 226 94 -155 42 199 109 4 -85 33 0 -99 -75 -37 -64 84 16 -62 33 208 -73 -208 158
3326 158 132 -266 -265 212 119 -284 -128 298 -15 -269 -20 208 -6 -265 -50 127 -105 -175 84 128 -111 -59
3348 -59 215 3 -127 104 216 -172 -49 263 -28 -311 33 297 -116 -288 203 363 -132 -323 188 328
3368 328 -289 -303 201 203 -307 -88 380 147 -178 82 364 -12 -183 68 -11 -139 16 61 -113 -79 136 53
$$ packed form
3211a25J43J30l16p2L40Ql54J30L46j51k95K58J48j80j69J61J10j32n8P5O9o9
3233cm5k0J78%j89J46mK1nj22j1J20K1k45N6L36k28l11K88K77l20j62L39Q2k41
3258d2k5J55J3j38n2J83J24k47j26K96r2j41J7J51j93J3J71j51o3L16o1l17J89
3281b0L03k47k82K83L26m12l16M08K36l65l76M28L76m60k24N60J69o66K3N50j12
3302A82m48O2M30j32k49J97J57r0j05q9J18l3r9K4L8k7J48o8p8R5J75k81j35L66
3326A58k6l98JM77r3m03J56M26l13k54K49K28k14k59K15J77k32p0K59M4k39N2
3348e9K74k12j30K31J12l88J23L12k91k83L44K64m13j72M91J60m95j91N11J40
3368C28o17j4N04Kn10K19M68k33l25K60K82l76j71K51p9j28J55M5j74L4K15q3
$$ plain form
3390 53 -100 18 230 42 -165 4 300 -16 -229 149 308 -186 -173 205 115 -375 -26 210 -112 -200 176
3411 176 101 -206 -57 307 58 -221 137 355 12 -265 64 343 -218 -418 255 282 -437 -282 457 146 -378
3432 -378 -67 494 21 -367 123 284 -128 -180 85 215 -88 -108 130 119 -235 -74 143 -114 -159 178 118 -124
3454 -124 105 220 -171 -219 146 56 -294 -150 244 1 -235 -22 255 -32 -286 96 216 -143 -125 247 214
3475 214 -203 -96 274 25 -266 20 177 -251 -272 144 181 -305 80 370 14 -230 90 296 -109 -355 51
3496 51 214 -204 -269 194 205 -331 -107 346 176 -302 31 393 -20 -131 184 181 -171 -78 36 -61 -218 26
3518 26 8 -228 -134 49 113 -164 -75 157 76 -115 223 358 -8 -85 314 137 -350 -126 178 -221 -416 102
3540 102 229 -181 -187 380 190 -207 -69 271 22 -356 -13 310 -18 -283 234 396 -174 -264 327 160 -389
$$ packed form
3390E3j53J18K12j88k07J69K96l16k13L78J59m94J3L78r0m90L49K36l22q8L76
3411A76p5l07J49L64k49k79L58K18l43k77L29K79n61k00O73K7p19J55P39l11n24
3432c78L11N61m73l88M90J61m12n2K65J30l03k0K38j1l54J61K17k57m5L37o0k42
3454a24K29J15l91m8L65r0l50J44L94k43k36K13K77k87k54L82J20l59J8L72l3
3475B14m17J07L70k49k91K86J57m28k1M16L7m86L85K90l56k44L20K06m05k46M06
3496E1J63m18o5M63J1n36K24M53j70m78L33L62m13j11L15ll52R3J14r7j57K44
3518B6j8k36R4J83O4k77Q9K32q1j91L38J35l66p7L99j77m87K24L04l99j95N18
3540A02J27m10oN67j90l97J38L40k49l78L43L23l28k65N17J62n70r0N91j67n49
$$ plain form
3561 -389 -83 341 -39 -260 134 144 -200 -182 173 95 -217 14 141 -66 -264 44 176 -168 -195 217 180 -187
3583 -187 24 363 6 -236 136 160 -323 -307 143 -138 -307 -56 304 -64 -70 291 267 -125 -135 205 70 -283
3605 -283 -170 293 28 -262 153 326 -245 -207 165 25 -416 -99 255 -67 -230 230 243 -69 -25 296 65
3626 65 -297 -28 184 -2 -305 52 287 -117 -270 172 206 -243 -83 325 121 -220 140 279 -137 -191 145
3647 145 100 -154 38 169 43 -56 64 150 -81 -192 154 173 -176 -172 290 93 -200 123 363 -37 -287 110
3669 110 103 -276 -153 127 36 -129 21 142 -8 -83 -4 79 -62 -80 35 78 -106 78 148 -74 -139 151 64 -297
3693 -297 -152 230 51 -186 133 310 -96 -136 128 84 -111 -84 97 64 -147 7 131 -38 -149 26 79 -101
3715 -101 -133 207 22 -219 99 336 -11 -204 214 193 -231 -162 182 118 -191 -134 188 83 -236 -99 230 38
$$ packed form
3561c89L06M24l80k21L94J0l44J8L55p8l12K31J27k07j98L08J32l44k7M12l7l67
3583a87K11L39l57k42L72K4m83J6M50k81j69K51L60l68oL61k4l92j0L40j35l53
3605b83J13M63k65k90M15J73n71L8L72j40m41L17L54l22j63M60J3l12M4L21k31
3626F5l62K69K12j86l03L57K35m04j53M42L4m49J60M08k04l41L60J39m16n4L36
3647A45m5k54J92J31j26r9J20Q6k31j11L46J9l49MM62j97k93L23K40m00k50L97
3669A10pl79J23K80r1j65J50J21j50p5P9Q3j41j8J15M3j84J84P0k22o5K90q7l61
3693b97J45L82j79k37L19J77m06m0K64m4j95K7J81l3k11J54J24j69j11J75N3j80
3715a01l2L40j85k41L18K37l47j93M18k1m24O9L44o4l09N7L22j05l19J37L29j92
$$ plain form
3737 38 -238 38 322 -2 -242 22 65 -186 -155 28 -56 -112 30 -21 -3 176 150 2 11 139 32 -158 -68 92
3761 92 7 -55 4 128 10 -146 -16 48 -193 -117 128 62 -100 199 434 57 -95 210 152 -202 -104 70 -39
3784 -39 -298 -143 117 -55 -230 18 240 16 -260 91 328 -30 -193 235 205 -228 -85 161 21 -190 -81
3805 -81 144 0 -70 26 158 47 -166 -114 76 -18 -92 36 105 -30 52 85 -17 -99 -31 -82 -95 90 11 1 147
3830 147 220 -20 -19 179 28 -235 -234 -34 -143 -244 -107 116 120 -99 3 236 81 -232 82 212 -30 -169
3852 -169 186 196 -174 -150 102 -1 -227 -130 -31 -2 -207 -15 97 121 -149 6 138 54 -38 141 223 -66 3
3875 3 137 33 -105 -35 -61 -162 -65 111 64 41 138 83 96 35 -39 3 -45 -182 -70 56 -100 -33 50 80 -40 21
3901 21 89 -84 15 41 -65 -21 126 68 -56 27 113 -119 -189 -58 39 -94 -108 47 173 10 -115 90 172 -109
$$ packed form
3737C8k76K76K84l24k40K64M3k51L1J83q4n6J42n1J8J79k6j48RJ28j07j90R0J60
3761I2q5o2N9J24j18j56J30O4k41P6K45o6j62K99K35l77j52L05n8l54R8J74j09
3784c9k59J55K60j72j75K48K22k24k76L51K37l58j63M28l0m33J43K46j40k11J09
3805h1K25j44p0R6J32j11k13N2J90r4p4J28O9j35Q2L3j02q2O8n1j3J85p9j0J46
3830A47P3k40JJ98j51k63JK00j09j01J37K23Mk19J02K33j55l13L14J30k42j39
3852a69L55J0l70K4K52j03k26R7R9K9k05J92J12K4k70J55J32q4r2J79Q2k89O9
3875CJ34j04j38P0k6j01R7J76m7k3R7n5J3o1p4M2m8j37J12J26j56O7Q3L0j20O1
3901B1O8j73R9K6j06M4J47n8j24Q3Q6k32p0J31R7j33j4J55J26j63j25K05Q2k81
$$ plain form
3925 -109 -298 152 141 -171 -73 254 76 -211 -65 110 -44 -152 -21 48 24 -41 89 172 38 -62 118 11
3947 11 -190 -27 151 -72 -176 104 100 -127 -74 151 78 -102 -117 135 111 -64 -92 87 103 -165 -195 41 63 -138
3971 -138 -37 30 133 -32 -54 31 70 -66 -196 -78 163 -28 -129 66 329 63 -200 55 59 -229 -249 10
3993 10 101 -47 -126 169 228 -22 -53 149 109 -204 -74 204 -79 -196 111 199 -133 -83 151 59 -139 -100 107
4016 107 -26 -168 -10 159 69 -125 -4 199 23 -200 37 157 -10 -125 109 69 -194 -108 7 -21 -45 -23
4038 -23 51 151 89 8 47 96 -64 -110 -89 0 -46 -43 -6 88 159 13 -60 95 116 -175 -127 84 -36 -193 75 200
4064 200 -81 -42 107 117 -55 -140 66 60 -55 -37 167 177 -167 -67 224 6 -259 70 130 -131 -158 167 53
4087 53 -195 -111 96 51 -113 -48 166 157 -128 -6 216 99 -199 37 111 -92 -100 13 59 -15 55 -6 -84 111 17
$$ packed form
3925a09j89M50j1l12R8L27j78k87J46J75j54j08J31O9k4o5J30Q3j34j00J80j07
3947A1k01J63J78k23j04K80mk27N3K25p3j80j5K52k4j75k8J79J6k68l0K36K2k01
3971a38J01O7J03j65k2Q5L9j36j30J18K41j91j01J95K63k66k63K55Mk88k0K59
3993A0R1j48p9K95N9k50l1K02m0l13J30K78k83j17L07Q8l32N0K34r2j98L9K07
4016A07j33j42J58J69r0j94J21K03j76k23K37J20j67j15K34m0k63Q6J15k8k4K2
4038b3P4J00o2q1L9M9j60m6K1Q9m6LL7R4P1j46p3J55K1k91M8K11j20j57K68J25
4064B00k81L9J49J0j72q5K06oj15J8K04J0l44J00K91k18k65L29O0k61k7L25j14
4087E3k48Q4K07m5j64O5K14rk85J22K22j17k98K36P4k03qJ13M6p4P0o1p8J95r4
$$ plain form
4112 17 -109 -68 120 25 -104 42 243 71 -30 32 105 -109 -232 -39 133 -85 -190 168 171 -109 -111 168 15
4135 15 -245 -20 218 -29 -165 49 143 -55 -122 75 78 -147 -122 133 111 -101 23 230 54 -89 -17 196 -105
4158 -105 -229 77 -38 -70 57 181 32 -38 78 -12 -82 -74 85 124 -79 -21 108 55 -118 44 55 -78 -106 65
4182 65 96 -119 39 192 3 -103 135 134 -181 -64 97 34 -186 -3 105 -59 -140 -76 79 -46 -114 72 150
4205 150 -56 13 254 102 -134 79 32 -176 -158 91 29 -299 34 270 -66 -170 55 139 -111 -198 68 142
4227 142 -116 -67 169 148 -89 -28 179 -21 -270 -39 78 -159 -120 125 34 -117 35 159 -37 -85 117 61
4249 61 -10 -3 128 135 -138 -55 141 -62 -173 17 186 -66 -151 201 141 -152 -71 115 -38 -191 -81 96 -30
4272 -30 -6 88 77 59 104 11 27 -33 -60 7 -93 -41 140 85 -130 72 210 -149 -223 79 129 -259 -110 250 177
$$ packed form
4112A7j26M1J88r5j29J46K01j72j01O2P3k14j23J93J72k18j05L58Lk80kK79j53
4135A5k60K25K38k47j36K14R4j98o7J97Lk25K5K55k2k12J24K07j76j43P2K13l01
4158a05j24L06j15l2J27J24j49p0J16r0p0QJ59L9k03N8J29n3j73J62J1j33k8J71
4182F5L1k15J58J53j89j06K38jl15J17J61o3k20J83J08j64q1O4J55j25o8J86P8
4205A50k06O9K41j52k36K13m7k08J8K49o2l28L33K36l36j04K25Q4k50q7K66P4
4227A42k58M9K36k1k37O1K07k00k49K31J17k37L9K45r1j51J52J24j96m8K02n6
4249F1p1PJ31Pk73Q3J96k03j11J90J69k52q5L52o0k93Q1J86j53j53J10J77j26
4272c0K4R4j1j8M5r3J6o0k7O7j00N2J81n5k15K02J38l59p4L02N0l88J49L60p3
$$ plain form
4297 177 -119 -50 246 85 -198 -2 158 47 -146 30 186 6 -196 98 104 -187 -118 130 -15 -142 99
4318 99 145 -28 -105 164 10 -172 5 48 -20 -29 24 139 -21 -38 71 51 -113 -83 27 66 -88 -12 159 -5
4342 -5 -24 80 -26 -136 0 91 -70 -36 149 46 -68 28 88 32 -108 -59 58 -27 -148 52 205 -51 -83 90
4366 90 25 -147 -69 128 4 -123 46 198 -136 -64 52 38 -129 -60 62 15 -130 -57 93 107 -90 65 142
4389 142 -12 -134 62 91 -128 -10 176 23 -134 46 100 -10 -139 17 22 39 -43 56 107 79 -63 28 77 -72
4413 -72 -81 1 -33 52 45 7 63 157 -22 -99 34 126 -72 -126 128 118 -12 -99 159 113 -148 -39 44 23 -147 -122 114
4440 114 76 -134 -23 114 0 -111 35 154 -43 -3 164 104 -43 8 73 -20 -114 17 -20 -25 -95 -57 89 -14
4464 -14 -27 73 40 -72 -52 132 60 -81 104 142 -4 -20 75 21 -101 8 -25 -41 -23 -46 13 37 -44 -57 28 -27
$$ packed form
4297A77k96O9K96j61k83J96J60j11j93J76J56j80k02K94Ok91O9K48j45j27K41
4318I9M6j73p7K69j54j82J77M3o8rN3J15j60j7J09k0j64L0J10L9j54P6J71j64
4342ej9J04j06j10J36R1j61L4J85j03j14R6O0n6j40M9J17q5j21K00J53k56l2J73
4366I0o5j72P8J97j24j27J69J52l34P2J16j4j67O9J22m7j45P3J50J4j97J55P7
4389A42j54j22J96K9k19J18J86j53j57J80N4j10j29J56NJ7q2R9N1k8j42R1M9j49
4413g2rQ2l4Q5pl8N6R4j79p7J33R2j98n4K54j0j30q7K58m6k61J09Q3k1j70K5K36
4440A14l8k10J11J37j14j11J46J19j97M0J67o0j47N1O5r3r4J31l7np0L8J46j03
4464a4j3J00l3j12K0J84p2j41J85L8j46j6R5n4j22J09l3j6J8k3N9K4q1j3Q5n5
$$ plain form
4490 -27 -93 -106 12 7 31 62 -26 85 33 4 -37 60 -2 -100 12 80 -37 -96 86 42 -83 -130 -36 21 -92 -57 95
4517 95 122 0 5 245 95 -97 -81 160 46 -143 72 152 -44 -89 54 75 -129 -117 -72 -4 -115 -30 142 154
4541 154 -71 7 138 22 -76 16 82 -35 -12 37 63 8 64 68 -6 5 -88 -131 16 -32 -94 20 144 46 -170 19
4567 19 116 27 -60 -18 168 99 -63 -22 169 -40 -204 -62 224 -143 -183 55 132 -72 -154 67 103 -108 -118 23
4591 23 34 -20 -69 135 125 0 -6 79 -5 -91 -87 -4 -109 -31 71 -2 -46 42 -29 -87 -73 -44 15 -43 5 13 67 -8 -102 -64
4621 -64 64 -1 -74 -47 22 60 47 -98 84 147 -23 -159 64 181 -61 -181 148 132 -118 -73 102 98 -125 -93
4645 -93 12 72 -101 -75 141 109 -60 -31 101 30 -130 7 11 -12 -87 55 -35 16 61 12 -25 43 -8 -34 20 -21 16
4672 16 58 -45 50 82 17 -105 6 27 -35 -55 150 119 -62 -9 13 -10 -35 -23 -94 -9 84 17 -5 83 114 -99 -86
$$ packed form
4490b7o6j3J18nK4L1q8J11n2k9m1R7o2r8J12O8j17n9J82m4j25m7R4N7j13L5J52
4517I5K7j22NK40j50j92J6K41j14j89K15Q0j96m5J43K1k04J2M5O8j11Q5J72J2
4541A54k25P8J31j16r8R2O6j17K3M9K6n5N6Mp4J1r3m3J47m8o2J14J24r8k16J89
4567A9R7q9q7M2J86o9j62M1J91k09j64J42K86l67m0K38P7k04q2K21L6k11j0J41
4591B3J1n4m9K04j0j25oQ5q4q6MQ3j05P8J02p3m4Q8p1n8J4K9N9n8M8QN4p5r4L8
4621f4J28o5p3K7O9L8j3j45J82O3j70j36K23J17k42j20L29j6k50M5J75mk23L2
4645i3J05O0j73K6K16l2j69K9J32p1j60J37Mk3p5J42r0N1M5m9l7O8n1k6N4m1L7
4672A6M2j03R5L2o5j22J11K1o2k0K05l1j81N3K2k3k5J2p1Q5R3o7k2Q8L1k13J3
$$ plain form
4699 -86 -12 -18 -61 -48 93 75 21 -95 35 195 -99 -109 74 24 -157 -138 123 22 -55 41 114 32 -89 -16 1 -32
4725 -32 -53 -8 82 50 -103 50 56 -83 -17 -3 -9 -40 37 -10 -40 40 26 -94 -34 -9 -76 36 59 77 89 93 67 22 24 -72
4755 -72 -130 -88 -5 -145 -53 22 43 -16 59 -4 -4 -21 -10 -39 39 5 -21 81 86 -31 -2 89 -62 -146 -34 -83 -73 13 34
4784 34 56 57 17 99 -31 37 24 -8 49 59 -2 1 8 -24 -64 16 35 -10 -16 -21 64 62 9 -16 39 -84 -63 11 30 -88 -31 97
4816 97 76 -21 36 90 31 -54 -43 22 38 -51 -100 114 96 -99 5 90 -11 -111 -3 -2 -124 57 101 104 30 53 38
4843 38 -11 -68 -49 23 -39 -73 -39 8 -71 -80 -2 -35 -137 -21 50 -14 20 78 27 -30 15 87 -25 -32 -24 -161 -24 10 -30
4872 -30 -68 37 88 38 -25 -5 68 -12 -43 114 176 -67 -149 50 125 -126 -151 85 17 -166 2 123 43 -55 21 118
4898 118 44 -60 -10 87 36 -86 18 93 3 -129 13 13 -91 -63 1 31 83 77 40 38 106 -12 -68 34 -53 -46 3 25
$$ packed form
4699h6P4om3J3J41j8n4j16J30J60k94j0J83n0j81J9K61j01p7R6P3q2j21P3J7l3
4725c2k1M5R0l2j53J53Oj39O6J4ol1P7m7l0Q0j4j20O0K5o7J12K3J8J2Mk6m5Kr6
4755g2n8M2Q3j40R2P5K1n9P5o3%j7J1k9P8l4k6J02Nj17K9R1j51q4J12m9J0Q6K1
4784C4K2Jm0Q2j30O8j3l2N7J0o1LPl2m0Q0J9m5onQ5kn3k5N5j23K1P4J9j18N7J28
4816I7k1r7N7N4n9q5J1O5J6q9m9K14j8j95J04Q5j01j00J08Jj22J81M4Lp4K3j5
4843C8m9n7J9P2o2l4L4M7p9rP8l3j02J16P1o4L4N8n1n7M5P2j12pQj37J37L4m0
4872c0l8J05N1n0o3K0P3q0l1J57O2k43q2J99P5k51k5K36o8j83J68J21q0r8P6R7
4898A18p4j04N0R7n1j22J04P5r0j32J42%j04K8O4L0N2ol7kO8j18n6J02q7PM9K2
$$ plain form
4926 25 55 48 110 111 -4 55 40 -27 15 -26 -2 -8 -40 -121 59 94 -82 -37 43 10 -144 -38 99 -52 61 62 88 83 -13
4955 -13 5 80 26 -43 -12 83 -79 -106 -4 41 -73 -19 63 45 -10 124 91 70 90 37 64 -32 -102 -93 94 -38 -22 105
4983 105 138 31 9 42 0 -138 17 45 -118 7 45 91 51 -10 4 -10 -19 -65 -51 23 -41 -39 112 -2 -8 -14 -1 -43
5011 -43 31 33 23 -24 -18 10 -54 -50 10 -34 -45 100 90 38 8 57 36 6 -25 49 -57 -87 -89 124 -20 -107 72 97 11 -59
5041 -59 94 -5 -102 -14 62 -37 -8 -9 69 65 9 -18 30 14 -110 -64 34 -72 5 5 88 -14 38 -25 -129 37 24 -27 -43
5070 -43 71 25 -84 -22 87 -17 -59 -85 56 69 -43 -89 123 42 -112 76 141 -12 -63 55 38 -94 29 86
5094 86 0 -59 -12 -2 8 -100 -21 95 53 -23 9 127 73 -32 40 82 -58 -102 48 -140 -27 -5 8 -20 -30 26
5120 26 -35 95 98 -93 6 125 52 -87 -91 81 16 -158 -131 78 18 -181 -67 120 -17 -115 -18 151 -52 -126 39
$$ packed form
4926B5L0pO2Jj15N9j5o7M2m1K4ol2q1J80L5j76M5Q0l3j54J06J37j51J13JK6nr6
4955a3J8P5n4o9L1R5j62k7J02M5j14N4Q2j8n5J34l3k1K0n3K7r6p0RJ87j32J6J27
4983A05L3j07k2L3m2j38J55K8j63J25L8M6m0o1J4j4rm6J4P4o4KJ51j14ooJ3m2
5011d3P4Kj0m7OK8o4MO0m4j1J45j0n2l0M9k1l0l1P4j06l0kK13j44q7J79K5q6p0
5041e9J53r9r7Q8P6r9K9jP8mn6k7M8j6j24M6R8j06P7%Q3j02N2o3j04J66j3n1j6
5070d3J14m6j09O2J09j04m2k6J41J3j12m6K12q1j54J88O5j53n1J18j7j32J23N7
5094H6q6n9M7J0J0j08P9J16m2p6L2J18n4j05P2M2j40m4J50j88J13K2J3k8j0N6
5120B6o1J30Lj91R9J19p3j39mJ72o5j74K7K09o0j99J14J87j37r8R7J69k03p4J65
$$ plain form
5145 39 191 -9 -78 95 109 -35 -30 33 30 -126 -162 -56 65 -4 -7 35 60 42 -13 137 16 -48 -59 -53 -40 51 -132
5172 -132 -35 106 -30 -60 44 122 9 -49 35 50 -156 9 21 40 -36 -122 5 74 -18 -11 169 33 -88 50 138
5197 138 -65 -73 59 61 -67 20 143 39 -14 -29 -7 -57 -108 -132 -59 11 -61 -18 139 193 50 87 132 90 27 -48 -13
5224 -13 49 -115 -117 107 133 -75 -104 70 72 -90 -8 114 77 -97 -24 98 2 -60 51 67 -25 -47 -1 111 -69 -57
5250 -57 52 84 -105 -4 107 -27 -84 45 42 -17 14 25 -51 -105 -38 -77 11 -14 5 58 64 65 43 123 74 -11 22 9 -28
5279 -28 -89 -47 -84 -42 6 13 -12 25 1 -95 62 47 -9 -30 104 13 -44 -21 95 -21 -151 -85 90 61 -110 -94 133
5306 133 49 -117 -1 82 2 -38 89 89 69 61 39 55 29 14 -76 -85 51 81 14 29 80 102 2 -30 19 79 -43 -82
5334 -82 124 -7 -157 -63 68 -70 -74 -11 42 -36 -51 108 -37 0 45 56 -26 16 -16 -8 -22 -22 33 -23 -81 -51 111 -42
$$ packed form
5145C9J52k00o9J73J4j44NO3lj56l6J06J21o9lM2K5j8n5J50j21o4j1OJ3R1j83
5172a32R7J41j36l0J04P8j13n8Q4J5k06J65J2J9p6q6J27O9r2PJ80j36j21J38Q8
5197A38k03qJ32Kj28Q7J23j04n3j5K2n0n1k4P3P0p2M3J57N4j43L7M5m2o3p5L5
5224a3O2j64kK24K6k08k9J74Kj62Q2J22l7j74P3J22r6o2J11J6r2k2M6J12j80J2
5250e7J09L2j89J01J11j34n7J29ln9L1J1p6n4O7l9Q8k5J9N3OJk2Q0m9q5L3j3l7
5279b8o1M2l7M2M8Pk5L7k4r6J57j5n6k1J34r1n7K3J16j16j30O6J75k9j71J6K27
5306A33q4j66J16Q3q0m0J27%k0qk2J6k6j5r0rJ36L0o7J5N1K2j00l2M9O0j22l9
5334h2K06j31j50R4J31j38mO3N3p8j5J59j45L7M5J1q2M2l2Qj4%N5n6n8L0J62j53
$$ plain form
5362 -42 -86 26 33 -114 -59 59 11 -63 96 143 -10 -64 49 -3 23 -58 -13 -5 24 20 88 9 -31 35 3 -21 -80 98
5390 98 8 -67 16 95 -10 -57 50 62 -2 -49 67 -15 -54 7 24 -88 -47 -68 7 38 7 -12 18 -6 18 59 -8 -22
5418 -22 -68 30 -20 48 58 -34 -12 122 127 -55 -12 16 -60 -33 -44 22 9 -70 13 115 3 4 7 56 -67 -41 17 21 -35 76
5448 76 90 -3 -14 119 30 -135 -33 24 -46 -76 29 77 2 -30 17 96 14 33 12 61 28 -42 66 94 -81 21 24
5475 24 -47 -34 -3 -75 -41 25 -41 -71 34 26 -78 9 44 -39 -36 28 98 25 18 40 81 4 -86 -36 30 -69 -116 59 55 -52
5505 -52 -26 120 40 -114 11 97 -52 -15 -37 49 9 11 34 77 29 -121 4 26 -47 10 34 -18 -43 -16 27 -39 54 -33
5533 -33 -34 32 13 -36 85 125 27 -75 78 81 -106 -120 -5 71 -93 -136 -22 27 28 -144 23 162 -29 -48 126 69
$$ packed form
5362d2m4J12Pj47N5J18m8p4J59M7j53n4J13n2K6q1M5QK9mO8p9m0O6l2k4n9J78
5390I8r0p5Q3P9j05m7J07J2o4m7J16q2l9O1J7j12M1k1P5L1l1j9L0k4K4M1o7j4
5418b2m6R8n0O8J0r2K2J34Nj82M3K8p6K7j1O6j3p9Q3J02j12JLM9j23K6N8Mn6J11
5448G6J4r3j1J33q9j65J02N7p0l0J05M8p5l2M7P9q2J9k1M9l3p0J08K8j75J02L
5475B4p1J3L1p2L4O6o6l0J05qj04Q7L5q3LO4P0p3pK2M1p7r0N0O6r9m7J75mj07
5505e2K6J46q0j54J25Q6j49L7k2Q6m0KK3M3m8j50J25K2p3N7K4n2k5K7M3o6R3q7
5533c3jO6j9m9J21M0r8j02J53Lj87j4J15P6j64m3J14M9Jj72J67J39j91j9J74n7
$$ [...]
8191A1
##END NTUPLES=NMR FID
##END=
