##TITLE=1H_CA-8647-2
 CDcl3, 8 sc, 
 19.9.2019
##JCAMPDX= 6.0         $$ Bruker NMR JCAMP-DX V2.0
##DATA TYPE= NMR FID
##DATA CLASS= NTUPLES
##ORIGIN= UXNMR, Bruker Analytische Messtechnik GmbH
##OWNER= root
$$ XWIN-NMR		Version 3.5
$$ Thu Sep 19 14:10:17 2019 Russian Standard Time (UT+4h)  she@DPX200
##.OBSERVE FREQUENCY= 200.1315
##.OBSERVE NUCLEUS= ^1H
##.DELAY= (6, 6)
##.ACQUISITION MODE= SIMULTANEOUS
##.ACQUISITION SCHEME= undefined
##.AVERAGES= 8
##.DIGITISER RES= 18
##SPECTROMETER/DATA SYSTEM= spect
##.PULSE SEQUENCE= zg30
##.SOLVENT NAME= CDCl3
##.SHIFT REFERENCE= (INTERNAL, CDCl3, 0, 15.7039)
##AUDIT TRAIL= $$ (NUMBER, WHEN, WHO, WHERE, WHAT)
$$ ##TITLE= Audit trail, XWIN-NMR		Version 3.5
$$ ##JCAMPDX= 5.01
$$ ##ORIGIN= Bruker BioSpin GmbH
$$ ##OWNER= she
$$ F:/spectra/data/she/nmr/H-F/1/audita.txt
$$ ##AUDIT TRAIL=  $$ (NUMBER, WHEN, WHO, WHERE, WHAT)
(   1,<2019-09-19 14:09:08.76 +0400>,<she>,<DPX200>,
      <created by zg, POWCHK disabled, PULCHK disabled
       configuration hash MD5:
       00 E9 B6 7A A2 85 ED C7 34 08 36 98 17 FE 4E 26
       data hash MD5: 16K
       35 C8 C8 EA D1 23 A7 C6 8A 02 DC 00 7F 55 91 42>)
$$ ##END=
$$ 
$$ hash MD5
$$ FA 6F 82 58 45 BC 68 A1 41 BC DD 26 BC EF 7E E4
##$RELAX= 
##$RELAX= 
##$RELAX= 
##$RELAX= 
##$RELAX= 
##$RELAX= 
$$ Bruker specific parameters
$$ --------------------------
##$DU= <F:/spectra>
##$EXPNO= 1
##$NAME= <H-F>
##$PROCNO= 1
##$TYPE= <nmr>
##$USER= <she>
##$AMP= (0..31)
100 100 100 100 100 100 100 100 100 100 100 100 100 100 100 100 100 100 
100 100 100 100 100 100 100 100 100 100 100 100 100 100 
##$AQSEQ= 0
##$AQ_mod= 1
##$AUNM= <au_zg>
##$AUTOPOS= <>
##$BF1= 200.13
##$BF2= 200.13
##$BF3= 200.13
##$BF4= 200.13
##$BF5= 200.13
##$BF6= 200.13
##$BF7= 200.13
##$BF8= 200.13
##$BYTORDA= 1
##$CFDGTYP= 0
##$CFRGTYP= 5
##$CHEMSTR= <none>
##$CNST= (0..31)
1 1 145 1 1 1 1 1 1 1 1 1 1 1 1 1 1 1 1 1 1 1 1 1 1 1 1 1 1 1 1 1 
##$CPDPRG= <>
##$CPDPRG1= <>
##$CPDPRG2= <>
##$CPDPRG3= <>
##$CPDPRG4= <mlev>
##$CPDPRG5= <mlev>
##$CPDPRG6= <mlev>
##$CPDPRG7= <mlev>
##$CPDPRG8= <mlev>
##$CPDPRGB= <>
##$CPDPRGT= <>
##$D= (0..31)
0 1.2 0 0 0 0 0 0 0 0.06 0 0.03 0 0 0 0 0.0002 0 0 0 0 0 0 0 0 0 0 0 0 
0 0 0 
##$DATE= 1568887748
##$DBL= (0..7)
120 120 120 120 120 120 120 120 
##$DBP= (0..7)
150 150 150 150 150 150 150 150 
##$DBP07= 0
##$DBPNAM0= <>
##$DBPNAM1= <>
##$DBPNAM2= <>
##$DBPNAM3= <>
##$DBPNAM4= <>
##$DBPNAM5= <>
##$DBPNAM6= <>
##$DBPNAM7= <>
##$DBPOAL= (0..7)
0.5 0.5 0.5 0.5 0.5 0.5 0.5 0.5 
##$DBPOFFS= (0..7)
0 0 0 0 0 0 0 0 
##$DE= 6
##$DECBNUC= <off>
##$DECIM= 24
##$DECNUC= <off>
##$DECSTAT= 4
##$DIGMOD= 1
##$DIGTYP= 9
##$DL= (0..7)
0 120 120 120 120 120 120 120 
##$DP= (0..7)
150 150 150 150 150 150 150 150 
##$DP07= 0
##$DPNAME0= <>
##$DPNAME1= <>
##$DPNAME2= <>
##$DPNAME3= <>
##$DPNAME4= <>
##$DPNAME5= <>
##$DPNAME6= <>
##$DPNAME7= <>
##$DPOAL= (0..7)
0.5 0.5 0.5 0.5 0.5 0.5 0.5 0.5 
##$DPOFFS= (0..7)
0 0 0 0 0 0 0 0 
##$DQDMODE= 0
##$DR= 18
##$DS= 0
##$DSLIST= <SSSSSSSSSSSSSSS>
$$ [...]
##$SUBNAM2= <"">
##$SUBNAM3= <"">
##$SUBNAM4= <"">
##$SUBNAM5= <"">
##$SUBNAM6= <"">
##$SUBNAM7= <"">
##$SUBNAM8= <"">
##$SUBNAM9= <"">
##$SW= 24.0689530833862
##$SWIBOX= (0..15)
0 0 2 0 0 0 0 0 0 0 0 0 0 0 0 0 
##$SW_h= 4816.95568400771
##$TD= 16384
##$TD0= 1
##$TE= 0
##$TE2= 300
##$TE3= 300
##$TEG= 300
##$TL= (0..7)
0 120 120 120 120 120 120 120 
##$TP= (0..7)
150 150 150 150 150 150 150 150 
##$TP07= 0
##$TPNAME0= <>
##$TPNAME1= <>
##$TPNAME2= <>
##$TPNAME3= <>
##$TPNAME4= <>
##$TPNAME5= <>
##$TPNAME6= <>
##$TPNAME7= <>
##$TPOAL= (0..7)
0.5 0.5 0.5 0.5 0.5 0.5 0.5 0.5 
##$TPOFFS= (0..7)
0 0 0 0 0 0 0 0 
##$TUNHIN= 0
##$TUNHOUT= 0
##$TUNXOUT= 0
##$USERA1= <user>
##$USERA2= <user>
##$USERA3= <user>
##$USERA4= <user>
##$USERA5= <user>
##$V9= 5
##$VALIST= <valist>
##$VCLIST= <CCCCCCCCCCCCCCC>
##$VD= 0
##$VDLIST= <DDDDDDDDDDDDDDD>
##$VPLIST= <PPPPPPPPPPPPPPP>
##$VTLIST= <TTTTTTTTTTTTTTT>
##$WBST= 1024
##$WBSW= 4
##$XGAIN= (0..3)
0 0 0 0 
##$XL= 0
##$YL= 0
##$YMAX_a= 581221
##$YMIN_a= -534346
##$ZGOPTNS= <>
##$ZL1= 120
##$ZL2= 120
##$ZL3= 120
##$ZL4= 120
##$ABSF1= 10
##$ABSF2= 0
##$ABSG= 5
##$ABSL= 3
##$ALPHA= 0
##$AQORDER= 0
##$ASSFAC= 0
##$ASSFACI= 0
##$ASSFACX= 0
##$ASSWID= 0
##$AUNMP= <proc_1d>
##$AZFE= 0.1
##$AZFW= 0.1
##$BCFW= 1
##$BC_mod= 2
##$BYTORDP= 1
##$COROFFS= 0
##$CY= 11.3945322036743
##$DATMOD= 1
##$DC= 2
##$DFILT= <>
##$DTYPP= 0
##$F1P= 20.1720416913024
##$F2P= 0.152960286110954
##$FCOR= 0.5
##$FTSIZE= 0
##$FT_mod= 4
##$GAMMA= 1
##$GB= 0.15
##$INTBC= 1
##$INTSCL= 1
##$ISEN= 128
##$LB= 0.24
##$LEV0= 0
##$LPBIN= 0
##$MAXI= 10000
##$MC2= 0
##$MEAN= 0
##$ME_mod= 0
##$MI= 1.114404
##$NCOEF= 0
##$NC_proc= 0
##$NLEV= 6
##$NOISF1= 3.799351
##$NOISF2= 2.8
##$NSP= 1
##$NTH_PI= 0
##$NZP= 0
##$OFFSET= 15.70392
##$PC= 1
##$PHC0= -9738.287
##$PHC1= 24.40096
##$PH_mod= 1
##$PKNL= yes
##$PPARMOD= 0
##$PSCAL= 0
##$PSIGN= 0
##$REVERSE= no
##$SF= 200.130013532006
##$SI= 16384
##$SIGF1= 3
##$SIGF2= 2
##$SINO= 400
##$SIOLD= 16384
##$SREGLST= <1H.CDCl3>
##$SSB= 0
##$STSI= 0
##$STSR= 0
##$SW_p= 3612.71676300578
##$SYMM= 0
##$S_DEV= 0
##$TDeff= 0
##$TDoff= 0
##$TI= <>
##$TILT= no
##$TM1= 0
##$TM2= 0
##$TOPLEV= 0
##$USERP1= <user>
##$USERP2= <user>
##$USERP3= <user>
##$USERP4= <user>
##$USERP5= <user>
##$WDW= 1
##$XDIM= 8192
##$YMAX_p= 0
##$YMIN_p= 0
$$ End of Bruker specific parameters
$$ ---------------------------------
##NTUPLES= NMR FID
##VAR_NAME=  TIME,          FID/REAL,        FID/IMAG
##SYMBOL=    X,             R,               I
##VAR_TYPE=  INDEPENDENT,   DEPENDENT,       DEPENDENT
##VAR_FORM=  AFFN,          ASDF,            ASDF
##VAR_DIM=   8192,          8192,            8192
##UNITS=     SECONDS,       ARBITRARY UNITS, ARBITRARY UNITS
##FACTOR=    0.0002076,     1,               1
##FIRST=     0,             0,               0
##LAST=      1.7004516,     0,               0
##MIN=       0,             -534346,         0
##MAX=       1.7004516,     581221,          0
$$ Real data points
##PAGE= N=1
##DATA TABLE= (X++(R..R)), XYDATA
0@%%%Qj6J6j6K4m0M9n7P2r2J17j39J64k02K44k87L36l95M65n41O24p17Q22r41
27e02J072j215J374j552J748j961K194k450K733l042L380l753M162m612N106n650
43b968O256o933P687q530R490j0591J1861j3347J5115j7266J9943k3377K7975
56A5315l4488M4478o1875J00520l23501J52346O88426o61209m32379O18089M02102
67E07824o69407k37040N98111J59198n78822m3022M75437j5915m06788Q7266K90286
78A67128j08068j97864J29884Q8513j01367l293O7198p9487k454J22801o4893
89A8098j45755J44400J34076k09119j03114K63140M7963k92125J8567L08877q8848
100I6160k99277J57503K70228k29465k28814K88545J70904l34694r3490L67989
$$ y = [0, 0, 0, 0, 8, -8, 8, -8, 16, -24, 25, -32, 40, -52, 65, -74, 90, -112, 132, -155, 181, -214, 251, -290, 334, -383, 439, -502, 570, -645, 729, -823, 925, -1036, 1158, -1292, 1441, -1601, 1779, -1974, 2188, -2424, 2682, -2968, 3288, -3645, 4042, -4488, 5002, -5589, 6272, -7075, 8040, -9226, 10717, -12660, 15315, -19173, 25305, -36570, 63950, -259551, -107205, 581221, -79988, -512367, 105722, 507824, -161583, -398623, 199488, 358686, -220136, -263158, 212279, 196364, -210424, -123158, 167128, 59060, -138804, -8920, 79593, -21774, -25067, 42131, -37356, -39810, 82991, 18098, -127657, 16743, 150819, -58300, -161414, 101726, 149689, -142436, -123869, 185008, 96160, -203117, -45614, 224614, -4851, -233665, 54880, 225784, -108910, -202400, 165589]
110A65589Q798l81720P7468L65580j65697l29849K40986K74739k95929k00921
120b40956L35365J26867l47765m9543L41658k3765l23020Q3545K86223j36820
130E1789k39271J79441J87173k04271j26897K11025N9185k06010j134J79295m7338
141D2987j32945Q8508Q4323j05005k8301J04687k6175r2920O8156O5216j03447
152c4916l3651J26707l569j39750M2777J43609q1796j34748J20735J15646j53682
163c2638q2517J81840M2084j95172M859J90690n8903j78897J00497J48391j35850
174a5616j06977J65774O9169j77345k5055J82023j7860j81317N5329J70463r1267
185B7321j52923J22159J27406j47687r6204J62252N9315j65325k1692J56247j0965
$$ y = [165589, 174387, -207333, -129865, 235715, 70018, -259831, -18845, 255894, -40035, -240956, 94409, 221276, -126489, -176032, 165626, 141861, -181159, -97614, 188609, 51789, -187482, -8041, 179132, -25139, -152036, 58989, 118174, -87836, -88970, 90325, 42987, -89958, -1450, 82873, -22132, -50433, 54254, 28079, -64841, 3315, 68531, -34916, -68567, 58140, 54571, -85179, -42402, 101207, 19411, -115337, 5398, 121044, -32638, -115155, 66685, 108769, -86403, -81544, 109146, 50243, -128654, -28157, 120234, -15616, -122593, 43181, 112350, -64995, -90050, 91973, 74113, -107204, -51875, 118588, 27321, -125602, -3443, 123963, -23724, -119928, 42324, 101639, -63686, -85378, 70869, 59904]
196E9904j34463L8348J07564n3116p5957N7997M3260n7868j8005M8140n010l3394
208b2600K7716K0931m1382k384N1238k2666o0288M4150N7656o7108m4650R0859
220C1472K8328j03012l999J06785k3609j04185M5656R1634o4442p4107P8682N7788
232F6991q4966l8378Q9387J9277r2802l621Q9221j6361q2748L7071P4196n0331
244F936n5503O2725L3718o9613j4259O4686p224n5816K2829M4364l1342l0215
256b8714L6090J8084l7079p769L7257o19l5605R355L2465j8469k8465K5430J8334
269B0295l2364p432L4395m558k8878J9756K3629k7090j2163K9850k920l3943Q187
282a3236K8010j5393k2576K2490K3413k1094j9161K3829J5864k9343j4867L0249
$$ y = [59904, -74559, -36211, 71353, 18237, -57720, 277, 43537, -14331, -32336, 15804, 10794, -22600, 5116, 26047, -15335, -17719, 33519, 10853, -49435, -5285, 52371, -14737, -59387, 31472, 59800, -43212, -47211, 59574, 35965, -68220, -22564, 69070, 4628, -69479, 9203, 66991, -17975, -56353, 33034, 52311, -40491, -44112, 45109, 28748, -54000, -16929, 57267, 6936, -48567, 14158, 47876, -21737, -35996, 28690, 21466, -34350, -11521, 32843, 1501, -28714, 7376, 25460, -11619, -19388, 17869, 17250, -18355, -9000, 23465, 4996, -23469, 1961, 20295, -12069, -19501, 14894, 10336, -18542, 1214, 24843, -2247, -14410, 15440, 12520, -21423, -13236, 14774, -619, -23195, -705, 22708, 1614, -17547, 6282, 22146, -7197, -22064, 8185]
294H185Q475l1248L32L1264o233k4262J2639J5977j6333q979J2118p96j0688L538
308f011O209l750o60N448J985l211j832L704K870n526j836Q614K6r520K532N721
324D763q792m041Q488k393o306R021M648j0672R47J0978m998r571O123P969l767
339B397n435K767P805n06j1071j063J1856l361j5290M692J3508o294q225R515
353A295P477m906l433J003R37n93o183l542P326L101p448K560J0483l236o818
368a977M825K065n477n56K352q35Q79Q6k839K093J438n935j87N975k833m069O813
385A818L125n252J424L821k606j342J16k663J776K825n340j000Q267j206q365
400d602L219N280n523l675K956J637R77M41j554L530M501n530m699N766n2p716
$$ y = [8185, 16660, -14588, -14256, 17008, 10775, -13487, -848, 15129, -1204, -10183, 1935, 1139, -9549, -6011, 198, -3552, -4212, 1236, 3221, 10, -1822, 1882, 4752, -774, -2610, 6004, 6030, -3490, -958, 4763, -4029, -8070, 418, -1975, -8281, 740, 5388, -5284, -4337, 6641, 1643, -7928, -1805, 6164, 2397, -3038, -271, 7534, 7028, -4043, -5106, 6750, 3389, -11901, -7209, 6299, 5, -8220, 1295, 8772, 3866, 433, 1436, 2373, 1780, -4403, -7945, -619, 2482, -4966, -2406, 8077, 4841, -1977, 2848, 4913, -564, -1120, 1232, 397, 1276, 1362, -1477, 616, 2054, -3881, -4068, 1907, -926, -4995, 1818, 4943, -309, 1115, 4936, 2330, 988, 1104, -1559, 217, 3042, -2298, -3298, 4969, 3763, -4602, -1383, 3897, -1626, -5301, -2345, -708, 269, 710, -844, 2686, 7187, 1657, -3042, 2724, 2672, -5044]
416e044J089N030k853p96L253j825n83K972k703k562N530J158m396L035M086l592
432A799j856J393k721j715O70k665K63M330j065j418N699O56m711L034J792o240
448b755Q3N782m197l365P264J418o641J453M235l933l533J797J514j10r22O17
464a293M665r8n971K513O100p949o070J0445K293j1912L054J2739n196r197P481
479A604O333p570m945N044L847l404m879L117O099m508p276N345N118p350j903
494e328Q024O32l605L184P45k570K582j312o615L813N867p927l616J1475J427
509F776j1662J388J0608m124j1855L259J1431m141j2437P781J7405r511j7113
522a2195J6001J6317k3890j5130K7502P961l1067j008L1980m441k9324Q931K5233
$$ y = [-5044, -3955, 1075, -1778, -2574, 679, -1146, -1729, 1243, -1460, -4022, 1508, 2666, -1730, 1305, 5391, 1799, -57, 1336, -1385, -3100, -2430, -5095, -4832, -502, -1567, -2985, 2714, 3370, -1341, 1693, 3485, -2755, -2672, 3110, -1087, -4452, 2812, 4230, -2411, -958, 3277, -656, -4189, -2392, -878, -988, -1910, -1293, 3372, 3274, -2697, -184, 5916, -2033, -8103, 2342, 4635, -7277, -4223, 8516, 3320, -5877, 1604, 7937, 367, -4578, 466, 4313, 909, -3970, -853, 5246, 738, -6538, -1193, 3925, -3425, -5328, 2696, 3328, -277, 2907, 3652, 1082, 3664, 2352, -4263, -450, 5417, -2510, -6126, 5349, 6776, -4886, -3498, 7110, 2986, -8869, -5610, 5821, 1680, -10757, -2976, 14429, 4918, -12195, 3806, 20123, -3767, -18897, 8605, 16566, -14501, -15509, 16471, 12030, -17294, -8363, 16870]
535A6870j2449k2912J3642K0353j4547j6762J7960J4733k0491j0004K2063K491
547A0947k3292M695K0143j1738j4099J7455P081j8645Q95J6345p972j3250J1009
560d26P825j2566k173J3380j102j2152N423J0609j1188r675J6653N743k2834K257
574a0226K9958j1296l2927K4022L1373l9118k7912N0182J8123n9305n412O6843
586C4305n379o7368J8155O7043l0583o6254L9638O1290n0682n4583O1457M6508
598E3547o8891l3146P4005J7226p5114j174O9289j3860n8306K6258M4362l2771
610A425k8014L3916J2162l1881J405K5953j2590j7778K2694Q883k9258K621L3506
623B3044j6868l5658L0005L0654m4705k0100N7705O816o3115J3265O3855l4377
$$ y = [16870, 4421, -18491, -4849, 15504, 957, -15805, 2155, 16888, -3603, -13607, 8456, 10947, -12345, -7650, 12493, 755, -13344, 4111, 11192, -7453, -6558, 9787, 1815, -11435, -426, 7399, -5167, -7340, 6040, 4938, -7214, -1791, 8818, -2370, -12045, 4608, 10351, -12483, -10226, 19732, 8436, -24491, -469, 30904, -8214, -36126, 14056, 32179, -27126, -32538, 34305, 28926, -38442, -20287, 46756, 16173, -50081, -10443, 50847, 165, -54418, 7039, 53547, -15344, -48490, 25515, 42741, -32373, -33547, 35742, 21882, -36424, -10166, 34196, 1425, -26589, 7327, 19489, -12392, -10987, 14966, 2376, -15402, 7292, 16175, -13083, -10462, 23044, 6176, -29482, 523, 31177, -13528, -33628, 24077, 30893, -32222, -18957, 44898, 10521]
635A0521n8596N2028M4757o8258k7337Q0140Q406q6043J2887Q7895l5140q6583
647f5323N5941Q0201p6396o8455R6057N2897j10825l1548J19746O187j22343J7977
659d5884J14890m1585j00638O0436Q2001p0980n8418P6077L4938p5031j3895O6833
671B8744o894n4930K4829L9965l7676j9814M7359l274n1667K6301M6902m9904
683a0059l5534P0211J8180q3342M837Q8577k9904q6462N2372P5719p1533n9080
695f6018Q7491M0305r5486j7171J00045o914j00072L0174R1900n5206p9557P7204
707F695O0370r4358l4579J05829N827j08964K2971J02741n0029q8819P3061P0788
719G1533q7505m7363R6534K3845r9508j627R4933k0980q6279M0999P2346n7055
$$ y = [10521, -48075, 3953, 48710, -19548, -46885, 33255, 41661, -44382, -31495, 56400, 21260, -65323, -9382, 70819, -5577, -74032, 22025, 74922, -35903, -67451, 52295, 58482, -63861, -45884, 69006, 27421, -73217, -12781, 69220, -1760, -60178, 15899, 50837, -24194, -38089, 28744, 21850, -33080, -8251, 31714, -5962, -25776, 21583, 18309, -33358, -7057, 39845, -10059, -45593, 24618, 42798, -40544, -35707, 52870, 22966, -63496, -11124, 64595, -6938, -66018, 21473, 61778, -33708, -50879, 49166, 42252, -57820, -27646, 64254, 9048, -70509, 6695, 67065, -27293, -61872, 43957, 49784, -59180, -36209, 66532, 16503, -72316, 745, 71533, -15972, -63335, 33199, 57044, -42464, -44091, 50842, 29862, -56417, -15418, 56928, -127]
731a27n2642O8968K8588p5354l170P2409k3597o1852M7877M5254o4555k0645P6297
744C7451m347p9194K9043P4525n2637o5351P1667N0810q6923l3378R7216J2084
756E0966j03337J0001J02065l3434r3980N6840Q0065p4167n7571Q7106L1986r2766
768c6226n646Q8452k0599p8156M2883O3184n8727m3186P0273K1793p7193j658
780c4806P6480k1285p3105M1724O3994n9582m7889P5547K9208q4152o102Q6240
792D6272j7532q0782L9602O8846n6621n1742O8076L1481p4800j2641P3674p689
804B6144p0322K5445O2550m0245n0043N4213L5699o3345j7390O8238k843o7024
816c8923K3331N9985m1207m6579N4703K8949o3205j0888O3969q266o0373K4494
$$ y = [-127, -52769, 16199, 44787, -30567, -33737, 38672, 15075, -46777, 1100, 46354, -18201, -38846, 37451, 33104, -46090, -17047, 57478, 4841, -60510, 11157, 61967, -24956, -58334, 38882, 50966, -52371, -42370, 59695, 26261, -67719, -10879, 69186, -4981, -62552, 24554, 56540, -36226, -41872, 46580, 25981, -52175, -9292, 53892, -4835, -48021, 22252, 44045, -33148, -34806, 41674, 20389, -52716, -10992, 53002, -6580, -54469, 21078, 50286, -33866, -39968, 46272, 28740, -52042, -12440, 56406, -215, -51957, 16119, 47600, -27200, -39841, 33833, 26144, -44178, -18733, 43817, 3572, -46471, 7742, 43441, -19904, -37294, 30944, 28101, -38923, -15592, 44393, 3186, -43393, 11310, 40259, -22946, -33834, 30135, 21869, -38504, -14010]
828a4010N3070l6887m1567M7535K8722n4282j5099N7215j112n7258J7658N3442
840C7427l2162m3215M6823K9673n6421j4090N9541m474n8831K0651N2699l3562
852D059m1792M3832L0229m9278j8338N1414N404n1534O329M8738j7374m3120K8782
865b649L5000l7813k3627M3910R819m6104M558M3977j7494l7030K8319K7481l5226
878f879j7757L7254O729l7633K359L5524r085l0669J6367K6360k1983k0224K5837
891F200J1266k9214k038K9263q140k5349J8005J9369k5015j0505K8415Q28k8986
904a5901P674K6169j4410k1518J9208J6494k2360j1491K3595N990k4995j96K5277
917A3536n626k3463J2668K0398j9492j5195K3780P160k6476O30K6666p386k2597
$$ y = [-14010, 39060, 2173, -39394, 8141, 36863, -17419, -32518, 24697, 23585, -33673, -16015, 37427, 5265, -37950, 8873, 38546, -17875, -31965, 27576, 23102, -35729, -15078, 37621, 4059, -37733, 6099, 36328, -12950, -31288, 20126, 25530, -26004, -19675, 29063, 11689, -31431, -2649, 32351, -5462, -29089, 14821, 24640, -21464, -16906, 27071, 9577, -27453, 866, 28347, -6879, -24636, 12618, 19347, -18286, -15927, 19597, 10512, -20157, -3790, 22570, 587, -19637, 6200, 17466, -11748, -13786, 15477, 7337, -18012, -7, 19362, -5653, -16158, 12257, 13085, -15901, -8227, 17942, 3532, -17986, 1222, 17716, -4644, -16135, 7460, 13450, -11545, -11741, 13536, 7910, -15553, -2885, 17513, -1979, -17174, 6606, 13766, -12710, -12080, 14586, 7200, -15397]
930a5397J3465J8466j6537j4522J6745R453j7615o899J7238M546j6138p74J6486
943H517j997j4971N444J1657r328q024J0970L155j0354K167Q577n380n224O041
957A250J330o209O36M140j939j652K655J085j532J98K454p42l122J722M191m618
973a53n537P222M548j1448l170J3816K41j4814L571J5184m967j2275O403J0812
987I433o163r918M218Q595l561r231L777J0469l480r545N076P699o625o614M905
1002i65L280m366j624K587K832M39k395J92M331j025n524J876L966m978l121O064
1018A569J218n359J605N221k001l863J611K738j396m111K8M772o44o637J853P490
1034D094l514o690N979N994n881k933O104J646m648j243J894J257k144l302J581
$$ y = [-15397, -1932, 16534, -3, -14525, 2220, 11673, -5942, -12841, 4397, 8943, -7195, -7969, 8517, 6520, -8451, -3007, 8650, -678, -8702, 2268, 5423, -4931, -2764, 5813, 433, -4791, 1250, 2580, -3629, -2993, 1147, -792, -2444, 211, 1296, -236, -38, 2416, 1674, -1448, 274, 4465, -153, -5690, 1532, 6080, -5368, -8538, 5278, 5519, -9295, -5724, 9460, 4493, -7782, -1379, 9433, 3270, -6648, -2430, 6165, 2604, -6627, -2850, 7619, 4139, -5406, -330, 7369, 744, -5870, -965, 2315, -2051, -3675, -1088, 1744, 2183, -212, -20, 4311, 3286, -2238, -362, 3604, -1374, -4495, 1569, 2787, -2572, -967, 4254, 2253, -1610, 1, 2739, 1343, -2768, -2740, 2032, 1388, -5249, -3396, 4094, 580, -6110, -131, 5863, -18, -2951, 3153, 4799, 151, -1092, 802, 2059, -85, -3387, -1806]
1049a806M268l020m919M553M299n686l050O115K162m485j301M316L449k712m697
1064b514L035N967n867q500O392P015r196n817J0477M980q620k625Q243L052o869
1079h47l949N548M562o189n510O804N093p687l457P724J721o555J5M222m49j530
1095d84P1J63J459L58k743K67K686j690k143K578O15k459J233J725k182o00J820
1112F74o65n54P4l35J703J666l272n29N251r80o316K013N527m257m675L944L655
1129B924k897k811K106L688n28m721J040N886k017o569L707N245n799m105N778
1144I27J239n717O53M890q39k721K189L294r19l603M45M320k261p143L139O913
1160D806n785o812P784N751p989l856P603L138n954k993M794M627l260n727L685
$$ y = [-1806, 2462, -558, -5477, -924, 3375, -2311, -5361, 754, 2916, -1569, -2870, 1446, 4895, 2183, -2514, 521, 6488, 621, -7879, -1487, 5528, -3668, -9485, 992, 5972, -2648, -5273, 2970, 6022, -847, -4796, 752, 5314, -875, -6385, 419, 5512, -2175, -5632, 2092, 3813, -2742, -2727, 1495, 1046, -484, -413, -250, 1209, 1567, -1176, -909, 1777, 87, -2056, 522, 1137, -1322, -89, 1636, -546, -1146, 674, 9, -545, -471, -806, 897, 2563, -709, -1238, 4013, 3033, -3283, -1270, 4257, 0, -4675, -731, 2924, 27, -2784, -678, 3010, 2482, -2239, -1199, 4687, 2670, -3899, -192, 5053, -746, -4851, 927, 2166, -3551, -2898, 1992, 1153, -1568, 621, 3915, 2996, -607, -162, 4158, 1897, -5246, -2107, 4806, -979, -7791, -7, 5744, -2245, -6101, 1502, 4640, -1314, -4307, 487, 5114, 1854, -3873, -188]
1175a88P547n013q531N126O879o927o783N919N518m599m803M320O658k752p273
1190d902M070Q051n960q415P429O348r282m470R611J956q301L40O985l41n009
1205a890p7M192K46m725j711M506J058n096N8N438J46l343J096K409k28j469k056
1222a446Q3K971k046m405M078M885n092k050P288k66p213K911N139o702m058P806
1238A883J414q468N35J0615q43j1109K555J3242m043j5813O177J6769j0044j7451
1252a4581J3265J6012j5601j2939J6727R779j5655o937J3036M827r511m605O260
1265G7N210l098n954R70P323J286q092l930Q732O134j1575r329J4115J0946j8232
1280e417j0307K3635Q891k6694l770K9047k125k9098O814K5928j2570k2692J6060
$$ y = [-188, 7359, 2346, -6185, -1059, 5820, -1107, -7890, -1971, 3547, -1052, -5855, -1535, 5123, 2371, -4902, -832, 7219, 1259, -7156, 273, 6621, -2661, -7131, 2480, 4436, -3865, -3525, 3460, 3119, -1890, -1967, 2225, 2471, -2254, -3965, 541, 1599, -3497, -3439, 1999, 2145, -1198, -102, 2307, 2079, 610, -1446, -1363, 1608, -438, -4843, -765, 4120, -972, -3022, 4266, 4000, -3213, -302, 4837, -1865, -5923, 1883, 3297, -5171, -4636, 5979, 5136, -5973, -3418, 9824, 5781, -10032, -3855, 12914, 2870, -14581, -1316, 14696, -905, -13844, 2883, 12662, -2993, -9930, 3106, 7933, -1578, -6183, 77, 5287, 2189, -3765, -2795, 4528, 5814, -2278, -6208, 2524, 8658, -2917, -12246, 1869, 12815, -5417, -15724, 7911, 16802, -9892, -13662, 15385, 13260, -15838, -9024, 16904, 4334, -18358, -2298]
1293b298J8446j8296j3073K0493Q984k1664m234K1911j753k2362P271K0394j3217
1306F02j6090J8912J1028k1229l415K1871l807k0003R352J5068j4485j0319J6113
1319C598M609j6977Q87J6961n369j4842J0384J3379j4252r817J8630M676k2228
1332a0361J240K2789r476k2230J6925J8043k3129j1507K8133M527k9314L743K9096
1345A8479j0749k6461J6484K2263k1388j8422K4689J2844k8027o489K9074r2k8595
1358a6390Q545K6060j5587j9789K2191J1588k5842k114K6194q215k4052J6808
1370f03J8951k3965j2524K8949N469l1682J674L3133q891l2778J6270L1194k3300
1383A897k7030K9762K0720l5235j2239L7150K034l6624P766L2471j6036k5174
$$ y = [-2298, 16148, -2148, -15221, 5272, 14256, -7408, -11642, 10269, 8516, -13846, -6575, 13819, 602, -15488, 3424, 14452, -6777, -10192, 11679, 7872, -12131, -2779, 12289, -2196, -12515, 3598, 8207, -8770, -7883, 9078, 3709, -11133, -749, 12630, -1622, -11439, 7191, 11867, -10361, -9121, 13668, 4192, -18038, -1113, 16930, -6199, -17706, 10427, 14954, -14360, -10617, 18479, 7730, -18731, -2247, 20016, -1372, -19794, 4895, 17739, -10288, -16777, 12297, 12205, -16390, -7845, 18215, 2628, -17161, 5030, 16618, -9224, -11338, 14856, 6641, -17411, -603, 18348, -5617, -18141, 10808, 16277, -15405, -13731, 19402, 10511, -22267, -5997, 25197, 1897, -25133, 4629, 25349, -9886, -22125, 15025, 17059, -19565, -11799, 20672, 4636, -20538]
1395b0538K3102J7371k6231q129K7291r87k6680Q091K3515j5536k0178K1666J4847
1408A7604k6630q173L0660j03l1983R427L0470j8339k5477K6359J8426l0969q727
1421a7455L3438o15l2571R086K8468j7878k4259K2335J7145k7446j0399L0566
1433A0415L288l0690O426L1696j4247k7348K3218K1533l1044j3954L4324K742
1445A6359l6708P087L4617j6313k9282K4136K3247k8611j5754L1429P992l2699
1457a4500j115L1622o180k9299J3539K5760j9413j9165K4946J1160k7894k007
1469a2546K7338p685k4282J6026J8606k1802j0903K5457K855k6689M252K5052
1481A5679j1557k3172J6787J9398k1409j4314K6278R650k8024j608K9768n884
$$ y = [-20538, 2564, 19935, -6296, -14425, 12866, 11879, -14801, -6710, 16805, 1269, -18909, 2757, 17604, -9026, -17199, 13461, 13358, -18625, -9198, 21272, 2933, -22544, 3815, 22241, -8728, -17455, 15983, 15368, -17203, -8117, 20351, 2473, -21786, 549, 17694, -9752, -20151, 10415, 13703, -16987, -10561, 21135, 6888, -20460, 2758, 24291, -6753, -20707, 13617, 16359, -20349, -13262, 21355, 5042, -24240, -104, 23143, -5468, -21222, 10207, 18199, -14500, -15615, 16007, 9827, -19472, -5933, 19827, 414, -18751, 6195, 17355, -10539, -12546, 14792, 7107, -17175, -1149, 17457, -4345, -15248, 10209, 13064, -13625, -9373, 15679, 4122, -19050, -2263, 17135, -4274, -18588, 7690, 17340, -10684, -12292, 17476, 11592]
1493A1592k8456J3644K3117k1315j7672K5495Q469k7664L1K7450p709k3930J4939
1506b009J9909j9671j4978K3354R324k6300l276K7763k480k7729R782K6559j6631
1519C617k2925K1848J6682k6665j0105K7778K016k6324M855K3390r460j7672J3376
1532D11J2785j4856p655J4749K324j5133J812J3423o701j1291J1283Q300j4893
1545e442k966J7645k648j8059Q965J6207j4552j2839J8021P750k0277k546K0123
1558I382k024j8596O010J6389q771j3955J1597J1089j3788p475J5795K762j6943
1571h528K058J6654p906j4957J3292J1242j7030o273J9370J238j9431L584J8177
1584A1490o823j6197R134J3768j0677j1860J1616R792j2480p332J2867M419j2566
$$ y = [11592, -16864, -3220, 19897, -1418, -19090, 6405, 14874, -12790, -12759, 14691, 6982, -16948, -2009, 17900, -1771, -16749, 6605, 15929, -10371, -13647, 14116, 11636, -16093, -6311, 20248, 3617, -19308, 2540, 19222, -7443, -17548, 10230, 12246, -14078, -9223, 14167, 4707, -12965, 411, 13196, -1660, -9315, 5434, 7758, -7375, -5563, 7860, 1159, -10132, 1151, 9451, -5442, -8408, 9237, 6589, -11470, -2505, 13702, -850, -13689, 4332, 12082, -8195, -10741, 9382, 7358, -11238, -5228, 11161, 2390, -11565, 32, 11121, -2667, -10142, 5653, 8415, -8528, -6470, 10184, 2278, -12679, 613, 11855, -5175, -11448, 7922, 9160, -10271, -6687, 11490, 4667, -11530, -2396, 11372, 695, -11165, 451, 10243, -2237, -9569, 3298, 7717, -4849]
1597d849j295J1101j781q209M474M217n313L18M600m272k261P052o48q432L406
1612a892Q804n553q705P312Q391q689q161J0142P724j2081o902J3804M743j5032
1626f095j697J5620j569j4291M796J1932p049q988P983N359p871k946O947J055
1640C186n678N27N430j078m561K421M047m459l441N267J041o770R21O551l017
1655C87m848M888L574n215q14M870j053l358J783J248k173n5J774p15j183J183
1671B93J444j724k247K297K294m093k653N615J610p046M56Q074j950p324M697
1686b57O089n140m623N104K901n114k456L762J941l431k350L710K461m134j687
1701c224M673L85m360R12L325j568j736J913L98q93J030m08j146J604P6k456L94
$$ y = [-4849, -6144, 4957, 3176, -5033, -559, 3658, -1655, -1337, 3263, -1009, -3270, 3782, 3134, -5298, -1892, 6912, 1359, -7346, -34, 8357, -332, -8493, 1649, 9373, -2708, -9610, 4194, 8937, -6095, -7792, 7828, 6259, -8032, -3236, 8696, 1647, -7341, 642, 6001, -1870, -4816, 2131, 3186, -2492, -1965, 3465, 2387, -2174, 247, 4294, -165, -3606, 1661, 2702, -4068, -3147, 3404, 387, -4461, 427, 4001, -1214, -2028, 2842, 1789, -1569, 214, 1462, -711, -766, 1008, 293, -890, 293, 1737, 13, -2234, 63, 2357, -1736, -4389, 1226, 2836, -4210, -3754, 4320, 2370, -4954, -257, 5832, 692, -3931, 1173, 4074, -1040, -3496, 266, 2207, -1224, -3574, 136, 2597, -1537, -3224, 1449, 1834, -2526, -1614, 1711, 143, -1593, 320, 718, -175, 855, 447, -699, 905, 981, -1475, -1081]
1718a081K285j345j824J910J435j354j055Q62J261p64k269O86K937j859l264L851
1734D12L062m450j235N404M0n228J462M001k477l639K017K267j990k594J591L172
1750A815j685l292K942L796l457k516M343J359m540M8L546j474k205J650N62j182
1766b90L64K90p22K08N74j051q3P60N5j18m97K52J429l27k011J408K281k988j731
1785b197M111K09m716J599M319l502l103M464J434m873j94M608n99m083J163M159
1801B799j097m856J793N259l154n769M563N192o186l765P484J943p431L25O546
1816C646j802n125K535L405k706k243K216J537j922j380J873J124k154l93K524
1831A135m62k181J738J407k692L8K682k280j865L527m8m223K756L834l990k526
$$ y = [-1081, 1204, -141, -1965, -55, 1380, 26, -1029, -167, 1094, 330, -1939, -1253, 1684, -175, -3439, 412, 3474, -976, -2211, 3193, 3233, -1995, -533, 3468, 991, -2648, -631, 1636, -354, -2948, -1357, 1815, 130, -3162, -220, 3576, 119, -2397, 1946, 3305, -1235, -1187, 2359, 885, -1320, 330, 892, -290, 74, 364, -358, -150, 424, -627, -710, 50, 105, -13, -510, -258, 1171, 844, -1167, 241, 2522, -466, -2197, 1914, 2123, -2593, -994, 3325, -177, -3280, 1184, 2618, -2255, -2449, 2159, 1560, -2523, -1360, 2799, 1702, -3154, -1361, 3898, 744, -5025, -462, 4730, -1456, -5221, 2263, 4206, -3225, -2900, 3646, 1844, -3281, -746, 2659, -47, -2290, -74, 1463, -459, -1839, 34, 1158, -996, -1389, 1135, 673, -1508, 230, 1637, -1055, -1017, 1665, -615, -2480, 1047, 999, -3224, -468, 3366, -624, -3150]
1847c150N578J297o183k12O506j085o806J320P172k011q594L298R161n071r231
1862h011P569Q720r085o826J0856M686j0956k566J0187L78r002J53P607p17o650
1877c657J090O250j171n717J844M763k758l749L131J879k938J86J904j380O9K161
1893A907j755j914L651O39m492M56M656j645m416J857L739k023l959K031M106
1908B838k199m367L339M774m528l660N686J938o357N8N748k056m652L370L202
1923C134m163j644M139N36m181J77M029m36m582J159N157j971n958L505N988n137
1939b48n200O531L751p072j864O921L74n858M66M470j155l503R02K822j062k184
1955a909J541K018j999r90K902o16l284K448K887m459j462N723o08o282K285N846
$$ y = [-3150, 2428, 3725, -2458, -2670, 3836, 2751, -4055, -2735, 4437, 2426, -6168, -2870, 6291, 1220, -8011, -442, 8278, -807, -7633, 3223, 7909, -3047, -5613, 4574, 4952, -4050, -3897, 3710, 2993, -3657, -2567, 3683, 2512, -3205, -1361, 3402, 644, -3105, 26, 1905, -1033, -847, 1057, -323, -254, 1907, 152, -1762, 1889, 2528, -1964, -1508, 3148, 1503, -2913, -1056, 2683, 660, -3299, -1268, 2838, 639, -3728, -389, 4385, -143, -3803, 1883, 3821, -2536, -2478, 3270, 1214, -3438, -68, 3134, -1029, -2673, 1466, 2002, -2179, -2002, 2027, 1591, -2991, -1832, 3325, 1354, -4604, -1099, 4889, -248, -5448, 1083, 4834, -2238, -4102, 2819, 3193, -2665, -2199, 2271, 1116, -2387, -1485, 1337, 275, -1909, -368, 1650, -349, -1339, 1563, 947, -2337, 111, 2998, -1461, -2923, 2800, 2192, -4090, -1805, 4041]
1971D041m167m714N428L568n722k159O149J519o142p38O587o34p360J918P262
1986D836l954o947O500N543p947l180Q994L48q962K052P922m327n779N240M107
2001D446n668k247O000O94o083P56O503k778o347M911N828p375m462R544J714
2016E436j1125J316J1162m210j0154P079Q091q499n495R030L181r239j174Q902
2030D301q63q331L057P890n193o744P488M659r882j979J1053j467j1423M977J0699
2045H242q459q379J0735N651j1876k544J1783m5j0853K239R924l948q577N266
2059h41O829p216m949Q436K130r208J576R199n044p450Q544M638j1129j180J2132
2074F467k825j1755O038J0579r003q679J0752O454j2352m170J3596J940j3988
$$ y = [4041, -126, -4840, 588, 4156, -1566, -3725, 2424, 3943, -2199, -2937, 3650, 3016, -4344, -2426, 4836, 882, -6065, 435, 5978, -1969, -5149, 3845, 4193, -4769, -2717, 5205, 878, -4901, 339, 4446, -1222, -3469, 2531, 3225, -2858, -2102, 4401, 1623, -4724, 187, 6015, -1360, -5822, 3722, 5436, -5689, -4373, 6789, 2579, -7575, -496, 7595, -904, -6399, 2631, 5812, -3427, -4601, 4301, 3438, -4893, -1836, 6054, 861, -5883, 1605, 6264, -3618, -5597, 5456, 3989, -7434, -2457, 8242, -217, -8596, 2139, 7790, -4086, -6630, 5153, 5108, -5745, -3506, 6418, 2470, -6107, -841, 5988, -1228, -6177, 2259, 4389, -4819, -3243, 5956, 912, -6538, 2006, 6644, -4485, -5665, 6467, 3642, -8113, -2075, 8504, -499, -9178, 1574, 8028, -4324, -8494, 5102, 7042, -6946]
2087f946J048J4704m018j3763P581J1872j0921r156J2768M781j4049p20J3446
2100F627l463j1363O921Q626q877n519J0585K900j1247K49J1537l126j1375N889
2114a636J0629r167r114J2018O597j4097k925J4891j117j4250M586J2048p893
2127E70q856R261N426r438j763R372r78q209L659O766o641m889Q734K699j0641
2142d928M96J2553l807j2672P801J1358j1921r623J3819N753j5879k179J5999
2155F770j118j4366M961J2961o697j0340Q831P931j0199n509J0848K560j1767
2168e134J88J1571m171j0647P348Q345j0011n239J1553J674j1449J814J0206m387
2182A661q114O471O185p190l582P692J383p827L80P300l172p017N245N713p648
$$ y = [-6946, -5898, 8806, 4788, -8975, -1394, 10478, -443, -9599, 3169, 7950, -6099, -6819, 6627, 3164, -8199, -1278, 7348, -1529, -7048, 3537, 6437, -4810, -4561, 6976, 3850, -7525, -1636, 8993, -174, -9288, 2730, 9327, -4770, -7695, 7196, 6079, -8171, -3585, 8463, 570, -8286, 975, 6401, -3037, -4800, 4572, 3594, -4615, -956, 5810, -831, -5720, 3014, 5713, -4928, -4432, 8121, 4314, -8358, -557, 10801, -1120, -10743, 3076, 8829, -7050, -9229, 6770, 5652, -8714, -3753, 9208, 2511, -7829, 1002, 8933, -1266, -6775, 4073, 6633, -5134, -4946, 6625, 2454, -8193, -845, 7500, -2511, -7750, 3803, 5477, -5972, -4158, 6048, 1661, -6453, 18, 6203, -987, -4569, 3123, 4506, -3321, -2941, 4359, 1187, -5830, -585, 5128, -2520]
2197b520l598J0096Q14j0448K683J0285o333r018Q529O526j0498l391J1335J002
2211E464j0712J435J0326l604r537N113Q692p296p564Q951N800j0486l145J1254
2225D691M68j1114K478R815n077p753O602N014o770k299O654K89n392J321M358
2240C285k699l207L509K058m624j028N342j114o000L215N917n032m600P580L038
2255E640q683m38Q801k323q378M131O541n599m854O317L588o831j791P094P31
2270C946p612P30P622k585p360M406O624o124m930P457K776q114m71P471j818
2285B018n860L261M214l891k442L780J026l613k66L571q13l225J888L194l010
2300a68k775M466J531n514j48N450k013m822L549L534m191j551M724k07m141J588
$$ y = [-2520, -6118, 3978, 4792, -5656, -2973, 7312, 979, -8039, 490, 7016, -3482, -6873, 4462, 5464, -5248, -3813, 6513, 2909, -6628, -1515, 7177, -119, -7683, 1268, 7068, -3418, -6563, 4691, 5159, -5955, -3477, 6338, 1261, -6492, 110, 5124, -1646, -3945, 2709, 2998, -2394, -1073, 3285, 586, -2621, 888, 2946, -1678, -2706, 2636, 1522, -4478, -1263, 4654, -378, -4978, 2602, 5640, -3043, -3481, 5320, 2997, -5381, -1250, 5291, -308, -5162, 1155, 4743, -2088, -3879, 3215, 3946, -3666, -2936, 4686, 2101, -5259, -853, 5771, -353, -5283, 2174, 4950, -3164, -3635, 3836, 2018, -3842, -581, 3633, -258, -2700, 1080, 2106, -1507, -1773, 1798, 985, -2240, -352, 2842, -168, -2943, 1523, 3054, -2460, -2608, 2842, 829, -3993, -444, 3090, -1101, -2652, 2072, 1865, -2276, -688]
2316f88L003k609k033L061J479l460j048M094K58m896M49N581j813n901L187N796
2332D460m734m668O033L418o273j353N569L33m769J83L643q18k849M30K158o97
2348F6j991R92J943j105n24K092M6j985J088J154k728o38K759r35k559K253J898
2365A826k285o04K476p2k060L19J335o95j456K22J722l69j556J381K146j961j608
2382a239K692M75l875N36L679j994k710L059J923l259p16L201K4k986q7K546m38
2399H31l196J78L328m44l756K080M381k466l208L764K610m259j665L697J6l462
2415a571L7K192q65j010K12P34K68l49l16K13L34k77L66l44J32J615L76k253P61
2434B55K579k360l267K901J715m277r45M475j58l739J778L603j742k447K002J916
$$ y = [-688, 2315, -294, -2327, 734, 2213, -1247, -2295, 1799, 2057, -2839, -2390, 3191, 1378, -4523, -1336, 4460, -274, -4942, 1091, 4509, -1764, -3117, 2452, 2785, -1984, -1801, 1842, 1024, -1825, -1395, 763, 66, -1925, -933, 1010, -95, -619, 1473, 1519, -466, 622, 1776, -952, -1590, 1169, 234, -2325, -72, 1826, -459, -1063, 1413, 1341, -719, -400, 935, 240, -1216, -994, 728, 359, -1197, 184, 2330, 369, -1239, 1453, 1928, -1947, -1411, 2268, 274, -2436, 623, 2546, -713, -1429, 1772, 1796, -1190, -1277, 1269, 831, -2365, -2187, 1141, 697, -3059, -979, 3402, 936, -2272, 1492, 4102, -157, -1822, 1875, 1891, -1571, -1534, 658, -207, -1217, -1005, -271, -3, -352, -668, -455, -121, -398, -32, -376, -244, 1371, 1747, -506, 255, 2834, 474, -2793, 108, 1823, -2454, -3399, 1076, 918, -2821, -1043, 2560, 818, -1629, 373, 2289]
2450B289k362j946K143J341k986r98L612M58l928J298M072k482l051L664J727
2465B851m215m70L788j436l100J813J944k042r24K131N45j593l10J962J26k125
2481a055N49K486j326k240K246J634l094o08L461j111l360J963J963l015r58L701
2497A236l36k743J799K634k019j753K019J509k595j464K607J398l617q72L871
2512A674Nm639J269M478k413l396L744K251l575p58L476k27k908N57J686r53j525
2529a254N50R81l73r87P76J298j166n33J581j50j601J176J480k217k57K483j128
2546F59k716K077J527k975r54L036M12k953M12K820M5k615K67L030j60l737M65
2563a360L755j611l915K415L001l274j679L536O06k811Q08K002j039j132J114
$$ y = [2289, -73, -2019, 124, 1465, -1521, -2519, 1093, 1551, -2377, -1079, 2993, 511, -2540, 1124, 2851, -1364, -1834, 1954, 518, -2582, -769, 1175, -867, -1791, 340, 885, -708, -1018, 944, 1070, -1055, -506, 1980, 654, -1586, 660, 2294, -800, -1408, 2053, 942, -2418, -455, 1508, -1507, -2465, 1236, 900, -1843, -44, 2590, 571, -1182, 837, 2346, -249, -1713, 894, 2292, -1325, -2197, 1674, 1679, -2960, -1691, 2787, 374, -3022, 722, 2973, -602, -1360, 2116, 1889, -1019, -462, 1224, 271, -1254, -704, 277, -96, -1083, -307, 991, -175, -708, 873, 723, -878, 298, 1778, -439, -696, 1787, 659, -2057, 20, 1547, -1428, -2382, 654, 1066, -1887, -1475, 1345, 1390, -1225, -958, 2072, 1912, -1825, -1360, 2395, 784, -3131, -716, 2285, -989, -2668, 868, 1474, -1337, -529, 1473, 434, -698, 416]
2578D16K1j228k09Q11J5j189K90K235m91k134J546K606k832k179L454R46m354
2595b276K94L925j313k880K254K139k257j147J941N8j937m7J657o8j625Q10K181
2612A709j068k205K441J828l511j194M389n90m617J459L874k652k912L293K351
2627B595l044j095K764O25k532p72K345K27k179M5K642p03k448K011J717k642
2643d44p52K828r96k910J798J750k691m62L359rk385J212K126j431k092R58J478
2660A337j778j720J805J774k391j079L699M07l926J116L689k677l317L481J905
2675B325m208l82M221m42l301J297K789j563k593J411K090k170k107K528J858
2690A753l269q60M214l41l978K226L501l302k618M017Q84m707L18M044j181l305
$$ y = [416, 437, -791, -1000, -189, -174, -1363, -1073, 1162, 671, -1463, 83, 2689, -143, -2322, 1132, 2078, -2276, -1982, 1943, 630, -2250, 4, 2143, -114, -1261, 680, 738, -1199, -1246, 411, 343, -1282, -472, 1709, 641, -1564, 877, 2705, -806, -2000, 2389, 1799, -2818, -1359, 2515, -137, -3049, 244, 2595, -449, -1544, 1220, 1845, -687, -1459, 886, 1113, -1066, -1021, 1621, 918, -1530, 481, 2198, -444, -1196, 1632, 636, -2274, -476, 1274, -1417, -1879, 1480, 1471, -914, 298, 2424, 993, -1099, -141, 1337, -441, -2161, -356, 1418, -973, -2052, 1647, 2054, -1872, -756, 2933, 256, -3061, 420, 2325, -1883, -2265, 1956, 1514, -1787, -490, 2299, 736, -1857, -446, 1644, -526, -2633, -105, 1753, -1516, -2376, 1838, 1497, -2481, -255, 3246, -56, -2674, 1343, 2227, -2480, -2162, 1882, 701, -2604]
2706b604J810K987j868k563K270K340k359k440L048J686l763o89L794m82l588
2721b421K211K175k993o44L362j084k946K836K123l694r53M227J87m514K14M417
2737B503q00m974J185N455k191n820L680N840m743m687O111L248o493j621O210
2752B903j05n353J224L725j776k567J575J549j863n53J899J10j661J007J987j864
2768B37j747L094R14m556K73M958k183n111L588M190m960k830N885J564n491j02
2784b277N134n62m588J187M253j792m026K421L326l567k690M348J262n169L05
2799b435N194k410m433M150L381n053j258N642J18n067J071M370j978m267J927
2814a048L429k770l124L212L010l622j658M246N64m290J079L283k688k350L612
$$ y = [-2604, -794, 2193, 325, -2238, 32, 2372, 13, -2427, 621, 2307, -1456, -2145, 1649, 1167, -2421, -210, 1965, -1028, -1672, 1690, 606, -2340, 496, 2619, -1075, -2028, 2199, 2386, -2128, -1914, 2503, 1703, -3271, -2086, 3369, 1178, -4642, -962, 4878, 135, -4552, 1559, 4807, -1686, -3307, 2903, 2798, -2555, -1331, 2394, 618, -1949, -374, 1175, -688, -1241, 658, 768, -893, 114, 2101, 237, -1510, 1584, 2498, -2058, -1785, 3173, 990, -4121, -533, 3657, -1303, -4133, 1752, 3316, -2175, -2277, 2857, 2295, -2293, -1106, 3147, 1355, -2671, -250, 3076, -491, -3181, 1167, 2429, -2740, -2435, 2759, 349, -4084, 66, 3447, -1606, -2864, 2778, 2896, -2171, -1100, 3270, 1292, -2975, -1048, 2381, -389, -3513, -301, 2709, -913, -2571, 1675, 2239, -2051, -972, 2311, -377, -2727, 885]
2829H85L07l620J401L514k736k258L808J361m214m34M396k13m678O20M869j505
2845A503n331K635N067l966m768N321L337o229j717O856j63o084K232N525l059
2860A159m109L759K838m017j998L535J197m022j130L968J69l945R66M232k105
2875D97k800L137J653l689RL169j613k191K610J123l044N41K902j581k372J944
2891B95J760k713j787K886J314l430r73M391O88m583Q64N003k255m792L748L210
2907C626n157j666N189K6n051J587M506k338l612L438K841l681k455L680J784
2922B717m595j492M796Q57n329O01N580j582m718K931L577l540j951L030Q19k591
2938h90m3J412m55n87K65p1k8L58j8l04j59Q24M63j249m22K046K10l081P37L236
$$ y = [885, 1192, -2428, -1027, 2487, -249, -2507, 1301, 2662, -1552, -1986, 2410, 2197, -2481, -1861, 3008, 1503, -3828, -1193, 3874, -92, -4860, 461, 3798, -2431, -4148, 2708, 2545, -3539, -1307, 4218, 1159, -2950, 809, 3647, -370, -2368, 1167, 2364, -1658, -2788, 1180, 1349, -2596, -1630, 2602, 497, -2303, 834, 2487, -1202, -1193, 1976, 363, -1828, 782, 1905, -1139, -598, 2304, 723, -1649, 295, 2055, -658, -2445, 441, 1755, -1675, -2648, 1743, 2431, -2152, -1288, 3715, 1460, -3332, 416, 3626, -1531, -3197, 1992, 2018, -3033, -1446, 3060, 722, -2890, 548, 3389, -292, -2747, 933, 2717, -1878, -3370, 1426, 2283, -3046, -2445, 3135, 1553, -3165, -234, 3343, -197, -2148, 882, 1701, -890, -933, 479, 24, -563, -298, -369, -397, -39, -57, -361, -520, 304, 767, -482, -904, 1142, 1352, -1729, -992, 2244]
2958B244j923l402K913K791l821j477M053L81l500M56L178r33k559Q41K298j104
2974D36k275J215K319j704j967K573J484l050m26L356j087k958J873K058k507
2989f60j118K612K40k073J77J710L5j364j62J424K70j833l4J900m53j863P12J516
3007A036j196n92J273j64o43J060k11q92R00L37j450N7J431q14j254J053O15p76
3025b30m33M65J027k50j192N53J770j258k000K181J302l088n35L157m27k965J314
3042f09K354j518j812J525J348j221j388Q60J701r92j831J335J949j677j252J930
3058G02N80j854J40J089p17k94Q03r86m06J476k08j680P20J492r62j054O39J051
3076E31k29q58rJ487Q2j842L77J782r21j606J315O23j417O5R71p92j30J061p76
$$ y = [2244, 321, -3081, -168, 2623, -1198, -2675, 1378, 1759, -1741, -1285, 1893, 960, -1599, -758, 1540, 436, -1839, -624, 1695, -9, -1976, 597, 2081, -969, -1395, 1961, 874, -2084, -211, 1847, -660, -1778, 834, 1074, -999, -822, 888, 923, -441, -603, 821, 1091, -742, -776, 1124, 671, -1192, -480, 1036, -160, -752, 521, 357, -286, 774, 563, -329, 571, 908, -542, -485, 946, 132, -1122, -69, 546, -230, -663, -198, 829, 579, -613, -60, 1710, 452, -1548, 633, 1935, -1153, -1688, 1469, 1042, -1923, -609, 1745, 227, -1585, -60, 1288, 67, -1321, -461, 1240, 248, -1583, -248, 1701, 24, -1228, 702, 1282, -572, -432, 657, -60, -354, 449, -537, -943, 533, 325, -1355, -635, 857, -105, -1159, -520, 531, 302, -556, -565, 922, 1004, -838, -461, 1321, 400, -1206, 109, 732, -685, -620, 351, -441, -571, 490, -286]
3095b86p99J365L50j554J02J469l90q91K44J051K42j049m18J586M55k258j9K318
3113A518j107k169J549J327k039o30K012P1j490M49J097k05k85L9K91L80o66m55
3131c13R66K17j315J00R85o24m33O03k90k77J053p91j162J662R47k268j96K493
3149A357k14k272N17K012m50j695K59J759J78k262l38K559j27l082N94K735j322
3166B08k130J576J330j214m92P61K35J63k41n37N33P64r32p12R25M34r15l39M00
3185a83K64Nq03l3J455j75j770J008J800j881j138K177K50k271M01K071r71j432
3203a226J421P98j094o94R28P18j080q53J104R86j729o63K325N1k589R93K180
3220A576j624j751K273Q73j872k80J364m9q79j0K42M98l66p06N20J038o89r19
$$ y = [-286, -1085, 280, 630, -924, -822, 647, 257, -634, -390, 661, 903, -146, -564, 1022, 1477, -781, -800, 1518, 411, -1758, -209, 1118, -921, -1551, 461, 532, -958, -509, 588, 383, 98, 137, 428, 808, 142, -313, 653, 870, -445, -345, 640, 16, -417, 186, -104, -381, 672, -119, -1281, 381, 1328, -940, -1136, 1357, 1143, -1129, -612, 1400, 950, -745, -486, 1273, 1451, -811, -1149, 1410, 1283, -1799, -1205, 1530, 208, -1922, -346, 984, -230, -722, 39, 274, 437, 196, -341, 192, 956, 24, -688, 237, 671, -244, -583, -183, 81, 86, -717, -750, 705, 530, -1240, -232, 1568, -313, -1451, 726, 976, -1295, -894, 1177, 206, -1226, 195, 993, -101, -795, 133, 851, -229, -1082, 22, 1008, -721, -1384, 941, 992, -1597, -604, 1576, -48, -1799, 474, 1347, -525, -805, 559, 510, -369, -379, -137, 361, -5, -711, -191, 847, 158, -761]
3238g61J097K99o44k08L2J12Q52p97j256J731J244k574q45L215K4l211N91K960
3256A861q46k529P53K322n24k389M84K529n97k636J030K853j730k211J977J411
3272A758k260q78K004k29j440O52O02l70K15K51j39R6L33n11j94J50J44J82n88
3291b22k31J046J92j709L10J806r79j940J873J343k356o83K553n0k070M90J404
3308G77m39r12L54O02J65r31j96R33j34r92N97M44q72N34Q13j216l64K033l38
3327H58k691J306K272k013j979K480J640k200j273K095J271k003j584J745J645
3342A569k382j472K763J104k758J40K551o98j772J216O24j477Q4J230j162n44
3358i84J520j3j333L16J279p3j410M9J538J87k243K85K365q47k378J446K019k004
$$ y = [-761, 336, 635, -9, -217, -185, -73, 779, -18, -1274, 457, 1701, -873, -1718, 1497, 1521, -1690, -1099, 1861, 1015, -1514, -761, 1561, 1037, -1352, -868, 1661, 1064, -1572, -542, 2311, 581, -1630, 347, 1758, -502, -1380, 624, 395, -1045, -393, 209, -161, 54, 305, 166, 262, 595, 84, -110, 40, 184, 366, -222, -453, 593, 785, -924, -614, 1192, 213, -1727, 146, 1489, -867, -1550, 1003, 953, -1117, -627, 777, 338, -574, -220, 382, 547, -384, -580, 353, 219, -773, -176, 268, -604, -70, 743, -473, -837, 1196, 858, -1833, -527, 1745, -268, -2247, 233, 1873, -327, -1600, 495, 1766, -237, -1821, -76, 1569, -813, -2285, 478, 1582, -1176, -1036, 1515, 817, -955, 261, 885, -592, -508, 722, -440, -984, 536, 523, -810, -494, 785, 712, -698, -649, 889, 1076, -1167, -882, 1483, 636, -1742, -296, 1723, -281]
3376b81r07K101K66j756Q10P52j294k24J191o40j001R29R11j089n89R94R92j185
3394b0j277J668J269k347q40L005N20l307O16L095j618k447J668J460k250q08
3410a613J827K84j326L09J078q2q12M08R31q29q98J338L63j898J76K364j250k467
3428b097K175J947l094j342L710K48l356M50L101p16k529O40K355o22k359N10
3444i79K417p08k386J277J730j426j463J772J74j239M34P50p54K08J301j262p75
3461i29J690R8k001J05J726k09j817K76J888r0j914M29K408q01k577J497K526
3478B305k337j913K961P42l277J26K921j319k228J827J651j644j019J927P50j774
3494c01q85J844N20k422k29K705m19k756J571K339k030j569K471M27k405M87K137
$$ y = [-281, -1188, 913, 1179, -577, 233, 985, -309, -533, 658, 18, -983, -54, 857, -232, -821, 173, 1165, -20, -1297, 371, 1640, -707, -1547, 1458, 1978, -1329, -713, 2382, 764, -1683, -15, 1445, -805, -1613, 214, 498, -828, -519, 559, 477, -335, 73, 1004, 175, -723, 615, 978, -920, -744, 1620, 370, -2097, 78, 2025, -1069, -2411, 1299, 1547, -1809, -1359, 1742, 1026, -1503, -863, 1492, 870, -1489, -979, 1438, 730, -1656, -379, 1351, -75, -1538, 234, 408, -831, -397, 353, -401, -193, 1108, -154, -929, 761, 859, -1142, -1037, 689, 480, -1337, -1061, 827, 737, -1177, -748, 1660, 859, -1718, -221, 2305, -32, -1945, 1016, 1758, -1519, -1393, 1528, 209, -2019, -192, 1459, -185, -1204, 723, 1473, -301, -1186, 658, 1178, -1244, -1473, 1232, 813, -1943, -372, 1967, -63, -1632, 839, 1266, -1139, -652, 1485]
3511A485j233j140J696M96j498m6J077m44j410K06J149m49j343J095J503j186
3527d2r87K131N72k545Q36K280j759j928K442N25k863R7K689j458k229J915J892
3544A568j855j495K251J435k373j309K599J033l291m67L918m62l541J486L050
3559B547k301k263K472Q99k704j07K086l42j280Q78J068p21q16P17L74j134n30
3576a157J229J24j363O30J795j034j123J871M65k208K92J764j434j392J762O28
3592H49k027k4K138o32j573J019J310r98j110J017J311j341j405J840J110k242
3608g58l98K829n52k583J163K112k218j353K025M24j994L39J708m76p99R04J026
3625A399p15r97P77M71j211r28J554M15j939L28K117n39j831J414J174j936p21
$$ y = [1485, 252, -888, 808, 1304, -194, -240, 837, 393, -1017, -811, 338, -111, -1454, -359, 1144, -42, -1029, 1102, 1674, -871, -35, 2245, 486, -1442, 1000, 1525, -1338, -1241, 1448, -10, -2239, -324, 1568, -287, -1782, 469, 1904, -469, -1778, 821, 1854, -1437, -1904, 2014, 1552, -1989, -503, 2547, 246, -2017, 455, 1354, -1350, -1457, 629, 287, -993, -115, 953, 232, -584, 133, 507, -627, -1157, 72, 196, -1167, -537, 1258, 224, -899, 972, 1437, -771, -479, 1285, -149, -1541, 221, 849, -1178, -1202, 936, 304, -1269, -250, 1060, 62, -1048, -31, 1280, -61, -1466, 374, 1484, -758, -1156, 1673, 1121, -1462, -299, 1813, -405, -1758, 267, 691, -1303, -964, 744, 268, -531, 373, 1399, 684, -313, 464, 935, -276, -1204, 350, 765, -1174, -846, 1271, 732, -1099, 315, 1489, -447, -1168]
3642a168J905j13j631Q58J087q48l39O92K19n81m14M24K26o10j25J009k73j254
3660i36Q61J277j617q34K118L48k388O89J954j160j424J234N99j026m65O67L19
3677B16k48j25K70L54l63k00L42k71o87Q74J23j273N78J613j286j315J968P58
3695A328k442j49K119l06j931R12J479p78r52M45Q72k81j070L75J083o28q01Q90
3713A65M36j323J93J035j068n99J606j49j269J013J347j355p07J454J79j614l98
3730a054J098K37j098k32J602M43j410k9J658l50j815O43J273j203q20J221L69
3747E33q39K46K43l28L15J61q17L30Q72n15o63P23N49o47m73K84P29m04r88K72
3767d17J171p37j629J315J348j713o25K115L48j663N42J569q57q96M14L52p51
$$ y = [-1168, 737, 624, -1007, -149, 938, 90, -249, 443, 662, 81, -333, 91, 317, -293, -418, 591, 318, -936, -75, 1202, -415, -1249, 869, 1217, -1171, -482, 1472, 312, -1112, 122, 721, -305, -770, -103, 216, -32, -157, 113, 467, 104, -96, 246, -25, -712, 162, 285, -988, -410, 1203, -83, -1398, 570, 1328, -1114, -1263, 856, 550, -1381, -469, 1010, 232, -720, -275, 597, 316, -754, -379, 704, 76, -725, 165, 601, -722, -529, 506, -562, -1161, 445, 296, -973, 40, 1387, 32, -675, 779, 958, -656, -1054, 44, 281, -817, -1049, 553, 996, -414, -443, 1215, 865, -950, -307, 966, -237, -1057, 164, 533, -306, -60, 183, -145, 170, 331, -486, -156, 716, 201, -462, 261, 810, 163, -310, -26, 703, 299, -689, -417, 754, 17, -1612, -297, 1051, -662, -1287, 828, 1176, -487, 55, 1624, 767, -129, 285, 637, -114]
3784a14o90J74L45j86m07Q16P19p64j98J209l56j476O88J097j304m68J540K31
3802H56r92N6P92l65n75k86K79J30l60l65O03O55o43l23J208k05p32L47n7k36
3822b13K13k77m71Q04M34j190J62J399l70j160R25R76r54q26P27N8p27o41L55
3841g76O86l46p93J085J330j340m93J635J15k026O16J410r18j007J217O93j010
3858G8m73O12J39q87n69M63R93r66n30J569O73j204n7J564l78j431L02M97n95
3877b00j40L7j4N71k3q16K34J059m51r22Q89N15o42j55K45L71k62o74j71Q16J24
3898C91j313N66J355q96p74J221J16j170M43O87q06l95J070K87r20j97Q82j0j097
3917e60l23J126L96j561k09K293K4k322P44K203j182k092J093J440j325q14R14
$$ y = [-114, -804, -630, -285, -471, -878, -62, 657, -107, -305, 904, 548, -928, -240, 857, -447, -915, 625, 856, -136, -80, 712, 347, -228, -514, -235, -105, -465, -830, -227, 428, -215, -538, 670, 465, -267, 80, 23, -213, 0, -277, -748, 56, 490, -700, -538, 861, 491, -669, 256, 1232, 278, -548, 179, 237, -490, -1131, -776, -90, -436, -1229, -144, 1186, -154, -647, 988, 1103, -923, -307, 1103, 185, -822, 395, 1088, 78, -395, 217, 356, -531, -1100, -637, 356, -610, -1140, 429, 1102, -102, -159, 1405, 1027, -404, -102, 395, -200, -340, -303, -317, 254, 231, -585, -351, 708, 257, -665, 224, 739, 97, -58, 187, 558, 296, -378, -549, 267, 391, -922, -356, 999, 103, -671, 550, 666, -504, -61, 626, -180, -575, 495, 782, -138, -335, 547, 537, -560, -883, 243, 639, -922, -1131, 1162, 1186, -1136, -392, 1811, 629, -1463, -370, 1070, -255, -1069, -155]
3934a55O47l91o04N5R35j05j029K14J001k48o14N05J92k06j2n10k27M98Lr96M65
3955e82J368o43p74J073O81j450j43P03j41o31J64L22K59k34j23M77j07p45J19
3974d07Q18o76p31J213K77j215N85J191r99p68J302J08j157k7R85j96q62R6P60
3993B97L1r49N1J141O0j467O46J530q71j256J169N52j522j81R81j00l91L92J92
4012C05K1J63l69m17M28lp98J24N55J35J56l3o1O27q2j175Q4J157r91j264J336
4033a02Q40j167k18J415l43o22K81M67o73j05J63K54q1m03N10L47o01o43J209
4052E28Q1j608O03J748j299j173J415P22j728l43J510q9r81K91R09k0n47l12N94
4071C01J0j067Q7R99m20p07J165M13j119K12J008q42q92P59K29j029J75R21m38
$$ y = [-155, 492, 101, -503, -448, 487, 382, -647, -433, 568, 320, -294, 211, 403, 197, 185, -325, -552, -54, -51, -1047, -582, 786, 143, -631, 442, 1123, -327, -470, 233, 92, -539, -375, -53, 206, -28, -151, 326, 219, -526, -407, 411, -265, -996, 217, 494, -721, -136, 1055, 56, -712, 590, 698, -459, -486, 499, 303, -559, -463, 297, 328, -621, -570, 571, 631, -836, -190, 1340, 469, -787, 382, 934, -588, -769, 212, 112, -279, 113, 305, 326, 489, 120, -297, 131, 128, -670, -546, 9, 144, 300, 267, 206, 833, 751, -424, -340, 817, -174, -1438, -102, 738, -429, -647, 768, 425, -197, 84, 551, -122, -227, -64, 190, 109, -294, 216, 563, -38, -681, 528, 609, -999, -396, 1352, 53, -1120, 295, 1017, -711, -1054, 456, 367, -614, -323, 586, 566, 19, -293, 301, 311, -756, -669, 330, -90, -797, 368, 781, -338, -126, 882, 40, -852, -93, 136, -893, -718, 203, -235]
4090b35l8N00J07j77j43j74J81m6l37L64N60n73k29R57m41j172Q78L71j270J15
4110h02J389n76r35J162O64j167j79J141l33p52K42P43j41p84j07J122m20j465
4128a198O92J529j246j079J935O26j822j9K005o94j529O62Q10j004l86P01N24
4145E07l94l26M94L54q80k60Q21J24j138O50J196j104o93J561o7j733L45J289
4163G46q53p48J150K40o32q5O42j76n29K2J98rm00M11N44m38n52R40L71j611J46
4184f23J418q05j468J441J213j696k88J744j17j475K49Q43l12q84K43P65j58p54
4202f64N19Q44q68m98J162J03j415O52J248j127p39J467J34j806K42J364j051
4219d33q97J221O35r38j69R73M58r48l49J084K09j515J50J742n24j885J113J413
$$ y = [-235, -273, 227, 334, 157, 14, -160, 21, -25, -362, 2, 562, -11, -240, 717, 276, -896, -18, 353, -917, -802, 587, 11, -924, 238, 902, -265, -444, 697, 364, -388, -146, 597, 456, -328, -435, 687, 267, -1198, -506, 1023, -223, -1302, 633, 1259, -563, -582, 1423, 729, -800, -138, 672, -332, -718, -17, 507, 113, -213, 281, 635, -245, -505, 316, 440, -698, -48, 1148, 44, -649, 912, 845, -888, -543, 746, -107, -855, 295, 535, -97, -182, 460, 284, -245, -223, -25, -34, -434, -23, 521, 83, -469, 471, 842, -769, -623, 795, -10, -1478, -37, 1176, -520, -808, 936, 819, -656, -407, 436, 124, -760, -517, 248, 90, -664, -145, 699, -169, -667, 495, 598, -817, -165, 1083, -44, -783, 684, 818, -988, -746, 618, -433, -1330, -109, 526, -412, -581, 392, 850, -98, -447, 637, 846, -669, -519, 1223, 699, -1186, -73, 1340]
4237A340j790r30J617K11j500M49J074l09l40N54J04l19k00N3j61qL4L58j33m10
4257c06O37P71j094q91J448N3j900M99J869j037j214J441Q96j520j68R41j30p33
4275d38L22M79k20j98L32K54m98l43O53Q1j164K63J733j061j633J666J179k096
4293f89o93K148R1k051L67J734l86j255N42J086k97j042Q6J032n86j012P94Q37
4311G06q12m34J109j74j064M90L32p46K57Q46n47j66R97k82r96O32L20q89l41
4330g62P92L14r04q0P53N56q21n96J106M84j632j01J908n18j659J006J363j379
4348a70q09J394k9j313M06Q62k07k99L06L57j34p06K20N80p57o76R84O59j132
4367d64k87J830m48j392O49O94o07l88N25K1j20J56l46N1M80k51n27L63K74k17
$$ y = [1340, -450, -1380, 237, 448, -1052, -603, 471, 162, -178, 376, 480, 161, -39, 14, -147, -155, -121, 237, 104, -306, 331, 1102, 8, -883, 565, 618, -1282, -783, 1086, 49, -1165, 276, 1172, -348, -516, 425, 295, -438, -116, 363, 143, -55, 277, 531, 33, -310, 343, 424, -740, -477, 1256, 195, -1438, 228, 1407, -689, -1382, 766, 857, -1194, -827, 907, 521, -734, -192, 894, 597, -445, -359, 673, 87, -925, -131, 706, -106, -540, 569, 395, -669, -179, 153, -593, -336, 510, -37, -203, 794, 512, -484, 148, 468, -421, -762, 30, 344, -560, -640, 113, 669, -152, -748, 358, 842, -790, -891, 1017, 499, -1160, -154, 1209, -170, -979, 415, 386, -927, -521, 341, 134, -165, 141, 498, 364, -342, -122, 458, -299, -975, 9, 668, -464, -751, 1079, 631, -761, -112, 582, -25, -413, 112, 133, 13, 169, -177, -126, 354, 103, -424, -61, 213, -4]
4387dPJ06J20L41l85p51P22N74j355k94J451o8j219P93J007o55o33N33P7m73q2
4408a88jJ69J36p4j99M98k42k26K65p7m43L41M09p84L31Q07p10n41Q73J65j144
4429f35K79O61j58m77M70L76k31l26j62J55J63p14lR60l52o63P33P82q43k12P39
4450E42l26n39K93K66l10J90j4l07K96N0o57N8K40q5J0M18o1o7K92j94l56M90
4472B29j54o51L05P25n87k89R92k92n10M41j11n31K19K71l21J25J80k07K43K04
4492B81n49J45M41o39JO66K02o92N57M07p75N9L19o56k62N27j13m71L38N23k33
4513G6k33J20J16J43m92l40Q49M53j086K27J404o08j052O82M06q61m15P33j36
4532a4k26J51j20J22L01m13k34M82n3k42L56K80l68M17r9m54J67L61p03k59Q87
$$ y = [-4, 3, 109, 229, 570, 185, -566, 156, 730, -625, -919, 532, 464, -755, 38, 1045, 390, -243, 290, 367, -106, -188, -189, -20, 116, 42, -157, 341, 99, -127, 138, 61, -382, -41, 368, -416, -85, 722, 12, -529, 344, 509, -635, -356, 305, 147, -330, 140, 516, 285, -41, -203, -48, 115, -599, -602, 358, 6, -657, 76, 858, 15, -197, 542, 216, -323, -30, 236, -74, 116, 102, -205, 91, 141, -516, -458, -218, -303, -293, 125, 64, -3, 289, 95, -261, 229, 75, -576, -271, 454, -133, -422, 570, 278, -232, 209, 98, -433, -214, 57, -264, -139, 41, -166, 77, 281, -268, -123, 318, -321, -320, 346, 548, -144, 413, 820, 45, 104, 423, -233, -495, 32, -81, -552, -214, 309, 76, -157, -37, 79, 222, -270, -610, 239, 692, -394, -167, 1237, 629, -423, 259, 665, -196, -611, 122, -14, -240, -89, -209, -87, 214, -199, -433, 49, -4, -246, 110, 390, 22, 439, 340, -114, 53, 414, -289, -548, 339]
4553C39n1p02M44M14o67J47K65n94m8O92l53l41N21L55k95o1k6J96L0p90j69J193
4575D99M5j452O37J759j046j634J022J208j415r52J204N65p48m88P12R49q11q42
4593g88Q40R10j007r75J304M82j111j15R89m09l75O6M8O0n6l22J00R06l25o56
4613d34P76M69r03n42Q31J49p32J12N87R5k61m57M42M55q17o64J385J56j426M01
4633c78J444p07j210J093O79j345l53J147J37r22j51J027K16r54l98J082L96j673
4651h70J77J715l88j524Q04J333r56r48P70L70o95m01J86O16K46o57k03J013J02
4670F90j261J34Q64l89o14L09N34K05l36m01N72N08r82q91J246L84j289J08J257
4689F48l69q88O10M45n00j91J09R3k2j37J55K68k08m25L96L02o63Q2Q60o40o45
$$ y = [339, 288, -414, 30, 444, -223, -76, 189, -405, -453, 239, -114, -455, 66, 421, 126, 65, 39, 235, 265, -525, -694, 499, 544, -908, -271, 1488, 442, -1192, -170, 1038, -377, -1329, -125, 440, -308, -796, -84, 865, 54, -788, 52, 962, -45, -1020, 284, 766, -345, -460, 529, 120, -255, -189, -141, -81, -137, -459, -359, 547, 222, -434, 342, 811, -92, -634, 197, 346, -386, -274, 313, 408, 147, -310, 132, 587, -230, -894, 491, 647, -779, -378, 1066, 359, -851, 242, 921, -424, -777, 370, 507, -415, -566, 461, 677, -277, -675, 407, 803, -870, -693, 1022, 634, -890, -86, 1247, 291, -657, 113, 483, -212, -613, -427, 189, 435, -222, -425, 588, 690, -571, -437, 427, 38, -576, -267, 267, 472, 136, -265, 307, 815, -167, -1058, 188, 572, -717, -609, 648, 279, -609, 1, 446, -54, -245, -136, -43, -65, -202, -47, 221, 13, -412, -16, 286, -377, -295, 565, -75, -720]
4710g20R13N71j101o8P90k69p06K85L93l2n4j1K98J58o22l92P08o3p42P9J050
4731D65n00o0O20k6m79K24k43k84K63p4n06L66N00k97M2N36j28l10j4l0r2j34
4753a61p4K8M18j31n15O11L07q99O1P62k82n38M99M89n30j56M52q3k29q5J67R7
4775B08j22m25M09L81p72l41R88j16j007M27R40n08k15Q71j92l35m1kk84P0p3
4796a39k25L17Q6q3J51N1k31J18L4m25L4M48l56k35Q87J51j005K98Q52p33o84
4817f89N58L25n78q6O00K28j26m69K01N28l06p86M13O67o40n16R05j08o46L04
4837b21K29l62K82M52m88M08L53n44j90O10k13p13K3K66j29l08J75K76N00n54
4857a48k35Q30R6r48K2J138m46r48Q03O03r07l72O56r9n53J16M89m3r1m0N07J99
$$ y = [-720, 193, 764, -337, -405, 385, 116, -590, -305, 88, 56, 2, -9, 289, 447, -175, -567, 141, 78, -664, -585, 465, -35, -95, 525, 499, 20, 244, 1, -283, -20, -94, -600, -234, 266, -31, 11, 547, 419, 109, 95, 65, -27, -161, -235, -207, 211, 80, -435, 176, 483, -416, -355, 407, 125, -413, 86, 575, 45, -111, 341, 258, 29, -56, 111, 208, 86, -339, 70, 451, -321, -662, 326, 210, -797, -370, 570, 62, -153, 718, 526, 191, 150, 148, -136, -66, -139, -364, -47, 39, -44, 107, 158, -73, 45, 79, -346, -312, 136, -220, -455, 432, 583, -422, -124, 728, -5, -689, -131, 194, -384, -470, 130, 358, 232, -237, -36, 492, 186, -600, -187, 480, -160, -676, 229, 121, -525, -221, 8, -354, -72, 380, -108, 300, 653, 109, -81, 529, 316, -397, -374, -108, -237, -545, -370, -94, 406, -148, -383, 447, 543, -405, -383, 755, 309, -639, 164, 767, -140, -512, 144, 45, -508, -392, 97, 54, -37, -77, 430, 629]
4879F29o70n3O22l83p92O54M20q93k1J029k88q00L90N72p79p8M59j8R6J56R7J56
4901E05q9l73K6K56m13m72N25R2k55J04J59j69L58R9o32L17M17n91m23Q68Q4p87
4923c94K44O86k60o38L56M09m07k54J8O03q3p65K54Q19o65p58R69M89r13j98J033
4944E45l77r57N07M65m45k25M02L77j19q1J01L82j47o64J77M01r08j76O12j8m30
4965e78M05M87j41m3K10l16L2J57m73o2M66J1m73M24K21m34j93K50O7j50j38j44
4987d15M56J61o78L12O38j63p53O48L80p87j11Q19m18n80M59J86l48o3K30J61
5007A34J69k27K3L48j31o71J93M92p11j44N74N8k41L14K70k85J38O7m56q5K16
5028D5k58j19M55j91n1M29l8k95L19p3n36J76K26m07J49L19k0j85K21r9K7J16
$$ y = [629, -41, -94, 528, 145, -647, 7, 427, -466, -487, 542, 254, -546, -156, 416, -363, -441, 18, 0, 96, 252, 349, 505, 416, 43, 69, 325, -88, -560, -35, 57, -198, -94, 65, -104, 254, 353, -279, 38, 455, -136, -559, 309, 393, -394, -150, 536, 276, -362, -6, 403, -4, -258, -240, 363, 280, -485, -231, 588, -77, -835, 134, 623, -290, -488, 545, 168, -789, -282, 183, -262, -487, -85, 292, 173, 92, 193, 575, 428, -236, -59, 342, -566, -742, -130, -148, -578, -173, 314, 173, 130, 340, 24, 56, 213, -260, -322, 144, 155, -318, 106, 327, -107, -300, -50, 17, -133, -271, -415, 41, 202, -476, -164, 474, 311, -442, 206, 586, -201, -312, 507, 89, -491, -32, 154, -194, -257, -27, 134, 303, 76, 99, 447, 316, -355, -162, 330, -381, -525, 49, 107, -134, 180, 450, 165, 303, 370, -86, -171, 45, -213, -332, 123, -68, -119, 310, 272, -23, 296, 223, -313, -137, 89, -318, -169, 150, 130, -55, 166, 67, 94, 210]
5050B10j16m62O40O9n99o2O76l22l24J90J36k64J84n4n2M69j76n02L63L51m83
5071a28j62K89J21k09N6J47j59K40p6l67J72K9k71J43K29j98K7M05j13l26M15
5092B64j32o23L78L24m48n4N27k56k38K24J6jj23L3N3K73k81k75P25J03q95K51
5114a55P01p42n23P43K20n87J50O09k15j87M8J6J0o7k30J47M21k29k38L45K2m24
5136a65K6O1m01L16N2k62L52N36k31m07O09J57n16m8L56m80J6M4l85J71K46k95
5158b48k84N03K76m30L2K51K18Q4m76j47P30l42q87M57R84o23q91J029O48j094
5178b10k50Q26K0o74j48L17L85m08k07N14K94o65j76P46j50j018N73O51o82j88
5198d50P86K04m68LK06r6j88l08J7K86j36o29L59P78m32m03O00L35m06k09K93
$$ y = [210, 94, -368, 272, 341, -258, -320, 356, 34, -290, -100, 36, -228, -44, -98, -150, 319, 143, -359, 4, 355, -128, -290, -1, 120, -89, -33, 114, -45, 195, 119, -248, -76, -47, -318, -175, 54, -144, -117, 288, 175, -151, 264, 132, -491, -113, 211, -237, -291, 236, -20, -258, -34, -18, -19, -142, -109, -56, 217, -64, -339, 386, 489, -406, -155, 546, -196, -719, 24, 244, -343, -193, 416, 201, 14, 62, 78, 88, 21, -209, -62, 359, 130, -108, 237, 259, -165, -139, -78, -479, -163, -111, -373, -21, 515, 284, -123, 486, 643, 127, 79, 435, -45, -29, 15, -370, -199, 47, -248, -532, -29, 247, -183, -151, 100, 318, 402, -74, -221, 509, 167, -720, -263, 721, 98, -793, 236, 884, -210, -460, 366, 386, -288, -436, -119, 266, -142, -349, 165, 459, -206, -382, 364, 214, -804, -231, 420, -262, -450, 336, 540, 72, 75, 281, 185, -3, -311, -294, -8, -144, -773, -414, 364, -68, -471, 129, 464, 58, -151, 142]
5219A42K17q8l77j93P19j96q74L07Q36o39o29Q97J62q53O2Q05k49n72M08L92M5
5240C22l80Q6O31j86q74K44J049q71r39P58O13p86m26J051K10n36m4J60L40j80
5260B42p19m8Q32p2r08K95J036k14p53K49N39O3p88k27P97K41q41k02J147k2j458
5281h11N42J009p38p82Q98M04p44l38Q87Q6m61l6L33J59m48p5M91J48q48O1N94
5302C31m66m75N25K33o70M06M59k40k40L42J57n35L13j32j27J21J67l93J24K61
5322A61k95M3J23r8j03J35j12K75qk88J14P12n35q21Q15N71j178m19J271J13j092
5343f16K43Q78j79q28K24P25l03n33j02R09Q4r08K23Q02o14n33N48R6m52K57K76
5364A97n11J96M76k81l66N12R5n20O3L67n8k77j11K39K63k43m22N00K92p16kO91
$$ y = [142, 359, 271, -106, -299, 420, 224, -650, -343, 493, -146, -775, 122, 284, -569, -507, 298, 49, -523, -115, 277, 322, -58, 28, 659, 473, -401, -157, 892, 21, -918, -160, 453, -333, -759, 292, 502, -34, -78, 82, 422, 242, -477, -525, 307, 235, -673, -378, 658, 444, -309, -60, 479, 542, -246, -473, 324, 565, -276, -478, 669, 647, -811, -269, 740, 2, -780, 118, 522, -222, -560, 327, 413, -48, -84, 249, 408, -40, -115, 376, 524, -324, -263, 331, -135, -610, -85, 148, -522, -116, 343, 103, -137, 205, 362, -173, 140, 8, -119, 2, 169, -224, -100, 161, -134, -91, 32, -66, -169, -34, -146, 129, 121, -167, -53, 659, 124, -697, 118, 689, -489, -908, 363, 476, -616, -373, 505, 326, -502, -278, 447, 144, -389, -491, 418, 502, -406, -183, 619, 5, -528, 20, 116, -336, -79, 197, -314, -118, 358, 77, -289, 223, 318, -202, -139, 228, 170, -107, -218, 21, 284, 41, -381, 119, 411, -305, -307, 384]
5386C84l04l84M82mm58K89L99m87k32P81k43m39K86K48k14l28Q7J83K9l20L7M67
5408B59J0n16L63M55n58k32M40j13o85O43J68m08J00N35k92k59K78l6l06p2J99
5429b7l1j09O9J12M6m0p5L03q3n42M15L60n64k43P29K07q55J50N80l63m06K81
5451h6L27j82j45l6P6J10k78j33M20M4l86J63L46k48O9J46k06k8L58m26k86N48
5473A67K5n25K18L49k35k17J47j04r9K02J1o9L24m0j09J40J01l06O6N9l51L02
5495E6J94n85l7P25k11n35L43M61l85l50M11O0j19m4j87K34J76l27j55N57j55
5516A27m03K13L18k67KL65l25r9R8l9j68K10M5k17K90j63o5L44k4m41J40M44l28
5539E7k86L85R2l17k0J32j44p0J85k14K36J21l37J35K99k43k89N34p8m99K88L41
$$ y = [384, 80, -304, 178, 174, -284, 5, 404, -83, -315, 466, 223, -216, 70, 318, 104, -224, -137, 46, 75, -245, -208, 259, 269, -247, 116, 571, 13, -219, 221, 108, -577, 66, 234, -174, -74, 461, 169, -90, 188, 152, -154, -226, -27, -58, -167, -98, 14, 60, 20, -55, 248, 165, -377, 38, 398, -166, -409, 320, 527, -328, -178, 402, 39, -367, -86, 241, 59, -86, -122, -46, 64, -214, -347, 73, 117, -269, -106, 240, -8, 61, 207, 1, -27, 331, -95, -381, 167, 192, -333, -115, 234, -1, -218, -71, -175, -274, -72, -61, -130, 194, 154, 45, 185, 286, -20, 46, 105, -246, 56, 250, -335, -372, 353, 142, -393, -50, 411, 26, -324, 87, 147, 28, -16, -203, 31, 207, -120, -275, 282, 127, -276, -63, 255, -12, -10, 355, 30, -69, 29, -10, -178, 32, 77, -140, 150, -13, -78, 266, 242, -199, -59, 385, 57, -229, 156, 248, -69, -89, 43, -101, -171, 14, -200, 36, 157, -180, -45, 254, 11, -278, 256, 178, -321, -33, 308]
5561C08m40n3K77mj40j01N4K38O6l50j90M70O5n11R7O14m09l40N11n7k73j7O3
5584a22m5K87l18j07L16K39o27J69L43k38j05L16L0k08J88K1j43J47J0m01J80
5605f8K13k83m2K49k38j01M44j86m17M87K76m93n0L74J0k83L2J74J64j1n15L3
5627b31O08l55m73N57M17o39j55N38j75l77K99K7k42K91r9m7Q4J19n3j03J78n8
5649A11L8J01l73Q8L54l63j27K98J20n57R7N63l58j12J77l5N0j%j09K24j22j78
5672a14kL23l00N0J38k00J26J53k78l4L47j92l84M00M7k83J61L04m35J9N03k17
5694A32m47K55L60l09j57J25L13j34l85R5N52m02n19M63N88p18l58Q55L4p35J82
5715b10P11m36m57L19J90j07k4N7k5K9j97j71K50P6k40L31o8k41L95r6l48J3P24
$$ y = [308, -132, -185, 92, 88, -52, -153, -99, 139, 205, -145, -335, 135, 200, -311, -214, 400, -9, -349, 162, 105, -168, -185, -122, -167, 120, -198, -305, 11, 250, -377, -208, 135, -103, -208, 108, 138, -70, 118, 139, -4, 143, 153, -248, -68, 145, -138, -180, 69, -169, -270, 174, -12, -429, 58, 334, -159, -209, 165, 175, -108, -76, 98, 262, 251, -264, -231, 377, 22, -451, 106, 523, -116, -271, 267, 92, -285, 14, 41, -201, 90, -9, -56, 28, 147, 94, -9, 169, 111, 149, 250, -123, -35, 319, -44, -171, 127, 247, -310, -213, 350, -8, -120, 57, 22, 72, 71, 71, -38, 186, 64, -114, -116, 207, -93, -43, 95, -105, 21, 174, -104, -138, 209, 17, -367, 33, 80, -203, -42, 262, -173, -154, 349, 132, -315, -60, 300, -9, -166, -41, 272, 138, -247, -152, 400, -2, -521, -58, 530, -188, -546, 309, 343, -392, -210, 501, 65, -392, -73, 117, 10, -14, 43, 18, 47, -150, -321, -71, 5, -235, 96, 28, -213, 182, 86, -262, -249, 475]
5738D75n39m55N79K91o75J11N70k36l97L7L80j73j52l2L28N5k51n3M32j12l10
5759a27J08N0j52J40J32l44J31N50m94m49O25L89r96n6Q64M5p14j5O39J17p34
5780b91m2O96R8p97j00R17j48r28K49R11n10n08M70J78m11J39M1R1J60m4m06J84
5802e1L89l28k65K85J37j71k74K26K19m1l84J19N18k23n77N16M65r08R8P28k64
5823B14q49O53M29o63j24N39N9n36J66L11R5l38l09N46J46p01l9Q82j80q12M65
5844d6N55o89k49O55m3k69mO7J05o4j00j78M95j6n81K42L91l62l03L58J97k95
5866a34pJ32K80j2j96q1L57n6n82K96M82n69n11O45K11n76j9N56p3k54J60O5N0
5889A64k2l09K45K92l59r9M42j46l40K15P5k38O7j1l21J70L68l09k39N53J23m72
$$ y = [475, -64, -519, 60, 351, -324, -213, 357, 121, -276, -239, 141, -32, -184, -216, 112, 167, -84, -137, 295, 183, -127, -19, 31, -121, 19, 151, -193, -62, 488, -6, -455, 170, 559, -437, -493, 371, 416, -298, -313, 326, 443, -291, -333, 363, 461, -336, -436, 481, 333, -595, -346, 565, 55, -453, 17, 195, -216, -77, -36, 55, 215, 171, -235, -51, 338, 10, -255, 30, 167, -4, -278, -52, 167, 126, -258, -139, 379, 156, -421, 95, 560, -348, -250, 478, 214, -635, 18, 447, -216, -340, 199, 258, -278, -112, 199, 294, -44, -353, 193, 339, -362, -401, 481, 301, -511, -46, 509, -180, -429, 226, 183, -86, -90, -23, 82, 18, -82, -260, 235, 219, -362, -120, 271, -91, -394, -36, 161, -134, -141, -9, 271, 259, 63, -18, 339, 283, -299, -3, 479, -90, -601, 44, 255, -321, -340, 216, 143, -111, 49, 114, 164, 142, -167, 78, 370, 11, -88, 354, 208, -132, 83, 158, -80, -13, -24, -345, -175, 193, -116, -355, 198, 321, -151]
5911a51K42L70l18j68R8j31N4N8j80lK84j38j34M46j41l10K05l3j58J12pl30J45
5934a88L91k99k26O22m7n66K02M74k32l61N00j08j96l5RL61j69k92m0L26k19l71
5956d64L13K33n58M47K52l75j5O71j98o12M83J91m89k73N62r4m60J09K16J19l21
5977b63j1N83j71l43MN29j77n45M15K59n27P7M85l82k66N71p8n37L64L38n37o4
5999b76M20J02m80M2L51J57l63l42O66J08p95J01P48k99o69N03N48p83j05P51
6019C85N1o88L95K53m90PK77q2j86k4J77k6j95Q2M20k03m16L12M80n46l32N55
6041B06J50o87J14O80m61m76O29O4l80L2L51k09m1J37k5n6r1K48O1l50k6M18p3
6064B15m10J4P12n66n54P18K48q06n0J001l55o68M40N19m54l12M07J55l91k93
$$ y = [-151, 91, 461, 143, -25, 73, -58, -4, 54, -126, -129, 155, 17, -117, 329, 188, -122, 83, 50, -108, 4, -3, -333, -188, 203, -96, -322, 300, 253, -313, -111, 363, 131, -230, 270, 162, -34, -69, -60, 301, 132, -160, -200, 126, -93, -464, -151, 82, -476, -29, 223, -152, -167, 504, 306, -306, 177, 368, -121, -394, 168, 74, -386, -277, -61, 58, -263, -274, 309, 138, -205, -201, 328, 151, -394, 21, 280, -247, -170, 315, -67, -333, 238, 160, -377, -13, 325, -212, -276, 144, 246, -234, -192, 159, 316, -47, -389, 277, 385, -410, -309, 439, 140, -529, -26, 522, -261, -366, 385, 436, -252, 143, 396, -94, -87, 190, 108, -78, -102, 75, 49, -146, -64, 356, 153, -263, 49, 529, -17, -349, 206, 356, -331, -217, 463, 2, -474, 155, 219, -161, -129, 222, 13, -28, 109, 84, 28, -63, 185, 246, -104, -130, 288, 215, -195, -181, 531, -35, -589, 129, 377, -429, -479, 522, 167, -501, -61, 458, 4, -308, 99, 254, -137, -430]
6084d30K30L37k29m14P75K6o31J00N90l19m01M76K1m71K05L04k05l03O45n7n39
6105b90K69K71l27k24K38J52j11l25K26N01l47k92N19K69o22j40M80rn46N9L73
6126A24l78K7L62j93j28L02Q7k10O7K42k56p8k4J09J24k56o4M01j13k38J6L70
6148B93n26j08N03j02m83L67N75o47j83O71J36n32J3L52k12m06q8M60O6n39Q6
6169c04O96O6p76K27O25m05l51J54J4j82K48m1j76K51K08m44R7M36j37l51K48
6190A03M8j38k46J67O4K32k55k31L73K5l60O4K81l39q9L28j30k35M80J21l72J50
6212D1N26l78l77K91J21l82j69O0J87K5l75J70M91j81l83L57K87l49mL60k50k91
6234b23N17k62k06J79J59l61k7K55j56j06K89Q8k33J85k6J00J1j14j53K99j69
$$ y = [-430, -200, 137, -92, -506, 269, 295, -336, -236, 354, 35, -366, 110, 131, -340, -135, 169, -36, -339, 306, 249, -290, -21, 250, -77, -301, -63, 89, -22, -347, -121, 380, 33, -259, 260, 529, -93, -233, 247, 238, -308, -249, 124, -254, -227, 135, -58, -186, 116, 203, -7, 60, 302, 46, -32, -56, 53, 177, -79, -143, 258, 145, -93, -77, 293, -233, -341, 162, 60, -423, -56, 519, -128, -311, 360, 496, -36, -23, 329, 117, -289, -377, 83, 149, -390, -304, 392, 458, -318, -91, 534, 129, -222, -68, -54, -236, 12, -29, -205, 46, 254, -190, -93, 343, 206, -145, 103, 151, 13, -233, -66, -2, 230, -25, -256, 117, 142, -218, -154, 127, -212, -301, 27, -103, -338, 142, 263, -109, 41, 567, 189, -188, 103, 224, -158, -327, -267, -80, -55, -430, -260, 231, 50, -333, 24, 311, -38, -42, 318, 68, -223, 294, 32, -174, 5, 164, -197, -224, 31, -125, -231, 58, 146, -87, 98, 72, 172, 183, 69, -84, 215, 46]
6255D6k59J93J37k92j85N17k12k49M50J37l39J82J77k18j17J71j04j04M3Mj35
6276a57J00j0L9L8Rm4L21p3l07J97J96l88q0M14j7n91K75L50m51K8K83J02l61
6299a27Q9K50j84j02m0K26J4m62P7N21j75m75L14M85n75k03M89J38m84J02J26
6320Dr2J31k0o1L14Q1l19k2M9j26j23m3R3OJ7k07K17M74j79m77L04N96p16k54
6344c53N76L9n37o4M89J41m62Q0Q2P3k07M8K26r3m30M06L16n02o1O41J2p07K64
6367b3N27m60m95L72K19l33k20L74K31n5k71J87M05m34k33J88L15m52r5K62pj39
6389a37J91j8j37L27R6m03J80J24m45q7M91j1m47K19L72k06k02M8L28k6n26Q0
6411a89N45k92n63M45N69p93j85Q49L9p81K48O89m60n75M49M32n02k14M04K43
$$ y = [46, -213, -20, 117, -175, -360, 157, -55, -304, 146, 283, -56, 126, 303, 85, -32, 139, 35, -69, -26, -22, -157, -57, -67, -28, 10, 19, -25, 296, 223, -84, 113, 309, -79, -159, 255, 238, -353, -78, 272, -179, -151, 132, 234, -127, -38, 212, 28, -74, -114, 112, 126, -336, -259, 262, 87, -388, -74, 411, -164, -367, 122, 260, -224, -122, 4, -88, 43, 23, -38, 276, 357, 38, 16, 65, -61, -184, -227, -134, -128, -111, -318, -101, 373, 194, -283, 21, 617, -99, -353, 223, 262, -275, -339, 150, 291, -171, -91, -9, 64, -143, -95, 131, 38, -392, 14, 330, -172, -233, 408, 420, -287, -23, 504, 44, -451, -79, 140, -193, -413, -39, 192, 137, -134, 53, 458, 24, -209, -21, 294, -158, -253, 9, 2, -137, 54, 36, -101, 226, 322, -81, 99, 223, -222, -309, 182, 171, -276, -57, 315, 109, -93, -45, 283, 257, -269, -189, 356, 64, -499, -54, 515, -278, -463, 386, 425, -356, -108, 581, 121, -454, -5, 427, -75, -289, 115, 358]
6431C58m92j72O17K87q04j43P44j62q13J57J001o11n26P15K88o85R5K91l1j76
6451f2j51N3K25J69l99J9M64j46k31o6K39M0k05m08K45N53n01n75P08O28p92l89
6473e82Q44L47j031J17O74j47n09n4O41j02l55j66N38j1n99K99M05k29l98M70
6493A52J22l89L6L53m06l7K35L7k31L22j03k84K39K6j34j23L32j16q8J15k8M6
6515G6M2l77L13K58m23l20N70O3m81M1N05j15l85K94K59m48J71Q5j23L3P7j45
6537c0n1J00RL1j39M9J32Q7k59o1M16m0n58K20K73k82k17L77J0j00q5o9J92J50
6561A55j81k39M30K0l13K7L21K0k73J6J25J90k02j42jQ5j59k04J31J53j97oK84
6584D0l1J2L05j31l95L39P3l49J05L43m97k05L45R0j72P4K03M8k51q4K0K12k19
$$ y = [358, -134, -306, 311, 598, -206, -349, 395, 233, -580, -423, 578, -33, -559, 156, 444, -241, -146, 145, 114, -62, -213, -160, 65, 234, -165, -146, 318, 172, -59, -125, 114, 154, -51, -459, -214, 339, -162, -737, -29, 599, -193, -582, 262, 609, -422, -305, 369, 222, -287, -341, 300, 198, -157, -323, 215, 204, -395, -96, 309, 80, -318, 152, 274, -115, -79, 274, -132, -169, 66, 103, -128, 194, 91, -193, 46, 72, -62, -185, 147, 31, -57, 58, 30, 76, 118, -259, 54, 312, -111, -431, 139, 202, -279, -238, 267, 152, -233, 61, 320, -128, 43, 128, 5, 38, 115, -30, -81, 19, 28, 59, -80, -31, 101, 188, -71, -132, 284, 244, -314, -94, 179, -103, -320, 57, 67, -33, -118, -187, 5, 155, -26, -265, 165, 185, -128, -101, 220, 240, -33, -17, 108, 298, 96, -46, -47, 38, -121, -325, -194, -41, -238, -244, 40, 9, 21, 326, 195, -200, 139, 212, -137, -32, 311, -186, -391, -46, 44, -128, -54, 149, 197, -54, -138, -118, 94, -125]
6607a25j00M69k4m44K04N26m23m22N23J72o41Q9L80k30k82K83J61j52J6J26L1
6628A37k65j8K03o5k39K7L45j57j65L86K09n18PN08k76l84L82O9m39OL63k31k53
6651c68K93K21k39L8J33K00l98j02M63P8n28O3P54l71p09N04N74p15m70Q99Q3
6672D03r40K17P20l79m46L76K29k38k03M63J42n02jK61ml23O3O19l86n71O79J87
6694C66p12J00O17k78n46M57L94o17j39O09mn61K36L11j39m51J86O44l85m85M35
6715C8L01m92j59N92m9o16J91O36n57l09O48P5p41K62L88k45k99M88J79m26j70
6736b65M39K10o09j82O76p6n95J10Q26n09n67O63M52p45j58O71j06o17L35N32
6756D85n97j51M31J00m42p6L71J54l92m4N58m3p12L24L83k76l52M38M3m87J65
$$ y = [-125, -225, 244, 220, -224, -20, 506, 83, -339, 184, 356, -285, -196, 184, -46, -328, -45, 116, -36, -20, 106, 137, -128, -146, 57, -8, -247, -220, 125, -32, -197, 189, 398, -120, -113, 395, 119, -265, 117, 186, -253, -247, 116, -115, -368, -75, 146, -93, -55, 78, 278, -120, -222, 241, 319, -209, -146, 608, 237, -472, 32, 606, -109, -579, 320, 403, -537, -320, 400, 21, -425, -49, 180, -58, -261, 202, 344, -158, -159, 102, 98, -225, -162, 457, 71, -500, 179, 366, -346, -246, 371, 93, -453, 4, 398, -219, -358, 251, 247, -314, -78, 233, 94, -357, -171, 473, 88, -397, 38, 339, -153, -312, 280, 231, -385, -194, 442, -115, -424, 224, 299, -442, -180, 208, -37, -336, 152, 331, -95, -265, 174, 384, -225, -407, 269, 193, -402, -292, 534, 25, -542, 121, 573, -172, -330, 341, 235, -382, -47, 485, -112, -263, 168, 268, -174, -250, 121, 275, -117, -161, 397, 354, -358, -34, 349, 73, -279, 159, 202, -285, -120]
6777a20L18l59rN89l74l15L38L97m68l31L67L66m98j89M46K67n82k51O50K65q70
6798c63O7P83k58o44L48M00m84j71N16j00l33L74nk47J19J62Q1k66q6K79p3k32
6820a33p8N07k14m58K12N50m36m23O37o7l60J93L92l63j33M24k09j53J30J19l01
6841a64L3J41N0j92N1J19N3j48k58M53L9m54m5O83l27l24L44K89l90j98M34k26
6863c7j26J12R1Oo4j75J69J03j70p5K56j1k05J76K2j59K17p3k44J38K86k22j65
6886a50K56J71m79O5M03j97m37L16J00r3o7m4J89Q9l27P4M11l6m84K88K90l55
6908a7j23L09q6j2q1L1L8O0j63k36L11K72m16K4L76j18l98K41K26j89r7p4J48
6931B6J57j41j67M09N7o15R6M47k53k76L61L4m27K34M12l51j25J12J51k42m1J58
$$ y = [-120, 198, -161, -170, 419, 45, -270, 68, 465, -3, -334, 33, 399, -99, -288, 158, 425, -157, -408, 242, 507, -363, -296, 487, 229, -415, -67, 333, -151, -322, 194, 94, -239, 135, 130, -117, 2, 164, 245, -21, -107, 172, 99, -133, -211, 296, 82, -376, -164, 386, -50, -473, 164, 97, -263, -70, 322, -41, -174, 250, 41, -112, 18, 137, -164, -131, 10, 60, -132, -81, 38, 91, -57, -315, 138, 177, -277, -322, 361, 34, -290, 54, 343, -47, -245, 189, -37, -163, -51, 40, 46, -18, -193, -24, 79, -91, -166, 90, 79, -126, 50, 72, -87, 130, 57, -187, -49, 237, 15, -150, 106, 277, -202, -137, 266, 69, -368, -52, 48, -45, -112, -156, 33, 122, -205, -131, 280, 244, -240, 48, 338, -17, -140, 169, 83, 71, -10, 21, 59, 119, -44, -280, 31, 303, -113, -89, 287, 169, -229, 12, 238, 49, -48, -122, 26, 183, 42, -125, 284, 341, -274, -178, 269, 16, -260, 101, 135, -292, -58, 354, 3, -122, -10, 141, -101, -142, 16]
6953A6J7m7j02J72K24k99k17L39R5m73N7K31Lk95K20J61j92m5J48qJ03j53k68
6976c13M46J21k70k45L66k2l12J38K7K17l8k48N8L30k64l28L98L06n08k56O24
6997B27J7n55J53L11j35k09J13J36q3jl8J83n5j73J01K88l35p3K19J82m80J46
7019f1L61l69p7L75o5l12J47J42j31r5J28r8O5N1M6l8M4k71K31R9k72L2J73p3
7043C2j80L51Q2k12o0L20l73k48L79J00n26J91L07j40n3M1Q8J5j05q2L40o9l43
7066a45N7M12l42l61M78J56m76P0K62R3n22J94K12pj23k07K86Rk13l9L09j3k15
7089a25J71J63m04O4J66j1j94J77k7k14L56Lk93Q4K97l22j85K15K50l16J2K18
7111H5l9r4o1J77J04k76j87M93j89l28j7O19k25m97O79J14m74K5L00m9l28R0J57
$$ y = [16, 33, -14, -116, 56, 280, -19, -236, 103, 198, -275, -218, 13, 16, -279, -59, 102, -90, -135, 13, 5, 108, -45, -313, 133, 254, -16, -261, 105, 83, -229, -91, -64, 153, 115, -133, -75, 255, -9, -337, 61, 367, -141, -397, 227, 244, -311, -158, 153, 18, -191, -78, 58, -25, -26, -64, 119, 64, -109, -8, 280, -55, -128, 91, 273, -207, -61, 300, -69, -146, 229, 164, -148, -1, 141, 10, -85, 43, -55, 10, 61, 107, 69, 113, -158, 73, 172, -100, -68, 105, 32, -148, 203, 285, 73, 13, 333, -40, -288, 91, 191, -335, -144, 163, 23, -30, 11, 99, 114, 9, -73, 267, 198, -145, -88, 324, -18, -379, 99, 255, -221, -151, 111, 204, -318, -124, 88, 81, -42, -249, 37, 46, -167, -206, 103, 90, -125, 46, 209, -195, -131, 35, 24, -170, 7, -20, -234, 122, 125, -168, -84, 213, -109, -294, -79, 171, -145, -133, 85, 46, -48, -109, 68, 172, -104, -291, 202, 13, -315, -332, 287, 62, -435, 244, 358, -116, -91, 209, 160, -168, -78, 79]
7134G9P7l36J69J83r7k63Q1L14k01o9K56J7m17J31L04j60k40K74k0o3m0J24j54
7157e1l2K14j76J31k21R8rK9q2J09K17k46J16J15j09l44K74K38l57r4M76k98k32
7180b34K36K36k84j7J09j5M6j05n3K71p6k86P0K06l33M9J99J26l59J43J36m3O6
7203H8L9j61Q0J46k07j99L36j16k47K05J59j23n1J88k41Q6J81k46J01J68j49j03
7225f6J3K2r9O4l1m2oK28k19j11M42j61m7J80O8k81J36j22j0O6m5j42p1J53q6
7250a67j16L11j9k18J93J71n0m3j81J58L3j58j26K59L82n67q4M45N1o52L21L31
7272B74k60l91L11K28k63q0K63J2l2j88J82K62l46j30K89k0m31K18L17k88J03
7293C0L30l81k92N61P1n52J50K60k97k81M76J18k80n9L06M2j52j85J76J73m22
$$ y = [79, 156, -180, -11, 172, 75, -188, -107, 207, 6, -63, 193, 210, -207, -76, 228, 68, -172, 102, 82, 19, -21, 103, -51, -83, 131, -45, 86, -135, -37, -46, -17, -99, 10, 227, -19, 97, 212, 103, -241, 33, 271, -86, -180, 296, -2, -234, 2, 238, -46, -63, 46, 31, 77, -28, -81, 190, 114, -172, -102, 104, -229, -180, 19, 145, -214, -71, 65, 22, 88, 127, -34, 46, 192, -15, -214, 122, 6, -241, -36, 123, 0, -51, 137, -104, -18, 163, -83, 18, 186, 37, -66, -53, -31, -130, -66, -97, -139, -145, 83, -136, -247, 195, 34, -13, 167, 235, -46, 90, -32, -42, 24, -21, -163, -234, -81, -167, -283, 28, 9, -209, -16, 155, 105, 62, -119, 39, 72, -86, -212, 47, 429, -138, -222, 223, 274, -378, -57, 274, 14, -377, -66, 162, -101, -181, 82, 94, 62, -126, 56, 318, -28, -158, 131, 111, -320, -102, 215, -73, 30, 360, -21, -313, 248, 319, -233, -83, 177, -120, -401, 75, 193, -87, -146, 160, 202, 50, -135, 41, 214, -208]
7314b08JL80q6m61L15M52n35j75N45Q9p29M4P24m30l12L84L73k70l11M13J76l58
7336B1k44K82J64m52j12M13j01l89K86K94l77P7M48j61m91M09K15m47k21N56o9
7357A01l72oN01j21l58J10M69j61m74K14L58k94l84O39p2m43J88N18l23n07N78
7378A61J28n49K4N08k62l69K05M84l17j94K14K89m42k51N84L1n00j08Q19l40n60
7399d45N31M26o91q2P57j87o57K72N40l98n01M15K85j89m40M70K57l52k95N92
7419C08n8o02J96M38l53k71N62J29p48L83M22m16l42O13J64o71j14N53n3m05J22
7440a43M19j55l14L0N30k29o06N42K81n45j81O70qo07K97L95n23k21N53Rm69L12
7462C7L13k77k13J12J14j60j29J52L03m37j19N65m1o01K16M50l92l20N35J20m98
$$ y = [-208, -207, 173, 87, -374, -59, 393, -142, -317, 228, 317, -412, -368, 356, -74, -386, -2, 371, 101, -210, 203, 379, 21, -223, 59, 223, -229, -341, 72, -29, -418, -132, 162, -215, -138, 310, 149, -342, 67, 282, -165, -386, 170, 101, -271, -277, 224, 103, -255, -145, 324, 163, -311, -97, 261, -33, -417, 222, 150, -293, -105, 413, 90, -417, 161, 289, -260, -236, 272, 10, -359, -154, 330, 13, -181, 33, 322, -120, -371, 213, 244, -256, -364, 455, 115, -445, 86, 512, -179, -261, 496, 309, -348, -76, 464, 66, -435, -20, 265, 76, -364, 106, 363, 11, -284, 308, 250, -352, -156, 282, -71, -342, 220, 349, -399, -16, 406, -10, -352, 261, 425, -246, -360, 193, 140, -265, -143, 276, 121, -193, -163, 367, 138, -468, 74, 355, -190, -371, 299, 291, -316, -19, 376, -147, -368, 185, 194, -275, 37, 350, 73, -140, -28, 86, -74, -203, -51, 252, -185, -304, 261, 220, -381, -165, 285, -107, -427, 108, 228, -270]
7483b70p0P16l49k77K69K38k08k19J75J71k60k12L16K30m23k20O10j3m01J83L23
7504C09k18l76M32O0l29J46O4o3j34K47n7j25N0J6j12J94j07j78J69O6L6K2j99
7527h7L0K56j2m32L35K85n03l22L48L81n67J74L66n1k40J32J70r0j67j71J17P2
7549B4r4j48L07p9n7P6L04k34l0K46j71k62K54m1j97j9K17j26P2l8o9J13R6l62
7573b18J22K67m0l23J35J85lk04J97K4m6r7p4J32o8k53j29M40j9l28J72L65j21
7596A16j80N0J09o1K6k85J82J35j01k74N24j4m37J05L04j40j72Q4N3o4M3r1lK58
7620A67l76R7M04k28k80K05J29j45j70L12o9l02J61J04J01k9j1p6O5k2j93J25
7642c1J36l04J30R1k11l6L48J11l24K10K03k74j36K35M9j51n7N9j40K06k07o8
$$ y = [-270, -340, 376, 27, -250, 19, 257, 49, -170, 5, 176, -84, -296, 20, 250, -173, -393, 217, 204, -197, -14, 309, 91, -285, 147, 207, -122, 24, 88, 25, -109, 138, 81, -44, 6, 22, -90, 104, -3, -181, -12, 54, 90, 112, -87, -57, 199, 187, -245, 90, 375, -128, -450, -102, 279, -288, -114, 252, 201, -39, 93, 263, 173, 6, -165, -48, 24, -70, -218, 89, 10, -47, 29, 333, 99, 69, 315, 144, -118, 136, 95, -102, -121, 96, -30, 42, 4, -65, 48, 144, -218, -96, 171, 131, -192, -57, 128, 125, -79, 118, 142, 96, -1, -75, 57, -11, -264, -393, 47, 28, -300, -128, 237, 116, -64, -14, 95, 34, 60, -225, -43, 92, -9, -283, 241, 227, -210, -105, 199, 59, -113, -29, 24, -40, 3, -88, -91, 167, -209, -112, 292, 64, -216, -11, 118, -27, -197, 115, 46, -256, -95, 9, 110, 81, 70, -6, 59, 37, -156, -31, 105, -199, -69, 22, -189, -225, 123, 234, -90, 120, 323, 49, -87, 148, 197, 46, -11, 48, -92, 114, -93, -161]
7664a61K97j2k94K36J13k19J03K8K9n4L4j45q3L17j99l37L88J48k83K3K66l6j89
7687c0M7N7M8p1m2p1L38k35k40L71N6m03q1M18l00m4J84J8j09M3K88k41P8M2j76
7712e5J0J16j99R7L3j50j5L00j83j1J55q8p2PJ30k43k7M17k73j05Q9R3j83Q6K25
7737A54q4k4o0K8J6j51q8J72%o3l7L43j39k44J60L09m20K5J22j01j58K24J64j22
7761B6K0J37k2r0p0n8J13j81k8J39L36l66j94L83j46j40J51J35j67k56L43q5M
7784a6j32J47l0J28j42O8J58k23J0R2n1r2P6J25k23P8J66j44m8J99k0k97K26J36
7808A91k54j84L17j8l22J98J58j24M0L3n2R6j89o7L28j79k65J79L90m07K7K33
7830A29J73n72J97R3k03J08N8r0l6K10o9L0O6o6K1O0j28r3J02K6j45J21j6l6J69
$$ y = [-161, 136, 124, -170, 66, 179, -40, 63, 91, 120, 66, 100, -45, -128, 189, -10, -347, 41, 189, -94, -71, 195, 159, -30, 17, 74, 122, 51, 9, -62, 276, 41, -199, 172, 228, -175, -256, 162, -138, -182, 2, 20, -89, -46, 242, 1, 79, 121, -55, -45, 71, -128, -31, 2, -148, -163, 137, -46, -57, 98, 10, -62, -55, 75, -168, -195, 222, -51, -156, -67, 26, -157, -71, 154, 70, 46, -14, 14, 30, -121, -209, -37, -37, -100, -137, 206, 67, -177, -17, 292, -128, -103, 19, -82, -240, -16, 148, 26, 46, 183, 161, 71, 1, -57, 56, -125, -153, -14, 322, -44, -238, 145, -1, -141, 10, 145, -22, -278, 65, -20, -16, -148, -1, -31, 97, -45, 23, 181, -42, -32, 60, 9, -83, -7, 118, -105, -27, 139, -5, -53, 146, 126, -171, 55, 191, -63, -247, 70, 52, -270, -72, 86, -38, 2, 35, -17, 79, -110, -177, 151, -28, -293, -114, 276, -131, -104, 129, 302, -270, -73, 20, -183, -75, -17, -107, -143, 67, -2, 28, 94, 28, 49, 109, -19, -112, -10, 16, -129, -8, -24, -60, 109]
7855A09k9j13j3K37j85r7J00J13k77k0K83j92j09K67k04J85m6j30J29J97k40j66
7877b01K64J03k87l1L65k34j2J01Q4j45j2jn0K3K9J09l6J4j38R3K50l91R8J12
7901A07O4l44J57J64j48M5r1q4J44j3r6PJ62J0r3J14j1j11r7K58j89l6K08k41
7925a14M2K07j18q4Q0J01k53J13J32m4K3j1p7J05j1j35J47N3j75p9J83j3l32J70
7949i0J97k86J85K71k19k78K35J57j87R9p1O9J9j05j07J17k8j64K62O5k24j3K32
7972A36j49k46L33P0m83J76K60j55k8J43J77l04L6Q9N1k90L0J68m0q9o8L13j09
7995B1l93M76J83l98p7L31o9m77K90K60j88j12K24J14l02L3J42P8l07N2K80K2
8017A83l39%L91k57j19J02L06m22R0L21o1l21L18J0l13N0K62n7k69J28K40k04
$$ y = [109, 80, -33, -46, 191, 6, -91, 9, 122, -155, -175, 108, -84, -193, 74, -130, 55, 9, -121, 8, 205, -35, -201, 63, 166, -121, -152, 213, -21, -33, 68, 152, 7, -5, -6, -56, -33, -4, 105, 69, 83, -55, 38, 288, -103, -5, 107, 171, -173, -16, 148, 0, 45, -46, -130, 14, 1, -95, -88, 74, 84, -9, 105, 94, -17, -114, 144, -45, -81, 127, -114, -72, 135, 17, -67, 13, 114, -139, -26, 106, 62, 85, 74, -3, 102, 91, -44, 103, 156, -19, -98, 85, 72, -260, -90, 107, -179, 6, 277, 58, -220, 15, 172, -15, 84, 13, 82, 101, -4, -111, 6, -22, -186, 76, 141, -83, -96, 136, -13, -259, 74, 144, -339, -163, 97, -58, -86, 57, 234, -70, -34, 55, 106, -184, -154, 14, -26, -115, -183, 130, 21, -372, 104, 287, -111, -188, 143, 74, -403, -113, 147, -41, -153, 71, 185, -117, -84, 58, 136, -171, -119, 161, 183, -156, -156, 235, -22, -141, -39, 267, -155, -65, 256, 195, -126, 192, 202, -111, -61, 201, 144, -125, 3, 243, 39]
8039C9j45R6J02k05o8K10J59k74n1L95o8m03J79M07n31j52M36N9n64K19M71l38
8061b7k21L67J78l10k52K30K45k85k37M71P3l50o2M58j18n05L20K26l00q5M61
8082B77n8m04L32M5k57j71K84Q4k75r8M71j56k66P1K32L5l79K2N16l58k10M53
8104A90k2l15K8L15k26k46L15K0k68J14K25j87j14J66J59j58j92K87J46k57k62
8125b82M04J53o39O9O98l10n00K64N78m16l79L86K74k93j13K06p2j41j4K83O0
8146B16l76NL29r9k40J85K22l82k5K38j8k53K87K4j93Q2J49j04o8L2k3q7J44L9
8170H4p9j09J39lL3j15Q7J58j29l16L20L16m69K7K85q4l75J65L26k82k41
$$ y = [39, -106, -10, 92, -113, -181, 29, 188, -86, -137, 258, 190, -213, -34, 373, -158, -310, 126, 185, -379, -160, 311, -27, -248, 119, 297, -13, -265, -35, 210, -75, -312, 159, 232, -118, -180, 278, 160, -345, -25, 201, -99, -184, 277, 219, -185, 147, 192, -65, -236, 48, 132, -143, -241, 230, 74, -192, -121, 111, 146, -233, -211, 305, -53, -263, 190, 168, -147, -119, 196, -30, -276, 39, 59, -209, -95, 130, -57, -171, -5, 154, -4, -196, 91, 237, -20, -282, 122, 275, -364, -295, 403, 93, -407, -143, 435, 19, -360, 26, 300, 7, -106, 100, 28, -113, -127, 156, 216, -160, -155, 174, 75, -165, 20, 242, -140, -165, 73, 55, -198, 89, 113, -80, 2, 151, 47, -21, 11, -12, -99, 45, 84, 5, -104, 35, 32, 65, -50, 37, 195, 66, -250, 70, 386, -83, -56, 229, 145, -230, -65, 261, -21, -262]
8191b62
$$ Imaginary data points
##PAGE= N=2
##DATA TABLE= (X++(I..I)), XYDATA
0@%%%%%%%%%%%%%%%%%LpPpQj4K1k3K5k9L7m4N0n7O6p8R1j01J13j33J51j66J83
40I6k06K35k60K82l11L44l74M03m35M68m97N13n12M86m01J96K56j292L993j3210
60a0226Q9528M79229n43779n49098O40086M17628o51256l22408O34426J93960
70C78090n92860j00070N29567J0942m42004N4881L50695r9906k43106J22598J42937
81A11764j19223m4289Q6528m0972l6788J05078l0003j37786J05099J43312j78342
92c5622j21033K38650P7997k80187j5596L02746n4280l07454J22271K86516j94064
103A9944k51333K60953K02345l13165j33857L53116N1341l78450L4047L76967
113B21908j21771l49608K06154L05396k70219k38736L18192J63677l45089q8952
$$ y = [0, 0, 0, 0, 0, 0, 0, 0, 0, 0, 0, 0, 0, 0, 0, 0, 0, 0, 3, -4, 3, -4, 4, -10, 11, -12, 13, -16, 21, -23, 27, -30, 36, -42, 49, -52, 61, -72, 79, -87, 96, -110, 125, -135, 147, -164, 180, -194, 209, -226, 242, -255, 258, -254, 232, -169, 27, 283, -1009, 2984, -10226, 79302, 558531, 14752, -534346, 105740, 523368, -127888, -450296, 184130, 378090, -214770, -314840, 214727, 225669, -216335, -161454, 189241, 89335, -153771, -31173, 111764, -7459, -51748, 34780, -6192, -42980, 62098, 32095, -105691, -592, 142720, -35622, -156655, 81995, 159992, -120195, -135791, 166955, 112675, -194779, -72508, 214008, 19944, -231389, 29564, 231909, -81256, -215113, 138003, 189344, -189106, -155059, 221908, 100137, -249471, -43317, 262079, -8140, -246876, 71316, 234993, -110096, -199048]
123a99048L45954J1178l34538N4957L06391j11031k63426J59840K13974j94378
133a0127j58383K09190R2976k10264k8147J96325k3438j57023O9882J08763r9986
144a0232n7635J05891l90j00811M7993Q0344q6810m9823J17033J5655j33944K3465
156d9264J43330o2038j40485J01653J26947j38063j00637J68650O2522j91267
166g8652k0340J94346l2296j85904Q1630J66278j17935j27408J52636Q8307j73537
177e2875m8003J80042K618j83024L6954J76859p3760j62625J07423J41326j35915
188a0980j12379J56561P8478j65127m0112J62720M892j46398K5739J21277m7465
199B7206r2535N6226N9271n8659k9981N4252O971m0595J6937K7481l5944j3066
$$ y = [-199048, 146906, 158084, -176454, -121497, 184894, 73863, -189563, -29723, 184251, -10127, -168510, 40680, 133656, -76608, -104755, 91570, 68132, -88891, -19009, 89754, -10232, -67867, 38024, 37634, -63177, -15184, 65160, -21650, -71473, 45560, 61215, -72729, -49264, 94066, 32028, -108457, -6804, 120143, -17920, -118557, 50093, 112615, -78652, -98992, 95354, 63058, -122846, -41216, 125062, 7127, -120281, 32355, 120662, -52875, -100878, 79164, 81782, -101242, -64288, 112571, 38811, -123814, -16391, 124935, -10980, -123359, 33202, 111680, -53447, -93559, 69161, 74053, -72345, -46606, 74671, 27206, -65329, -9103, 50168, -8491, -38472, 15780, 22751, -17844, -907, 26574, -9370, -22436]
211b2436M6291j0079n6588L3917O1211n5437n1531P9776L7068r8648j7240J05640
223E1944j0370j06691L5486R9068n5317q2680P2494O6005q2639m8556Q6905K8353
235E4002r1839j1271R1844n871q5584K7333P9533m4695o6068N6516M4148o7707
247a9659k4165O8072L617o0299J6194N0547k7682l6979L4037K3937l7098j2671
259b2149L7251L231l6637M700L3858j4144l0983K2057K4106k8969j2848L4895
271A4368J854l2182J2418K6338k5003j9075K7760L868l2255O356L2172j0743k4112
284a8236J9927K3279k2336k1937K1525J6891k7126j5645L0293J2445l0555l710
296a5185L1687l376k8795R253J9482j5526j2821J4590M160j1192L681R215l011
$$ y = [-22436, 23855, 13776, -42812, -8895, 52316, -3121, -54652, 25124, 62192, -36456, -53696, 51944, 41574, -65117, -29631, 69437, 14120, -68560, 3934, 69939, -12700, -61256, 25649, 54002, -37837, -49108, 42736, 36865, -48719, -21386, 58147, 13452, -52616, 3900, 48048, -19659, -43824, 24248, 27865, -32434, -16240, 34307, 6625, -30354, 3683, 27620, -9478, -22149, 15102, 18333, -18304, -13604, 20254, 6110, -24873, -2816, 21290, -7679, -20527, 14368, 16222, -15960, -3542, 22796, -2207, -21282, 6478, 10346, -21909, -15553, 16619, 5876, -18236, 1691, 24970, 2634, -19303, 2222, 19113, -8013, -23658, 6635, 19080, -11475, -15185, 16502, 13126, -15669, -6416, 13066, -2460, -15281, -691, 3469, -7723, -4042, 5173, 2162]
309B162k544M903J103m263k423K948K337m763k851O751P63j0016O02P644n832
324c479m894R697J782p049O532O026j0337k083J0921l089j0435N973Q979m986
338C558o691K975N902k043j0041r36J1208q72j3227M592J5485m911j0433Q343
352B909P714q114o150K019J159j141l143j153P673M757p006p3R442l401r583L513
368e78M161n876j434M300o18n99P06k056O05K314l962p46O707q66m824N537L708
385F479o341j209M119k677l162J474r27M77L202l413k088P048L3q812K042O773
401C018m386m092M902L056p19J28j224J011K779n260n781N408K293p231J073P128
417B103j650k526L394m62k094K756j088k886M724K044n146P64L935m198l632K112
$$ y = [2162, -382, 4521, 5624, 1361, -1062, 1886, 4223, -540, -3391, 3360, 4123, -5893, -5291, 2353, -3479, -8373, 1324, 3106, -3943, 2589, 8615, -1722, -3805, 7116, 4027, -6408, -435, 8544, 3558, -3133, -158, 5744, 3701, -6340, -7276, 3932, 3060, -10167, -5575, 9910, 4999, -5434, 2909, 10623, 2509, -3641, -1622, -463, -1604, -4747, -5900, 1773, 6530, -476, -549, 8893, 5492, -4091, -578, 3583, -2293, -3727, 573, -45, -644, 62, -1994, -1389, 925, -3037, -3783, 2924, 2058, -2766, 2771, 6479, 138, -1071, 3048, 371, -2791, -1317, -2244, -1767, 1435, -1978, -4066, 2982, 3015, -5797, -3755, 3018, -1368, -5460, -558, 2498, 1779, 1907, 683, 1694, 4473, -787, -6568, -1160, 1133, -6098, -5025, 2103, 453, -2073, 1321, 859, -1235, 1521, 433, -2453, 2271, 4315, -831, -67, 3868, -330, -3962, -1850]
433a850r03j684K265J98L96M709j03k556L560Q75n942O50L112n386r95O539j999
450H86m532O197K455p596l14N374l118l826L284K953m36o17M13K712l07n846O07
467a711N937n298o158R531M654j0984P10J2881m357j1437O349P320q137n583O178
482a05M220m070m145K885N565l666p006N046O800n975l331Q324J624o196J139
497A109J875l872L68P41n079K576O681n772m907J0131K627j1993m16J1099l147
512B021j1021M157J1880l051j1163O246J4825q449j7952J1765J6318k0477j6302
525b1203K5843J2084k9383m198L2090j762l0977O656K7147j0529k3943J3517K1716
538A7058j3744j8450J6050J5820j9680j2701K1098O293k3019J179K2295q222j7167
$$ y = [-1850, -2753, -4437, -2172, -1974, -1578, 3131, 3028, 472, 4032, 4907, -1035, -385, 2727, -2659, -3654, 2885, 886, -3646, 2551, 5006, -2590, -2904, 2470, -648, -4474, -1190, 1763, 1327, 710, 1123, 3835, 3528, -2318, -1711, 4226, -1072, -7230, 2301, 6955, -4029, -3319, 9562, 5205, -6232, 117, 7437, -700, -6283, -105, 4115, 45, -4100, -1215, 4350, 684, -6322, -1276, 5524, -451, -3782, 4542, 6166, -30, 1109, 2984, -888, -520, 221, -4858, -2282, 4399, -1373, -6280, 3851, 6478, -5515, -5931, 5168, 2021, -9000, -4843, 7037, 3986, -7177, -931, 13894, 5445, -12507, -742, 15576, -4901, -21203, 4640, 16724, -12659, -16857, 15233, 13471, -17506, -10850, 16297, 5768, -18175, -4658, 17058, 3314, -15136, 914, 16734, -2946, -15647, 5451, 11744, -11275, -10096, 12199, 3977, -13190]
551a3190J5025J0681j8597l297J7666m850j4918J0095J0708j1659m773J3184N72
564F647j3151K999J1397q235j0271J3941Q332j9452k191K6672o500l2365J7227
577d950L2303l1874k9939M5303K3860n4818j1360O3909m5o7912J1427O6970k4719
590A8155o7254L5290O4148m4908n7740N6547N0942o5534m0363P1645K5320p5422
602b9174r010P2768o318o4247K0600N1594l0224l6353L3703J9953l3411n017K9318
615A4182p019k2051J7877J3390k6354l658L1405r733l5147K3453L3986l6881k5851
628c2401N1986J4300o1365K470O3837k4182o2348M3333N2539o0322l6305P4985
640B6527J8100q3835K183Q7232k4113q7664M5593Q4238o6044p5060Q6739O1080
$$ y = [-13190, 1835, 12516, -6081, -9378, 8288, 3438, -11480, -1385, 9323, -2336, -7109, 6075, 6647, -6504, -3505, 7892, -343, -10614, 3327, 11659, -7793, -9984, 16688, 10188, -22177, -4950, 27353, -4521, -34460, 10843, 34703, -20115, -31475, 32434, 32389, -35523, -24096, 42874, 18155, -49099, -13809, 50339, 5431, -52309, 4238, 55180, -10354, -50717, 20928, 46248, -29174, -38184, 34584, 28266, -35981, -15381, 36213, 5989, -30364, 3339, 23292, -10119, -15136, 14182, 7163, -14888, 2989, 16379, -9975, -13633, 17772, 8039, -27108, -3655, 30331, -6550, -32401, 19585, 33885, -27480, -25010, 38827, 14645, -47703, -4370, 48169, -12153, -48458, 26527, 44627, -39208, -37025, 50207, 26094, -61570, -15977, 68261, 2217, -72843, 13896, 74976]
652G4976j04352m2951J15900J8910j22166O244J19986l0213j08333N2109R2050
663G2160o6600p0514P4126M6212p6462k4076P1445L244o1011J6656M7910l2031
675A059l0405M2797Q439n0505J4626N0511l8319m1828O0839K7692p7722p207Q6975
688D6952j7378q8275M1535Q2025o2007o7677Q0203N0017r2428k9420R8210M784
700D6541j01167J8470R6735m2724q6242O7121P0804q6204m8067J00832K0432j08229
712e1698Q689J07072l6848r6148O2401Q0434q1369n9667R2546L5376r9194j2759
724e1165R7871r898r0859L1344Q0084m9480o3266O3611M0989p3240j5938P5264
736C5317r928o7789L6537N4614n7073l3742P1395P858p9044J6190P7625m1489
$$ y = [74976, -29376, -72327, 43573, 62483, -59683, -53439, 66547, 36334, -71999, -19890, 72160, 5560, -64954, 9172, 55384, -21078, -45154, 26291, 29535, -31476, -14820, 33090, 1059, -29346, 13451, 21890, -28615, -13989, 36522, -1797, -43625, 17214, 44906, -32816, -40023, 46952, 29574, -58701, -17166, 64859, 2852, -64825, 15378, 65395, -27033, -56453, 41757, 46541, -54626, -36156, 60579, 17855, -68387, -1266, 69538, -16666, -64733, 36099, 56531, -51698, -43009, 64063, 27215, -68933, -6532, 73902, -7467, -67134, 25412, 60788, -38406, -51165, 46706, 36808, -54051, -22707, 57377, 7897, -55369, 8242, 49231, -24009, -39947, 35317, 25389, -42400, -5863, 48751, -8322, -42064, 29331, 37189, -41855, -25665, 51960, 10471]
748A0471p0533O2610N8476p9980m2419R2856K2879j00823j081J03981k1482r8525
760f3570M5617Q7994o6223o9768Q1222M4876r1245j8920R1466p748q3813L2500
772a7612P1216n1527n3831O4696L2410p4688j1925P7538r684p4970L2150O9756
784E3529n0653n6390O8242L9047q0870j8067Q6127o176q4588K8940P5412m8833
796E720o0952O2578M1564p2296k2219P4973K722p2108J7151O7231l2636n6489
808d4761M7568M3213n9354k6967O6399P382o8488J3138O4317l2908n4204M8268
820C603L8085n9765k0030O4493J300o2535J7017N7487l1130m7561M2472L5219
832C8655n1335k2173N6211P390n7562R417N6282k5093m8893L9412L6711n2362
$$ y = [10471, -60062, 2548, 61024, -18956, -61375, 31481, 54360, -46463, -47544, 56437, 34955, -63570, -17953, 70041, 3818, -65950, 15272, 60148, -31097, -50017, 41449, 33701, -50112, -17612, 53604, 2077, -51754, 12942, 45352, -29336, -41261, 36277, 26593, -48377, -16227, 53529, 2876, -53514, 14728, 53775, -27095, -45162, 40965, 34789, -49799, -20859, 54553, 5720, -55232, 7346, 48910, -23386, -45605, 29368, 32090, -40018, -22867, 44364, 11728, -44761, 2807, 46020, -13334, -40301, 26098, 33480, -35008, -21870, 42447, 9539, -44665, 3603, 41688, -18077, -38107, 26386, 27686, -34849, -17832, 39655, 8525, -39036, 3436, 38655, -12680, -34853, 21358, 28748, -28814, -19397, 36885, 11792, -37101, 2311, 39022, -13340]
844a3340k2643N8596M737n9563J3183N6457k7438m7378L8983L6144m7226k4367
856c3855N0663J1715n1645N81N0685j1980m6176K3229L9479l3593k9956M1206
868A0353J7029m5659k575M5803j1364m1090K3122L2340l2465k2793L6890J2178
880B1769l7505j806L7005n599l3302J2624K8488j9483k3772K3963J5870k7686
892i434o662K9726k763k7820J3241K2722k1822j5319K6925N576k8939L616K7810
905A6857j1325k3985J7031J9017k1092j3979K3230Q761k4360l046K5441k576k4604
918a4630R142K1988j6462j8147K1733J1726k5268l018K6929m099k4790J0520K0193
931A5817j5489j6671J6685J1994j7150p656J7619N946j6243k818J6290o00j6042
$$ y = [-13340, -35983, 22613, 27350, -32213, -19030, 37427, 9989, -37389, 1594, 37738, -9488, -33855, 16808, 28523, -23122, -22541, 28144, 16164, -30012, -6783, 32696, -897, -30853, 10353, 27382, -18277, -20852, 24951, 13587, -27503, -4381, 27959, -4506, -27299, 9591, 21769, -15736, -17542, 19463, 13864, -19438, -6814, 21674, 2191, -21581, 2382, 18252, -9434, -16096, 13630, 10867, -16953, -3712, 19010, -2812, -18131, 8794, 14370, -14569, -10953, 16857, 5532, -18453, -1422, 17595, -3497, -17476, 5754, 14515, -9845, -12891, 12550, 9974, -14630, -5488, 16500, 38, -18109, 3624, 15350, -9918, -12936, 13993, 9894, -14896, -4376, 15817, 328, -16343, 342, 12336, -4814, -12470, 5149, 11095, -5148, -7966, 8324, 7724, -8318]
944h318L514J3292p632r700J0353N652j0702l13R609m209p164N875L321o416O6
959b772N550j140k813K670J266k081l86J595o82k871R81L353l244n140N897N245
975E428r198l687J2947K136j4379K034J5324m290j3987N547J1250o696j0455N092
989b934R080l609q678L761R926l725j0237L935Q491o197p281N841N170m216j996
1004b669L845K493r59k461n77L022q83n477J075M971l374l675N844K629n756K48
1020a704N352k117m740J646K932j630l363O85M440J7n475J161P547k305o979M833
1036C00O664o097m660N848J804n728j743K953J100k111k248J768M011j872m466
1051d477M013M942n099l469O124K836n164j674M394K141l744m597K247N106m608
$$ y = [-8318, -4804, 8488, 856, -8844, 1509, 7161, -3541, -3854, 5755, 1546, -5618, 257, 3578, -2838, -2772, 2778, 1638, -1175, 1495, 2761, 680, 294, 1889, 1207, -1664, -683, 2670, -574, -5714, 183, 5428, -3770, -7457, 5490, 7626, -6753, -4719, 10605, 6315, -7672, -2125, 9125, 2429, -8026, -2934, 6146, 2537, -6141, -2380, 7546, 3821, -6416, -2481, 6010, -187, -7468, -1627, 3543, -673, -2669, 1176, 3669, 2710, 249, -328, 2694, 1811, -3666, -2591, 2380, -994, -4669, 1175, 3804, -1952, -1704, 3648, 1531, -3209, -1563, 1369, -261, -3624, -2939, 1501, 1518, -3957, -2796, 4751, 2446, -4533, 300, 6964, 867, -3793, 2055, 3859, -1869, -3612, -659, 441, -1670, -3918, -2150, 1861, -11, -4477, -464, 4478, -621, -4090, 2034, 4870, -294, -1968, 2426, 4567, 823, -3774, -1527, 3579, -1029]
1066a029p661O254Q244p372o147J0342N840r496l723Q363K687p742l837N756M313
1081D792n689n221O663N605p247m398P868K565p179p02N463k47k905L32Q57N88
1097A145J56k383j98K852j008k649K514J516k744K55K193j747j268K107J21j343
1113d81P00K69Q33J163k729j373L938j58o237J420O018k935n332M370M611l474
1129F03l020K589L150j300m208M99N190j570o553K566O010m921m837O177K828
1144C203n650K04N674o92l655J465K667j866l882L72L596j657n738K752P235m218
1160a90o740P068O600p812m753Q131L434o835k855N242L813m001n458L222O360
1175E226m715q332M881P760o026o654O835O538m941m657M557N845l757o912L154
$$ y = [-1029, -8690, -2436, 5808, -1564, -7711, 2631, 8471, -1025, -4748, 3615, 6302, -1440, -5277, 479, 4792, -897, -6118, 545, 6150, -1097, -5495, 2373, 4938, -2241, -2943, 2520, 2273, -632, -300, 557, 1145, 1301, -1082, -1280, 1572, 564, -2085, 429, 1945, -799, -544, 1649, -98, -1366, 741, 862, -481, 219, 488, 1321, 2484, -245, -1618, 2320, 2162, -4075, -2655, 3363, 428, -4904, -534, 4077, 603, -2417, 172, 3322, 2022, -2186, -1687, 3503, 1933, -4620, -2054, 3956, -965, -5802, 375, 3203, -2447, -2243, 3431, 2739, -916, 549, 3216, 1350, -2532, -2160, 1436, -221, -5959, -3207, 4028, -190, -6930, 138, 6738, -1074, -5827, 2304, 5738, -1097, -3952, 1290, 5103, 1102, -4356, -1134, 5226, 511, -7821, -2940, 4820, -1206, -7860, -1025, 5513, 572, -4085, 472, 6317, 2560, -4352, -1198]
1190a198P505n125q657O555P554q360n252R565L312q844o75P624l99o109J22M061
1206A679m3m190r80M581J739m460m07N581J92m430M31K604j216k149j055O56K482
1223A015o03l483L201N134m518l663O170N37p624J372O080n072m403P514L189
1238D846p931k34R936q80j0797J414J1886l589j4741M858J6347q029j7176J1819
1252b271J7055j4540j4647J6525J1368j6458q321J4346N774j1343m488P948M942
1265E890m672n643J956O633n6p949k690Q289M926r989p649J2937J0564j5967j0592
1280a4012K1216R637k5269o584K7503Q19k9583M307K7847r985k4223J4791K0812
1293A7276j7041j5768J9310J0981k1291o774K1564J434k2281M658K1881j0132
$$ y = [-1198, 6307, 1182, -7475, -920, 6634, -1726, -6978, 2587, 5899, -2945, -3620, 4004, 3605, -2504, -2382, 1679, 1636, -2554, -3534, 1047, 2786, -1674, -2081, 3500, 3692, -738, -307, 2297, 1081, -1068, -2123, -1467, 1015, 412, -3071, 130, 5264, 746, -2917, 3253, 3790, -3834, -2462, 3618, -1454, -5857, 1657, 4846, -3085, -3319, 6617, 5737, -5060, -3646, 8240, 4651, -10090, -5232, 11115, 3086, -14090, -2271, 14784, 244, -14403, 2122, 13490, -2968, -11289, 3057, 8831, -2512, -7000, 948, 5890, 1218, -4425, -2469, 4164, 4108, -3841, -6531, 1758, 6684, -3305, -10954, 1983, 12547, -3420, -14012, 7204, 16841, -8428, -15012, 12491, 13310, -16273, -11966, 15881, 5896, -18327, -3536, 17276, 235, -15533, 3777, 14758, -6533, -13307, 8257, 9691, -12590, -7932, 13949, 3817]
1305C817j8247J6251J3922k0480p579K1704m13k1644O597J7686j2057j2603J5687
1318B641P591j6726j374J7311k920j5977P827J4136j2558j1951J6228P309k0703
1331i166j957K2647n084k2775J3476K0845k0112j4965K6209Q149k9031m72K9282
1344A7046p593k8161J3641K4277j9148k0444K3269J5803k6261r739K8986L415
1356A5091k8955M309K7859j2190k3408J8792J5904k4429p186K6321l212k5415
1368a6519J2655K1685k0533j5605K6567R137l0524j749L2620n348l3167J2680
1380h101L2111j9821k9298K6451K4014l2836j6742L6353P518l7339L157L5102
1392B0569j1912k9028J9853K1306k5221j2936K6766L327k7335M451K5360j1702
$$ y = [3817, -14430, 1821, 15743, -4737, -12316, 9388, 8975, -12669, -6072, 11614, -443, -13046, 2641, 10232, -6494, -7868, 9443, 6523, -9454, -1627, 12509, -49, -12000, 4228, 11537, -9166, -11123, 11524, 6440, -16335, -2859, 17986, -2126, -17091, 9118, 17267, -11764, -12236, 17046, 9453, -18708, -5067, 19210, 62, -20382, 2887, 18690, -7571, -17310, 11676, 15091, -13864, -9555, 18304, 6114, -17294, 1498, 17402, -7027, -14213, 12108, 8896, -16519, -3864, 17821, -2712, -18317, 8250, 17387, -13137, -14886, 17734, 12386, -20781, -8101, 24010, 4189, -25109, 1342, 25356, -7480, -24222, 12131, 19649, -17690, -14533, 20569, 8657, -20371, -518, 20788, -4433, -17369, 9397, 12724, -14611, -10160, 15200, 3498]
1404C498k1969J8685J7827k4109j1514K8969M191l1677M767L1726j3853k8382
1416b1841K2568K2319k9042j4022L2615L571l3739M734L0570j3854k6440K0306
1428b255K1109k4667j3305K9736P183l0546J751L1553j0458l0236J8361K4162
1440B2388k7714j8198L2912Q335l5947K708L6263j1545l2051K0719K6373k6780
1452b537j9737L0216J1832l2346m397L2399k519l0362J0007K7746j6558k2646
1464a8902K2164J5284k6673p020K7988k845k6283J2220K1818j9475j4772K3954
1476G458O650k6503O44K6153p917k4131J4527K1739j8947j6621K4271J2105k7455
1489h027n802K8747k557k9673R203K5801j7606k0650K3736J3432k6495m054K8000
$$ y = [3498, -18471, 214, 18041, -6068, -17582, 11387, 15578, -16099, -11332, 20394, 6541, -21841, 727, 23046, -5996, -20018, 12597, 16168, -17571, -12837, 17733, 3879, -22561, -2255, 18854, -5813, -19118, 10618, 17801, -12745, -10994, 20559, 10101, -20135, -1774, 22388, -5326, -23524, 9388, 17723, -18224, -15516, 20747, 9202, -22849, -2130, 24243, -2537, -22274, 7942, 19774, -12572, -16969, 15430, 12911, -17451, -7444, 20302, 3744, -18902, 3262, 18546, -8127, -15147, 12841, 9996, -16287, -4067, 17751, -1724, -16496, 7458, 14108, -12395, -11751, 14402, 6485, -17646, -3119, 18620, -327, -16948, 7323, 19428, -8027, -13829, 14918, 12361, -17312, -8109, 17692, 86, -20564, 3172, 16604, -9891, -13945, 14055]
1502A4055l855k5699J1446K2022j7575j7550K1608J2131k4953o397K7253N79k8173
1515a5108O117K7296j3496k5100J9147J9995k4623j3348K7552O366k7099J781
1527a0520K5162p358k0470J1473J5019j4519j0461J4823M715j4983j69J4541m180
1540C073j2303R220R969j3082n839J6535K27j8463N835J7454j1963j4939J6540
1553B264J0475j9493m994K0557K18j9435M146J7626p537j5182J0188J2377j2522
1566a312r402J4648N316j6570n65J7309n107j6041J0887J3232j5165q885J8538
1579F883L742j9554J207J8944n491j7293Q154J4955j0103j2802J1139J1000j2030
1592a249q636J2731N951j2768k895J2093k90r853L489O235n252j965N248k461
$$ y = [14055, 10200, -15499, -4053, 17969, 394, -17156, 4452, 16583, -8370, -14767, 12486, 13065, -15108, -8991, 18305, 4809, -20291, -1144, 18851, -5772, -19120, 8432, 14798, -12301, -10520, 14642, 7284, -13186, -1713, 13306, -1213, -11674, 3149, 7864, -7119, -7288, 7253, 3073, -9230, -10, 9959, -3123, -8962, 7573, 7800, -10663, -4828, 12626, 663, -14276, 2264, 12739, -6754, -11748, 8809, 9027, -10408, -6262, 11364, 3827, -11355, -1167, 11210, -1312, -10714, 3934, 9250, -7320, -7885, 9424, 4317, -11724, -837, 12395, -2770, -11655, 6883, 10625, -8929, -7722, 11222, 5731, -11562, -3408, 11547, 1444, -11358, -219, 10781, -1249, -9885, 2846, 8797, -3971, -6866, 5227, 4937, -4916, -1427, 4808, -444, -2409, 2839, 378]
1606C78l696N930J040q068K060Q730m613q835O555Q422p966q369R371P899j1157
$$ y = [378, -3318, 2612, 3652, -4416, -2356, 6374, 1761, -7074, -519, 7903, -63, -8432, 939, 8838, -2319]
$$ [...]
8191F2
##END NTUPLES=NMR FID
##END=
