##TITLE=1H_CA-8647-1
 CDCl3, 8 sc, 
 19.9.2019
##JCAMPDX= 6.0         $$ Bruker NMR JCAMP-DX V2.0
##DATA TYPE= NMR FID
##DATA CLASS= NTUPLES
##ORIGIN= UXNMR, Bruker Analytische Messtechnik GmbH
##OWNER= root
$$ XWIN-NMR		Version 3.5
$$ Thu Sep 19 14:15:55 2019 Russian Standard Time (UT+4h)  she@DPX200
##.OBSERVE FREQUENCY= 200.1315
##.OBSERVE NUCLEUS= ^1H
##.DELAY= (6, 6)
##.ACQUISITION MODE= SIMULTANEOUS
##.ACQUISITION SCHEME= undefined
##.AVERAGES= 8
##.DIGITISER RES= 18
##SPECTROMETER/DATA SYSTEM= spect
##.PULSE SEQUENCE= zg30
##.SOLVENT NAME= CDCl3
##.SHIFT REFERENCE= (INTERNAL, CDCl3, 0, 15.7039)
##AUDIT TRAIL= $$ (NUMBER, WHEN, WHO, WHERE, WHAT)
$$ ##TITLE= Audit trail, XWIN-NMR		Version 3.5
$$ ##JCAMPDX= 5.01
$$ ##ORIGIN= Bruker BioSpin GmbH
$$ ##OWNER= she
$$ F:/spectra/data/she/nmr/H-F/1/audita.txt
$$ ##AUDIT TRAIL=  $$ (NUMBER, WHEN, WHO, WHERE, WHAT)
(   1,<2019-09-19 14:14:53.09 +0400>,<she>,<DPX200>,
      <created by zg, POWCHK disabled, PULCHK disabled
       configuration hash MD5:
       00 E9 B6 7A A2 85 ED C7 34 08 36 98 17 FE 4E 26
       data hash MD5: 16K
       46 F1 E3 BE 6B 4F 00 4C F1 14 AE EB 26 52 57 AA>)
$$ ##END=
$$ 
$$ hash MD5
$$ FB 33 96 64 CE CD 7D AF 1F EE 4E 47 F9 4A 2F 47
##$RELAX= 
##$RELAX= 
##$RELAX= 
##$RELAX= 
##$RELAX= 
##$RELAX= 
$$ Bruker specific parameters
$$ --------------------------
##$DU= <F:/spectra>
##$EXPNO= 1
##$NAME= <H-F>
##$PROCNO= 1
##$TYPE= <nmr>
##$USER= <she>
##$AMP= (0..31)
100 100 100 100 100 100 100 100 100 100 100 100 100 100 100 100 100 100 
100 100 100 100 100 100 100 100 100 100 100 100 100 100 
##$AQSEQ= 0
##$AQ_mod= 1
##$AUNM= <au_zg>
##$AUTOPOS= <>
##$BF1= 200.13
##$BF2= 200.13
##$BF3= 200.13
##$BF4= 200.13
##$BF5= 200.13
##$BF6= 200.13
##$BF7= 200.13
##$BF8= 200.13
##$BYTORDA= 1
##$CFDGTYP= 0
##$CFRGTYP= 5
##$CHEMSTR= <none>
##$CNST= (0..31)
1 1 145 1 1 1 1 1 1 1 1 1 1 1 1 1 1 1 1 1 1 1 1 1 1 1 1 1 1 1 1 1 
##$CPDPRG= <>
##$CPDPRG1= <>
##$CPDPRG2= <>
##$CPDPRG3= <>
##$CPDPRG4= <mlev>
##$CPDPRG5= <mlev>
##$CPDPRG6= <mlev>
##$CPDPRG7= <mlev>
##$CPDPRG8= <mlev>
##$CPDPRGB= <>
##$CPDPRGT= <>
##$D= (0..31)
0 1.2 0 0 0 0 0 0 0 0.06 0 0.03 0 0 0 0 0.0002 0 0 0 0 0 0 0 0 0 0 0 0 
0 0 0 
##$DATE= 1568888092
##$DBL= (0..7)
120 120 120 120 120 120 120 120 
##$DBP= (0..7)
150 150 150 150 150 150 150 150 
##$DBP07= 0
##$DBPNAM0= <>
##$DBPNAM1= <>
##$DBPNAM2= <>
##$DBPNAM3= <>
##$DBPNAM4= <>
##$DBPNAM5= <>
##$DBPNAM6= <>
##$DBPNAM7= <>
##$DBPOAL= (0..7)
0.5 0.5 0.5 0.5 0.5 0.5 0.5 0.5 
##$DBPOFFS= (0..7)
0 0 0 0 0 0 0 0 
##$DE= 6
##$DECBNUC= <off>
##$DECIM= 24
##$DECNUC= <off>
##$DECSTAT= 4
##$DIGMOD= 1
##$DIGTYP= 9
##$DL= (0..7)
0 120 120 120 120 120 120 120 
##$DP= (0..7)
150 150 150 150 150 150 150 150 
##$DP07= 0
##$DPNAME0= <>
##$DPNAME1= <>
##$DPNAME2= <>
##$DPNAME3= <>
##$DPNAME4= <>
##$DPNAME5= <>
##$DPNAME6= <>
##$DPNAME7= <>
##$DPOAL= (0..7)
0.5 0.5 0.5 0.5 0.5 0.5 0.5 0.5 
##$DPOFFS= (0..7)
0 0 0 0 0 0 0 0 
##$DQDMODE= 0
##$DR= 18
##$DS= 0
##$DSLIST= <SSSSSSSSSSSSSSS>
$$ [...]
##$SUBNAM2= <"">
##$SUBNAM3= <"">
##$SUBNAM4= <"">
##$SUBNAM5= <"">
##$SUBNAM6= <"">
##$SUBNAM7= <"">
##$SUBNAM8= <"">
##$SUBNAM9= <"">
##$SW= 24.0689530833862
##$SWIBOX= (0..15)
0 0 2 0 0 0 0 0 0 0 0 0 0 0 0 0 
##$SW_h= 4816.95568400771
##$TD= 16384
##$TD0= 1
##$TE= 0
##$TE2= 300
##$TE3= 300
##$TEG= 300
##$TL= (0..7)
0 120 120 120 120 120 120 120 
##$TP= (0..7)
150 150 150 150 150 150 150 150 
##$TP07= 0
##$TPNAME0= <>
##$TPNAME1= <>
##$TPNAME2= <>
##$TPNAME3= <>
##$TPNAME4= <>
##$TPNAME5= <>
##$TPNAME6= <>
##$TPNAME7= <>
##$TPOAL= (0..7)
0.5 0.5 0.5 0.5 0.5 0.5 0.5 0.5 
##$TPOFFS= (0..7)
0 0 0 0 0 0 0 0 
##$TUNHIN= 0
##$TUNHOUT= 0
##$TUNXOUT= 0
##$USERA1= <user>
##$USERA2= <user>
##$USERA3= <user>
##$USERA4= <user>
##$USERA5= <user>
##$V9= 5
##$VALIST= <valist>
##$VCLIST= <CCCCCCCCCCCCCCC>
##$VD= 0
##$VDLIST= <DDDDDDDDDDDDDDD>
##$VPLIST= <PPPPPPPPPPPPPPP>
##$VTLIST= <TTTTTTTTTTTTTTT>
##$WBST= 1024
##$WBSW= 4
##$XGAIN= (0..3)
0 0 0 0 
##$XL= 0
##$YL= 0
##$YMAX_a= 619088
##$YMIN_a= -564235
##$ZGOPTNS= <>
##$ZL1= 120
##$ZL2= 120
##$ZL3= 120
##$ZL4= 120
##$ABSF1= 10
##$ABSF2= 0
##$ABSG= 5
##$ABSL= 3
##$ALPHA= 0
##$AQORDER= 0
##$ASSFAC= 0
##$ASSFACI= 0
##$ASSFACX= 0
##$ASSWID= 0
##$AUNMP= <proc_1d>
##$AZFE= 0.1
##$AZFW= 0.1
##$BCFW= 1
##$BC_mod= 2
##$BYTORDP= 1
##$COROFFS= 0
##$CY= 11.3945322036743
##$DATMOD= 1
##$DC= 2
##$DFILT= <>
##$DTYPP= 0
##$F1P= 20.1720416913024
##$F2P= 0.152960286110954
##$FCOR= 0.5
##$FTSIZE= 0
##$FT_mod= 4
##$GAMMA= 1
##$GB= 0.15
##$INTBC= 1
##$INTSCL= 1
##$ISEN= 128
##$LB= 0.24
##$LEV0= 0
##$LPBIN= 0
##$MAXI= 10000
##$MC2= 0
##$MEAN= 0
##$ME_mod= 0
##$MI= 1.114404
##$NCOEF= 0
##$NC_proc= 0
##$NLEV= 6
##$NOISF1= 3.799351
##$NOISF2= 2.8
##$NSP= 1
##$NTH_PI= 0
##$NZP= 0
##$OFFSET= 15.70392
##$PC= 1
##$PHC0= -9737.707
##$PHC1= 23.60096
##$PH_mod= 1
##$PKNL= yes
##$PPARMOD= 0
##$PSCAL= 0
##$PSIGN= 0
##$REVERSE= no
##$SF= 200.130013532006
##$SI= 16384
##$SIGF1= 3
##$SIGF2= 2
##$SINO= 400
##$SIOLD= 16384
##$SREGLST= <1H.CDCl3>
##$SSB= 0
##$STSI= 0
##$STSR= 0
##$SW_p= 3612.71676300578
##$SYMM= 0
##$S_DEV= 0
##$TDeff= 0
##$TDoff= 0
##$TI= <>
##$TILT= no
##$TM1= 0
##$TM2= 0
##$TOPLEV= 0
##$USERP1= <user>
##$USERP2= <user>
##$USERP3= <user>
##$USERP4= <user>
##$USERP5= <user>
##$WDW= 1
##$XDIM= 8192
##$YMAX_p= 0
##$YMIN_p= 0
$$ End of Bruker specific parameters
$$ ---------------------------------
##NTUPLES= NMR FID
##VAR_NAME=  TIME,          FID/REAL,        FID/IMAG
##SYMBOL=    X,             R,               I
##VAR_TYPE=  INDEPENDENT,   DEPENDENT,       DEPENDENT
##VAR_FORM=  AFFN,          ASDF,            ASDF
##VAR_DIM=   8192,          8192,            8192
##UNITS=     SECONDS,       ARBITRARY UNITS, ARBITRARY UNITS
##FACTOR=    0.0002076,     1,               1
##FIRST=     0,             0,               0
##LAST=      1.7004516,     0,               0
##MIN=       0,             -564235,         0
##MAX=       1.7004516,     619088,          0
$$ Real data points
##PAGE= N=1
##DATA TABLE= (X++(R..R)), XYDATA
0@%%%Qj6J6j6K4m0N6o4P3r8J24j48J78k17K63l10L62m24M98n80O69p71Q85j010
27e38J149j304J476j667J877k106K357k632K936l271L633m030M470m955N487o071
43c189O721p448Q259r166J0196j1378J2742j4337J6237j8548K1424k5113L0052
56A6452l7050M7786o6481J08023l47902J60351P37909p01062m55585O55652M17998
67E36091p15683k41848O37675J55678o15453k6749N05628l6927m29861J14675
77a16774L03050j38372k05766J59651Q9435j22030N126Q0439r8748j0986J44653
88H9678o3316j66988J55333J55247k29564j23242K92305O5066l26740O360L45532
99A99671q4255l38157J59672L08329k39104k63646L05044K02746l52956j17245
$$ y = [0, 0, 0, 0, 8, -8, 8, -8, 16, -24, 32, -32, 41, -57, 67, -81, 97, -120, 143, -167, 195, -229, 269, -311, 358, -413, 472, -538, 611, -693, 783, -884, 993, -1113, 1244, -1388, 1548, -1723, 1910, -2120, 2350, -2605, 2882, -3189, 3532, -3916, 4343, -4823, 5373, -6005, 6737, -7600, 8637, -9911, 11513, -13600, 16452, -20598, 27188, -39293, 68730, -279172, -118821, 619088, -81974, -537559, 118093, 536091, -179592, -421440, 216235, 371913, -243540, -270289, 235339, 198412, -231449, -116774, 186276, 47904, -157862, 1789, 91224, -30806, -25680, 54759, -43989, -54975, 89678, 26362, -140626, 14707, 169954, -59610, -182852, 109453, 174519, -152221, -145861, 199671, 115416, -222741, -63069, 245260, 6156, -257490, 47554, 250300, -102656, -219901]
109b19901L88166K1600m06093P0321L89867j62972l47383K46453K85854l09457
119d3545k07897L51953J27167l65220m1183L60904l8278l40208J03314K97634
129B04641j64290k47666K11498J92611k35504j24655K41550M8091k37399J5184
139i5939K08979o5942j56448J10642J01168j30700m1578J29874j8497j15516O6855
150g102Q6632j05087n0279J29722N396j46655L9444J52498q1043j40467J25397
161H456J16882j65790q1681J97382L8241k11486J4435K07585p3719j95932J19551
172b6076J63431j58419j18823J91797P8060k04624l0762K07898j8250k06305O0600
183f1473J95558r7239j73813J29524J41469j58474j06232J74034O6222j74845
$$ y = [-219901, 168265, 189865, -216228, -145907, 243960, 80988, -266395, -19942, 265912, -43545, -251442, 100511, 227678, -137542, -178725, 182179, 143901, -196307, -92993, 204641, 40351, -207315, 4183, 196794, -38710, -163365, 78185, 126276, -111123, -95939, 113040, 47098, -109350, 1292, 102460, -28240, -69818, 60056, 41559, -73957, -7102, 79530, -25557, -75836, 53886, 59282, -87373, -47929, 104569, 23526, -116941, 8456, 125338, -40452, -122133, 75249, 113490, -97996, -83561, 124024, 50305, -145627, -26076, 137355, -21064, -139887, 51910, 129970, -74654, -105416, 102482, 84232, -122073, -61473, 134085, 36846, -136967, -7443, 134026, -24448, -130680, 43354, 109576, -65269]
193f5269k2997J63846j5216j40600M4570J09383o1248p2649O9241L7827o8415
204b1527r706N5839j8446l9649M4586K5739n8719l340O8093k7209p8377N2479
216a0237P5368p6966n9145J03760L9997j19407j3900J23044j6916j19354M3752
227c0004J07562o4326q9715P9340O9315q8199m6705R4896K6959r7065q739R1369
239D4688j5279q4958L7374P5530n1262n3854O4921K9832p2787r289O6855j3452
251A8319n6213L2198M4291m1881k9723M5340J4451m6327j654M7046o751m3327
263b4231J5514L7947k6486l2927L3507K2449l9032q691M0463n286l5203J9968
275b008K7642k7746j3206L2031k388l5986Q450K8034j7582k1551K6509K2133k5225
$$ y = [-65269, -88266, 75580, 60364, -80236, -35666, 73717, 12469, -60180, 9061, 46888, -21527, -31233, 24606, 6160, -33489, 11097, 36836, -21883, -25223, 42870, 15661, -62716, -10237, 65131, -11835, -70980, 32780, 72777, -46630, -60530, 62514, 45598, -73756, -30004, 77558, 13232, -76483, 2857, 72172, -16027, -62732, 32164, 59123, -37942, -46681, 44688, 29409, -55549, -18175, 57355, 6093, -47761, 17160, 46992, -25795, -35084, 31771, 18319, -37894, -5696, 38595, -3286, -33009, 12331, 26782, -19545, -21199, 25847, 19096, -24231, -8717, 29230, 2744, -30183, 3324, 25773, -13259, -21950, 18513, 13227, -21976, -2008, 25634, -2112, -15318, 16713, 14325, -21661, -13211, 14823, -2759, -24310, 2199, 24332, -893]
288h93j6803K7356J1242l3401r536L4671L872l3676N788L2573j2831k6561J7873
301c26J7195k0178q284J6707j590j4330L383O852l937j36O559J272k641O3K105
316B714q69m067K174O564l697o238O479J530j3301k95J2800n789r418J3475P716
331I778j5085k737J3836k654j1780N041J0671k053o811Q54O892L29r646j927J0624
346E332r58j2447J964R319m493m896O802M348r23P40k583l545K784k516p745M303
362d514Q243l855j964P097J31n001P32O30j630K430K6l256K584J527n346k25L317
379I26k886r90M020k261j870N431J36m637M460M290n425j313L402l167k069L109
395A156j707r33N262j092n897K642K530n570j258M439K27OJ660o98J525K238m629
$$ y = [-893, -17696, 9660, 20902, -12499, -22035, 12636, 16508, -17168, -11380, 21193, 8362, -18199, -326, 16869, -3309, -11593, 5114, 3524, -10806, -7423, -571, -4508, -4644, 1915, 3187, 546, 609, 2714, 1845, -2222, -48, 6516, 2819, -3419, 3060, 4590, -8711, -9006, 3794, -1995, -11413, 2062, 9778, -5307, -8044, 5792, 3138, -8642, -3601, 7070, 5017, -1794, -940, 5952, 6281, -3365, -5292, 5332, 4374, -8073, -6109, 3210, -1283, -6179, 623, 4971, 4048, 4788, 2205, -1340, 1444, -1072, -8817, -4514, 3729, -126, -2090, 5007, 5138, 137, 869, 1499, -131, 2299, 2325, -931, 1653, 3180, -2166, -2391, 926, -1960, -2950, 1070, -1191, -3061, 2370, 2506, -2131, 2329, 6619, 1194, -119, 3283, 116, -1953, 1156, -551, -1484, 3778, 2686, -3211, -569, 1961, -3609, -4867, -428, -201, -195, 1465, 767, 2292, 4530, -99]
412i9k116O188j857p566L911M540o984j329O838j096m052L803J537l170O53J288
428D89o39K439O92k514J869Q10o058j325K754k878j693N077N92j279M485l77m924
445b480L971K508p903M48Q564l873o882O550M892o906k416N113Q08m440k651K410
461b287L911k764l596P098L919q104n98Q233n488r000R008M958j0969J228J3030
476H579m415j0762P150P733q374o019P695N607o916o396O977O175r820o855J1985
491B344M341j3526K19J4580l599j0601Q184P082q861j859O440l651m284M256k8
506A037m181M195M022n021k959N154J054q241l033R998L314j2444J15J9509k569
521I950k2011R396K3058j8481k2740K4662J6825l0540j0434L3149M010l2805K085
$$ y = [-99, -2215, 3973, 2116, -5450, -1539, 3001, -3983, -5312, 1526, 430, -3622, 181, 1718, -1452, -799, 489, -150, 2289, 2981, 467, 2336, 3146, -2912, -4237, -1483, -4361, -6054, -977, -385, -1664, 2821, 2444, -2480, 1491, 3999, -3904, -3456, 5108, 1235, -5647, 903, 5795, -1111, -3527, 1586, 2394, -2046, -4697, -2287, 1624, -1140, -4736, 2362, 6281, -1823, -2421, 5812, 324, -8676, 332, 5290, -5679, -4451, 8579, 4164, -6598, 552, 8285, -89, -6108, 1587, 7194, 278, -6118, 859, 7034, -2786, -9641, 2344, 6685, -6841, -6622, 7958, 4359, -6242, 1942, 9024, 163, -1696, 4744, 1093, -3191, 1065, 1037, -3144, 1051, 5073, 52, -2907, 2247, 3301, -4940, -7973, 2025, 5339, -7105, -6990, 12519, 9950, -12061, -2665, 20393, 1912, -20828, 3834, 20659, -9881, -20315, 12834, 16844, -15961, -13876]
534a3876L0904p144k9657J0800K7469j4480k4463K0772K1695k5624j5660K9693
546A0429O007l3122L528L1757j3244k5908K2230J8416k7095r781K7300L54k5897
559a5026O143K2524j0557j7520J4521J2958j7190p195J8977k54k0388Q944J8374
572A4311j9390j1757L0563K493l7705J1587M0767k8586m1007M2797L3799n5908
584a8036k2819O7785J2543p3085J100P6495j5274p9355K7645P7446m1840p2496
596e9891N6805O4498o8839n1247P8223L3594q3093j4126Q1014m965p2201K2053
608a8175N8767l3888m1893M0491K4034m2974p129M0297q318l4806K3303K7194
620B6903l4942j5528M4367l09n1385J6447N0924l4910m3601N3398L1459o4956
$$ y = [-13876, 17028, 9884, -19773, -8973, 18496, 4016, -20447, 325, 22020, -3604, -19264, 10429, 16436, -16686, -13158, 18599, 5355, -20553, 1677, 20093, -7002, -16783, 10517, 10871, -15026, -8883, 13641, 3084, -14436, 85, 13043, -4147, -11342, 7635, 7381, -13007, -4063, 14311, -5079, -16836, 13727, 16220, -21485, -9898, 30869, 2283, -38724, 4073, 37872, -18036, -40855, 26930, 39473, -33612, -32512, 43983, 28709, -50646, -23001, 54445, 12605, -59891, -3086, 61412, -7427, -58674, 19549, 53143, -29950, -44076, 36938, 31973, -40228, -18175, 40592, 6704, -35189, 5302, 29336, -13638, -20767, 19530, 11212, -23594, -291, 26903, -8039, -23567, 20800, 20491, -30894, -14447, 36477, 1567, -42034, 11364, 42823, -22133]
632b2133j2181P1487j0546p1550L1954O3227n2528m9539O9634L2158q1890j1610
644d3517R0004j1102r4421L4776R3304n9503q5999Q4203P3431j05159n3201J20587
656D3403K7590j29862j097J28681k6539j19247N0822J04103o7855q2741P9702
667F960N8902q5326l5945Q3504J2106p6509J0448O5361k9137m7824M4847K5213
679C2600n5326o59N6782k6209n0348N1317L6600p0364j5836Q2229r131q6760L3805
692b1300Q2209n6662p0757P7435N5962r1739l5112J02660J1666j09532J2500J08287
704F5617l9984j01139O6313Q6183q8979o3903J06427L6192j16296o482J16913
715F0862k3053j08273N0050R4678p0186p4372Q5516N2009r4660k9235R6675M252
$$ y = [-22133, -34314, 37173, 26627, -44923, -12969, 50258, -2270, -51809, 17825, 49983, -31907, -43517, 46487, 35385, -59036, -24260, 69044, 9541, -76458, 7745, 81176, -23983, -77184, 43403, 70993, -58869, -59966, 68715, 42176, -77071, -26249, 77854, 9999, -72742, 6960, 65862, -19464, -55409, 28095, 40201, -36308, -25860, 39501, 10364, -37460, 7387, 32600, -22726, -23385, 33397, 7188, -43160, 8157, 44757, -25607, -41443, 40786, 31655, -55105, -21300, 60909, 4247, -66510, 10925, 66887, -24852, -59964, 42696, 54362, -55170, -42670, 65617, 25633, -75506, -9193, 76990, -11989, -75892, 30535, 66727, -49569, -56051, 60862, 37809, -70464, -20414, 74264, 4078, -70294, 15222, 67231, -27429, -56664, 40011, 44263]
727D4263r3831J9242Q4886m0372o9125N8239M7248p1148k2363P5203n600p0773
739d4131L3071N9377n4005l9089P0566J6216p9351Q395Q0481l2759p6173N4425
751b977O5757p3769n1177Q8379L1650j00152r540J04306j5164j01222M1311R2081
763F9483o3373p3246Q1824M9465r3112k3437R4993m010r0360K9235Q0212m9313
775H361o3819O5518M4564p7828k5028Q2673J527q4411K0968P9982m2149o7838
787e7480O2030N1512p5743k9546Q3554N743q2941J7936P5485l8338o1757N3968
799D423M3924o4911k6343O8655N674o9541J3261O5671l0494n6593M7544M4481
811D5751o0307k7638O9109P742p1919J4134O8659l3977n8474N0468M2466o2866
$$ y = [44263, -49568, -30326, 54560, 14188, -54937, 3302, 50550, -20598, -42961, 32242, 26642, -44131, -11060, 48317, -5688, -44777, 25789, 42005, -37346, -28951, 51530, 18771, -57402, -2977, 62780, -10989, -62166, 26213, 57863, -42289, -51829, 52477, 37313, -63909, -22598, 69483, 6110, -67136, 14688, 64153, -28959, -52396, 42597, 38587, -51773, -22538, 57674, 8361, -55458, 10060, 54624, -23204, -48232, 34441, 35968, -48443, -27475, 52507, 10358, -57480, 4550, 56062, -19681, -49227, 34327, 40070, -42871, -24935, 50550, 12212, -49545, 4423, 48347, -16564, -42907, 25748, 31422, -38119, -24858, 40813, 10319, -46274, 1270, 45751, -14556, -42194, 26915, 34657, -37262, -23128, 45531, 11554, -46920, 3548, 46014, -16852]
823a6852k4823O7229N725o7315J2268O2726k6730n3439L9995M2031n0395k9078
835c8658N6794J3068o0048M585N9369k1121n1901L8118M0203n0916k5581N7627
847B1539P149n9785J0008N6460k4663m8042L7024L7607m4993k6374M9507J3819
859B9256n1805j392N1580j1004m7780K3367M1001l4216l0342M2735J6750m7161
871a9011j921M6736j2144m1239K4322L2627l3157k2863L7294J1618l9005k047
883a8790L8213o083l4414J4828L0497k1679k4823K6939J5901l1725n894L2848
895A5818m771l0461J5904K4839k4130j6153K8837N972l0622L491K9142j1148k4951
908a8233J7090J9742k1434j4875K3869Q832k6138k432K7400l864k6305J1869K3342
$$ y = [-16852, -41675, 25554, 31279, -36036, -23768, 38958, 12228, -41211, -1216, 40815, -9580, -38658, 18136, 31204, -28844, -24259, 35110, 13989, -37912, 206, 40409, -10507, -36088, 21539, 28688, -31097, -21089, 35371, 10708, -37334, -310, 37297, -7696, -34070, 15437, 29256, -22549, -23941, 27639, 16635, -31145, -7778, 33223, -993, -31335, 11400, 28150, -19011, -20932, 25804, 13660, -27579, -3257, 29370, -3787, -26650, 10644, 22262, -16743, -18790, 19423, 13340, -21074, -6246, 24251, 2572, -22251, 4688, 20589, -11136, -17030, 15818, 11047, -19414, -3510, 21329, -2801, -18954, 9883, 15855, -14767, -11276, 17866, 6718, -18233, -1143, 18599, -2835, -17710, 6159, 14991, -11147, -13579, 13821, 9957, -16348, -4479, 18863]
921A8863j9570j8763K5048J0847k8529k064K9142n368k5883J2363K1637j6553
933A170j7444J7559J1922j8691q345J8549N286j7500j277J7871k300j6098O290
946c008J2624j0475q485J2538K984j2382K796J0456o644o718Q235K104q702N90
960d087P122k639m706L970L433l409j933M804J144n652L91O927l571q411O635
975A8P170j1268n854J4008K702j5488J863J6055l829j3170O034J1412o499r882
989f728M677Q073m215q140M634Q823m165p832N659N835p028m552N033J153m138
1004b911L87K390M38J316l02j452K636R50m314k84L741k709l279L904J692l650
1020a447N42L726q01k548N46J727j39l026j612M058Q48o062N5P169j951o542M648
$$ y = [18863, -707, -19470, 5578, 16425, -12104, -14168, 14974, 9606, -16277, -3914, 17723, 1170, -16274, 1285, 13207, -5484, -13829, 4720, 10006, -7494, -8771, 9100, 6800, -9298, -3008, 9616, -859, -9344, 3194, 6178, -6204, -3408, 7048, 404, -6314, 1921, 4025, -4677, -4087, 3035, 396, -4310, -340, 3093, -316, -2249, 2555, 3699, -1953, -1562, 5365, 1794, -6617, 18, 7188, -4080, -9934, 4074, 6776, -8712, -6849, 9206, 5377, -7793, -1759, 9653, 3154, -6728, -2051, 6022, 1807, -6333, -1699, 7124, 2959, -4873, 786, 6621, -407, -4959, 74, 1227, -2911, -2524, -134, 304, 1620, 1318, -134, 2502, 3452, -862, -1146, 2595, -114, -3393, 511, 2203, -1447, -905, 2821, 2020, -528, 18, 1745, 1606, -1420, -3032, 1026, 1874, -4188, -4133, 3036, 1085, -5457, -809]
1037h09O391m943l344N748J585m723r06K227L35j877k379J358L178k681l745M100
1053d85K826n167j623N431P21l823N25L338J482j404k702J423M109l736o923M204
1069a804N940p013n244Q471M339o994k240O976K309n348l210M486M006n182n061
1084e569N997M713p425l230P778J125o981Q70N176j510k505J777O75j30j08j246
1100e93K44J459j343j292K486k30k332J801J301k400j15J735j120l62J311j150
1116f00O48K900k376k568M768J079o292j76N988j918n473K182M438j436l703R03
1132a636M611M7n236L76O556j599p014L556N897o359m475O704J079o947J372O306
1148C238k151l784L979L757l085l735K852L777m580n639M995N258p362m732Q969
$$ y = [-809, 5582, 639, -2705, 3043, 4628, -95, -1001, 1226, 1561, -316, -2695, -1337, 1841, -840, -4585, -485, 2341, -2826, -4449, 982, 1703, -2120, -1595, 1743, 3225, 1821, -881, 542, 4651, 915, -6008, -1804, 4136, -2877, -8121, 350, 4689, -2305, -4545, 2431, 4740, -608, -3818, 668, 4674, -508, -5569, 428, 5141, -2284, -5514, 2264, 3389, -3592, -2722, 2454, 944, -1561, 216, 891, 761, 653, -593, -349, 1110, -233, -1525, 961, 731, -1601, 200, 1501, -899, -1014, 721, -399, -761, 550, -600, 48, 2948, 572, -1996, 2772, 3851, -2441, -2617, 3371, 1453, -4020, -1838, 2600, 1164, -2539, -1636, 2975, 3022, -2214, -1838, 4718, 3119, -3895, -339, 5558, -801, -5276, 1428, 2507, -4440, -3068, 3238, 1087, -2697, 1282, 5039, 1954, -1781, 1071, 4848, 268, -5371, -376, 4882, -2480, -7212, 1757]
1163A757L179q922r78P848l7n709N93L577J434j350k933J166N059j479o901J456
1179b240O408l275p212K420O865j931o662J887R029j245r934L119J1512n735j2019
1194i013Q409R954j1471p751J2555M140j1931q05J0936m46q676J601P147k275
1208B374o627J416N480k882m759M029L858m046m78N210j948l643M347J67o608
1223d110K092N653n473l688P691K428p064R21O256k534m681K363J698l448n35
1238b431K772p69k402L164M020m888l615Q626L014j2910j383J5775k270j8778
1252a2075O459J9401j0565j7998J4025J5607j5340j2522J4960J0211j4233q606
1264a0676J2650P441j1007o172J0199N063q290l261N747J343k793j521k152K288
$$ y = [1757, 4936, -3986, -4964, 2884, 2847, -2862, -2269, 1308, 2742, 1392, -1541, -375, 4684, 3205, -3696, -2240, 4168, 893, -6319, -3899, 2966, 1035, -5627, -3740, 5289, 4044, -5890, -2771, 8741, 3006, -9013, -604, 9350, -2121, -9872, 2683, 6823, -5108, -5913, 5023, 4577, -4099, -2498, 4649, 2374, -4253, -2837, 2643, -239, -4998, -969, 2889, -1157, -1635, 3575, 1627, -2016, 2331, 2498, -4110, -2018, 3635, -1838, -5526, 2165, 4593, -2471, -1550, 4706, 2172, -2509, -146, 1552, -1896, -2431, 341, -428, -2830, 334, 4354, -534, -4149, 4477, 7491, -5419, -6802, 8973, 6703, -12075, -5616, 13785, 3220, -14778, -753, 14854, -486, -13008, 1952, 12163, -2070, -10676, 1974, 9415, -1592, -7764, 2435, 7498, -792, -4053, 1694, 3037, 244, -1277, -3429, -1141]
1278a141N524m971q185J0018R925j3674p605J7452M757k0229j444J9782l133j9767
1292a2691O211J8615q976j6403J2299J5267j5240j2936J8027Q848k1675m217K3006
1305A0135j426k2292Q110K0265j2562j5307J6110R527j7385m378J5839r16j4230
1318h510L962J1051o842q055R277N365j0298j246J2424k813j2234P910J0544j3518
1332b983p689J7150J588j9842M668J9689j1012j6867J7013J2924k0084p427K2542
1345I670K318k2815K255K2096p107k1437J1174J9114j6122j5918J9923J1319k2761
1358h291m334K4346k706k2219J0574J7986j6597j1552K0099L502k1663L957K0325
1371A3427j0812j7880J6475J4604k1156j0504K5065N813k7931j05L0069o134k9752
$$ y = [-1141, 4383, -588, -8773, 1245, 11170, -2504, -10109, 7343, 12100, -8129, -9573, 10209, 7076, -12691, -6480, 12135, 3159, -13244, -945, 14322, -918, -13854, 4173, 13021, -8654, -12871, 10135, 8709, -13583, -5473, 14792, 2230, -13077, 3033, 12560, -4825, -9203, 6636, 5720, -8510, -4548, 6503, -339, -8394, 883, 6248, -4050, -5296, 7128, 4315, -7919, -9, 10535, -2983, -10672, 6478, 8066, -11776, -7108, 12581, 1569, -15298, 1715, 14639, -5445, -12872, 9670, 11988, -10827, -8572, 13524, 6417, -15020, -3846, 15268, -854, -16772, 3151, 14470, -8291, -12625, 11721, 9015, -13204, -2630, 15356, -1241, -12793, 7306, 10808, -10855, -6898, 13427, 2615, -15265, 1210, 15814, -5342, -15846, 9219, 15032, -12899, -13004, 17065, 10931, -18821]
1384a8821J3367K7127k0399k2292K5199J4501k8292o395K8309j832k4823R784
1396d567K0460j4493j4323J8061P932k0584k397K1058m654k1102J0746J9342j7250
1409a771j5884K3386J0575k7719k854K9936n411k9023J4060K5396k0413j8920
1421a8642K5552J1774k7386m666K6901l563k6303Q446K2528j4857j9213K0137
1433G08J4539k3235o850K7570L86k7338Q972K5506j8035k1280K3665J2874k9099
1446a1617m921L0316l464k8700J1573K6129j7098k1555K1666J6253k5512j1163
1458a8093K7402M697k8188K278K8228r177k4740J6535J9466k1873j2255K4609
1470H889L369k5173N148K2620j2118j7568J7754J1788k1222n992K1977m95k2966
$$ y = [-18821, -5454, 21673, 1274, -21018, 4181, 18682, -9610, -16005, 12304, 10472, -14351, -4567, 15893, 1400, -12923, 5138, 13070, -7514, -9911, 11147, 6493, -14609, -3863, 15479, -1771, -17655, 5731, 16306, -11413, -14267, 15669, 10258, -18765, -4705, 20691, 278, -18642, 6910, 18684, -8702, -13368, 13533, 9970, -16333, -7887, 14641, -216, -19429, 708, 15247, -7988, -14838, 12732, 13118, -14220, -5248, 20258, 2223, -19057, 4608, 17482, -11617, -16538, 13778, 10314, -18386, -6813, 19316, 2218, -19337, 2329, 18582, -6930, -18093, 9309, 14006, -14182, -11904, 16324, 7147, -17593, -1058, 18408, -3465, -15720, 8889, 12258, -12915, -7767, 14853, 2735, -14833, 2921, 14709, -6513, -12505, 9472, 8977, -13989]
1483a3989N696K1847j1111j9584J7261J7186k0933j0806K5502M549k7085K871
1495h596K5328j1692k2666J7399J5804k2031q924K4249K208k3693M940K2674j0261
1508D739k0045J5158J6406j9553j2516K3354P718k5621j090K6985n691k6064J2227
1521c993K1985j8614j7227K1729J0365k2982l532K2269j714j8778O798J5605r681
1534B230j1587J1344P197j3562l558J3697j087j3836O363J2674j1119r016J5612
1547E352M425j8084J436J8308p309j6672J1804J2941j5150q851J6346M967j6452
1560f939j180J5981j982j4809N075J3563q329j1178J1380P842j4314l351J5702
1573G461k163j6037P727J4112j2394j0616J5956O486j7489k067J7738j344j6771
$$ y = [-13989, -8293, 13554, 2443, -17141, 120, 17306, -3627, -14433, 11069, 15618, -11467, -8596, 16732, 5040, -17626, -227, 15577, -6454, -15378, 8871, 11079, -12614, -7674, 15000, 4739, -15306, -148, 16258, -3295, -15811, 7543, 15261, -10360, -11450, 15535, 9844, -16220, -3993, 17992, -622, -17849, 3880, 14245, -8737, -12269, 10000, 8286, -10492, -3694, 11911, 2230, -9357, 1987, 9184, -4378, -7936, 5761, 4674, -9162, -2799, 9875, -1244, -10260, 5352, 9777, -8307, -6871, 11437, 4128, -12544, -740, 12201, -2949, -11800, 4546, 9513, -6939, -8119, 7862, 5880, -8929, -3854, 9709, 1380, -9798, 1582, 9424, -4890, -8241, 7461, 5298, -10739, -3012, 11100, -1294, -11910, 4046, 10532, -6957, -9024, 8714, 7370, -9401]
1586i401L830J5579n839j4754P379J3379r087j1402J0555Q937j1612n585J1415
1599C394J989r740J342O791l336k588L846j390k957M680J012o740J256P589k916
1614B232p937M343Q391n580q899O990R123q886r269J1067Q187j3344n670J4891
1628E639K528j4689J090J3049l716j0653N133P687n984n261N438L620m843j939
1642b901N020J140m664N01M624k159m860L729K634n853r69O497j407n622L793
1657d97M491m533k135M949J85l986R27K344j546j226J287O62j105j56J289O1k260
1674a249K85K719k103l631L790K948n589j166P035k77o771L059O134m069m854
1689c739M727K838m817k354L728J780l570j971L722K260m485j332M906L57n055
$$ y = [-9401, -5571, 10008, 4169, -10585, -3206, 10173, 1086, -10316, 239, 9176, -2436, -8021, 3394, 5383, -4357, -3015, 3776, 440, -2148, 1698, 308, -2649, 2031, 3043, -3697, -2441, 5148, 2232, -5705, -1362, 7029, 1449, -7450, -460, 8663, -223, -9492, 1575, 9762, -3582, -9252, 5639, 8167, -6522, -5432, 7617, 3901, -6752, -1619, 6068, 84, -5177, 261, 3881, -962, -2901, 2119, 3259, -1405, -904, 3720, 1561, -3299, 430, 3064, -2789, -3758, 2739, 1332, -4290, -497, 3994, -539, -2674, 2275, 2460, -1526, -599, 1745, 199, -1027, 260, 922, -183, -339, 950, 1011, -1249, -964, 1755, -348, -3979, -189, 2759, -2830, -3996, 3039, 2762, -4009, -950, 5184, 1115, -3739, 988, 3826, -991, -3345, 383, 2163, -1407, -3378, 344, 2604, -1881, -3213, 1693, 2050, -3005]
1704c005J161M210k359k592K962J120k125Q08Q51j161N09Q12k116j65J919q59
1720c0j767J565J326r28j024N19J529m78k729L27L637j566l993L348M110m517
1736f71k445O026J069n911O12N114k013m421J675K955k139k945J651L158j677
1751C8l038K888L438l599k073M725P29m947J137L793k832k224L310M88l370J091
1767d46K191j885j594K055P27j874n92J813Q82j887p74K891N82l685Q34L983k762
1784D59l344M100J514n103P26M921k879l895M348K208n462l69N363o93n225J669
1800a662N320k085n703K989N959m447o405O122N786p839m155R240J964r661Q79
1815c698Q670k837p076M102N089m407l351M069J712l613j126L252O77l184L45
$$ y = [-3005, -1844, 2366, 7, -2585, 377, 1497, -628, 180, 1031, -130, 379, 1191, -925, -1090, 829, -30, -1797, -232, 1094, 166, -858, -339, 1190, 712, -2017, -1690, 1947, 381, -3612, -264, 3846, -671, -3116, 2910, 3979, -1932, -1320, 3794, 1781, -2640, -965, 1990, -149, -3094, -1443, 1715, 38, -3000, -112, 3326, -273, -2346, 2379, 3108, -1839, -702, 3091, 259, -1965, 1345, 1833, -1537, -446, 1745, -140, -1734, 321, 1048, -826, -1418, 395, 1277, -610, -1384, 1507, 2089, -1596, -762, 3221, 459, -2885, 1215, 2729, -2374, -1648, 3273, 394, -3501, 847, 3055, -2407, -2776, 2587, 1894, -3331, -1662, 3658, 1573, -4130, -1141, 4818, 371, -6034, 88, 5874, -1965, -6120, 3120, 5084, -4577, -3698, 4972, 2135, -4941, -839, 4250, -157, -3508, 561, 2273, -1340, -2466, 786, 1463, -1721, -1376]
1830a376L184j262k682K796J442l926N86L932l166l161N052J108o304J716O603
1845D542l950n352O064M056p127k725P821J401q455o04Q770n36j0072J949J0695
1860F477m149j0725O963J0188r000p818J0790N433j1286k487J0560l79r269J773
1874b929P374k557o089L301M725l390l607L751K408m625p32M733j056m424L523
1889D06K804m956n18N757j780n297M280L795n687k053O095J36n895Q75N135j912
1905A185n004K584M395k988l909M085L694n057k408O349J19o838K244O055m446
1920F0m619O281K393p126k38O833j598o227K554N770l232n307L687N283m412n358
1936e256N457M846o494l715P287K232p441j3O525j419m964K258K645k456j231
$$ y = [-1376, 1808, 546, -2136, 660, 2102, -1824, -1238, 2694, -472, -3633, 1419, 2527, -3777, -2061, 4542, 592, -4760, 1304, 5360, -1767, -4492, 3329, 4730, -3725, -4329, 4441, 3905, -6167, -4218, 6477, 2328, -8397, -1434, 8754, -246, -8064, 2726, 8159, -3127, -5614, 4946, 4567, -4702, -2929, 4445, 1888, -4201, -900, 3825, 435, -3172, 579, 2987, -1638, -2370, 2363, 1307, -3117, 406, 3210, -1746, -2264, 3493, 1713, -3584, 696, 4491, -1196, -3249, 2846, 2982, -2913, -2038, 3097, 1185, -3819, -1235, 3160, 172, -3737, 348, 4042, -1015, -3423, 2926, 3045, -3793, -1549, 4506, 60, -4559, 1722, 4115, -3011, -3249, 3584, 1986, -4241, -1687, 4083, 851, -4456, -769, 4514, 102, -5256, 201, 5047, -1447, -5162, 2125, 4357, -3084, -3097, 3428, 2009, -2955, -697, 1948, -508, -1739]
1951a739J709J24q01N97L25p05j14J060M65j842m84L004J52m168J076M571k602
1968F28m866M138L783n528k207N932Q11n373P02M837q59m050J178L520j410m075
1984b839J715L966k716l760M237L102n113j713N788l17n466J986M443l142k886
1999b715L811J085l459j68L064k76k678P75K955j344l285K415L288m061k865N425
2015A967J685o881J9P196k085o261L764N389m796l543M819J879m559j033M085
2030A645L91l604N78L657j564l729K841L233m879k137O419j18p076K295P056m745
2046B63n862O391M223p232k214P053J027o517M8O085n83n868J400N163k774m865
2062d262L979L497m972j226N924j002n699L551M479n688k571P123j6p341J967
$$ y = [-1739, -30, 94, -707, -110, 215, -490, -604, 456, 921, -921, -1405, 1599, 1751, -2417, -1341, 3230, 628, -4238, -100, 3683, -1845, -4052, 1880, 2691, -2682, -1980, 2857, 1998, -2052, -874, 2646, 1236, -2839, -1124, 2842, 126, -3634, 603, 3705, -1408, -3121, 2667, 2350, -3116, -1130, 3313, 171, -2715, 1096, 2181, -1278, -1446, 1618, 1342, -1336, -561, 2394, 1050, -2235, 180, 3468, -593, -3458, 1967, 3652, -3229, -3210, 3986, 1901, -4360, -596, 4793, -3, -3546, 1273, 3152, -1407, -2440, 1645, 2036, -1568, -990, 2667, 1103, -2626, 215, 3448, -1431, -3568, 2851, 2733, -4343, -2048, 5008, 263, -5599, 792, 5015, -2217, -4431, 2622, 3649, -2868, -2820, 3265, 2682, -3186, -1786, 3377, 603, -4262, -283, 3214, -1758, -2984, 2940, 1938, -3761, -210, 4269, -1419, -3990, 3133, 3117, -4224, -2257]
2077b257O738l928n978M775N176n666m319O606L601p378k205Q763O58q937J857
2092b494Q827m616p994O430N424q316k600Q590j55q106K799O610m386m834N658
2107H37L926o100k501P102J027q096K95Q642k653q560N109P918p194o106Q783
2122B429L419r437p65Q675j917p160L359M932l877k789M319J553m041J74L868
2137B742k296l694L744L359n406j876Q010R5r309K352R278n511r166P529P146
2152F997r797m989J0140K691r633l8R545r11p968K582P098l770o278M892M662
2167E223o397l288P345M48q076K052P117m310n461O490L390p507j103O998r39
2182A982n823K547N159k927l583L511K698m235k114M350M62n190J177N043l309
$$ y = [-2257, 4481, 553, -5425, -650, 4526, -1140, -5459, 1147, 4748, -2630, -4835, 3928, 4586, -4351, -2494, 6333, 1717, -6277, 153, 5577, -2739, -5339, 3251, 3096, -5010, -2211, 4399, 13, -4821, 837, 4763, -1337, -3838, 3264, 4291, -3805, -3510, 5132, 2479, -6081, -972, 6946, -248, -6354, 2429, 5848, -3589, -4354, 4321, 2404, -4756, -1397, 3535, -342, -3131, 1188, 2741, -1300, -1126, 2742, 446, -3248, 496, 3855, -1551, -3427, 4583, 4678, -4631, -2279, 6999, 1488, -7678, -149, 6997, -2800, -7789, 2351, 5042, -4591, -4629, 4916, 4005, -3963, -1381, 5717, 1947, -4331, 561, 5223, -1174, -4462, 2883, 3331, -4745, -2693, 4424, 114, -5347, 1143, 4533, -2974, -4077, 2921, 1982, -3841, -1294, 3865, 938, -2645, 866, 3564, -671, -2785, 1565, 2027, -3163, -1986, 3057, -252]
2197b52m160N424K874o684k76P678k512p424M133N818n978m054P157K829o959
2212b386j121P036j77p113R37P207k232p151L757O540n682n680P117L929p707
2227b726j491P814p06o913K167M990k793l147L219K078k688r25K332k01j820N71
2243b39J838j574j658K321N05l851N94M808k271l954M522L787n805k274O378j71
2259B956o555J697N701k861m640L586L647l925k861M516K172m875j654N664K55
2274B823o364J340O369k936n572M926M129o126k438N927L39n147J202M401j755
2289A118l219J934J988k105j662K385J320k471m94K998o09l535J980K951l188
2304f09k037M030K40m352J332L460k377j903L411N74l084O54K303j864j774K197
$$ y = [-252, -4412, 1012, 3886, -2798, -3074, 4604, 2092, -5332, -1199, 4619, -1359, -5413, 1744, 4573, -2386, -3507, 3529, 3352, -3761, -2824, 4383, 2151, -5000, -1243, 5297, -385, -6065, 1052, 4981, -2726, -4217, 3597, 2891, -4022, -1855, 3135, 342, -2805, 414, 2492, -196, -1121, 1211, 1010, -810, -239, 1599, 25, -1633, 688, 1193, -2658, -2064, 2744, 473, -3481, 1041, 4828, -977, -3251, 3127, 2956, -3599, -1902, 3799, 938, -3702, -116, 3531, -394, -3255, 1261, 3433, -1442, -3096, 2568, 2823, -3541, -2201, 4168, 1232, -4340, 586, 4715, -1411, -3849, 2078, 2417, -2730, -1528, 2873, 1118, -2101, -167, 1821, -284, -1946, 439, 1759, -712, -1206, 1792, 1183, -2352, -372, 2579, -609, -2646, 1384, 1624, -2728, -1396, 2064, -313, -2216, 1195, 1769, -1315, -661, 1642, -222, -1996, 201]
2320B01J724k437j474L143J039m279j223N315K14n747J296O343k909o024M164
2335f54M888m817l056N070K104m499j275L375N64l131p62K637N05k602N8K532
2351I37o61j663K223J279k223L23J880k318j985K469O71k997R56L020j326j843
2367a258J655J150j725p90J314P53j607q62J759O30k199j60L163m15k788J857
2383D77K215l414j540L658j61l314J818K973k256k090K554J268k837j064K630
2398I17Q76l325j309L650L01m385R78N504j172m507L552L977m711l236M540J158
2414B808m727l76L814o74k882M58K191l84j808Q90J594j112j140J635K22j665
2430a156J351K583k193j423L532o68m598J084L457l009k831M211J730m264r6M341
$$ y = [201, 1925, -512, -1986, 1157, 2196, -2083, -3306, 2009, 2223, -3524, -2228, 4115, 1206, -4818, -654, 4234, -583, -3639, 1431, 3535, -964, -2239, 1136, 1700, -1431, -2193, 444, 949, -1653, -1595, 937, 276, -1387, 836, 2115, -108, 215, 2095, -223, -2208, 261, 932, -2065, -1109, 1911, 585, -1258, 397, 1547, -178, -968, 346, 1099, -508, -1370, 389, 1019, -1180, -1340, 1823, 1408, -1380, 477, 2692, -722, -2262, 1396, 1235, -2079, -261, 2712, 456, -1634, 920, 2188, -649, -1713, 917, 1793, -1532, -2841, 809, 1110, -3275, -2297, 3207, 2035, -2472, 1080, 5057, 346, -2890, 1650, 2808, -1919, -2295, 1519, 845, -2037, -1579, 612, 228, -1580, -690, 904, -208, -1348, 287, 509, -1156, 195, 2778, 585, -838, 2694, 2026, -2572, -1488, 1969, -1040, -3871, 340, 2070, -2194, -2290, 2051]
2446B051m38l604J249L674j681l620J815K945l347l050M418K375m932n56N906
2461C205j119n519K964M531m219k974M653R77m875r0L684q29k862J747K705j542
2477D37k175J929J634k911r15L934M6l967J758L716l497k881M265J042m834N23
2493a896M335k479l271L142K264l241n74L806L03l116K5L016j057l452J614L618
2509C037k688l328L624K330n220r30N417m10m814K696M198l525k929L743J491
2524B692l691n92L238j17k920k4K410n29k604J329K819j672k123K759R17l151
2540a259J30L424j625k129K754P67l577J13K904j713k458K507J899k421j416K540
2556D40J339k652j180L604J218l970n00M373j214m858J829M217l251k701M219
$$ y = [2051, 1613, -1991, -742, 2932, 1251, -2369, -554, 2391, -956, -4006, 412, 2787, -2145, -2701, 3205, 2086, -3433, -469, 4062, -157, -3131, 1522, 2499, -2376, -2466, 1218, 389, -2473, -726, 1979, 437, -1738, 191, 1825, -1086, -2001, 1933, 1979, -1988, -230, 3486, -11, -2892, 1373, 2415, -2419, -1896, 2439, -40, -3311, -169, 2095, -1146, -1720, 2086, 2389, -727, -702, 2314, 1257, -2195, -581, 3037, 349, -2979, 645, 2975, -2245, -3175, 2242, 1832, -2982, -286, 3912, 387, -2542, 1201, 2692, -999, -1591, 1647, 1530, -1390, -1414, 996, 467, -2137, -808, 2011, 339, -1784, 975, 1892, -1259, -1129, 2295, 670, -1459, 1295, 2062, -1515, -1402, 1502, -211, -2669, -162, 1737, -684, -2100, 440, 1779, -873, -2053, 1551, 2769, -1201, -1701, 2672, 1458, -3400, -1571, 2646, -605, -3306, 913]
2571I13J383l958J70L486r99k356J625J443k154j300J586N87j947l65L168L70
2587A652l090Q85L324k264l510L488K073m239p76M696p54m084J829L116k385j888
2603a927K868O63k781l32K081j31k139P01K987r11k808K200K661l639j932M369
2619A930O34n035P45M466k354l812L207K442k852q39L142M10k723j97J666k63
2635E67j957O25K376r01j791J776J346k788n80L372j193l362K288K162l451j040
2651b551M056P1l052J555K868j797k373J382J195k086j412J981J573k146j035
2666a771L043M00l490R28L540k201k802L078J230l783j51L649r03k626K179J836
2682B156k113j371J787M88k090n62K203M19k599K40L124r64l220K541L250l457
$$ y = [913, 2296, -1662, -1492, 1994, 995, -1361, 264, 1707, -447, -1747, -161, 426, -1521, -1886, 1282, 1652, -1438, -553, 2771, 507, -3003, 485, 2558, -1681, -2457, 2239, 1485, -2599, -770, 2346, -39, -1927, 941, 1604, -1177, -1509, 572, 441, -1698, -997, 1990, 1079, -1729, 471, 3132, -507, -2439, 1930, 2564, -2471, -1726, 2740, 386, -3426, -219, 2223, -629, -1468, 1674, 2084, -639, -836, 830, 567, -1390, -765, 1611, 710, -1081, 695, 2041, -747, -1327, 2045, 852, -2510, -222, 1940, -1511, -2551, 1505, 1576, -1476, 79, 2947, 1150, -1223, 159, 1354, -732, -2144, -163, 1410, -736, -1771, 1272, 1672, -1818, -890, 2650, 449, -2353, 725, 1955, -1828, -1979, 1670, 767, -1859, 320, 2156, 43, -1328, 459, 947, -1143, -1705, 498, 917, -1682, -1442, 1682, 718, -2502, 39, 3289, -168]
2698a68k113M195L05m853M52L986j498k958K353K326j817j746J408J529j383j458
2714a440J516J338j741j099J874j37j569J211R61j757L11K230k036k074L451J074
2730B113l799K93M235r36m231J176L535j671l755J835L952j809m269K384M393
2745C446l436l660M347L064m424j662M368J42l660O18K071j108o50O67k10l67
2761d54N79j98o93M75J256K24j515M3J922k73l242Q31L886k249l893L257L140
2778C096m529k109M992R37m292M27L943q97l184J040K505j185k226J310K175j757
2794B46k133K227J149l065l94L469j093k967K405K168l208n38L578j60k742J134
2810G6K148j781j953J153J202j418j194J473J412j625p33J981L80k316Q17K020
$$ y = [-168, -2281, 1914, 2219, -2634, -2182, 1804, 306, -2652, -299, 2027, 210, -1536, -128, 1401, 18, -1440, 76, 1414, -327, -1426, 448, 311, -1258, -47, 914, -843, -532, 1698, -338, -2412, 1039, 2113, -1686, -1393, 2842, 1906, -2325, -1149, 2386, 715, -3040, -1205, 2747, 938, -3331, -947, 3446, 10, -3650, 697, 3761, -663, -2325, 2043, 2185, -1475, -857, 1214, 106, -544, 123, -87, -454, 125, -73, -766, -291, 965, 1189, -326, -283, 1639, 1366, -1876, -1045, 2841, 592, -3301, -44, 3096, -1433, -3542, 1450, 2387, -1905, -1478, 2465, 1568, -1616, -576, 1929, 744, -1482, -172, 2003, 246, -1887, 340, 1489, -1576, -1970, 1499, 406, -2561, -156, 2012, -1196, -1734, 1844, 1684, -1058, 76, 2224, 443, -1510, -357, 845, -573, -1767, -294, 1118, -507, -1240, 741, 1121, -1195, -378, 1642]
2826A642j987j469K531j87k954J495K905k396j549L345O70l504Q4L195n73k940
2842a692O19L110q00l513J026L587k112l666L191L146m290j710M457M73m391J294
2858a271M015j587k740K332J822k418j438J721R43k009j181J937Q30k294n20K899
2874A041k76k128J373J745j727p02J593p09j349J790M14j849Q83J816j651j402
2890a138J878P57k315o28K021M11k196n61K589O24k794L79L529r26l878K254K846
2907B852l616k113M285L32l981R70L765j716k904K162K543k295k235K176K126
2922B351k930k373L023K016l644j199M596N46m124N65L703j685k672J798J401
2937A372j213o82L17K08J09m56o47Q91O16r51m07R77K12l36l80q2J242K52j861
$$ y = [1642, -345, -1814, 717, 530, -2424, -929, 1976, -420, -1969, 1376, 2046, -1458, -1374, 1821, 1248, -1692, -1073, 2037, 1237, -2276, -1250, 2337, 225, -3441, -250, 2896, -1394, -3104, 1353, 1826, -2565, -1271, 2744, 1157, -1583, 749, 2571, 153, -1285, 436, 1379, -630, -1811, 126, 956, -1338, -1858, 1041, 765, -1363, 10, 1755, 28, -674, 919, 210, -1139, 651, 1065, -784, 99, 1915, 264, -1138, 740, 1497, -818, -1446, 575, 986, -1210, -1771, 818, 1442, -1352, -973, 2556, 1630, -2248, 6, 2852, -764, -2877, 1408, 1740, -2241, -1271, 2494, 778, -2126, 36, 2579, 284, -1951, 225, 2351, -579, -2952, 71, 2087, -1557, -2756, 1840, 2386, -1738, -1173, 2530, 845, -1827, -29, 1372, 159, -523, -206, 2, 111, -345, -992, -101, 515, -436, -843, 134, 346, 10, -370, -452, 790, 1042, -819]
2956h19J5K184r87k675J684K485k568j579L114O02k568p3K212l06j583L76J217
2973G31M5j679j58J955k66k116J164K153j905j437K363M94k720O00K234j239j587
2990a368J447J025j418n97R58Q12o02r80Q44J340j510j442J939R86k228n03K534
3007A237n80j679Q51R50p45m5K05J45J35l0p91K38P73r93l66P42L4m60K31J84
3027C6O1N48n75l59J300J51j795J63J999j536j618K072Q85k204k86K005q6j629
3045h68J36J320R9j416l63J788K17k206K42K609p14k289J378J734j832q20J702
3062G17j78j292P03L11q75L12N18o60k70N75J26k28k84K40Q30l72j285J101J610
3081A599j664j137K042N89k412J02J887j014j015R08K78n74K48M3m47N06K83o68
$$ y = [-819, -804, 1380, 393, -2282, -598, 1887, -681, -2260, 854, 1456, -1112, -1185, 1027, 721, -862, -486, 731, 776, -903, -1061, 894, 628, -1488, -324, 1829, -76, -1513, 850, 1344, -1376, -776, 1458, 219, -1368, 79, 1104, -314, -911, 47, 859, 257, -723, 121, 1461, -49, -1491, 448, 1434, -794, -1297, 1237, 657, -1022, -171, 779, 34, -11, 194, 339, 474, 444, -347, -109, 664, -329, -695, 47, 81, -379, -148, 36, 97, 645, 70, -289, 1011, 1162, -633, -470, 1529, -7, -1625, 447, 1332, -872, -1158, 847, 761, -868, -732, 588, 687, -729, -1092, 696, 913, -1293, -1051, 1558, 844, -1445, -67, 1667, -165, -985, 717, 539, -753, -50, 261, -614, -302, 216, -444, -714, -139, -13, -241, -525, -285, 545, 173, -1112, -11, 1599, -65, -1202, 840, 1429, -983, -881, 1006, -8, -1023, -115, 163, -411, -163, -120, -567, -61, 222, -446]
3099d46pN09q1l9j56j97J110O6j456N78J777j311j684J885J039k421m71K098l01
3118D92j818N73J171l87p54M37Q67M6p65J0J162l06j412P85J194j411n81J304
3136F07k13r68N19J93n88N01M85j240L44J222q18j151J351Q48j281n72J093P90
3154A122o92j330R82J844j670j963K209J725l073j341L295L60l076L04K402n34
3170E64j590N49R90j4p00k48R07N06j008m71R83r4q23K60Q1l05M08j23o97P09
3190a16Q58j289k97J861n37j944J233J316j566n56J586Qj355M56J024l92p66l
3208d79R09K3j385L65J743j139j598J674J159k281m80K574k33k371J217J633j384
3225e3r09J082M72p92l70L33O53k91r84O21J076p40p63R56J79q06K79J60m76O94
$$ y = [-446, -453, 56, -25, -64, -220, -417, 693, 759, -697, -119, 1658, 347, -1337, 548, 1587, -834, -1305, 793, 492, -1326, -753, 418, 31, -723, -286, 581, 627, -138, -128, 1034, 728, -684, 101, 1295, -116, -697, 607, 394, -574, -55, 138, -450, 51, 536, -704, -360, 862, 44, -1107, 244, 1092, -189, -761, 332, 1122, 430, -900, 82, 1926, 256, -1707, 502, 2227, -846, -2187, 1108, 1468, -1608, -1304, 1098, 564, -1026, -477, 513, 499, -201, -449, 458, 964, -44, -515, 468, 374, -449, -189, -108, -413, -5, -128, -825, -116, 742, -547, -844, 1017, 480, -1464, -231, 1085, -481, -1037, 549, 557, -798, -342, 682, 290, -476, -479, 430, 453, -932, -567, 1176, 37, -1561, 113, 1272, -1009, -1489, 1085, 852, -1519, -302, 1331, -53, -962, 120, 592, -200, -570, -237, 416, 125, -859, -238, 838, 98, -665, 291, 470, -336, -57, 103, -373, 321]
3245C21K33j455M26J914j331j763J922J341k285q05K317M59j904l57J651O58j875
3262e33r16K202Q69k394m81K859l62k555J015J927j487j389J580J29j259N96N04
3279C05n89J38O38m07j17N55J0n40l02M61M68o51p82J007R84k067n45K548j50
3298I64k597R74K525j807j956K211J168k198n46J636M34j183k17R71M57r39o89
3315g92R76M48j314O1J132q22j14J049n02j155J860K66k459L14K518j177k322
3332b033J802J983j777j469J727J308j451j754J476J518j768j652K258J266k327
3347h93l46K600n09j887J236Q94j799J08J446j080j135J678N17j556j61J692J82
3364I87j612j89J768J87k205q9K493m71k838J438K319j772j458K350N44k244M77
$$ y = [321, 554, -901, -475, 1439, 108, -1655, 267, 1608, -677, -1482, 835, 1294, -610, -967, 684, 1342, -533, -1449, 753, 1622, -772, -1253, 1606, 1244, -1311, -296, 1631, 144, -1245, 335, 464, -795, -199, 305, -284, -146, 492, 85, -32, 523, 533, -7, -309, 152, 620, -31, -813, 194, 1178, -889, -1434, 1114, 964, -1633, -659, 1866, 59, -1897, 314, 1482, -716, -1262, 374, 808, -375, -592, 379, 836, -103, -792, 184, 632, -682, -621, 511, -311, -425, 624, 122, -1033, 827, 1093, -1366, -1052, 1466, 289, -2033, -231, 1752, -25, -1494, 233, 1541, 90, -1664, -188, 1330, -438, -2090, 168, 1434, -893, -1239, 1361, 852, -1035, 201, 1095, -704, -596, 850, -230, -1365, 313, 830, -726, -887, 805, 987, -625, -814, 954, 1141, -1064, -1153, 1340, 869, -1969, -531, 1788, 16, -1442, 908, 1452, -792, -315]
3381c15J611j131j142J323L10j528M67J160m74j084O03J199p47j401Q54J602j360
3398e3j433K408R01k650K64K581j212k299J654J202k410l03K111m78j562R42J482
3415A145j073q78J114R51j344j069J811Q72k464l89L037n44l376J314L227k635
3431c01k272L084J555l087o61K810J53k345J63J828j71j728M0J901k69j735N73
3448d62J265q32r33J019J43j116R67O47j404L03J828j215j705J981R11k451m01
3465a455K293jj978P8J719R0j820J98J948j66k273R19K440j717j872K293R44k981
3483a341j01K817j225k217K007J703k058p21K191M95j944o09J852K23k204j84
3499a316K353j80k544R42K577j766j831K299J010k322P8J994o80j234J253L52
$$ y = [-315, 1296, 165, -977, 346, 656, -872, -405, 755, 281, -803, -200, 999, 252, -1149, -295, 1307, -53, -1486, 922, 1823, -827, -563, 2018, 806, -1493, 161, 1363, -1047, -1350, 761, 283, -1279, -337, 1145, 72, -806, 308, 1259, -85, -1154, 657, 1529, -935, -1324, 1713, 1169, -2207, -893, 2334, -301, -2573, 511, 2066, -1021, -1682, 1128, 1281, -1064, -901, 927, 756, -972, -932, 969, 700, -1035, -462, 803, -29, -962, 57, 200, -916, 51, 698, -706, -403, 1425, 210, -1495, 486, 1397, -1054, -1455, 838, 837, -1141, -1063, 656, 746, -1074, -876, 1072, 906, -1367, -448, 1992, 275, -1597, 696, 1640, -1341, -1442, 1375, 150, -2067, -60, 1643, -415, -1136, 1055, 1550, -394, -1003, 849, 1072, -1132, -1316, 1037, 857, -1687, -745, 1832, 66, -1765, 534, 1544, -778, -700, 1294, 614, -620, 633, 985]
3515I85j117r9Q05m01r36M11N06m04p85O36R86j027l90J611N13j916N03K271j562
3534E90j789K183P34l095j63K694q65k501J679K200j798j523K047J303j862j473
3550a639K027J203k522p27K957M77l195P65K833j718k274K066J056k398k95K006
3566F22k51j323R52Q45p65m32M55J19p13l25N69K93r21J18J514l97j071J326O54
3585A269j739o0J843j401j359J603N94j946M0J955p37j525J237J248r76p81J013
3602B78P08j159r98J421R13j830m98K381R5k432P91K000j709j575J769M85k075
3619a435L92J835o21p06R90N95p47l23L02L66j053n35J080M83j253p7J702m50
3637E45j675J238J238j625o90J698j63j356P87P59j025J52N89k68m79K66K95k75
$$ y = [985, -132, -231, 574, 173, -763, -352, 154, -250, -1035, -399, 587, -440, -830, 781, 1294, -622, -119, 2152, 590, -1199, 984, 1718, -1377, -1540, 1154, 289, -2212, -533, 1667, -131, -1654, 393, 1696, -166, -1639, 388, 1591, -931, -1658, 1299, 1776, -1419, -654, 2179, 461, -1813, 253, 1309, -1089, -1384, 622, 371, -952, 0, 845, 80, -352, 103, 222, -491, -816, -247, 46, -875, -757, 757, 360, -711, 615, 1269, -470, -530, 1313, -88, -1447, 156, 750, -1196, -1156, 799, 62, -1463, -226, 1022, 46, -735, 278, 986, -173, -1171, 250, 1163, -667, -1165, 1216, 1311, -1121, -330, 1670, -39, -1614, 155, 640, -1435, -1043, 792, 171, -535, 455, 1050, 303, -20, 282, 648, -405, -940, 140, 623, -630, -707, 995, 545, -1130, 108, 1346, -279, -969, 729, 566, -790, -3, 756, -269, -117, 472, 204, -275, -9, 286, 11]
3655A1j87J58N64m51o33M13J012j113p48J680L71j833L27J742j090j244R81O38
3673E98j050j17O11P2j85K70j52L0J55l97P4J8k35K89K16q41K88J240q54j239
3693a209J577P12k098r8J974n22j380P83J179q00q05P36K67m57k78K15M35j45
3711H6m48N90L60j146K4R42q86p20J515J67j439P91J591j168j162J504K20j419
3729e98l81J067J48o86k07R12M83q48m91J164N19j514j45J214l90j046P22L45
3747B68n52R1K52l50M07M47r02J00J130m21r83O27Q14j036m40P73N33n70p00N12
3767@P40p73j258R18J158j531p53K298L09j629O00J770r29j231Q91L60j188o57
3785i05N36L53m70m44P18R94p88o48J347J54j672K47J383n97j228J310P12q77
$$ y = [11, -176, -18, 546, 95, -538, -125, 887, -226, -974, 706, 1077, -756, -429, 1313, 223, -1021, -40, 598, -452, -569, 42, 114, -71, 199, 47, 77, 232, -165, -91, -73, -308, -19, 197, -644, -356, 884, 30, -1209, 368, 1080, -1018, -1116, 858, 336, -1044, -261, 918, 118, -687, 49, 316, -141, -419, -204, 231, 86, -362, 228, 588, -558, -534, 408, -478, -1198, 317, 484, -955, -164, 1427, 259, -903, 601, 821, -598, -979, 88, 236, -450, -657, 255, 738, -110, -601, 563, 1082, -432, -577, 637, 247, -799, -77, 268, -284, -193, 59, -291, 116, 563, -339, -239, 891, 470, -513, 114, 928, -108, -548, 225, 758, 188, -512, 0, 740, -33, -1291, -373, 785, -746, -1499, 799, 1108, -521, 79, 1849, 920, -311, 580, 940, -248, -905, -369, -16, -486, -930, -212, 782, -6, -654, 693, 847, -825, -578, 805, 208, -1020, 290, 1002, 125]
3803A25k81N92j02l21l95j19M62K77r46L0J118m60p44Q31M27m90k63M57k0N1l94
3824a65n13M56N01j085oJ567j36j239Q13J239j173q23P96Q4r43m78K99N95j03
3843c14p35Q89J142r30r56J566L35j697P4J570m99j315J179P08q26n30L94J77
3861B32n44o62J18J035k09r69R10J222j123o42J517J56j390J74P01l29m30L6k5
3880b22J23J96o70M4R25j54p55P62N90o43j08J73M6j51k35m79M64N78p83j21J099
3901F79l54p61O56K87q83J07Q28m35n84R93K12q35n4N82k10o11l93O63O19r56
3921d50n26J584P80k130k31K229m32k060Q21J321p63j108P78Q13n69n53l5O51
3939A20K91q94P5J120k32p46O02K67o73o8P3n88L46M16o31j31J164P3r97L91O17
$$ y = [125, -156, 436, 334, 13, -382, -501, -39, 238, -708, -678, 440, -20, -764, 67, 494, 4, -259, 198, 178, 229, -165, -678, -222, 279, -806, -812, 755, 619, -620, 193, 1432, 259, -564, 232, 316, -627, -1105, -806, -211, -314, -1049, -160, 982, 52, -904, 662, 997, -700, -626, 944, 445, -870, 309, 1017, 191, -339, 55, 232, -312, -974, -856, 179, -30, -999, -89, 1133, 10, -632, 885, 1041, -349, -175, 526, 197, -233, -197, -222, -99, 97, -573, -529, 396, 242, -513, 249, 839, 196, 88, 261, 307, 156, -79, -558, -94, 484, -299, -420, 679, 325, -436, 220, 507, -376, -269, 559, 124, -460, 533, 745, -90, -144, 438, 228, -383, -776, -113, 506, -450, -976, 608, 1388, -742, -973, 1256, 824, -1236, -415, 906, 143, -965, -187, 626, 57, -496, -531, 120, 411, -483, -408, 712, 480, -266, 336, 603, -70, -138, -65, -653, -307, 109, -522, -653, 511, 584, -413, -22, 595]
3960E95n96m74N72j85j61J76q0K10J92o00K11N44o49m59Q76o2p19M23P34r74l0
3981d56R38m13o63Q77M76r92J57P21m05n04P3J43k1l88j5N64K86p90L59J166n71
4002E42j302J044M81j401l92J381j98p67O80P77m61k52J4p5j18l57j20N43K2m34
4022c93P65M60p90j07R78n49j145Q91L60r33N1P59k79m04M55l6j12J98J1l03K05
4043H2J19k04l0j15Q0L43l98m18R28N14j440J8J721n62j804R27J252j451r05J280
4063f3P20r85j31R16L00o67n46N75L30r75l48J237J2j106P53R48j091l13J215
4082G81m13j356Q00O41j134l02J181J48p18K15M03r4k95k40N46J58p63K04J108
4101H70o15q30Q63L19j403J58J118q62n80J275K13j213M57Q54r25l61J030N5m52
$$ y = [595, -1, -475, 97, -88, -249, -73, -153, 57, 249, -351, -140, 404, -245, -704, 172, 110, -609, -186, 548, -426, -456, 482, 69, -594, 283, 759, -233, -76, 645, 240, -264, -191, -48, -69, -457, -472, 92, 378, -412, -53, 1113, 542, -760, 284, 765, -636, -1028, 353, 155, -612, 68, 845, 384, 132, 146, 71, -47, -404, -524, 19, 41, -393, 372, 832, 42, -65, 913, 364, -781, 110, 470, -463, -412, 347, 68, -336, 119, 83, -29, 169, 180, -123, 82, 201, -3, -33, -148, -68, 275, -123, -541, 387, 901, -539, -521, 1200, 638, -1166, -239, 1013, -438, -1343, -63, 657, -328, -459, 457, 757, 90, -456, 119, 449, -526, -874, 363, 375, -731, 22, 970, -121, -434, 781, 368, -988, -188, 453, -681, -983, 198, 346, -372, -157, 246, 152, -143, -383, 163, 321, -442, -238, 870, 255, -575, 288, 607, -796, -638, 480, -382, -962, 313, 526, -687, -230, 624, -301, -662, 368, 423, -29]
4120b9q0P23Q4q17m20R49j7j545K50J805o98j728J695J540j963r15K333o5k082
4139i80M26J511o87j247J009Q22n96q41N27Q27p25r47J185N75j287Q6J585n73
4157F70j540J186Q07j785l56J721n54j090J099O56q58j73N55k0o85pM67J33n79
4176c53L43Q86o65p31Q51O70j635m40J861k00j978J055J846j581j082J745L90
4193I82j624j72J271k59q69J56J004j28r07J25R62o83p34J010O37j278L2J621
4211A146p75j310J317O07k002n3J694n84j555J230J172r67p37J016M95q65o16
4228g87R52P13j252l21J839m3k110M71J932j538j570J736P13j628O7J620m20o45
4246b71L76L16m95q2K58ll69K04L69J9o16K82R65r07j009J365O64j966r6K062
$$ y = [-29, -109, 614, 698, -119, -539, 410, 393, -1152, -902, 903, 205, -1523, 172, 1712, -251, -1166, 1167, 1102, -980, -554, 957, 270, -977, 32, 854, 258, -583, -56, 771, 46, -901, 284, 859, -428, -342, 1243, 670, -870, 316, 1123, -662, -1018, 703, 149, -941, 158, 814, -44, -217, 338, 318, -367, -374, 93, 226, -353, -10, 876, 211, -520, 331, 1001, -634, -1074, 787, 587, -1391, -336, 1510, -71, -1153, 592, 982, -642, -814, 457, 198, -671, -515, 489, 361, -546, -421, 541, -142, -876, 134, 771, -507, -475, 1146, 371, -939, 378, 985, -1017, -1070, 624, 40, -1515, -285, 887, -80, -817, 199, 694, -171, -787, 165, 878, -374, -695, 1144, 1101, -1009, -538, 1394, -144, -1714, 22, 735, -893, -826, 794, 374, -271, 105, 421, -74, -156, 102, 99, -270, -66, 303, 322, -294, -12, 953, 46, -963, 402, 1066, -900, -996, 1066]
4266A066m88j758R88J318j443n64J179J89o97O3O60p8m01J69K25n15l98O11M49
4285E75j114k6J662l26k157J171J770j858j444K070Q68k097M6J988k23j571M65
4302b01J077m43j122L63R48l36j212Q07J042j016p85J385J1j410L31J120q73m79
4320g93J251J05p81N47J86q25J4N98l86n58O50K76l50k86J55M55l08p85P14R33
4340H12j161n44J756J26j864M70J654j319j160J367M20j278o2J312j22p51L09
4357c5N62l24o65P0Q06l22j082Q53J100j194o23J570J41j746L60J270o91o44Q14
4376B20J86n55J95J26k26q2J97k64O4L42j67K05O5m16L76L18j212J35J099o44
4396c8r65J034Q61j262L3J094l69p08L90J03k87P3J40k08K75J65m99R7K08k86
$$ y = [1066, 578, -1180, -192, 1126, -317, -881, 298, 487, -210, -147, 513, 435, 34, 203, 428, -87, -485, 126, 575, -539, -565, 1097, 771, -1386, -215, 1555, -303, -1747, 323, 1191, -906, -860, 1128, 905, -666, -201, 876, 433, -689, -326, 622, 286, -926, -119, 923, -93, -878, 507, 518, -892, -561, 559, -314, -793, 458, 563, -218, 329, 515, -310, -296, 302, -84, -642, 8, 284, -66, -352, -197, 258, -50, -835, -121, 812, -349, -893, 863, 989, -875, -405, 1249, -70, -1230, 137, 557, -721, -783, 529, 407, -344, -35, 527, 203, -462, -392, 414, 92, -990, -137, 963, -231, -854, 716, 857, -889, -529, 741, 50, -594, 220, 406, -149, 46, 172, -54, -136, 61, -203, -139, 203, 36, 241, 306, -110, 266, 584, -628, -493, 606, -38, -1003, 31, 892, -370, -337, 757, 388, -320, 70, 173, -114, -41, 99, -109, 166, 331, -168, -71, 137, -149]
4416a49K05j19l36O02M70p49k51J282n87j277P83Q17j055m49J304J39q97O3O56
4435D52q2n30m46N37M28r78k56J264K65j406K72J334p16r06Q74N03q45o9N21j05
4455A11qk9m07L60J01p66J78N11k64l70P63J9m59L25J00n44L58K36o53K37P12
4476E11m93l84Q04j4p95J41L27m22L5K93j71P0K51l15M6K77n34p9M91k7o12Q91
4498B91L84p21K61O67o58m48N15j75o09K95M35m57p3N16p7l50M1J31J71k6o05
4519d92O54P97q42p17J343J62j279R6J111o61p33P11O1k82j2k7j84K96k57j60
4539d15L53K11m29M80K94l53l6L42m82m11P64k13o07O95L45o38J68L09m58j76
4559b57K95l86k01P38j20n53M17M14j75l93K17J63J2m48m24R60N55j326j34J782
$$ y = [-149, 56, -63, -399, 203, 673, -76, -327, 955, 368, -909, -126, 691, -364, -813, 491, 630, -267, -204, 452, 370, -160, -606, -69, 359, -619, -875, 389, 654, -752, -480, 854, 138, -768, 106, 609, -236, -305, 216, 111, 103, 74, -333, 27, 128, -638, -460, 51, -213, -583, 180, 199, -260, 65, 165, -379, -21, 215, -438, -201, 511, 18, -366, 438, 424, -371, -230, 97, -325, -290, 3, -168, -98, 153, -162, -116, 161, -373, -452, 39, 12, -600, 291, 675, -46, 215, 882, 224, -224, 291, 116, -493, -198, 237, -220, -293, 223, 146, -204, -163, -32, 139, 113, -492, 162, 959, 117, -600, 743, 905, -374, -278, 833, 172, -561, 150, 211, -71, -83, -110, -294, 2, -255, -415, -62, 149, -280, 200, 494, 141, 105, 447, -35, -446, 318, 105, -502, 193, 538, -100, 68, 377, -81, -257, 38, -348, -549, 189, 69, -484, -67, 347, 172, -221, -4, 159, 171, -277, -701, 259, 814, -512, -646, 1136]
4579A136m44j695N53J244q32j187Q99P33m52l53J45N58J3j159M88J103m72q49
4597e71P32P20p74m10O22k14n85K53o3M1K11J02l75N23J81p01K37N28o24k66N88
4618A55o4l50L90K91l09j48m6P6N7k33l67P33M67j069J71J279o62j259J059O08
4638G79j299k79J094L34r20kP95p0o36n58R09O28j291m13J747L47j793L70J401
4657A143o74j278N70P45n23n13K01O62J83n92m74R85J74j149P6Q57j14p57M33
4676d5N05k54k36j14J85M71m43o44N49M89p81k55J068l41n33L06L39n29Q9J82
4696Hj20J18K83l26n0J73l72m0K70j46j02O61K3p24M73M69r62j85N50no31K40
4718c95M45J41j51j27J28M89m68q18N34M51r48oJ190rp87N87L89o08k64K25k43
$$ y = [1136, 692, -1003, -450, 794, -38, -1225, -326, 407, -45, -398, -253, 305, 318, -841, -353, 750, 278, -571, 161, 881, 107, -303, 319, 105, -480, -227, -290, -249, -38, 64, -311, 212, 393, -308, -71, 457, -167, -433, 155, 91, -259, 131, 422, 113, -35, -81, -5, 52, -181, -548, 185, 652, -417, -246, 1033, 371, -888, 171, 779, -520, -799, 295, 629, -291, -293, 502, 432, -204, -762, 147, 775, -516, -929, 818, 1165, -628, -258, 1143, 469, -809, -239, 506, -17, -530, -329, 333, 516, -76, -550, 435, 609, -540, -464, 393, 279, -478, -45, 460, 206, -30, -144, 41, 512, 69, -575, -26, 463, -318, -573, 495, 154, -379, -73, 266, -263, -174, 8, -112, 6, 289, -37, -87, 86, -286, -326, -56, -202, -304, 357, 380, -344, 129, 598, -364, -549, 1, -4, -635, -395, 50, 191, 40, -87, 41, 530, 62, -756, -222, 229, -719, -725, 465, 456, -331, 256, 645, 37, -227, -2, -245]
4739b45P9j5j29L55J60m24k2P60k68l73L77J33o83L06K78n68P2L46m41j77O96
4760B17k47m84P08L03o47J71N15l70l77J86J59m2o2j29M46M27p99k56R11m83j192
4781a045P30Q42j041j44J173O2o69M14L01k85l35J33j80N6n0l09N07J37n10L42
4801A29K88m57j95N71l91m60P74J29r05O13N46p29m63Q01Q4q62J85P25j53n26
4821b96Q0N54Kp03r8Q11Pj080M26J061p75q59J097K05j311K81Q62n10k15O16K44
4842C99l32K54Q0m01Q8m5k83o6nl8L33j96j45O38o1p78J92R96o02p03J151K77
4864G53j064l3J106n79r27O14K82o24j26O69Q7k10nL95K96o61k09Q53k88j090
4884g61P16J025j143n36J275J55j560K04J210p17o87P37N53l00l27N01L21l32
$$ y = [-245, -166, -181, -310, 45, 205, -219, -241, 519, 251, -122, 255, 388, -295, 11, 289, -279, -207, 139, -302, -479, 217, -30, -514, 194, 497, -150, 21, 536, 166, -211, -25, 134, 92, 30, -99, 347, 774, -25, -281, 630, 147, -1045, -315, 527, -514, -658, 515, 577, -92, 322, 623, 338, 3, 136, -44, 12, -38, -347, 160, 297, -213, 129, 417, -40, -235, 336, -55, -515, 259, 388, -517, 96, 642, -87, -550, 251, 335, -527, -342, 383, 230, -296, -216, 338, 340, -363, -461, 350, 357, -723, -297, 764, -11, -870, 227, 432, -879, -598, 264, -246, -461, 155, 399, 67, 321, 401, 0, 88, 43, -240, -306, -311, -349, -16, -212, -357, 281, 220, -558, -366, 630, 28, -675, 476, 753, -311, -344, 762, 183, -744, -130, 152, -472, -598, 71, 158, -52, -57, 338, 634, -27, -236, 617, 329, -761, -45, 980, -163, -699, 576, 731, -829, -625, 585, -132, -819, -82, 471, 171, -156, 345, 666, 334]
4902C34n02J92N35o15l21O39R0r52N04N35o34o1N77k36l33N46m0o68N63L35o15
4923a27k82P11j78n18K24M52n9k72m4M38J06q10q9R79k78j080O19J047q22o42
4943f25J174n6j163J32P43l32m61L48O37r6l55L01O07l86q65J86N51o84q20J012
4963a52K64p33J79R33m13l84N01K0k42J43Mk87K67O2l38O7K54k51n0K67l07J2
4985a84K18l13P6M32l46m94Q63n6n50K81Q08m76l82P00j69p23L3J93k11R7P1K78
5007A46K29j46k16L79L0p52Q5N83m45p65R10L54n05K6P44l45l11L65k37k70K6
5028a15j5J7K10j12J00L61p3p18N50K63p55p1Q70k60n95K82M34o10J29K14k7R
5050H8oj40K80J87o07j11M14j05m81M54J29l74M34J22m44L71K94p07j39N94j16
$$ y = [334, -168, 24, 559, -56, -377, 262, 352, -600, -96, 439, -195, -256, 321, 85, -248, 298, 258, -410, 153, 488, -127, -409, 302, 124, -394, -170, 282, 223, -49, -93, 345, 451, -359, -448, 531, 253, -827, -208, 839, 17, -625, 549, 493, -670, -538, 205, -127, -588, -240, 397, 301, -54, 247, 854, 468, -397, -211, 340, -344, -1164, -152, 112, -621, -442, 491, 78, -306, 195, 215, -27, 116, 120, -167, 100, 162, -176, -109, 145, -106, -156, 111, -196, -184, 34, -279, -203, 229, -117, -611, 252, 196, -354, -73, 735, 259, -123, 577, 408, -315, -282, -89, -300, -203, -132, 146, 375, 229, 13, 392, 422, -330, -245, 338, -107, -872, 38, 392, -113, -87, 657, 312, 1, 366, 129, -141, -115, -130, -113, 97, -15, 85, 446, 373, -345, 205, 468, -287, -358, 512, 252, -343, -61, 373, -237, -108, 106, 79, 88, 82, -58, 222, 409, -198, -309, 105, 0, -481, -27, 102, -272, 162, 284, -160, 211, 505, -202, -341, 253, 137]
5071A37o02L08N46k47k30J79J07k16j73j98K55R9l32J97N18l94k36N96j11o34
5091d31L70N99q81j54P89j09p06N03M33n71j95J93J66j59j51J79M84j76l22L70
5111B31L49j017p5Q58l71p69P18N52p67K3P41k25n78M41J10k98P8P2k1j5j6NK00
5134B26j37l14J78J51n85L52M02n35k27J032j1q76M59N97n80k69N71k0l17j8k10
5155a31o1N9o7k93M44K34j38L1K21j35K18k51l81M37K03r36j42J311p0j241O04
5176h4J138r04p55R13K92r31k19O35K27l22k59M28L09o05l93O80O7r29L94Q45
5196E27o30n05R68K36p94K22L96k17j44k21j6J50m3n77K27M75l71l77P13L40n02
5217a43J27M73j26K0j54l16L65j13p10K29P49m48o95Q24L83r37k21J001l64n94
$$ y = [137, -465, -157, 389, 142, -88, 91, 198, -18, -191, -389, -134, -35, -367, -170, 348, -46, -282, 314, 203, -431, -61, 538, -343, -497, 292, 183, -523, -20, 413, -158, -353, -160, 6, -153, -304, -125, 359, 183, -139, 231, 580, -437, -512, 346, -25, -794, -76, 476, -291, -268, 473, 248, -330, 111, 221, -77, 1, 73, 52, 37, 21, 26, 226, 89, -225, -47, 104, -481, -129, 273, -262, -489, 543, 532, -344, 115, 712, 132, -137, 434, 414, 97, 79, -131, -192, -133, -200, -493, -49, 185, 47, 78, 299, 164, 382, 131, -250, 187, 390, -546, -688, 623, 553, -688, -84, 1054, 150, -605, 308, 600, -331, -550, 85, 312, -10, -269, 159, 468, -137, -530, 150, 217, -712, -318, 527, -103, -608, 360, 596, -198, 24, 420, 203, 59, -162, -178, -28, -71, -648, -421, 54, -317, -694, 19, 359, -143, -16, 457, 331, 351, 197, -119, 246, 133, -577, -348, 401, -47, -742, 82, 465, -472, -693, 308, -56, -650]
5237f50L36O29k79k05P4N33K47q82N4P87n16j108O61R44q57m72R41M76p24r4K93
5258A88N0j75l78n4O45J60q62L9Q80j64o80K77M71m0l61m5J16M49n69m99Q19K51
5280E18j073N0R80k13r21O18P13q42j39O54j57n63N45J27j69n0m4L84M6n64n2
5301a52L93l27n04N04L63o70l1R09m04k89M86pm28J66O9k56J80J07l21J28M13
5322C29m57j66K54K05l49qK20k7J05j65k9N95m55p21O05O23q01l89J150m2j029
5343e52J16R39m16o69L91M40j36m45J00M16J40m13j79N71k32m82L12J91l76J17
5363a67O24n89j1N00k92n85N81L37n85J87J97k03j48J15Qk5K35k39j15M38p7j82
5385DJ49r0k15L01m8m28M87K82o65j8Q35l05o08L00N70o11k47L16n5p7K3R6O6
$$ y = [-650, -314, 315, 36, -169, -95, 438, 685, -197, -143, 644, 128, -980, -319, 625, -232, -704, 237, 713, -11, -105, 188, 238, 63, -315, -369, 276, 436, -426, -387, 493, 329, -351, -74, 397, 357, -4, -49, 67, 516, -53, -552, 267, 518, -555, -505, 475, 262, -659, -41, 672, -170, -309, 345, 188, -375, 170, 297, 128, 78, 34, 418, 464, -100, -152, 241, -86, -590, -86, 277, -393, -424, 485, 81, -208, 278, 271, -157, 9, 78, -178, 2, 109, -212, -84, 329, -128, -294, -40, 165, -184, -192, 28, 1, 106, -59, -88, 507, 52, -669, -64, 559, -242, -631, 519, 477, -552, -436, 503, 87, -582, -191, 249, 113, -332, -232, 184, 324, -89, -268, 303, 71, -411, -99, 92, -284, -167, 457, -132, -143, 357, 65, -520, 61, 398, -187, 0, 197, -6, -154, -39, -31, -56, 179, -60, -175, 263, 186, 4, 153, 63, -152, 149, 101, -327, 160, 442, -223, -241, 594, 289, -319, -19, 551, -60, -307, 9, -46, -123, -100, -4, 62]
5408F2L35l31r7L69k32m36L42L9m31L51J72k56J41M34m76j98O19j85o23L76L58
5429C33m42q4M37j61k76J13J32j6k8j57M3M80l89l42N67J07p49L02O39o43j50
5450b84N28p8l23J57n8k74L04k1m09L05L21k39j30M52j7k60K82k42j34K56k32
5471i6p5J73J17l82J37K84l60l2L69m48j94O61o8n02K97O35n18l10N02K06m02
5492fq4J10J44l4l77o5P03m67n02M79M82o79L6O05k22l12L58M4m05M13o8m62L27
5515A8P2j24K2L86k23j33J59j64j56K46j19k34K78Q6k66K33rk66L75K38n91o8
5537b40P34k49o73M80N99q97j08O40J1m58j32L90J05k60k55K94M64n59l06Q20
5557D00Jp22K07O84n16l55M98J21m99N8J99j30l4k5j70M08Q8m58P8L64j74k66
$$ y = [62, 397, 66, -31, 338, 106, -330, 12, 51, -380, -29, 143, -113, 28, 462, -14, -212, 407, 222, -401, -25, 333, -109, -193, 244, 83, -193, -80, 52, 36, 8, -149, -106, 374, -15, -357, 210, 317, -432, -130, 509, -134, -284, 244, 166, -157, 0, -58, -332, -28, -49, -458, -153, 168, -71, -201, 251, 234, -26, 256, 14, -120, 136, -96, -171, 2, 119, -263, -126, 158, -202, -234, 135, -313, -507, 154, 86, -416, -119, 516, -2, -312, 190, 396, -6, -90, 20, 164, 130, -247, -312, 391, -76, -578, -99, 383, -296, -260, 345, 123, -189, 169, 213, -192, 221, 153, -309, 18, 90, -34, -12, 374, 151, 18, 177, 13, -143, 103, -16, -250, 28, 114, -152, 81, 72, -194, 181, 419, -172, -240, 494, 245, -428, 52, 651, -246, -354, 286, 297, -161, -293, 97, 202, -58, -313, -19, 445, -114, -420, 400, 401, -321, -114, 570, 54, -301, 197, 318, -181, -123, 76, -54, -88, -113, -283, 125, 213, -245, -167, 197, 23, -243]
5579b43K30J18k35Q9L9r8J95j70k30L13K18n45j08O65k68l16L22K33l15KL12k63
5601e5q6J89j19j13L15k88J54J69m58j91N88q1n29L33N73n45k91N75O3l26p0K46
5623E3O6N0k77q2N16K1q17M23N10m89l26N08Jn23K21L26l39R7R1j03K11K3l01
5646a40J25K60l05J50K08l11j32L53P0o50L77L05m47k08N38j05k92K43J96k90
5666e5K28p1k36K96J20l31N6K19k33%J32j35L2J74k14k33M10N2n82L72K83o29
5688c45J00O53l41n39N41L18n63M4L21J13m54k2K30K13m33k58O77J47r37PJ113
5709E85m47q84O54P12q89j51Q25k46l80J12L89l21k3K0k5L5m7l3J02j0k03L98
5731A73j12m24M46L70q18q8R85k29j050N81Q75o79o03P70J91n60j7L38R7l37j26
$$ y = [-243, -13, 105, -130, -41, -2, -100, 95, -75, -305, 8, 226, -319, -427, 238, -30, -346, -24, 209, -106, -104, 208, -55, -141, 48, -71, -184, 131, -157, -3, 166, -292, -483, 105, 24, -505, -172, 401, -144, -435, 140, 203, -123, -193, 53, 119, 169, -108, -190, 326, 347, -470, -47, 463, -26, -352, 156, 157, -366, -145, 181, -158, -61, 30, -73, 138, 161, -140, -15, 245, -60, 90, 298, -13, -145, 208, 278, -372, 5, 310, -137, -345, 193, 88, -204, 39, 235, -55, 173, 102, -134, 162, 282, -49, 7, 226, -7, -7, 125, -10, 22, 196, -18, -251, 159, 211, -371, 1, 284, -345, -245, 408, 67, -472, 69, 387, -176, -132, 189, 302, -152, -174, 56, 269, -164, -422, 255, 402, -535, -528, 585, 138, -746, -92, 620, -269, -420, 405, 159, -221, -109, 280, -41, -64, -44, -69, -34, -81, -114, -12, -22, -225, 173, 61, -363, 83, 453, -365, -453, 532, 303, -747, -166, 709, 30, -573, 197, 388, -172, -189, 149, 246, -91, -217]
5752b17Q6N32m58j87L43P9l48K00K20l07R9L18m85j46P05j78r94N64R36q78p13
5773h29J083N34j026j61O76K85o90l80P97K98p57k02P70K06r42j4Q64l18p14P55
5793B35O9n43J89K62l40J28K18k30l06N89j16l70J03J62R6k70m2J37K95m75j39
5814c48N20K46p90J81P91n30n76Q02J19p99R0P11l54m09M07J59l26J1K40J9j91
5835b7j85J37M24n65k42P31K3o88K23P47p12k49O89j08n64K42L01l03OJ23j97
5856a94J53J10k29n0K22r3k14P8J98k38K44q6N0L17m3l09L02L03o70j17N71k47
5878E8o99N47K68m30q4L59J14j57J87o9j62K31j13Kk8n2NL28o3l56K97J17m87
5901a87l5N08l86m21P50j12n09K57M78k92j65L74O2l44P2k22Q0K58k40k3K96O5
$$ y = [-217, -131, 401, -57, -244, 99, 178, -170, 30, 250, -57, 42, 360, -125, -271, 434, 256, -738, -174, 762, -116, -829, 254, 788, -238, -399, 277, 562, -128, -508, 289, 587, -170, -372, 398, 604, -338, -352, 512, 194, -520, 235, 304, -239, -50, 212, -128, 0, 218, -12, -318, 271, 155, -215, -112, 50, 146, -124, -166, -29, 266, -209, -348, 172, 418, -372, -191, 600, 70, -506, 296, 415, -384, -294, 417, 63, -346, 61, 220, -106, -95, 145, 164, -27, -212, -75, 349, -216, -458, 273, 296, -392, -169, 578, -134, -383, 306, 198, -366, -124, 177, -126, -120, 3, -194, -41, 69, -160, -210, 12, -81, -295, -217, -19, -257, -13, -99, -49, 268, 225, -84, 218, 521, -149, -266, 305, 58, -641, -94, 174, -256, -340, 19, 133, -24, 163, 94, -68, 163, 50, 52, 24, -28, -23, 305, 242, -114, 183, 300, -187, -222, 286, -100, -521, 229, 117, -392, -135, 343, 51, -114, 260, 322, -22, 50, -172, -92, 166, -74, -97, 199, 264]
5923B64l71J91K07k79J19r2n6P3m5l83J0P02k82o41Q15L59q19o0O67M3p99L02
5945g5M03j94l66K44J68N3m77M8M15j80o30M65K15n31m9P74k43m50Q33R4p11K42
5967D8N31o22m72O46K4m92L0L04K8j96K1K09K20l02j39L98k7n54L51K64n21L0
5989b21O48m36o04Q65K74r51P8Q48m20p19N29N83n26m75N60M46l81m21M08M76
6009E61p02m22Q70J75r72P2J038n21o63P66K77p80K44N22m66k77M80Lm23N9L55
6030A96j34k23j05M96r9m46K42N31m11n47P07K96r98P7J087m77q53Q72L71q36
6050b54j43P38j12o17L77L20k15m11L93K21l32l75O28K39p05q6Q99l54q40M87
6070a42P84q38l29R25J41r98K22P58m72l41M87J50m33j81K73nk94q2M68K6l90
$$ y = [264, -107, 84, 291, 12, 131, 39, -17, 56, 11, -372, -362, 340, 58, -583, 232, 591, -228, -288, 379, 422, -377, -75, 328, 134, -232, 12, 180, 233, -244, -196, 219, 39, -591, -126, 89, -442, -491, 283, 40, -410, 423, 517, -194, 48, 579, -43, -515, 131, 155, -337, -307, -3, 25, -171, -150, 59, 279, -23, -162, 236, 209, -345, 6, 270, -251, -221, 427, -9, -613, 252, 526, -425, -347, 501, 81, -638, -109, 474, -52, -527, 33, 479, 98, -323, 85, 561, -141, -563, 307, 482, -490, -418, 620, 99, -564, 202, 479, -301, -57, 465, -1, -278, 202, 205, -218, -159, 196, 62, -161, -266, 230, 131, -315, -73, 458, 47, -500, 207, 503, -495, -418, 669, 192, -661, 211, 582, -254, -397, 341, 229, -388, -11, 309, 94, -317, 76, 297, -35, -410, 218, 457, -248, -334, 565, 211, -629, -142, 642, -196, -525, 400, 541, -457, -235, 523, 51, -290, 197, 347, -86, -267, 6, 1, -293, -375, 93, 119, -271]
6091b71K13M69l85n60Q01O9r36L19Q27o25p47J079K52r17J36P39k38p18K46L82
6111A35j44m89K27O11j28o39N64M45m92m65P46N8p71J16M53n12k69O39j15l72
6131d02N68K51n61Q5M48k37l41K40J63k15k91K52K91j28l81L11M23p24l85R59
6151C26l3j039O73P00n21p43R89M24r71m5P94j89p33J01M71n0m99L3O84J45q71
6172c54K35O42m53k99L35m8l32J21J63l16J53N87l51l30N86J18o02J55M20k50
6192A80l80j0L13K9j94j50M19j28l63J02M54m82k92N79k2n86M79N69o33k13Q60
6213E31Jp77J95M48k67o53J86M12j32l79P3N22k2n19L15N32m41l33O40p9m63J86
6235b4K85o40K70K34k39k15M16N7l91Q4J62L1k3O1l2o3oj32J43J12k00o5L26k78
$$ y = [-271, -58, 411, 26, -534, 267, 336, -600, -281, 546, -79, -826, 253, 505, -412, -276, 463, 225, -493, -247, 135, -9, -498, -271, 340, 212, -427, 137, 582, 90, -375, 371, 429, -342, -226, 227, -285, -554, 85, -30, -402, 166, 417, -144, -59, 389, 152, -189, 51, 214, -1, -292, -40, 251, 123, -258, 53, 476, -248, -633, 326, 293, -746, -73, 627, 106, -637, 352, 776, -195, -240, 554, 365, -368, -267, 204, 154, -345, -312, 372, 517, -354, -119, 523, 70, -229, 106, 58, -274, -153, 10, -306, -153, 434, 83, -247, 339, 457, -145, 10, 430, 180, -200, -210, 103, 132, -62, -212, 207, 79, -284, -182, 272, -210, -502, 77, 55, -531, -52, 517, -116, -329, 531, 532, -245, -50, 398, 131, -522, -336, 76, -56, -435, -362, 160, 138, -381, -66, 466, 25, -308, 332, 253, -210, -24, 261, -379, -109, 125, -114, -329, 87, 144, -247, -163, -1, 30, 7, 68, 36, -27, -33, -165, -22, 90, -110, -175, 151, -127]
6259a27k70O17l6o04L75M66m16r1M23j42k68R8J44k30K2Oj39L09j24k20K33l9
6281a3k6J93J39l26P8L78m53j94M30J17p35K75L49k72l44M74K31l13Q4M5J67p3
6303B11l21O8K95k11m25N30K11o72l0P70k11n41K15M63n33o1K69jM8j08N3K16
6325B35R5l44j52M56j83l89j2J82j77Q4R3k54M63K18n41J06P33l31o33L49L57
6346C55m79k91M29kl6j60K41J2N8l35O8K45k26j81M74j19m58M97L23n61j75Q17
6368D96j59p66J81M70k89l55K97K61M2m68K69M97j75p36K82N89n99m39O54J44
6388A96o15L34L34k81R5K13j68j19K01j21k44K13P3k45J07J46n7l6K1R1L4j13
6410E9k89M58Qn56kP35k44p72Q33N76j022j53Q38m1r17K10O98k32o40K81O06j77
$$ y = [-127, -397, 220, 184, -420, -45, 421, 5, -86, 337, 195, -73, 25, 169, -61, -39, -33, -172, 137, 13, -207, 26, -13, -39, 154, 293, -33, 45, 423, -30, -224, 206, 323, -412, -137, 212, -60, -404, 70, 301, -12, 72, 117, 284, 211, -110, -42, 253, 42, -383, 147, 358, -314, -344, 426, 215, -326, -111, 352, -181, -242, 27, 26, 74, -34, 19, 235, 330, -14, -166, 290, 107, -282, -294, -112, -289, -205, -112, -366, 97, 315, -226, -120, 613, 282, -351, -2, 355, -124, -415, 14, 12, -24, -184, 57, 69, 127, -208, -140, 105, -121, -302, 172, 53, -405, 92, 415, -146, -321, 496, 337, -429, -248, 222, -67, -422, -125, 136, 178, -290, -21, 476, 301, -435, -153, 436, -163, -602, 52, 196, -419, -85, 249, -32, 63, 276, 108, -11, 190, 69, -175, 38, 111, -134, -27, 119, 62, 26, 47, 138, 172, 59, -230, 228, 236, -320, -322, 413, 169, -603, 230, 806, -216, -369, 469, 428, -489, -279, 419, 187, -453, -172, 434, 257]
6432B57p70M87O51m24q01P35N76r82l39R19J38r70L08P46n48k86M22J52m22k09
6452c60K30K12L2k26j3M09j13n7j00Q8k04K23j85k51M41J11n56q1Q50l38p45N66
6474f7P31o03o19Q91J31o56m7L49J14l56l46N34M03n62j79N97j98m73L51K93n60
6495b72K2N37k54k83L66J30n20l6N12k27l19L98j4j4j46J9L84k47RL4J74l12o1
6518a20L02J01o79K06N90n73k28N00P8m32K41K24j96O2J64j43ojQK3j43J73k54
6541a03N3p6J12L17k62l01N16Q8n74m7O23k26o40N80J41k31j77K62Rm3K1j86J53
6564IJ98k57j81M35J36m31O1K34m8j06n8j26K48k04j03P5J18k90PM27q1k12K60
6587A11J86l29J02L15l85m12L63J70m40J42L42j86j38N8J82j01p6j00K66j35l22
$$ y = [257, -513, -26, 625, 201, -600, 135, 711, -271, -610, 309, 447, -523, -215, 531, -17, -303, 119, 271, -151, -360, -130, 82, 114, -112, -125, 284, 171, 114, 14, 102, -102, 121, -64, -315, 126, 237, -319, -400, 450, 112, -633, -67, 664, 61, -558, 333, 464, -192, -239, 110, 224, -132, -478, 56, 459, -103, -282, 315, 117, -356, -5, 288, -272, -250, 287, 33, -250, 116, 246, -274, -310, 202, -25, -344, 54, 40, 26, -120, -101, 283, 36, 45, 79, 253, -59, -120, 182, 283, -396, -190, 400, -173, -401, 99, 177, -255, -14, 210, 14, 76, 240, 97, 91, 90, 98, 121, -22, 151, -103, -50, -126, -14, 303, 41, -260, 256, 344, -230, -277, 346, 120, -520, 60, 201, -30, -207, 55, 64, 21, 42, -144, 9, 207, -50, -231, 204, 340, -91, -30, 204, 156, 50, -8, -134, 114, -90, -193, -118, 0, -290, -283, 144, 63, -149, 111, 297, -32, 70, 385, 0, -412, -49, 121, -319, -177, 165, -21, -159, -101, 81, -20, -96, -196, 70, -65, -387]
6608c87L56K17l46k7N59k24m38L77K52o44m2O75l22k93J86K66l22r3L96j8k45
6629a17q5K97Nl19j7L86j68n48M46P46n36n03Q92L3p75J61O50n79m46N27J65n95
6651c80J34M29j41l10K06L76k47k95J79N18m39l27O46K19r63J31R76n32o59N37
6671E8N31r25j29Q28j73o87L22N41k34m80M98K02m22j86L54L35q12L6Q12l55p26
6692f12O59O66r48m50J096P6j093L64R42o19p31O28M47n60k56O65M7o66j11R02
6712D46r5q17P2Q95m02q29R02L83q70o6Q65k56p41M90M75p55j16P41j95o90M17
6733a46N64l99n52N42M26n85m28P29M93j190o4J174k57j115O97J010j085o55J171
6752C30K39j085K31Q97m77p18N69M92o02l97M76N81o54k64N87K50p37p5R34m56
$$ y = [-387, -31, 186, -160, -187, 372, 148, -290, 87, 339, -305, -347, 328, 6, -287, -101, 165, -157, -250, 146, 128, -117, -202, 95, 100, -219, -236, 150, -18, -566, -120, 626, 90, -413, 479, 512, -263, -102, 548, -31, -477, 50, 215, -380, -246, 183, 42, -268, -62, 314, 67, -228, -49, 469, 30, -297, 349, 568, -395, -264, 712, 180, -479, 58, 589, -336, -465, 363, 190, -497, -175, 366, 132, -348, 150, 352, -70, -256, 98, 433, -379, -343, 469, 114, -612, 47, 713, -235, -685, 411, 487, -606, -242, 700, 81, -650, -22, 425, -135, -391, 274, 321, -345, -456, 446, 351, -466, -394, 501, 99, -730, 172, 555, -315, -381, 484, 228, -513, -23, 452, -303, -419, 322, 127, -563, -146, 418, 19, -533, 9, 435, -150, -578, 151, 644, -546, -610, 564, 307, -808, -111, 899, -186, -841, 330, 569, -516, -285, 612, 135, -583, -14, 478, -124, -521, -45, 536, -118, -382, 205, 455, -282, -357, 577, 121]
6772A21p67O50M83p66j02Q90k96o95N95L75o65j63O72n4o82K74O62l72m95K45
6792i0P42n89o82P56L97p26m84J199l1j024K69Q87p22m14P06K89o56K6N58k67
6812A44m79L20M29n39j44M30J56m03k64N66K07q24Q7Q08l74q48P12N49p19k85
6832d71Q13m4n99L75J81l80r1K87m7k12K44J57j36k73J38K88k14m78M86L54n97
6853b19k71R37r5p75K54P22n38m46O20L2n16J39K80o8j93R1k4Q7j34q5K10M6l36
6876b82K66K13k98k7L89l20k37M79J36n08J30M55n38k50M35Q3l12k8L36j19l36
6897c33J73K25Q0k63j21N04L5n21J43M48k39m26M16K08k39n0J45k27N0J80k32
6918d4j7K74j95n5O7J33l87J91R9n7m0J1K6R7J8k56K03K25k57k98N20j54m36L62
$$ y = [121, -646, 4, 487, -279, -381, 509, 213, -482, 113, 488, -177, -340, 332, 278, -404, -130, 532, 160, -335, -90, 652, 63, -619, 137, 534, -192, -676, 523, 492, -532, -263, 624, -98, -512, 194, 483, -173, -147, 411, 144, -335, -15, 414, -125, -269, 161, 317, -86, -350, 216, 423, -401, -314, 494, 120, -728, -16, 533, -186, -471, 342, 298, -301, 74, 255, -125, -216, 71, 24, -188, 56, 213, 77, -196, -58, 230, 16, -462, 24, 378, -219, -490, 447, 352, -423, -169, 553, 15, -431, 189, 221, -295, -156, 124, 56, -137, -46, -70, 17, -117, -202, 8, 54, -282, -16, 197, -101, -128, 261, -59, -296, 183, 319, -189, -59, 396, -142, -392, 43, 126, -186, -214, 122, 3, -333, -160, 65, 145, -118, -239, 265, 300, -221, -78, 370, 131, -295, 121, 329, 90, 40, 185, -42, 8, 188, -44, -61, 213, 18, -37, 30, 163, -224, -33, 66, 9, -31, -20, 6, 103, 121, -135, 68, 293, 36, -262, 258, 104, -332, 30]
6942C0K53m50j9L41j62j06J34Qj67M9J46op5o7j1L69k62m18L09M39m83k10M44
6965H6P5l92j3L06J20k67qQ6J48j6l66J70L16k66l38M37K56n39q2K08K05j95m1
6988a10K5K29m9l30P2M87l03l87M60J32m80m3N85k88j62J14Q2j35Op1J09J50r4
7011aL8J48k9l12J13K91l98K0L68o0k37K18M3k86o3J16RJ2J18k74K53J23k89o0
7035a39M16j35l53J06K68k52j8K22j02j5N3j34O1K51k63l4K23j09k78J19K90l96
7057b19lJ86J30k1k4n3L3K61l82j65N14l8n26J40M84l75k91N47j5l04o5K04O9
7080H7j00o6J09J32j76j87L62J90m84n3N30k28n07K90K14k61p0K32n7k0J30qj26
7103f7O6q5j91K54o6r1N6K20q8o4J8l7J70k2k52J13K11k50j62M27n2n06K33N09
$$ y = [30, 283, -167, -186, 155, -7, -113, 21, 29, -138, -89, 57, 51, -24, -91, -102, 267, 5, -413, -104, 335, -148, -358, 86, 161, -231, -244, 62, 182, -85, -93, -7, 141, 125, -241, -71, 245, -21, -359, 78, 334, -205, -287, -79, 126, -69, -110, -85, 144, 95, -235, -163, 324, 21, -366, 94, 226, -254, -297, 288, 0, -162, -48, 34, -101, -95, -166, -57, 93, -1, 37, 185, 156, -156, -43, 248, -150, -130, 238, 178, -59, 159, 202, -84, -147, -31, -22, -10, 108, -166, 87, 210, -79, -139, 277, 142, -211, -105, 163, -89, -107, 115, 13, -2, 51, -83, -22, 229, -34, -68, 155, 46, -232, -113, 177, -219, -222, -36, 94, 73, 49, -4, 29, 290, -92, -257, 257, 219, -307, -167, 317, -58, -349, 198, 183, -121, -186, 18, 87, -13, -79, 30, 162, -14, -201, 161, 351, -133, -186, 344, 116, -391, -101, 113, -148, -218, 14, -43, -63, 67, 59, -67, -1, -86, -277, -23, -89, -180, -124, 96, 8, -56, -38, -75, 95, 73, -179, -66, 145, -105, -267, 160, 108, -398, -165, 344]
7127C44m11k92N34L9l48L0J70q4K5j77J37J99l23k43N95J06n41J08N43k63m59
7148c11M43M9l37%L28j00j26O4J8o2J88k20o0K52j07k70L34O1k20J21P6j79K05
7171A47m3k85L3L45l27j72L87J0k44O6L09k16q3R8Q6l4j12J1J11J7l16Q5K29j35
7195c3j83M04Q0l83r1M27k42j54K74m6j30Q8R5k29P7Qk09J67K56l02j5K82k02
7218f1j20K09J93l01L1L19l45j12J53n0j5K0r5J62J70k64k51M30J84n15J70M67
7240C79k01l22J58J95k41n0K0k7J62k67j58K79K63l46j2L84j06j08k6R7p8R6l59
7263b68K15L21j87m60O34J53n61j56O48o6o29K71K80k47l07L10L12k21k37J46
7283d9L42j58m15L37K74m66j78O07j59m25L54L14m50J03L50k69m33L26J24n13
$$ y = [344, -67, -359, 175, 214, -134, -104, 66, -18, 7, -170, -33, 166, -157, -400, 195, 301, -240, -132, 411, 148, -311, 132, 181, -156, -156, 172, 72, -54, 10, 28, -34, 154, -66, -126, 126, 19, -251, 83, 144, -76, 45, 121, -58, 147, 104, -181, -148, 197, -130, -302, 85, 95, -149, -83, 226, 10, -73, 25, 111, 77, -35, -24, 87, 104, -212, -127, 102, -33, -216, 188, 268, -115, -206, 221, -21, -175, 99, 53, -77, 11, 106, -123, -46, -38, -247, -80, 176, -126, -141, 141, -61, -181, 28, 221, -80, -49, 270, -75, -187, -34, -84, -99, -79, -174, -12, 158, -106, -357, 73, 257, -258, -88, 379, 178, -144, 14, 209, -32, -82, -62, -89, 73, -194, -352, -73, 190, -156, -168, 216, 110, 2, -24, 73, -5, 91, -268, -53, 268, 81, -379, 255, 408, -153, -309, 339, 273, -356, -85, 195, -52, -359, -49, 263, 42, -195, -49, 293, 135, -280, 57, 331, -135, -313, 294, 135, -290, 64, 378, -72, 31, 381, 112, -321, 5, 129, -384]
7303c84O5L46o9J2j3J58J95k82qK24L7m55J29L77n45j05O33q5p62M44N66o68l20
7326e10O52L5n60J51M94j15k78K12L24j32l94J16N01n82n30O85J24o20r2P87l28
7347f0m58O89M24q45k9P78m18m58J25M51k88l14M43L96m57l09M49K91n39k63O15
7368B23O9p62J56P05n18l93Q06N7p90L76N18n86m28O67J26n08JM87J35n41k5M69
7390B44O2o77K53O78o24o73Q19L81q11j24J056m07o46M69O29p24l38P96n8n94
7410b89J05N93k40n04J73O17l15n02M52M72o19l83O16J24p34L01O64n63l52P95
7430D11l5p22K07N59l54m96M65L43m09l79M02M16n32k24N63L36r90J83O80k04
7450B20o37K70N74o22l06P90j26n52L21L96m83k04O35j07k22j16L76j13m84K85
$$ y = [-384, -319, 27, -42, -30, -43, 115, 310, 28, 20, 244, 281, -174, -45, 332, -213, -318, 315, 230, -532, -88, 478, -190, -510, 142, 177, -383, -232, 262, 147, -131, 81, 405, 273, -121, -5, 496, -86, -616, 69, 193, -427, -519, 268, -60, -518, 171, 595, -250, -279, 499, 81, -377, -252, 199, -89, -403, 40, 436, -21, -330, 119, 410, -129, -392, 223, 292, -470, -314, 391, -127, -520, 286, 343, -447, -71, 447, -139, -567, 100, 226, -282, -281, 206, 341, -200, -225, 244, 306, -371, -118, 560, -64, -737, 82, 463, -348, -472, 584, 177, -469, 0, 629, -95, -433, 363, 305, -289, -184, 409, 169, -335, -162, 455, 140, -362, 90, 562, -57, -440, 176, 300, -434, -133, 531, -32, -384, 411, 376, -346, -139, 420, 66, -430, 35, 378, -31, -410, -8, 408, -124, -348, 215, 551, -439, -256, 424, 220, -417, -147, 427, -195, -501, 289, 163, -389, -68, 328, -155, -359, 276, 169, -53, -169, 207, 94, -390, -105]
7470a05L61k07m59K59O04o73k41Q54m0o78J59P76o40n76P38K49o26qO49j88m73
7491b65J46L36n6n28P7N03j86n14M54M45n10k65O36Pn07Q5N59m52l16N10n9l06
7513b06J68Q8Oo2qPK8j54J9J38j19n1K92m8k72K37L38l24k78M49j22m73K42L54
7537B49k99j38N05J2l17r7M18j28k41Q5N7j33j34LJ14J04l72L45M00m98m1N34
7559D28r5m25R2K41l14k76K54K41k99N3JJ45J47m37J08K86p3l21J41L84k51j80
7581a50M24k09k4J41k21q4K85j94l79K13K21j54p2K54mk2J18j77P9J0p6j11K04
7604G2M8l83J97J95j68r6K72j17j09J48n4p0K2l1k9J10n5m0J72J07m06J49K89
7627B23l85qJ11J65k16O8L27k59j23K58l3j6j04kl2j6j45J41J17j73k45M32J81
$$ y = [-105, 256, 49, -410, -151, 453, -220, -461, 393, 353, -325, -166, 610, -30, -606, 132, 381, -245, -253, 396, 208, -265, -119, 217, 161, -367, -290, 213, 27, -487, -33, 412, -98, -363, 273, 280, -227, -142, 417, -35, -351, 159, 100, -206, -38, 50, 56, -6, -14, -7, 21, -133, -114, 24, -95, -146, 146, 98, -174, 63, 401, 77, -201, 248, 126, -347, -105, 249, -50, -188, 317, 329, 12, -85, 333, 205, -36, 49, 106, -27, -161, -158, -44, 60, -312, 33, 433, -65, -106, 428, 333, -92, 0, 241, -73, -349, -95, 146, -153, -100, -99, 46, 193, -244, -136, 150, 77, -244, -103, 281, 30, -150, 274, 65, 41, 182, -39, -123, 162, -32, -411, -198, 23, -131, -203, 51, 47, 25, 143, -34, 45, 55, -21, -132, 72, 120, -263, -66, 129, -39, -135, 137, 20, -89, 59, 5, -65, -43, -74, -103, 7, -48, -88, 84, 191, -215, -66, 223, -162, -170, -59, 106, -110, -42, 285, 26, -97, 161, 128, 112, 8, 6, -26, -42, -187, -46, 71, -102, -347, 85, 266]
7650B66m51K01L88k49m00K77Q2k08mP9m9N4l6j52K30J51l13L3L06k8k52J48M0
7673A13j14J30k38r3K76Jk25J33L69m08l16M57J32m12R4L12j07j02p6J35K2p6
7695GN5k3P2j41j88K80k01o1K79Lm08K94L55l13j44K53J22l64M6J57j85R1m1q7
7719a42R7k7j28K41J17j23n3J46j27j02P7L6k12R3O7o3J18J84j57j42L08k50r0
7742a32J91m9o8J45m7j57N1R6r5O0K08l34o0K67o1k71K99J92l71j2L53p4k28K07
7766A10j70J96n0l10Q8L05k11k76M27M4l52O3L16P3m36M25j13j93J4n6Q8K35r6
7789A21k22L71p2k11k4K93l17k41L32J44k29L3J06k2Mnj90K31L2l03K3L39k43
7812e0q1J24K46l27Q9J07j02J00l0k08K17M2k99P3L50j77k89M15K2k73p8K47j24
$$ y = [266, -185, 16, 404, 155, -245, 32, 114, -94, -98, -19, -68, -14, -50, -202, 28, 179, -134, -101, 205, 177, -75, 73, 113, -1, 129, -109, -202, 74, 75, -150, -17, 352, -56, -372, 85, 217, -195, -101, 211, 104, 2, -74, 61, 83, 7, 62, 39, 111, -30, -218, 62, -139, -200, 79, 82, -326, -32, 323, 10, -134, 119, 241, -123, -77, 80, -105, -14, -55, -142, -45, -72, -200, 41, 158, 35, -18, 128, 1, -101, -24, 12, -200, -107, -40, -103, 15, 199, 42, -100, 208, -42, -132, 59, 10, -58, 87, 40, -117, -66, 30, -65, -5, 203, -131, -191, 76, 15, -256, 43, 235, -136, -148, 205, 131, -97, 110, -60, 136, 86, -224, -136, 169, -42, -318, 109, 153, -199, -136, 180, 253, -183, 242, 129, -64, -50, -106, -18, 217, 121, -101, 270, 198, -13, -37, 256, -61, -302, 30, 174, -55, -22, 84, 62, 66, 61, -129, 102, 134, -169, -146, 193, -50, -131, -7, 239, -88, 1, 108, 6, 106, 76, -132, 85, 127, -172, -99, 251, 74, -215, 200, 222, -51, -129, 118, -6]
7835fj07N1O7j61R7m3J77M7j16k01M16P8l68N2J12k03PP3J03k04R5P7r7R8J53
7860A97l24J27J38k14j06J46r3MJ92r5m0J02L6k15J23j2j24J37R6k21J12L30j95
7883A01l59L11K5k40L4K12Mj01M6nj08J19q9n6K92q7j21K04j3k68Q2J32m5j91
7907a21J33l5L1J12J0o6m0Pj29L21p7k34j38M09k31m1J12J8j48J71j00j12J83
7930C5m6q0J66M8k72K05Q9j70mK10j88j77K25J13l17J19J84j67RN7q3j04K24o0
7954A6j93K39QL8lPqj23L8mj24J03j81J56J59j88j24K53J3k26L3J36k16j4K94
7979H9j6k68K02Q0m4j57M6J32k2M3l7J63j44k09L9L51l62q7L78j86k64L74K24
8002C25m17j97M22k8k83J80J55q5j20J69J33j51j59J7K03k65k22K71K50m51J03
$$ y = [-6, -113, -62, 5, -156, -59, -102, 75, 122, 6, -195, 221, 299, -69, -17, 95, -108, -101, -28, 75, -129, -34, 43, -54, 44, 197, -127, 0, 138, -76, -182, -36, -129, -125, 67, -28, -68, 34, 70, -145, -22, -34, -158, -21, 75, -146, -34, 296, 101, -258, 53, 78, -162, -128, 84, 88, -13, 33, 28, -80, 39, -50, -106, 186, 99, -22, 182, 169, -99, -17, 115, 70, -121, 12, -23, 8, 120, 130, 64, 24, 31, -98, 223, 146, -88, -226, 183, -48, -89, 23, 41, -107, 64, -36, -148, 35, -11, -91, 75, 123, -149, 56, 145, -25, -29, 181, -7, -184, 41, 154, -163, -44, 140, -27, -18, 39, -44, -148, 76, 16, -177, 62, 70, 108, 105, 112, 104, -19, 19, 15, -109, -6, -187, -31, 128, -60, -184, 69, 82, -144, -111, 25, -191, -205, 89, 73, -195, 7, 87, 43, -114, -68, 64, 42, 85, 48, 211, 67, -142, -103, 248, -114, -201, 177, -9, -273, 101, 325, -92, -289, 133, 105, -178, 2, 157, 72, -48, 121, 254, 103, -56, -39, 164, -101, -323, -52, 198, -253, -150]
8023a50L81j68l17K77K80m24j4M19k32l50L42Q1j15j5J6m0j4l6R6J29k56o0L02
8046A32J65n65K12M22l90l47N03K5l50J75M22m58j85K98J62l45o1K75O7j06j89
8067a38L86j32k96J7L46q3m13M28J20m65oN62j96m93L73L19n22r5M74j12k99J39
8089h6K65j10k98J38K11j46l63K59L65k66l72L54M47o20J8M07k02j56J07J94l08
8110a62Q2K15j87j1J21k6k13O4J84r1j3j9J71Ok30pN11l96m21M52L78o86k2O81
8134C81j52o51L02M88j53m52J00K71j27j22J72R0j16k41L12J03m48n3N44k81k27
8155b60L59K39n22J01L67j46m20K57J33j75L2P7NK2N3q7J29j42k6N8p1p6K49j02
8179E4k03J7L74r5m99K90L34l56p3K91qk51
$$ y = [-150, 231, 63, -254, 23, 303, -121, -135, 284, 52, -298, 44, 125, 10, -5, 11, -29, -43, -79, 17, 146, -110, -170, 132, 297, -268, -56, 366, -24, -371, 132, 157, -193, -18, 404, -54, -239, 59, 221, -124, -185, 90, 157, 51, -138, 248, 116, -180, -163, 183, 100, -313, 115, 235, -230, -236, 326, 130, -363, 10, 329, -193, -288, 186, 74, -225, -86, 179, 69, -229, -91, 120, -26, -389, -130, 235, -31, -403, -49, 398, -222, -204, 203, 1, -155, -48, 146, -162, -80, 135, -52, -63, 58, 32, -181, -117, 67, -24, -37, -56, 115, 121, -109, -116, 395, -1, -422, 30, 408, -278, -300, 381, 229, -422, -120, 368, 215, -237, -137, 134, 7, -115, 57, 147, 31, -210, 102, 205, -243, -296, 248, -33, -260, 99, 338, -184, -83, 284, 138, -282, -25, 108, -67, -35, 42, 47, 69, 122, 35, 164, 22, -4, 54, -17, -93, 156, 54, -149, -132, 242, 147, -352, -62, 272, -84, -157, 134, 126, -125]
8191a25
$$ Imaginary data points
##PAGE= N=2
##DATA TABLE= (X++(I..I)), XYDATA
0@%%%%%%%%%%%%%%%%%KoPpQj4K1k3K5k9L7m4N1o0O9q0R3j05J18j35J54j72J91
40A01k15K42k67K91l21L55l87M18m50M82n10N25n22M88l92J67L26j449M367j4290
60a1041R6389N14409n78748n85244O77339M36400o94215l32825O78061J95401
70C95926o30575q9723N63174p680m68818P8956L68469j29292k52918J53545J47598
81A28662j44754m1442J03059n5474m7842J26566k3971j59242J09510J64609j94418
92c4737j42285K63559R6647l12136l0764L38240m5503l45413J21423L25596j99898
103C4729k87569K74494K35943l30855j63041L71790O9205m00688K4658M02116
113B30782j16379l70757K07113L19238k80270k47821L34012J67811l61889q4732
$$ y = [0, 0, 0, 0, 0, 0, 0, 0, 0, 0, 0, 0, 0, 0, 0, 0, 0, 0, 2, -4, 3, -4, 4, -10, 11, -12, 13, -16, 21, -23, 28, -32, 37, -43, 50, -55, 63, -72, 82, -90, 101, -114, 128, -139, 152, -169, 186, -201, 217, -233, 249, -261, 264, -258, 230, -162, 5, 331, -1118, 3249, -11041, 85348, 599757, 21009, -564235, 113104, 549504, -144711, -477536, 200525, 395926, -234649, -324372, 238802, 231122, -237696, -158740, 209729, 80437, -172481, -18936, 128662, -16092, -57534, 45525, -9949, -57791, 68775, 44804, -114438, -4928, 159681, -34737, -177022, 86537, 183184, -128952, -159716, 178524, 133021, -212392, -90969, 234627, 34729, -252840, 21654, 257597, -73258, -236299, 135491, 204696, -195992, -171334, 230782, 114403, -256354, -49241, 269997, -10273, -258094, 75918, 243729, -118160, -202892]
123b02892L64309o42l53729P1647L21020j34613k72933J90553K21313k26634j60532
134a83133K39841Q6298k41236j4067K27337m0908j84141R0064J28634j24310p2491
145h8112J31979J0276j24759M3917J02493q7505o9406J19106K8596j38788J7669
156e4534J51992n9950j48233J03053J30304j46648j00636J83138O0531k07269
166h8252j3624K10608m4417k03391R8580J82735j38873j40940J77008R8327k00593
177f2832n5355K06530N720k07998M0285K02266p9591j86019J13504J58616j44942
188i816j23963J68372Q7087j75898m4144J70626K942j53517L1164J25882n4563
199B4172r1523O6197N4408p0359k2875O3302l898m7238L2552L2894n2964j6219
$$ y = [-202892, 161417, 160775, -192954, -121307, 199713, 65100, -207833, -17280, 204033, -22601, -183133, 56708, 143006, -98230, -112297, 115040, 74132, -110009, -19945, 108689, -15621, -88112, 43867, 54143, -70616, -26699, 75794, -11711, -81117, 37989, 66585, -72203, -54534, 97458, 37508, -110725, -7672, 122632, -24016, -124652, 58486, 119017, -88252, -101876, 108732, 64315, -139076, -40496, 142239, 3366, -137574, 39434, 137761, -62832, -118187, 88343, 94063, -113935, -73650, 128616, 49025, -136994, -23490, 135126, -9816, -133779, 34593, 121680, -54218, -98362, 72264, 75206, -78311, -47147, 78735, 24172, -67351, -1154, 53254, -17105, -39980, 23322, 19424, -27814, 4738, 37632, -15332, -31551]
211c1551O3175j1850p3931M0857P9114o4179o8127R0848M9768j13654k7904J22036
223E4602j438j22203L1154J14609n4811r8836P2810P9606q4048n7971R1593L6357
235F1424r7093j8202R4687k609q7961K7531Q1332m5016o6082N7856M1160p0520
247b3493j9806P1257j923o1574K4030N0473l7951l7081M4083K2064m5804p550
259b3275M6716k778m6025J0657M0472k1272l5965L0585K8510l6382j5442M0610
271A6411J926l8217J3081L1545k4952k1489K9527M375l4976O001L3289j1950k3484
284a8913K3295K1957k6379k0519K5263J3435l0556j0445L4650P732l4334J035
296a3779L3519r840l0533J5552K1725j9931j3015J8659K937j5511L607J1454k771
$$ y = [-31551, 31624, 19774, -54157, -13300, 65814, 1635, -66492, 24356, 74124, -39530, -67434, 54602, 53164, -69039, -37885, 76724, 21913, -76923, -4113, 75493, -8555, -66526, 25067, 61424, -35669, -53871, 40816, 38207, -49754, -22223, 59109, 14093, -51989, 5867, 47027, -23493, -43299, 27958, 26035, -35539, -11509, 38964, 1013, -36068, 8015, 30079, -15725, -23275, 23441, 20663, -25362, -14705, 25767, 4495, -31470, -885, 27625, -8757, -24199, 16411, 18337, -19880, -6799, 24746, -206, -21695, 7832, 12207, -22769, -16768, 16521, 4571, -18913, 4382, 26339, -40, -20559, 4704, 18139, -12417, -22862, 11788, 19520, -14814, -13779, 19740, 9900, -20633, -5081, 16644, -3287, -16302, 2357, 5294, -10217, -6610, 4844, 2073]
309B073k346N883M53m851j082J797o54l162J339N152l191p361M447L886j0267
324g884p35J4394j798j0558R990Q856j4974n512J4652k12j2650M616J1393l770
338E808q783R93O018o54q373j568J0030O94j1667J740J1976k559o785O372M854
353H096m955k256j850l595K130R30m644M438R298l646n024N653M97o932J04K569
369H13j590J132Q59l231J042K166m333r55M830j057k088M094j83l048M380J168
385C999n312K161M246n674l410M228j249k845L626K71k095L733k51o176J799M356
401A407m277j374O024J139k064J042n19p51J293l532k962N228J70p129K960O377
417C032n407k444P584L77n584K850K813l799k87K607q69N25P46l299k43J095m288
$$ y = [2073, -273, 5610, 6063, 1212, 130, 1927, 1273, -1889, -550, 4602, 1411, -5950, -1503, 2383, -7884, -8619, 5775, 3977, -6581, 3409, 12265, -2709, -8221, 6431, 6219, -6431, -1815, 9578, 5808, -2975, -1982, 4036, 3382, -4991, -6559, 3471, 4165, -7502, -5762, 6214, 3655, -3130, 3242, 8096, 3141, 885, -965, -4560, -2430, -1500, -6144, -1706, 7592, 3946, -1078, 4575, 5072, -1860, -1756, 813, -777, 355, 1214, -2017, -975, 1191, -3142, -4097, 733, -324, -2412, 1682, 1499, -1549, 2831, 3999, -1313, 848, 5094, -580, -3990, 238, -1011, -3856, -230, 41, -2054, 1679, 1428, -4748, -2949, 1407, -2870, -4244, 1780, 2919, 855, 1897, 1378, 627, 1920, -1612, -4574, 654, 824, -6305, -3345, 3032, -2375, -4819, 2765, 3142, -2442, 408, 3221, -578, -865, 1742, 873, 1398, 2144, -1155, -1398, -303, -4591]
434d591j284M921r0j504N186J618l142K041K63n534J864L633o164j129Q628k053
450B663p851N462N775p099l794O077J389m983j327L521L813k081l451M837L855
465F806q174k988Q092k585q820P530P844r777j583J2332l195j2275N566R039q029
480b17o756Q105N289p322n953O648O156q163o408J0972O245j2530j937J4682j923
495F888j2933N929Q647r371m865P413j163n623M383K393m064K286M135n064l674
510d683M840J665o429j611R375L972j0423j573J5839j230k1393M958K2376j4316
524A367k3473K1621K0198k7573j3587L2172P355l3032r14L1885m648l0282R104
537i807K8854j2364k5760J7585K3100k3497j9469K7742J0974l1652j309L3175
$$ y = [-4591, -5875, -954, -1044, -2548, 2638, 4256, 1114, 3155, 3418, -2116, -252, 3381, -2783, -3912, 4716, 2663, -5188, 274, 6049, -1050, -4844, 1233, 2622, -2361, -3688, -167, 3646, 1565, -1886, 2951, 6806, -1368, -4356, 3736, 1151, -7669, -139, 7705, -2072, -3655, 8677, 5482, -6793, -1227, 7812, -217, -6973, 1132, 6421, -901, -6854, -206, 5950, -2213, -8621, 2351, 8596, -3934, -5871, 8811, 6888, -6045, -116, 8531, -840, -5705, 1708, 545, -5078, -695, 1698, -2366, -80, 4055, -1009, -4683, 157, 1822, -4607, -6218, 3157, 7129, -3294, -4867, 10972, 9742, -11651, -6693, 15683, 1367, -22106, -485, 19713, -7860, -21447, 10725, 18080, -14952, -15866, 16019, 11371, -18911, -9807, 19047, 6683, -19077, -1492, 21608, -1889, -21358, 6384, 17358, -14294, -15603, 17572]
549A7572q253k9178J8073K2297k5479j4261K7353N194k6777L344K4504q198j9945
562a3754J2679J5056j5915j0360J7979L797k0104M887J9781j3772j5416K4985
574I843P635l4783L759L9438k0135m1405L6060L8399m9310k8093O2558J7705p1037
587b9366o232P4508q248p8468K1575P8941l4465p5216M9521O9151o3181n8837
599f0317P4158M2776q1561k3794Q2873M528p7229J4091O5807k8696n0727L7734
611c57L2932m2215j5463M2449p84l7912J6065L1229k9628k2116L9879P599m8391
624b6713Q450N2204k5402m7675M4716L8312o0182k2610O8909N66p2517K1157O8402
637D7617m2485n6686O1540M1295p6280k2394Q6436M50r2953K2987R4578m6954
$$ y = [17572, 9319, -19859, -1786, 20511, -4968, -19229, 8124, 13318, -13459, -10115, 14389, 6191, -13754, -1075, 13981, -1934, -12294, 5685, 9482, -10622, -5735, 14046, 274, -15142, 9843, 17478, -17305, -13546, 25892, 5757, -35648, 412, 38811, -10499, -38592, 23966, 41671, -29366, -35598, 38910, 30662, -47806, -26231, 52710, 18245, -56971, -7450, 61701, -1480, -60317, 13841, 56617, -24944, -48738, 34135, 38663, -38566, -24475, 41332, 12636, -38091, -357, 32575, -9640, -25103, 17346, 16562, -21350, -5285, 25944, -3684, -25800, 14079, 21678, -26713, -18263, 33941, 8539, -39136, 5580, 43892, -16290, -38900, 30009, 30575, -41942, -20785, 47617, 5132, -51554, 9986, 51281, -24999, -47393, 39043, 39493, -53460, -30473, 64105, 17151]
649A7151r0376P2112Q0513r5362o4443J13506M0877j26629j4141J30594j2800
660E1002j24664L9576J12500o0226r4007P4463P0741q3457m7511Q5290K4144q0423
672c2572o14P1643k0237n7512L7477L6787n1019j3194N7111j2569n4308L9252
684B45M4489o1717k6791P7171L475q5429K1649Q5795m5153p7021O7584O3925q5389
697a7167m6376R7493K3288j07187L05J09593k6000j05321N3523R4720p7970p5987
709g7086R8698N0730j12514k1350J17903q190j13376L7204J02221o0915q5197
720g1872P8323O2832r0992m0967R6452J6761r5868P610R0275l0017p7771M9691
732e543N8713o5676l4754P4398Q722p3789J9957O6056m4137n0007O2973K7650
$$ y = [17151, -73225, -1113, 79400, -15962, -80405, 33101, 73978, -52651, -66792, 63802, 51002, -73662, -34086, 78414, 18188, -75819, -1356, 69385, -14072, -61583, 23707, 47851, -32572, -33186, 38457, 18220, -39292, -1815, 34972, -16047, -29241, 27870, 15301, -39007, 245, 44734, -16983, -43774, 33397, 36872, -48557, -26908, 58887, 13734, -63287, 4297, 68222, -17167, -63543, 33950, 57238, -49949, -49644, 59949, 33949, -71372, -17849, 76871, -1099, -77086, 21612, 72342, -40172, -61522, 56381, 48191, -65185, -27981, 74240, 13325, -71872, 6451, 69283, -21709, -62676, 33776, 50537, -45331, -37721, 52554, 22537, -55234, -5543, 53170, -12506, -47260, 27138, 35860, -37929, -17972, 48084, 3947, -46060, 16913, 44563]
744D4563p6168m395Q0598k0865p9248M3884P1598o4725n9070Q1505M2090r4838
756c5071k0752J03401k305j03312K8458R7837n2994q3675P3120O1567q8595l6937
768e9258R5033R845r3509J7363Q5801m0082p2738N7676N4250p2504l5172Q0842
780B7547J3714q3729J0055Q3327l1421p4415N2585O0292o9702m0940Q0332J7733
792D5378q4368O321P9875k9049o9535M6532N3027o0236l5510O7769J5997o9061
804c2860M220O8537k1736o1611L9378N1159n4402l6608O5354J7933p1442L241
816b8837P1022k4613o4556M2567N0823n7517l3832O5834J5700o7807L795O5783
828C8362j9827n8432L3621M7869m5745l5739N4048K1447n8750m043O0296j2696
$$ y = [44563, -31605, -36000, 44598, 23733, -55515, -11631, 59967, -4758, -63828, 17677, 59767, -35071, -55823, 47578, 45273, -58039, -29581, 68256, 15262, -68413, 4707, 66274, -22321, -59258, 35775, 45620, -47889, -30526, 55275, 15193, -57545, 131, 54381, -18123, -53295, 27547, 41261, -42468, -32413, 50914, 19493, -54922, -2337, 57955, -11747, -52687, 27645, 45378, -38990, -32669, 47206, 18157, -51378, -4846, 48181, -12055, -47565, 20204, 36201, -32860, -28640, 39897, 18161, -43450, -4072, 47087, -7315, -43923, 21431, 39364, -32078, -28837, 42185, 17572, -46984, -4417, 46406, -11111, -44943, 20891, 36591, -31216, -27421, 38362, 18535, -39897, -6276, 41593, -4152, -39891, 14157, 35604, -23146, -27189, 33107, 20411]
840B0411n6495K9502M6533m5295l3716N5033J6539n9281J744N8970j7553n2597
852c6205L1155M3099m1613l2225M7483K0260n0979p462N1939m655n0029J7354
864a1878M4782k9240l6045L8873K3792m5481r497M7614n132m4834J8410L7143
876B8507k9358k7900L5676J7293l8265o365L8937j988l6316J0202L2479j8497
888D405k8127K4156K0758k9527j1027L2725Q90l2178J0469K8030k0426k0752K6788
901F184J1029l0042j058L0191p532k7303J4146K2472j9573j7320K2935J2030k5061
914h902n591K6928m83k7069P499K5182j6124k1427K2658J5115k6999o161K9276
927A3902j854k7658Q988K3625j5056j9722J7363J4533j8069r795J8874P085j8022
$$ y = [20411, -36084, -6582, 39951, -5344, -39060, 15973, 32512, -26769, -25025, 33945, 16392, -36205, -5050, 38049, -3564, -35789, 11694, 31954, -19025, -26487, 25452, 20797, -29232, -11878, 32904, 3664, -32381, 6492, 30284, -15197, -24694, 22920, 17788, -27046, -8636, 28507, -851, -28751, 6925, 24218, -14047, -20412, 18525, 16537, -19779, -9577, 22902, 4405, -23722, 434, 21192, -8335, -19362, 13363, 14253, -17925, -7456, 20574, 148, -20604, 6184, 17213, -12829, -13887, 16304, 8772, -18531, -4385, 18087, -1486, -18806, 4129, 16159, -8902, -14493, 12435, 11952, -15117, -7618, 17564, 1440, -19987, 2671, 17786, -9213, -15374, 13902, 12048, -15610, -6622, 17003, 1947, -17775, -412, 14121, -3948, -13743, 5131, 12216, -5806]
940e806l205J7842o62j7222M094J4495q534j0731J1808N918j2698l7J1698n127
954A833q884P659M440q746l12Q107j543n492L416M063l656k645L936J203n278
969a899o96O019j996p967M913Q032q796o626J3113M831j4630q4J6024k909j4851
984g522M922J1864o624j0770N489Q972m324p857M450Q470m369q557M515O626o520
999a235n487O245L008m417N47L467J29n41k27j594R74R91l728r58M045j326l498
1016c605L814K677l745n15L768j019l364N18J815n00k294p94L399J637m834k91
1032c333P039o80o699L431O805n208m986N182K032n528j554L206L77j932j494
1047c342J688L211k064l249L412L712m649j958N641J222m434O8L734M4k461k480
$$ y = [-5806, -9011, 8831, 8169, -9053, -4959, 9536, 1002, -9729, 2079, 7997, -4701, -4738, 6960, 1833, -7051, 608, 5048, -3698, -4010, 4097, 2554, -2938, 478, 4541, 885, -1760, 2176, 3379, -1899, -2595, 3424, 1428, -6539, -1626, 6406, -2390, -9016, 4097, 8928, -5702, -5786, 10238, 7329, -7522, -2600, 9264, 2640, -8130, -2641, 6331, 2007, -5850, -1400, 7070, 2701, -5856, -1341, 5285, -1235, -6722, -477, 2531, -1886, -1339, 2128, 2257, 1716, 1489, -105, 869, 1860, -1868, -2826, 1219, -107, -3605, 209, 2886, -859, -1374, 2394, 1375, -1989, -1471, 344, -156, -2450, -3244, 155, 1792, -3042, -3333, 3706, 3026, -3673, -242, 6563, 1355, -3631, 1551, 3583, -1945, -3499, -293, 84, -1848, -3342, -1654, 1557, -507, -3756, -344, 3368, -1281, -3239, 2402, 3624, -810, -742, 2992, 3036, 575, -1905]
1063a905O65L153k776n819L935P039n545n225Q248N309p717l062P049J947o485
1078a189k985M759L460m743m614N676N105o786m058P841K275p609J84O110j154
1093B272l783J712J432j211k70n22j72J508q39j525K031P03k425R42J873k256
1109e30o48K325m39j126J354k70k78J956j486l047L249J884n760q34O199q87n664
1126d002K277N188j678l898J263L935k68m929k39N887j082p164K478O524n132
1141h40n253O716K956o690O58O859j729m971L351L230l794l937K417L298l789
1156a518m649M696N710o062m831Q446M166q982j868Q733M31o893O27M648J65k412
1172D07k089P27L638j358o524J364O609k442o655L318P243j836o320K071Q026
$$ y = [-1905, -1240, 1913, -863, -6682, -2747, 4292, -1253, -6478, 1770, 7079, -638, -3700, 3349, 5296, -1189, -4174, 585, 4045, -698, -5312, 364, 5469, -1317, -5375, 2466, 4741, -2868, -2684, 3426, 2272, -1511, 201, 1633, 422, 152, -370, -542, 966, 127, -1398, 633, 1336, -1089, -147, 1726, -530, -1178, 1147, 708, -418, 936, 666, 388, 2344, 858, -2189, 1060, 2944, -2816, -3650, 2549, 1662, -4002, -1725, 3463, 1785, -2113, -850, 3085, 2817, -2112, -2351, 3536, 2454, -4710, -2232, 4292, -840, -6093, 623, 3579, -3111, -2453, 4406, 2677, -2294, 1057, 4287, 493, -3444, -1027, 2271, -1518, -6167, -1471, 4239, -1823, -6654, 1792, 5958, -3024, -4892, 3841, 4272, -2621, -1994, 2654, 2819, 407, -1682, -955, 2683, 1325, -5199, -3835, 2774, 332, -6323, -3005, 4238, 2402, -3918, -1847, 6179]
1187F179j556r665J983J0706m644j2236P035J1039r955q765J2261O024j2108k276
1201e978J1505m5r920J010P497k128o779J787O189k047m777L740M743l966k269
1216a438M637j046m916K938J810n576Q90O559l603m481O944L112p485p69O360
1231C936k274n693K496L110k948o88L161L73k397K182L087m021m017O517L292
1246F116j1051k538J4314k15j7622M609J9386q451j8781J2458J6861j4795j4363
1259a4072J5373J1313j4792r310J3589P917j1767o695J0647N475r587m202P101
1272I90K206m730j296L15K022M234l009p055P529R454j2003r105J5337O006j9204
1287h309l293J9976p82j9718M967J9484p470j7362J0342J5833j3822j4416J6661
$$ y = [6179, 4623, -5042, -3059, 7647, 3003, -9233, -2198, 8841, -1114, -9879, 2382, 8406, -3702, -5978, 5527, 5482, -4438, -3428, 4069, 1941, -4838, -3051, 3138, 1091, -3686, 54, 4797, 831, -1438, 3199, 2153, -2763, 175, 1985, -3591, -2701, 3858, 255, -4226, 2718, 5830, -1655, -2424, 3936, 1662, -4031, -1535, 1575, -1373, -2061, 1100, 1473, -924, 1258, 4345, 324, -3693, 2824, 6116, -4935, -7473, 6841, 6626, -10996, -6387, 12999, 4548, -14233, -1775, 15086, 291, -14072, 1301, 12614, -2178, -11488, 2101, 10018, -1749, -8444, 2203, 7678, -1909, -6111, 990, 3196, -1534, -2830, -2515, -493, 3741, 732, -6323, 1206, 10660, -1343, -10448, 4889, 10895, -8309, -11602, 8374, 7592, -12126, -7159, 12325, 4855, -12507, -2165, 13668, -154, -14570, 2091]
1300B091J1122j9826o785K2752J680k2739M873K1563j0591j8164J4497J2180j7162
1313d509p132J6822J570j5136K753J3045n422r234Q130P004r611l405J1334r36
1327E273j2619N089J1496j1044r475J5512N055j8685J485K0441p816j8346J4303
1340F69J5184j8964j0124K1324M799k2983k69K2451m913k1843R131K0548j3531
1353A479j7569J8139J4103k1418p863K3935Q11k3659O618K0095j3747j5156J8559
1366D327P403k1249L80K1321p451j9223J3792J6383j8845j2502K3105Q336k6521
1379a0744l103K9116l122l0087R641K8661j7123k5177K3108J8753k7037j0464
1391a7578K8976K278k6834N957K2946j2567j7738J6271J0917j9656n166K0675
$$ y = [2091, 13213, -6613, -13398, 9354, 11034, -11705, -6832, 14731, 4140, -14024, 473, 12653, -4509, -11641, 5181, 6751, -8385, -5632, 7413, 1991, -7243, 887, 7891, -1720, -5125, 6209, 5273, -7346, -2257, 9239, -1805, -11280, 4232, 9287, -9398, -7913, 12528, 4712, -13634, 669, 15853, -3111, -13235, 8089, 12888, -10095, -10364, 12087, 7174, -14669, -5538, 15010, 1479, -16090, 2049, 16152, -5266, -13129, 10806, 11617, -12042, -5424, 14671, 924, -14232, 4327, 11730, -9519, -9139, 12182, 4731, -14492, -700, 15683, -3162, -15664, 7441, 15777, -10744, -13847, 15269, 12147, -17940, -8299, 20362, 3239, -21938, 1170, 19923, -7114, -17578, 11398, 13676, -13158, -7201, 15745, 3178, -14560, 1711, 12628, -7028, -12194, 8481]
1403H481r83k1035P793K0535j3854j7676K0403J3481k5563o904K9235j104k9864
1416a7055R685K7520j7265k2717K3108J5323k7153q518K7138M98k7027O101K5043
1429A4681j1497k0496J7828J7670k1357j0786K5742L533k8157L922K6311j3829
1441C565k4181K0749J7421k6668q725L0215J031k9614P888K7610j4577k4200J9559
1454G3J9026k3792j3831K6767Q136k7844j237K8590n524k6852J2808K2182j9562
1467a060j6194K3663P770k5200R83K4188q785k0364J5100J4713j9971q893K1739
1480G689K843k2649L444K2737p961k0617J4250J8976j9262j4391K3120P546k7029
1493a1304j295K6115p627k4145J4701J9612j9571j2218K3627N785k4198J728K3108
$$ y = [8481, 7498, -13537, -5744, 14791, 937, -16739, 3664, 17145, -8418, -15322, 13913, 12809, -17055, -7370, 20150, 2885, -19832, 3276, 18599, -8554, -17072, 10066, 10564, -16463, -10362, 14681, 3184, -17312, 516, 18186, -3171, -13957, 11785, 15318, -12839, -8917, 17394, 3565, -20616, 133, 17554, -9114, -17839, 12376, 13407, -16207, -8319, 19291, 4714, -19486, 73, 19099, -4693, -18524, 8243, 16379, -11465, -12702, 15888, 10364, -16488, -3680, 18502, -1060, -17254, 6409, 14179, -11021, -10038, 14150, 5365, -14999, 101, 14814, -5157, -14050, 7689, 10532, -12117, -8673, 14064, 6103, -14514, -264, 18712, -550, -14941, 8179, 15725, -11304, -12599, 13516, 5889, -18256, -3555, 16057, -3514, -15732, 7895, 13680, -10518, -8790, 14318]
1506A4318p832k1464J2778J8255j7551j4530K1605J0419k4731m636K6415k342
1518A0704k7192Q899K4245j5574j9870K0611J4006k2365o566K2914R13k0712M305
1531e682J7167q562j3928J0335R327j2368n468J3795J442j3893M019J3411q526
1544A069j1091J3507O725j7084j803J8385m539j7729R688J4938j3480j0992J6039
1557C633P012j6568k850J6347n97j5302L570J4215o738j2472R760R546j3027n727
1571i198J5300O84j5994N066J5316j0234j2491J4657Q289j6818m250J7867J19
1584H313j7427K568J6207m776j5174O608J3928q162j2254R859J0456j1485p293
1597h632J1791L908j0763j16Q312k565m781L892M20l626L215K024n904K15P187
$$ y = [14318, 6486, -14978, -2200, 16055, -1496, -16026, 5579, 15998, -8733, -13369, 13046, 10704, -16488, -7589, 16656, 1082, -18788, 1823, 15829, -6536, -13102, 9812, 10725, -9987, -5682, 11485, 2923, -11005, -670, 8657, -3711, -9179, 4616, 6058, -7835, -3816, 9595, 1069, -10022, 3485, 10210, -6874, -8677, 9708, 5169, -12560, -2872, 12066, -1414, -12406, 3633, 10645, -5923, -8773, 7574, 6977, -8325, -4755, 9460, 2722, -9750, 10, 9556, -3471, -9198, 6102, 6786, -9208, -4142, 11174, 940, -11551, 3106, 11395, -5423, -9673, 8194, 8313, -9114, -6546, 9661, 4885, -10289, -3681, 10247, 2085, -10169, -310, 10146, -1339, -8632, 3159, 7067, -3696, -3812, 4500, 1935, -2846, 1046, 1466, -2160, 1055, 3079, -2825, -2610, 4577]
1612D577k112p804L610Q270n022q551O036R139p863r575J0252Q858j2393o714
$$ y = [4577, 2465, -5339, -1729, 6541, 1519, -7032, -996, 8143, 280, -9295, 957, 9815, -2578, -9292]
$$ [...]
8191a74
##END NTUPLES=NMR FID
##END=
