##TITLE=1H_CA-8646-2
 CDCl3, 8 sc, 
 16.9.2019
##JCAMPDX= 6.0         $$ Bruker NMR JCAMP-DX V2.0
##DATA TYPE= NMR FID
##DATA CLASS= NTUPLES
##ORIGIN= UXNMR, Bruker Analytische Messtechnik GmbH
##OWNER= root
$$ XWIN-NMR		Version 3.5
$$ Mon Sep 16 14:05:46 2019 Russian Standard Time (UT+4h)  she@DPX200
##.OBSERVE FREQUENCY= 200.13155
##.OBSERVE NUCLEUS= ^1H
##.DELAY= (6, 6)
##.ACQUISITION MODE= SIMULTANEOUS
##.ACQUISITION SCHEME= undefined
##.AVERAGES= 8
##.DIGITISER RES= 18
##SPECTROMETER/DATA SYSTEM= spect
##.PULSE SEQUENCE= zg30
##.SOLVENT NAME= CDCl3
##.SHIFT REFERENCE= (INTERNAL, CDCl3, 0, 15.7039)
##AUDIT TRAIL= $$ (NUMBER, WHEN, WHO, WHERE, WHAT)
$$ ##TITLE= Audit trail, XWIN-NMR		Version 3.5
$$ ##JCAMPDX= 5.01
$$ ##ORIGIN= Bruker BioSpin GmbH
$$ ##OWNER= she
$$ F:/spectra/data/she/nmr/H-F/1/audita.txt
$$ ##AUDIT TRAIL=  $$ (NUMBER, WHEN, WHO, WHERE, WHAT)
(   1,<2019-09-16 14:04:44.03 +0400>,<she>,<DPX200>,
      <created by zg, POWCHK disabled, PULCHK disabled
       configuration hash MD5:
       00 E9 B6 7A A2 85 ED C7 34 08 36 98 17 FE 4E 26
       data hash MD5: 16K
       46 F2 C3 C9 4E 7D 64 B4 12 9C 75 8C 7B 2A 16 E1>)
$$ ##END=
$$ 
$$ hash MD5
$$ E6 91 90 85 1D CC C3 78 F4 61 FC D3 C2 69 7D E4
##$RELAX= 
##$RELAX= 
##$RELAX= 
##$RELAX= 
##$RELAX= 
##$RELAX= 
$$ Bruker specific parameters
$$ --------------------------
##$DU= <F:/spectra>
##$EXPNO= 1
##$NAME= <H-F>
##$PROCNO= 1
##$TYPE= <nmr>
##$USER= <she>
##$AMP= (0..31)
100 100 100 100 100 100 100 100 100 100 100 100 100 100 100 100 100 100 
100 100 100 100 100 100 100 100 100 100 100 100 100 100 
##$AQSEQ= 0
##$AQ_mod= 1
##$AUNM= <au_zg>
##$AUTOPOS= <>
##$BF1= 200.13
##$BF2= 200.13
##$BF3= 200.13
##$BF4= 200.13
##$BF5= 200.13
##$BF6= 200.13
##$BF7= 200.13
##$BF8= 200.13
##$BYTORDA= 1
##$CFDGTYP= 0
##$CFRGTYP= 5
##$CHEMSTR= <none>
##$CNST= (0..31)
1 1 145 1 1 1 1 1 1 1 1 1 1 1 1 1 1 1 1 1 1 1 1 1 1 1 1 1 1 1 1 1 
##$CPDPRG= <>
##$CPDPRG1= <>
##$CPDPRG2= <>
##$CPDPRG3= <>
##$CPDPRG4= <mlev>
##$CPDPRG5= <mlev>
##$CPDPRG6= <mlev>
##$CPDPRG7= <mlev>
##$CPDPRG8= <mlev>
##$CPDPRGB= <>
##$CPDPRGT= <>
##$D= (0..31)
0 1.2 0 0 0 0 0 0 0 0 0 0.03 0 0 0 0 0 0 0 0 0 0 0 0 0 0 0 0 0 0 0 0 
##$DATE= 1568628283
##$DBL= (0..7)
120 120 120 120 120 120 120 120 
##$DBP= (0..7)
150 150 150 150 150 150 150 150 
##$DBP07= 0
##$DBPNAM0= <>
##$DBPNAM1= <>
##$DBPNAM2= <>
##$DBPNAM3= <>
##$DBPNAM4= <>
##$DBPNAM5= <>
##$DBPNAM6= <>
##$DBPNAM7= <>
##$DBPOAL= (0..7)
0.5 0.5 0.5 0.5 0.5 0.5 0.5 0.5 
##$DBPOFFS= (0..7)
0 0 0 0 0 0 0 0 
##$DE= 6
##$DECBNUC= <off>
##$DECIM= 24
##$DECNUC= <off>
##$DECSTAT= 4
##$DIGMOD= 1
##$DIGTYP= 9
##$DL= (0..7)
0 120 120 120 120 120 120 120 
##$DP= (0..7)
150 150 150 150 150 150 150 150 
##$DP07= 0
##$DPNAME0= <>
##$DPNAME1= <>
##$DPNAME2= <>
##$DPNAME3= <>
##$DPNAME4= <>
##$DPNAME5= <>
##$DPNAME6= <>
##$DPNAME7= <>
##$DPOAL= (0..7)
0.5 0.5 0.5 0.5 0.5 0.5 0.5 0.5 
##$DPOFFS= (0..7)
0 0 0 0 0 0 0 0 
##$DQDMODE= 0
##$DR= 18
##$DS= 0
##$DSLIST= <SSSSSSSSSSSSSSS>
##$DSPFIRM= 0
$$ [...]
##$SUBNAM2= <"">
##$SUBNAM3= <"">
##$SUBNAM4= <"">
##$SUBNAM5= <"">
##$SUBNAM6= <"">
##$SUBNAM7= <"">
##$SUBNAM8= <"">
##$SUBNAM9= <"">
##$SW= 24.9336996594482
##$SWIBOX= (0..15)
0 0 2 0 0 0 0 0 0 0 0 0 0 0 0 0 
##$SW_h= 4990.01996007984
##$TD= 16384
##$TD0= 1
##$TE= 0
##$TE2= 300
##$TE3= 300
##$TEG= 300
##$TL= (0..7)
0 120 120 120 120 120 120 120 
##$TP= (0..7)
150 150 150 150 150 150 150 150 
##$TP07= 0
##$TPNAME0= <>
##$TPNAME1= <>
##$TPNAME2= <>
##$TPNAME3= <>
##$TPNAME4= <>
##$TPNAME5= <>
##$TPNAME6= <>
##$TPNAME7= <>
##$TPOAL= (0..7)
0.5 0.5 0.5 0.5 0.5 0.5 0.5 0.5 
##$TPOFFS= (0..7)
0 0 0 0 0 0 0 0 
##$TUNHIN= 0
##$TUNHOUT= 0
##$TUNXOUT= 0
##$USERA1= <user>
##$USERA2= <user>
##$USERA3= <user>
##$USERA4= <user>
##$USERA5= <user>
##$V9= 5
##$VALIST= <valist>
##$VCLIST= <CCCCCCCCCCCCCCC>
##$VD= 0
##$VDLIST= <DDDDDDDDDDDDDDD>
##$VPLIST= <PPPPPPPPPPPPPPP>
##$VTLIST= <TTTTTTTTTTTTTTT>
##$WBST= 1024
##$WBSW= 4
##$XGAIN= (0..3)
0 0 0 0 
##$XL= 0
##$YL= 0
##$YMAX_a= 206336
##$YMIN_a= -383454
##$ZGOPTNS= <>
##$ZL1= 120
##$ZL2= 120
##$ZL3= 120
##$ZL4= 120
##$ABSF1= 10
##$ABSF2= 0
##$ABSG= 5
##$ABSL= 3
##$ALPHA= 0
##$AQORDER= 0
##$ASSFAC= 0
##$ASSFACI= 0
##$ASSFACX= 0
##$ASSWID= 0
##$AUNMP= <proc_1d>
##$AZFE= 0.1
##$AZFW= 0.1
##$BCFW= 1
##$BC_mod= 2
##$BYTORDP= 1
##$COROFFS= 0
##$CY= 11.3945322036743
##$DATMOD= 1
##$DC= 2
##$DFILT= <>
##$DTYPP= 0
##$F1P= 20.1720416913024
##$F2P= 0.152960286110954
##$FCOR= 0.5
##$FTSIZE= 0
##$FT_mod= 4
##$GAMMA= 1
##$GB= 0.15
##$INTBC= 1
##$INTSCL= 1
##$ISEN= 128
##$LB= 0.24
##$LEV0= 0
##$LPBIN= 0
##$MAXI= 10000
##$MC2= 0
##$MEAN= 0
##$ME_mod= 0
##$MI= 1.114404
##$NCOEF= 0
##$NC_proc= 0
##$NLEV= 6
##$NOISF1= 3.799351
##$NOISF2= 2.8
##$NSP= 1
##$NTH_PI= 0
##$NZP= 0
##$OFFSET= 15.70392
##$PC= 1
##$PHC0= -9212.215
##$PHC1= 11.80096
##$PH_mod= 1
##$PKNL= yes
##$PPARMOD= 0
##$PSCAL= 0
##$PSIGN= 0
##$REVERSE= no
##$SF= 200.130013532006
##$SI= 16384
##$SIGF1= 3
##$SIGF2= 2
##$SINO= 400
##$SIOLD= 16384
##$SREGLST= <1H.CDCl3>
##$SSB= 0
##$STSI= 0
##$STSR= 0
##$SW_p= 3612.71676300578
##$SYMM= 0
##$S_DEV= 0
##$TDeff= 0
##$TDoff= 0
##$TI= <>
##$TILT= no
##$TM1= 0
##$TM2= 0
##$TOPLEV= 0
##$USERP1= <user>
##$USERP2= <user>
##$USERP3= <user>
##$USERP4= <user>
##$USERP5= <user>
##$WDW= 1
##$XDIM= 8192
##$YMAX_p= 0
##$YMIN_p= 0
$$ End of Bruker specific parameters
$$ ---------------------------------
##NTUPLES= NMR FID
##VAR_NAME=  TIME,          FID/REAL,        FID/IMAG
##SYMBOL=    X,             R,               I
##VAR_TYPE=  INDEPENDENT,   DEPENDENT,       DEPENDENT
##VAR_FORM=  AFFN,          ASDF,            ASDF
##VAR_DIM=   8192,          8192,            8192
##UNITS=     SECONDS,       ARBITRARY UNITS, ARBITRARY UNITS
##FACTOR=    0.0002004,     1,               1
##FIRST=     0,             0,               0
##LAST=      1.6414764,     0,               0
##MIN=       0,             -383454,         0
##MAX=       1.6414764,     206336,          0
$$ Real data points
##PAGE= N=1
##DATA TABLE= (X++(R..R)), XYDATA
0 0 0 0 0 0 8 -8 8 -8 16 -16 23 -24 32 -40 48 -57 72 -82 99 -117 137 -159 184 -214 244 -281 322 -364
28 -364 412 -468 527 -593 665 -743 830 -925 1029 -1143 1269 -1406 1555 -1723 1910 -2113
44 -2113 2341 -2599 2885 -3214 3589 -4025 4541 -5158 5911 -6862 8098 -9783 12230 -16120
58 -16120 23297 -41014 177421 151197 -203096 -14491 201497 206336 35099 27097 106925 125010
70 125010 -8053 -53035 47155 128101 47002 -21451 -594 43265 13720 -53553 -80085 21261
82 21261 111970 22853 -128940 -97923 21876 33349 -28652 -36972 -14636 -5599 -18516 -33870
94 -33870 -35134 -25651 -10281 37654 55572 -34978 -105912 -12652 93860 45738 -32842 -7694
106 -7694 40503 29968 -5691 -12475 34317 83265 47694 -20185 -2460 58799 57067 12994 3711
119 3711 50343 95194 44888 -53969 -20213 116033 111356 -26087 -45620 63553 95260 12862
131 12862 -39355 12357 86569 62529 -31317 -41826 39023 64022 13524 -16881 -11972 4559
143 4559 26924 14516 -22346 -9533 18108 -10513 -30426 9833 20549 -23963 -39242 -9620
155 -9620 15964 12614 -20459 -44601 -19189 12744 10445 5448 -9918 -49604 -31506 44961 40340
168 40340 -42569 -50875 20490 45715 -647 -48587 -35214 32461 58168 -5622 -53224 -17023
180 -17023 19676 9666 -3798 -4688 -417 1040 -24897 -40803 12119 48083 -21483 -78950 -16535
193 -16535 52206 14399 -63387 -72373 63 59713 10577 -78678 -66480 11622 29221 -9070
205 -9070 -35629 -36891 -8639 19857 -7838 -46235 -20518 16769 4710 -9760 -6169 -13015 -16449
218 -16449 -4590 3700 15874 22238 -10624 -36765 -5261 29895 23932 5938 -11808 -16997 20674
231 20674 43863 -6194 -42433 7974 60105 38784 -18508 -45527 -6771 59823 52129 -18553
243 -18553 -32835 14986 30547 8710 -1843 611 13843 21789 -2010 -15861 15875 24591 -13370
256 -13370 -15671 22777 26465 -5952 -26267 -16061 20287 37519 -6433 -41615 -4991 30745
268 30745 6276 -22086 -17363 2565 23274 13200 -29389 -33982 10964 26371 3258 -8940
280 -8940 -12833 -13294 6116 14204 -3289 -3972 6558 -5032 -7705 10831 8050 -5750 -93 6114
294 6114 7313 12672 -2443 -22586 4610 38344 15626 -20539 -17510 3553 24254 27406 -7710
307 -7710 -28924 6524 31931 6644 -14086 -5143 6648 16323 11465 -10327 -9928 10876 5306
320 5306 -3443 15961 13854 -17572 -16313 12503 21661 12942 -7038 -25287 -2357 35673 19181
333 19181 -23578 -21854 9286 27115 19968 -14010 -33707 1792 36390 13199 -14610 -9685 -3671
346 -3671 1803 14467 6228 -11486 -3540 4242 -4379 984 7603 -6747 -10974 2574 6685 4572
360 4572 -2674 -22822 -14933 27000 26783 -22036 -34395 -520 22125 17642 -7594 -30737 -9127
373 -9127 30370 18310 -21356 -19961 5443 17033 13137 -5647 -17077 3955 17132 -2183 -2710
386 -2710 16663 4030 -15887 1890 20519 11694 -2449 -10784 -3863 23937 24867 -14344 -24502
399 -24502 9635 28480 14446 -7971 -22648 -4301 31444 20509 -21149 -18942 11106 14181
411 14181 3954 -3351 -12896 -4876 13423 5910 -8881 -2411 -1634 -8750 1604 9805 -1338 -6997
425 -6997 -7076 -9013 8320 22065 -7245 -30323 -1677 26523 14017 -10927 -23322 -7227 28812
438 28812 27557 -18709 -31059 8135 29044 11365 -10212 -17318 1048 25850 10519 -18558
450 -18558 -5038 17875 3936 -8783 2483 8274 3163 -3883 -10933 2372 24067 3762 -30927
463 -30927 -12497 26168 20716 -11510 -27651 -13209 23160 29410 -17114 -40459 -435 30641
475 30641 9673 -18425 -22752 -3911 21207 12254 -22876 -19808 12953 11677 -10455 -8555 1145
488 1145 2450 123 -8240 -7667 13191 12080 -18828 -17892 15369 21296 -1913 -18159 -13345 14531
502 14531 34247 1283 -36924 -9203 36699 27541 -11270 -23598 -3088 28730 28864 -10191 -23148
515 -23148 11155 27212 5333 -6582 -275 7717 14521 5759 -9635 3823 21314 586 -17000
528 -17000 7268 24744 5278 -16580 -13461 11467 32117 8169 -32946 -18421 29290 29812 -7095
541 -7095 -24139 -9349 21319 32344 -3613 -33251 -1377 35799 17150 -13676 -10539 7992
553 7992 19297 11017 -6839 -1588 19148 9157 -11390 3951 22374 9355 -6784 -6406 4775
566 4775 23220 18065 -19913 -25603 20414 37684 -1212 -31659 -15669 20370 32679 -2223 -37681
579 -37681 -11988 30874 18440 -16717 -19130 -346 14638 13811 -9590 -20505 7199 22099 -3520
592 -3520 -14380 6754 15115 1286 -9230 -1814 19730 23033 -9942 -24690 14339 39936 10392
605 10392 -19614 -10065 16691 34021 17619 -21802 -18568 30693 42520 880 -22831 -2189
617 -2189 27574 31385 1982 -18056 7551 32067 10561 -9921 6092 18973 10370 3091 -121
630 -121 4709 19049 10679 -14949 -5535 24699 18649 -13229 -22187 -2711 21584 15950 -23727 -35987
644 -35987 3974 24495 -9989 -36559 -22209 -122 6580 -10292 -38147 -32693 718 1911 -26830
657 -26830 -32711 -15897 -7466 -12378 -25428 -28476 -7545 1360 -23461 -29468 -1774 3346 -18318
670 -18318 -23582 -7786 7382 10252 -10291 -29755 -5032 27718 14001 -17276 -15857 9560 25622
683 25622 12244 -18902 -17379 24755 35849 -2169 -20719 671 15981 12808 3113 -5056 1183
696 1183 11626 127 -12136 2532 11701 -3311 -11391 -2464 5160 4143 -10499 -26467 -7270
709 -7270 25279 10069 -30775 -31260 -1052 14612 4269 -20375 -29995 -3484 15908 -6865 -29704
722 -29704 -17828 18 3972 -3280 -19733 -22857 -3748 569 -15448 -11727 2629 -6563 -20724
735 -20724 -14392 -2022 3101 -3409 -20977 -17561 10454 11905 -19382 -27541 -2763 16241 12390
748 12390 -10604 -30177 -10336 24029 13863 -20014 -17775 7871 14222 -167 -16232 -12655 11363
761 11363 16230 -9748 -16453 4602 8005 -7057 -7136 744 3786 2648 -8538 -15652 3801 17769
775 17769 -3620 -21907 -6425 13563 12039 -5501 -21565 -8329 21307 15352 -15729 -15687 8685
788 8685 13052 2713 -5576 -8934 3286 18251 5719 -13162 -4122 10951 7483 222 -2600 -792
802 -792 8417 4999 -10257 -3625 13916 3107 -14750 -3846 9670 3449 -5939 -11365 -8912 7221
816 7221 11277 -10783 -21149 -3560 9118 2806 -10662 -20670 -7963 15332 6293 -22025 -18140
829 -18140 2510 1487 -5048 -2563 -6003 -9658 -5462 -5708 -5869 1474 -1240 -11794 -8114 -337 -2700
844 -2700 -5714 -9502 -11457 3807 13677 -11459 -30713 -6635 16565 5005 -11969 -15030 -7838
857 -7838 3935 3836 -10584 -12211 1276 4263 -1708 -4858 -10514 -8281 5075 4546 -5932 174 2718
872 2718 -13620 -11900 12372 15192 -5851 -15125 -5721 8998 12395 -5208 -16907 556 15554
885 15554 5185 -7434 -10292 -7052 8853 17606 -4183 -20092 -1749 11140 -839 -6012 659
898 659 422 -3522 -5021 -2958 4539 3852 -10937 -11066 5843 6526 -5563 -7143 -5911 -4507 7652
913 7652 6762 -15893 -16209 9029 12844 -9014 -16705 -3970 9306 6533 -11480 -16026 4173 11503
927 11503 -5248 -11290 -2869 -552 2198 4765 -6860 -11140 5127 7152 -8997 -7000 7770 5669
941 5669 -5624 -7999 266 9581 3696 -11886 -4785 15832 8772 -12286 -9061 5085 9234 10534
955 10534 1924 -15006 -8072 15582 13953 -6053 -8668 3528 9950 4591 -8169 -6883 10446
968 10446 10810 -5483 -3630 6185 -1277 -6029 4311 6209 948 1692 -4486 -11197 2990 16176
982 16176 1881 -14608 -8738 8238 14162 -2694 -21750 -7020 21121 12202 -14826 -13108 2234
995 2234 3980 3974 3175 -5763 -4313 4081 -418 -4905 3995 6668 -2197 -5359 -1157 6225 7725 -5861
1011 -5861 -13640 8168 22429 -1888 -20096 -3450 13067 9407 1728 -7157 -8217 5333 11437
1024 11437 -1837 -8990 -601 6674 6371 -2816 -11423 -2462 11858 1367 -11813 545 7782 -6126
1038 -6126 -9866 1541 3883 369 -2525 -8148 -4975 6705 3166 -10149 -8784 2775 8962 4012
1052 4012 -12958 -18162 7674 22945 -2521 -21248 -3191 12204 4824 -4988 -6833 -214 10390
1065 10390 6024 -9980 -8446 6955 8485 649 -3127 -3390 3641 6571 -6335 -8846 12205 14363
1079 14363 -10335 -15035 5146 12770 2293 -8066 -8893 4629 14422 -503 -17357 -7070 10722
1092 10722 11327 -62 -13550 -12441 8267 14921 -7364 -16499 3012 10679 -3382 -9671 -4139
1105 -4139 2114 5177 -1179 -9301 -1663 6383 -3416 -9624 -604 6442 4451 -3125 -13888 -7029 14893
1120 14893 12083 -14054 -15274 8030 13324 -733 -11915 -8554 7640 16214 -1783 -17078 -4160
1133 -4160 10671 6404 -2037 -5528 -3827 5460 5440 -9212 -7349 9764 5706 -11173 -8084 4559
1147 4559 4323 -3421 -11064 -7605 7851 8479 -12991 -19017 497 10241 1320 -10713 -15709 -4775
1161 -4775 11449 3397 -18420 -12427 7990 6403 -7255 -10980 -5450 3539 5932 -6151 -9792 3293
1175 3293 5382 -6991 -6237 4664 5215 -512 -5600 -7830 4215 13508 -2244 -16078 -1544 13999
1189 13999 5890 -9039 -11519 -634 13359 7923 -14492 -14403 6479 10513 -3236 -9423 -6229 649
1203 649 5994 -2758 -13370 -3391 7730 -2809 -10460 -2823 1438 -1812 -5584 -8188 -2089 7910
1217 7910 -1654 -17404 -7967 10310 5738 -8902 -13475 -5810 7945 9411 -10661 -18650 2287
1230 2287 14257 451 -12438 -8834 2096 10333 3131 -12028 -6544 10811 6770 -6932 -3170
1243 -3170 4933 4951 1991 -1906 -1281 9714 9323 -6125 -4780 12245 13793 -534 -5674 -248 11476
1258 11476 16602 1025 -12951 2188 19305 9731 -6308 -5659 4122 12791 9150 -7165 -9597
1271 -9597 8704 12637 -2303 -6979 587 3677 2910 -1157 -6129 991 7555 -3762 -11323 1833
1285 1833 8380 -1090 -8555 -6245 2042 9613 1581 -14494 -7633 12129 9282 -7321 -10138 -587
1299 -587 8814 9469 -4597 -12264 2701 13761 2217 -6606 -316 4822 5123 3089 -2718 -581 9490
1314 9490 5108 -5717 478 10459 4008 -3060 -625 4202 9879 6767 -6943 -6243 11822 13769
1328 13769 -1502 -6332 1276 7872 9943 2066 -8741 -632 14638 7887 -6058 -4072 3566 6110
1342 6110 5232 -1699 -4055 4126 5067 -4869 -2669 6839 2612 -5510 -2874 665 2859 3512 -4834 -9421
1358 -9421 4080 10904 -3116 -12157 -3770 6258 8356 -499 -12640 -5932 11526 7683 -9092
1371 -9092 -7388 3283 4746 2291 -1667 -6468 -222 7737 359 -5655 1358 4301 -2238 -3186 28
1386 28 2998 4515 -3400 -10349 1372 12426 -822 -12885 -3018 6627 5137 -1007 -8913 -7866
1400 -7866 6790 10520 -5048 -11837 -1626 6760 5454 -2580 -10107 -2141 9791 2359 -8904 -814
1414 -814 6104 -1190 -4104 1243 1828 956 414 -4332 -1774 7017 3383 -7183 -5162 4378 7792 2710
1430 2710 -8747 -10823 6409 15581 -2733 -13794 -738 8849 3178 -1435 -3487 -2534 5033 5941
1444 5941 -2886 -3895 2902 3513 1647 839 -957 2812 5997 -2148 -4633 8688 10102 -5473 -6494
1459 -6494 7123 9362 1690 -3232 -3615 3796 11258 3496 -7977 -3785 5661 7100 2813 -5035 -6492
1474 -6492 5930 10090 -5479 -9402 5181 6972 -4300 -4015 1727 1059 -1217 -2418 -3288 2309 3899
1489 3899 -3888 -6161 1200 3053 667 -1577 -5787 -1754 10951 4485 -13130 -7416 11085 9073
1503 9073 -3547 -5722 -432 5279 6199 -1182 -4568 3210 6467 2397 1131 -79 -2189 4946 8391
1518 8391 -513 -1566 7432 2414 -5711 2693 11018 3714 -3672 -2920 2842 8320 4413 -6177 -4771
1533 -4771 7337 7513 147 -5153 -7111 580 13009 5622 -13338 -8387 8789 6272 -5244 -5466
1547 -5466 -459 2357 1316 -3942 -3842 2432 -87 -5314 -61 4456 -1037 -4246 -3068 -2764 4173
1562 4173 8109 -4733 -13013 2370 13056 1108 -10081 -5181 5285 9331 1310 -8741 -3421
1575 -3421 7419 4571 -1955 -151 -123 -368 4146 2314 -4825 135 6400 -302 -3731 3272 3631 -2744
1591 -2744 -2857 -39 3525 4472 -3050 -8317 1087 7394 -287 -4713 -2252 -1376 3027 4622 -5885
1606 -5885 -10277 3550 10093 -1635 -9215 -4425 2853 5460 -460 -7880 -1578 6372 -45 -6375
1620 -6375 715 3344 -986 -1670 -531 141 4861 2146 -7678 -3929 9868 6849 -5722 -6202 2255
1635 2255 8488 4839 -6845 -8105 7517 12681 -2170 -9003 -763 5498 5360 2213 -4310 -3705 5287
1650 5287 4311 -4387 -2379 3784 812 -1404 -375 -1337 628 1376 -4626 -3512 6735 4211 -7704
1665 -7704 -8012 265 5509 5366 -2634 -11142 -3297 9676 4023 -8009 -6004 1780 6102 3381 -6309
1680 -6309 -8827 4547 10392 -1697 -7180 704 3950 821 -1131 -1238 2170 5062 -1375 -5958 3690
1695 3690 8153 -2166 -5810 1750 6198 4203 -1939 -8405 -1570 12012 7428 -8423 -8411 3109
1709 3109 7171 2983 -4304 -6960 2479 8333 -1292 -6738 -224 2639 45 1304 326 -3810 -721
1724 -721 1950 -1943 -437 4242 -323 -5305 -1663 2567 3325 644 -5275 -3784 7313 6155 -7502
1739 -7502 -7172 4533 7360 2053 -2144 -6239 -1258 8943 5663 -5406 -4007 4596 4726 -95 -3547
1754 -3547 -1367 6151 5495 -4401 -3447 5883 2685 -5626 156 6596 2428 -2600 -4343 -2490 4722
1769 4722 7559 -2668 -8606 -442 6679 3279 -4374 -8239 -458 11082 3358 -12115 -7385 7648
1783 7648 5856 -2377 -2570 -2123 -947 3213 992 -3398 691 3575 -819 -2580 656 2707 3213 -1456
1799 -1456 -5436 2966 11536 -702 -12005 -306 12205 5505 -4627 -5689 -479 6856 7484 -3518
1813 -3518 -7540 1618 7681 3081 -3275 -6126 366 9210 2788 -8594 -1911 7216 -136 -5711 1526
1828 1526 4349 -689 -2950 -2260 68 3765 1314 -5559 -3418 3674 4206 1 -5242 -6266 4584
1843 4584 11618 -2382 -13563 -1112 10731 3593 -4627 -4006 -383 3998 4441 -2850 -4216 2378
1857 2378 4101 848 -501 -1714 289 4241 463 -4057 3329 7154 -3986 -6979 5030 8023
1871 8023 -1390 -5403 -1315 4107 5526 -1778 -7273 -753 7358 3942 -3208 -5978 -3511 4970 8156
1886 8156 -4260 -10482 1867 7802 -2010 -5528 304 1346 -874 -1276 -1380 254 1686 -2788 -2909
1901 -2909 3280 3079 -2563 -2762 -1174 1001 6578 3450 -8717 -5802 9313 8870 -4579 -6804 1363
1916 1363 7259 5622 -3135 -6296 2279 8255 1691 -2718 -1270 660 3077 3937 -2154 -3048 4511
1931 4511 3355 -5346 -2178 6355 2737 -4656 -3526 2048 5308 1208 -7771 -5551 6797 7157 -3954
1946 -3954 -7492 -2396 3252 6387 650 -9708 -4575 8104 5297 -6685 -5568 2075 4280 1311
1960 1311 -4223 -3950 2819 4502 -2980 -2469 3407 1631 -2186 -1167 279 2309 4756 -1703 -7730
1975 -7730 1203 9999 1694 -7437 -3668 4692 7285 1013 -8519 -5219 7961 7536 -4141 -6354 -293
1990 -293 3079 3752 -329 -5814 -1357 6045 1035 -5966 -1322 2980 31 -1688 -1583 -294 2073 -869
2006 -869 -5620 -625 6739 522 -6840 -3785 1879 3846 2203 -4677 -6510 3161 8216 -1366 -7270
2021 -7270 -1383 4677 5020 436 -5867 -3027 6025 4648 -3230 -1773 2511 966 405 1051 -358 1056
2037 1056 2425 -1672 -1777 4835 3054 -4132 -2810 3150 4206 1378 -3857 -5977 2796 8320 -439
2052 -439 -8527 -2112 4168 3366 -705 -5044 -4554 3579 5077 -4233 -6049 -100 1739 -113 -676 -2386
2068 -2386 -2026 1051 -841 -3375 1715 3241 -3965 -4286 1571 3302 1084 -2079 -4970 546 8301
2083 8301 2466 -7586 -3756 5547 6036 1145 -4797 -4564 4261 8899 -609 -6675 950 5601 2220
2098 2220 -663 -1879 119 4135 1778 -3101 74 5463 306 -4235 490 4236 2229 -1469 -4348
2113 -4348 -1056 6369 3937 -6184 -5548 3695 5258 282 -4083 -4101 1279 6703 278 -6946 -1820
2128 -1820 4868 2322 -1456 -1999 -1682 2335 3286 -2176 -3084 2416 2352 -1763 -451 1317 26 597 71
2145 71 -2017 2030 4421 -2210 -5067 2087 5384 1403 -2539 -4411 -151 6805 3004 -6481 -4631
2160 -4631 4234 4244 -1134 -3823 -3415 1347 5245 -533 -5849 -1007 3018 -498 -1909 767 1 -782
2176 -782 -830 -2021 1062 3807 -2206 -6191 1748 6233 -218 -4727 -2765 1460 5285 3043 -5396 -5067
2192 -5067 3901 5631 -158 -2526 -1776 1198 4471 1623 -3642 -668 3463 418 -770 2276 506
2207 506 -2267 57 1713 894 1558 -514 -3908 163 4110 955 -3215 -2927 -783 3481 3583 -4457
2223 -4457 -7421 2114 6137 -1115 -4968 -2549 178 2351 1027 -4605 -3590 2887 1855 -2373 -1922
2238 -1922 -211 -511 729 -473 -2160 2035 2202 -3891 -2626 4900 3243 -3737 -3103 1464 3493 2215
2254 2215 -2056 -3924 2219 6125 595 -3874 -1243 1394 3777 3286 -3682 -4098 4003 5052 -2656
2269 -2656 -3071 1601 1472 -10 208 -826 -549 1004 -880 -1548 1304 241 -2639 -1303 -355 -641 1651
2286 1651 44 -5691 -2500 5877 2005 -6693 -4280 2852 3838 403 -4389 -4289 2482 4539 -1349
2301 -1349 -3860 -113 995 1528 1067 -2405 -2235 3863 2725 -3516 -337 4533 378 -3724 132 4085
2317 4085 2595 -1330 -3377 1008 6530 1715 -5045 -1886 3907 3537 1645 -1516 -5283 239 7573
2332 7573 2045 -6306 -3002 3491 2422 -293 -2275 -1053 1722 423 -2861 -101 2369 -2092 -3023
2347 -3023 1658 2038 -689 -361 -2167 -3209 3154 5881 -2786 -7394 -30 5809 3564 -3315 -5982
2362 -5982 852 7411 1799 -5930 -1834 3272 1839 974 -508 -2747 123 4541 579 -3579 1397
2377 1397 4000 -440 -2456 683 3043 2314 -2809 -3739 3156 5929 -2536 -6133 1301 4456 1064
2392 1064 -1349 -2889 -1992 3957 5073 -3481 -5552 1633 5001 888 -3889 -3664 2961 6247 -1375
2407 -1375 -5834 1086 5112 -419 -2146 1332 978 518 1357 -774 -659 3373 2562 -2228 -1326 3490
2423 3490 3444 148 -3534 -938 6424 5492 -4774 -6040 4829 7545 -180 -3211 -1243 1201 3959
2438 3959 2173 -3460 -2809 3281 3493 -914 -2788 -1725 1574 2779 -1944 -3450 2662 1741 -5152 -2667
2454 -2667 4603 2738 -3216 -3770 -1119 1966 3434 -1230 -5664 -745 4568 2602 -2628 -4570 -940
2469 -940 6091 4551 -5310 -5732 4234 5911 -1949 -2079 1514 2245 1544 15 -1321 1783 3725 -157
2485 -157 -2201 1690 3425 1171 -1087 -2751 875 6634 1822 -7131 -3068 6789 4472 -3617 -4615
2500 -4615 -119 3658 3066 -3178 -5566 1069 4227 -297 -3535 -2933 -536 2466 183 -5184 -3170
2515 -3170 4211 1273 -6165 -3136 2576 1315 -2345 -3316 -1580 2386 937 -4894 -3816 2992 3077 -2120
2531 -2120 -4328 -2549 1319 5286 120 -7326 -1893 7052 2909 -4749 -3456 1734 4465 2197 -3630
2546 -3630 -3633 2909 4262 -1136 -1833 1064 720 857 223 -1582 627 4300 -242 -4855 571 5237 741
2563 741 -3773 -2206 1768 3940 22 -6030 -2342 5566 3208 -4167 -3650 -62 2004 2957 -1216 -5465
2579 -5465 -406 5429 364 -4126 -1064 2261 1786 -173 -2188 -696 3358 1148 -3265 669 4330
2594 4330 -88 -2454 294 2169 2668 2146 -2067 -2943 3899 5749 -1113 -3894 -122 3646 4056 -580
2610 -580 -4925 -36 5938 2043 -4295 -1398 2150 780 205 -596 -1903 981 1984 -2570 -2667 2053
2626 2053 1568 -1718 -1498 -335 1182 1671 -2348 -4804 2161 5657 -1440 -5660 -28 3268 2113 -495
2642 -495 -3025 -1193 4499 3049 -2583 -2347 1974 2968 2161 -400 -2573 1195 4607 120 -2633 2418
2658 2418 4040 -867 -1215 1401 2067 2426 687 -1542 905 4581 1336 -2749 -100 2534 2732 1884
2674 1884 -2233 -3764 3295 6173 -1469 -4634 701 3303 1015 -1097 -2040 -344 3242 770 -3650
2689 -3650 -1063 1824 -250 -739 -257 -1622 -314 1078 -2685 -3182 2617 2171 -4041 -3326 1221 1334
2705 1334 -767 -2640 -3312 859 3400 -2260 -5436 -875 1404 247 -640 -3063 -3833 1040 2985 -2862
2721 -2862 -4184 996 748 -1994 -1692 -1200 -850 267 -1152 -1789 1023 641 -3449 -1539 2209 707
2737 707 -1273 -803 -1752 -805 3195 1588 -3918 -1382 3403 1854 -1400 -1780 -721 2499 2902 -1827
2753 -1827 -2353 1844 1358 -1088 1052 1438 -1214 -19 1672 -904 -546 1804 -223 -1891 710 1336
2769 1336 -1196 -1503 -1026 -50 2872 -372 -5009 -2045 3147 480 -2723 -1444 -1322 -799 1294 -1162
2785 -1162 -4293 -805 2358 -696 -2649 -1664 -1041 661 238 -2673 -1363 2159 -412 -3961 516 2805
2801 2805 -812 -1880 -143 -116 1635 1126 -2406 -1825 3133 3327 -1434 -2180 -378 2637 4036 72
2817 72 -3845 673 5069 443 -2416 779 2022 359 473 -135 -1175 1758 1373 -1645 -117 2110
2833 2110 150 -1925 -500 -147 984 1819 -2476 -4040 1572 3489 -2032 -3262 210 735 1208 -496
2849 -496 -3318 -1833 3037 1795 -2757 -1875 501 822 659 -653 -2291 632 3058 -1711 -2292 2093
2865 2093 2278 -1066 -580 906 912 2191 -127 -2467 1845 4784 607 -2614 258 2519 2588 1763 -2029
2882 -2029 -1580 4035 3776 -2311 -2381 2224 2543 1055 28 -1661 126 3506 128 -2737 421 2258
2898 2258 -657 -1559 123 29 1024 161 -2886 -1109 3512 258 -3978 -1768 1522 1450 167 -2560 -3409
2915 -3409 1582 3797 -2232 -4517 309 2731 591 -1295 -2970 -1208 3180 1490 -3870 -1364 3024
2930 3024 1010 -1249 -819 -269 1148 1664 -1786 -2436 3231 3017 -2882 -2476 1953 2357 645 -2142 -2896
2947 -2896 1439 4818 -889 -5122 -259 3897 1571 -1175 -2840 -1661 3501 3453 -3014 -3819 2110 2539
2963 2539 -1172 -1389 -330 664 1973 -491 -2946 1114 3441 -1259 -2930 1105 2476 908 -449
2978 -449 -2470 -340 5109 2584 -4128 -2450 3881 3652 193 -2198 -1761 2885 4827 -1589 -4492 1287
2994 1287 3839 134 -1677 -954 -39 2440 575 -3529 -1434 3608 986 -3785 -2050 1314 1167 -315
3010 -315 -3689 -3022 2818 3037 -4101 -4953 1105 2385 -841 -2809 -3235 -483 3199 -817 -5422 -2128
3026 -2128 3512 929 -3180 -2868 -889 2289 1940 -3352 -3362 2661 2758 -2453 -2488 968 1264 1138 -450
3043 -450 -2495 1009 3938 -161 -3589 986 4135 1009 -1473 -1942 275 4730 2343 -4258 -2662
3058 -2662 4331 3659 -1890 -2737 -507 1934 3147 -1134 -4275 343 3299 -304 -2448 -660 -56 610
3074 610 145 -2627 -1847 2349 -70 -3913 -948 2671 243 -2327 -2354 -909 2382 1992 -3566 -4698
3090 -4698 1419 3375 -485 -2884 -2502 362 3724 1408 -4311 -2594 3634 2066 -1988 -1353 555
3105 555 1309 906 -1485 -1752 2529 2667 -2862 -1851 2422 2032 -699 -1058 -1218 1136 3563 -313 -4892
3122 -4892 -137 4446 784 -3185 -2145 714 3153 547 -3939 -2309 3526 2165 -2811 -2050 525
3137 525 291 876 -62 -2583 272 3131 -682 -3381 -17 2607 616 -1202 -1574 432 3026 449
3153 449 -3554 -218 4087 1024 -2338 -514 424 1046 2664 -631 -3081 1169 3937 -131 -2737 -182
3169 -182 2252 2776 145 -3838 -177 3875 715 -3575 -383 2581 -340 -687 -477 -1116 560 1808
3185 1808 -1614 -2782 838 1723 -1513 -2363 -1045 1209 2093 -2243 -5118 451 4274 -1209 -4221 -214
3201 -214 1313 69 69 -1342 -2219 915 2429 -679 -2229 -385 773 1166 113 -1719 296 2345
3217 2345 -1199 -2444 2566 3171 -1857 -2015 1529 1136 441 657 -989 -847 2749 1808 -1713 -2045 -67
3234 -67 2416 2823 -1535 -4219 897 4082 -1415 -3020 1406 1156 -1820 -523 695 -1205 -408 -172
3250 -172 -1393 -429 670 -718 -1601 -644 -466 980 404 -4030 -3127 2955 2268 -4110 -3479 1533 792
3267 792 -1466 -1262 -1029 -891 490 -434 -1568 -598 -286 -561 818 -559 -1872 907 1386 -2879 -1507
3284 -1507 3139 1021 -3420 -131 2379 58 -624 -163 -21 1363 1658 -833 -439 1464 493 949 1417
3301 1417 -1316 -891 4108 2614 -3440 -477 4334 2138 -1172 -239 1450 1253 1470 332 596 1820
3317 1820 987 -786 1106 1822 -25 1181 1313 -1303 267 4061 105 -3219 711 3705 -100 -2132
3333 -2132 -529 1233 1745 -227 -2417 -791 1405 -512 -1177 561 -1087 -2074 1016 -219 -3692 -1228
3349 -1228 2081 -1181 -2680 -215 289 -1717 -1826 -1039 803 1409 -2099 -3413 555 2581 -331 -1241
3365 -1241 -402 -1127 1164 3199 -401 -2687 2200 4347 358 -913 745 2302 2313 827 -401 2137
3381 2137 2958 -434 -785 3370 2913 167 829 757 140 2330 2185 -1509 -1267 2827 1988 -1688 -2047 172
3399 172 1948 1637 -2040 -3010 954 1970 -2156 -2203 36 -637 -331 406 -2013 -2457 616 1091 -1841
3416 -1841 -1676 478 -358 -1190 -1326 -832 1453 1346 -2653 -2564 2284 2257 -1552 -1159 941 929 1793 211
3434 211 -2675 -448 4217 2186 -1835 -1370 1159 2143 1677 -1353 -1158 2742 2670 -2056 -1516 2460 1655
3451 1655 -447 -72 -556 32 1240 -830 -2609 620 2363 -1082 -2619 -1163 284 1347 -160 -3399
3467 -3399 -2150 2251 642 -3741 -2499 977 584 -351 -1697 -2947 26 2208 -543 -2744 -350
3482 -350 516 -210 -434 -1439 -896 2178 1168 -2598 -818 2924 940 -2321 -529 1115 1659 1190 -1736
3499 -1736 -1747 2989 3436 -1180 -2184 1024 1889 1443 232 -2382 263 4300 1170 -3585 -885 2485
3515 2485 1719 -571 -1336 -544 1581 1023 -2453 -1663 2307 1278 -2312 -1613 431 852 890 -1405 -3376
3532 -3376 400 3469 -638 -3964 -863 2328 1863 -624 -2938 -1783 2740 2246 -2526 -1866 2107 1265
3548 1265 -342 -665 -1221 473 2779 -197 -2629 911 3106 -112 -1877 -367 1095 2206 22
3563 22 -3376 -746 3961 1332 -3103 -1448 1805 1793 135 -1748 -2431 1313 3167 -1710 -3826 -334
3579 -334 2075 237 -1421 -2563 -783 2250 157 -3673 -1258 2384 50 -1899 -915 255 601 751
3595 751 -1282 -1885 1366 2374 -1436 -1688 943 1808 1207 -532 -2071 1226 4089 643 -3507 215
3611 215 3016 1555 55 -502 -230 2376 3120 -745 -1266 2092 2151 443 60 -292 298 1927 232
3628 232 -1935 1002 3014 -964 -2339 971 1675 412 -452 -1538 -584 2512 831 -3386 -2340 1772
3644 1772 1451 -222 -1792 -2131 598 2517 -1170 -3544 545 2291 -499 -1884 -231 102 662 -100
3660 -100 -1899 -435 2142 -131 -2454 -302 1626 1009 -195 -1651 -1421 2083 2434 -2171 -2563 1669
3676 1669 2344 -440 -1578 -970 550 2374 74 -2730 -546 2007 157 -1628 -513 -299 174 404
3692 404 -1654 -1847 1442 1153 -2255 -1575 911 691 -42 -1059 -1722 412 2413 -904 -2782 -177 2307
3709 2307 481 -769 -1393 -240 2212 2064 -2427 -1567 2322 2242 -637 -503 198 1344 1990 -24 -1604
3726 -1604 845 2813 -366 -1391 1183 1308 299 -70 -918 82 2334 242 -2757 -453 2011 491
3742 491 -1156 -1255 -823 702 1365 -1412 -3237 54 1514 -1209 -1779 -1171 -556 513 -232 -1928 -1544
3759 -1544 1011 -322 -1838 -479 -72 -714 203 -62 -1269 734 705 -1673 -1236 1543 1011 -949 -466
3776 -466 64 1005 1823 -108 -2074 836 2766 161 -542 81 462 1346 1833 -349 -1117 1484 1464 -686
3794 -686 110 1333 330 218 485 -190 769 751 -1019 -874 2183 1181 -1650 -968 609 164 512 285
3812 285 -1906 -365 2147 264 -1540 -697 420 146 354 -811 -1572 853 885 -1195 -317 1277 -481
3829 -481 -992 193 85 121 779 -58 -1250 836 1935 -616 -1082 267 512 944 560 -1630 -571 2731
3847 2731 1035 -1989 -666 1000 758 242 -120 -1326 372 1904 -299 -1217 238 721 -56 95 -175
3864 -175 -122 1386 541 -1612 197 2186 -221 -1993 313 1432 528 32 -1151 -904 1742 1899 -1145
3881 -1145 -1323 1056 767 934 420 -1603 -194 2171 640 -1724 -159 1307 -451 -501 238 38 -231
3898 -231 278 -980 -357 1190 -7 -1755 -184 461 -201 -210 -1123 -2196 654 2173 -1581 -3190 -150
3915 -150 1234 -82 -882 -1558 -865 1003 485 -1643 -931 564 -125 -291 275 -570 -833 838 -506 -1199
3933 -1199 1474 1564 -1693 -1109 1292 1440 249 -503 -751 1347 2976 -176 -1944 960 2467 538
3949 538 31 -221 -328 1764 2240 -912 -1297 2301 1814 -784 -686 196 752 985 -284 -1528 890 1508
3967 1508 -1236 -1702 946 397 -1084 -553 -1409 -814 1079 246 -3023 -1883 1325 332 -1343 -2329 -1629
3984 -1629 717 1327 -2108 -3564 434 1466 -965 -1327 -549 -568 552 864 -1449 -1053 1738 463 -1387
4001 -1387 264 1370 463 72 -529 -101 2756 1827 -2193 -1386 3186 2422 -822 -778 -33 1094 2606
4018 2606 461 -2349 -400 2333 1255 -1062 -1335 -505 1410 1101 -1702 -2044 1092 901 -2297 -833
4034 -833 1062 -307 -1241 -1112 -824 -26 987 -1686 -2334 337 1466 -233 -1520 -1520 -231 2532 1091
4051 1091 -3389 -2167 2718 1864 -1712 -764 499 1128 1383 -17 -1031 895 2219 361 -472 691
4067 691 609 473 1050 -375 287 2492 575 -2703 -21 3417 956 -1874 -1442 543 1593 547 -2239
4084 -2239 -1921 1463 1413 -1079 -1913 -1167 -331 1538 299 -3232 -1701 1907 -28 -2875 -1049 833
4100 833 -75 -711 -1058 -910 1163 549 -1783 -628 1497 268 -1211 -310 -232 702 2369 -243 -2844
4117 -2844 316 3447 788 -1955 -857 1705 2469 435 -2328 -862 2686 2100 -703 -769 351 46
4133 46 1097 372 -1322 -41 2267 -351 -2533 90 1776 -319 -1291 -684 521 1108 -1011 -2984
4149 -2984 24 3030 -388 -2586 -1090 68 698 1171 -1153 -2741 499 2651 -534 -2619 -538
4164 -538 1236 1223 -308 -1911 -189 1836 554 -1251 773 1540 -1064 -433 1084 316 817 1471 -712
4181 -712 -1329 1632 2093 -921 -1512 353 2058 1821 -1113 -3161 639 3497 -133 -2419 -107 540
4197 540 -111 819 -261 -1539 129 1233 -843 -1598 29 90 -434 -515 -743 536 383 -2082 -2366 2006
4215 2006 1937 -1987 -2069 523 698 -32 -457 -1499 -537 2194 1193 -1704 -1795 504 1822 1079 -861 -1948
4233 -1948 926 2453 -817 -1739 1439 1047 -905 -91 903 -314 150 645 -472 -182 1099 -779 -576
4250 -576 239 822 1312 338 -2281 -1426 2638 1933 -2373 -1944 1345 1250 -332 -561 -1081 -226 2197 493
4268 493 -1616 -901 594 856 830 19 -1178 719 1504 -1122 -874 1987 764 -1866 33 1622 458
4285 458 -393 18 -77 1562 1534 -994 -1478 845 1675 1652 404 -1455 -1050 2465 1733 -2147 -1394 1447
4303 1447 821 -781 -219 -339 -433 371 -94 -768 -115 -657 -1294 -240 716 -823 -724 -402 -1748 -726 1627
4322 1627 -304 -2939 -785 1645 239 -1417 -1272 -840 769 1400 -860 -1369 282 474 325 903 -513
4339 -513 -631 1278 1382 -893 69 1602 85 -105 1586 1461 -183 -213 529 1367 2075 33 -1601 326
4357 326 2140 771 -218 -116 -520 1105 1983 -236 -2095 656 2029 -73 -639 -450 -198 465 630
4374 630 -842 -439 294 -1340 -1641 501 291 -1480 -596 -43 -618 234 103 -2026 -1047 1675 688 -1569
4392 -1569 -1301 -592 804 1673 -872 -2783 185 1867 -107 -951 -253 -301 69 1207 -514 -1801 758
4409 758 1306 -387 -4 239 -407 -334 599 41 509 766 -1121 -1103 1535 1499 -1377 -1219 379 618 1358
4428 1358 -334 -2293 -639 2541 1471 -1403 -1245 -258 647 1526 -451 -2024 609 1489 -115 -617
4444 -617 395 -342 -373 963 533 -374 242 -419 -785 1252 1594 -704 -1300 87 1195 1357 621 -1485
4462 -1485 -1408 2233 2005 -1204 -1222 791 425 1000 310 -1851 -645 1339 462 -766 137 59 -927 329
4480 329 729 -335 237 134 -1213 331 1704 -522 -1842 184 1020 771 44 -1450 -1475 1627 2206
4497 2206 -1347 -1452 438 988 674 548 -1055 -343 1965 926 -1306 -261 1239 413 383 429 -157 674
4515 674 1031 -650 -667 1588 730 -1267 220 1402 674 214 -240 -1074 1035 2129 -702 -2485 345
4532 345 1909 1144 -247 -1842 -1057 1807 1761 -1613 -1599 874 923 -73 -431 -1071 -620 988 -90 -1082
4550 -1082 389 835 -1361 -563 1340 621 -254 -655 -1154 710 2506 113 -2695 -378 2273 1462 64
4567 64 -1423 -1092 2053 2922 -479 -2219 78 1626 1019 604 -787 -1075 1220 1352 -370 -304 905
4584 905 179 -518 571 442 -244 -243 -666 -175 2085 880 -2539 -1594 1453 1458 -314 -1626 -1595 358 2388
4603 2388 -9 -2689 -1168 1557 1176 -143 -1095 -1224 733 1459 -835 -1349 933 532 -880 483
4619 483 946 -350 -220 226 -317 994 1171 -1205 -1234 1385 1367 134 -562 -916 36 2741 980 -2774
4637 -2774 -805 2069 1574 -475 -387 -586 673 1836 332 -1596 -17 983 138 -305 -64 -371 58
4654 58 203 -1122 -167 1207 -682 -2406 212 1299 -405 -1546 -1021 102 1262 586 -2267 -1334 1435
4671 1435 1533 -676 -1432 -1400 411 2152 122 -2343 -461 2467 481 -723 24 253 261 968 273 -278
4689 -278 902 533 -405 1039 1585 -110 -404 323 113 1463 1635 -1100 -2203 1374 3306 -270 -1616
4706 -1616 -733 778 1774 661 -1835 -1669 1136 1252 -71 -986 -1257 -241 1369 389 -1950 -716 900
4723 900 -626 -807 818 323 -1618 -485 210 713 1170 -1280 -2141 716 2329 173 -1335 -647 140
4740 140 1436 1659 -1252 -2454 978 2672 233 -978 -205 552 1104 1021 -825 -94 879 55 -134 1028
4758 1028 61 -929 257 506 -68 237 346 -1549 -524 2159 987 -1823 -1286 304 1104 1186 -1138
4775 -1138 -1874 915 1859 -306 -1140 -283 -392 481 1041 -710 -1786 743 1459 -193 -741 324 -58
4792 -58 522 381 56 515 69 -882 -150 1916 826 -1239 -149 961 624 725 4 -1576 -296 2166
4810 2166 950 -1751 -999 732 1433 976 -1208 -1954 778 1785 -689 -565 157 -561 -666 1024 103
4827 103 -871 -41 249 -653 490 926 -906 -1254 311 971 571 -409 -2065 -282 2434 975 -2461
4844 -2461 -954 1065 720 481 -29 -1297 112 1525 808 -1082 -537 -27 237 851 -17 -923 400
4861 400 278 -460 374 1502 -703 -1361 1096 1118 -190 -492 -964 -510 1390 1182 -1239 -1441 549 792
4879 792 726 -381 -1655 -461 2282 1124 -1930 -856 387 -192 188 267 -618 -668 544 200 38 339
4897 339 -299 -950 437 1068 -413 -222 -391 -353 1402 1877 -985 -1860 619 1827 336 -856 -995 80
4915 80 1934 1384 -1532 -699 539 842 748 527 -936 -1049 1176 813 -660 -81 421 -690 -209 1025
4933 1025 180 -801 -612 -410 817 1009 -1235 -2347 703 1650 -55 -1210 -1019 -1119 1065 1692 -1073
4950 -1073 -2143 181 1215 90 -874 -1219 -83 1120 847 -926 -184 205 -540 118 1264 225 -1154
4967 -1154 326 692 206 1128 400 -1003 -248 1634 909 -255 -736 -1 1527 1757 -1019 -1984 873
4984 873 2037 197 -303 -300 -494 655 1701 -531 -1335 388 473 -151 105 -4 -444 213 194 -232 605
5003 605 269 -1734 -817 2272 637 -1629 -826 290 592 861 -355 -1790 -503 1668 932 -580 -1229
5020 -1229 -914 1046 1618 -573 -1541 565 813 -500 -157 847 -586 -563 649 289 -144 -262 -528 -43
5038 -43 1146 542 -1019 -1041 -160 508 1595 238 -2437 -725 2236 1288 -1490 -1052 361 763 588 -342
5056 -342 -1468 -201 1435 889 -306 -620 -699 152 1205 11 -404 467 -209 -1080 491 1803 -673
5073 -673 -1554 111 971 860 -281 -1310 -258 1937 1103 -904 -1516 -254 763 1737 76 -2313 -466
5090 -466 2002 593 -1492 -526 489 173 210 -91 -820 -382 -147 -323 240 597 -906 -1190 278 347 88
5109 88 595 -915 -1758 842 2002 -820 -2364 -318 1575 859 -535 -1450 -703 1379 782 -664 -760
5126 -760 -372 -16 1097 581 -1313 -624 1324 251 -761 61 632 -615 -351 443 578 295 -654 -1102
5144 -1102 813 1745 -708 -1841 -66 590 189 405 -1297 -1307 844 1715 -862 -2195 -175 589 714
5161 714 -170 -1256 -580 575 -28 -660 -106 -5 -991 -129 598 33 -620 247 -451 -149 966 410 -1603
5180 -1603 -712 1407 914 175 -964 -1274 1098 2366 -469 -1858 101 1082 440 294 -498 -1097 718
5197 718 1372 -484 -854 206 327 248 417 25 -627 -64 -496 -288 1063 418 -1533 -866 1075 521 -787
5216 -787 -1071 -982 421 1427 167 -2271 -1146 1042 1292 92 -1275 -1645 626 1573 -563 -1336 50
5233 50 597 -12 524 84 -788 94 682 51 234 638 -735 -816 1011 1264 -27 -509 -1046 256 1936
5252 1936 933 -1792 -798 1337 1037 -351 -576 -456 511 1790 194 -1456 -670 701 621 162 -133
5269 -133 -856 -98 603 -207 -575 334 -271 -1127 228 583 -550 -821 -441 -3 1042 413 -1358 -1440 571
5288 571 1073 -131 -1108 -662 -164 1399 924 -2006 -810 1191 711 -219 -638 -404 415 1062 408 -780
5306 -780 157 385 -221 -35 1062 -55 -298 69 101 347 679 -876 -1180 1057 1539 -292 -990 -222 223
5325 223 1159 669 -1220 -1363 1131 998 -464 -729 -712 -221 413 357 -1133 -515 506 -94 -404 61 -612
5344 -612 -1013 -239 -7 -81 60 -528 -1402 28 1200 -545 -1148 -1015 196 1031 858 -1052 -1644 815
5362 815 1868 -149 -904 -207 241 1139 866 -1083 -758 620 165 -457 141 230 -637 -137 489 -269 8
5381 8 -108 -1333 20 1519 -66 -1313 -736 115 439 546 -754 -1739 72 1440 58 -1170 -809
5398 -809 167 698 968 -838 -1115 300 569 -299 -300 81 -284 -20 567 -104 -233 346 -427 -414 730 737 -325
5419 -325 -707 374 927 636 -296 -1735 53 2076 448 -1448 -565 569 722 586 -575 -1148 523
5436 523 1300 -175 -868 -183 205 108 -87 -475 -557 147 146 -840 449 543 -806 -957 625 416 135 -165
5456 -165 -1147 -381 1417 411 -1297 -897 503 742 649 -749 -1608 30 1781 511 -883 -248 422
5473 422 536 362 -37 -743 161 558 -132 -161 369 -242 -391 345 316 32 312 -627 -805 1280 1040 -1006
5493 -1006 -1484 505 1136 357 -802 -1367 -253 1341 680 -1062 -953 208 304 387 -38 -1253 -22 672
5511 672 -245 -803 243 -3 -861 41 764 -64 -493 -520 -380 617 1129 -834 -1203 469 996 48 -73
5530 -73 -810 -709 1116 1739 -531 -1461 -165 746 385 -156 -580 -398 667 100 -484 -117 60 -346 236
5549 236 499 -392 -510 187 -194 -111 845 109 -1236 -530 897 643 -151 -769 -723 1034 1067 -1058 -1173 490
5569 490 801 -222 -74 -474 -680 555 861 -494 -343 543 159 -75 316 436 -66 180 42 302 1143
5588 1143 177 -1080 327 1556 319 -566 -124 -124 494 883 52 -1024 -477 1153 514 -131 -943 -502
5606 -502 799 1028 -993 -1251 540 326 -376 107 -38 -759 -123 397 -563 -501 85 -581 -702 193 372
5625 372 -66 -428 -567 206 890 -113 -1641 -157 1456 830 -869 -573 -152 70 1257 -120 -1025 -174
5643 -174 1028 391 -30 -237 -890 602 800 -198 -363 623 -261 -727 820 970 -782 -768 149 38 154
5662 154 271 -567 -565 670 520 -131 -394 -642 -275 1288 145 -1354 -784 998 217 -831 -151 -135 28
5681 28 670 210 -127 -186 121 -285 454 255 -317 -179 185 -203 292 927 -389 -1461 1124 1482 -642
5700 -642 -968 -45 356 783 281 -933 -512 1010 40 -282 -194 -571 -666 751 566 -1040 -54 813 -573
5719 -573 -457 583 247 -827 -409 359 -15 -294 -729 -744 679 1016 -853 -1055 106 2 478 543 -644
5738 -644 -1308 891 1197 -722 -692 427 663 326 343 -487 -15 584 -81 243 686 27 -91 563 828 -59
5758 -59 101 153 -424 -135 1319 196 -967 -288 592 1021 185 -1141 -681 1383 1158 -375 -730 248 -133
5777 -133 340 658 -307 -831 413 874 -582 -709 202 -208 98 178 87 211 271 -634 48 955 211 -1034
5797 -1034 -175 855 212 -84 -246 -510 85 1368 443 -871 -459 581 958 299 -264 -626 1215 1187
5815 1187 -433 -605 759 -472 -284 641 305 -318 17 417 -184 494 398 -133 -483 291 575 -91 -491
5834 -491 -1043 46 960 -25 -1547 -624 809 -31 -541 -238 -801 66 536 -8 -685 -203 326 -261 -63
5853 -63 -44 -481 -167 138 -545 304 743 -573 -962 467 762 -242 -431 -123 -141 1185 388 -928 -441
5872 -441 553 719 170 -230 -825 -249 1239 -104 -1191 -261 718 72 -528 -31 -301 -311 222 -95 -399
5891 -399 268 -278 -714 217 862 -130 -361 -670 -685 476 612 -1022 -1271 680 686 -421 -911 -721 -39 713
5911 713 186 -969 -727 700 -70 7 -115 -449 -229 700 164 -864 229 505 -418 -62 936 326 -560
5930 -560 -152 349 530 916 -745 -934 629 928 192 -465 -484 -184 786 840 -720 -1135 597 949 -65
5949 -65 -596 -602 -144 689 -48 -936 -181 340 -630 -421 642 395 -268 -52 -309 -133 480 225 -930 23
5969 23 1210 519 -540 -303 2 884 1115 -654 -1331 712 1332 64 -383 251 124 658 765 -399
5987 -399 -378 934 624 -649 250 397 -156 -21 249 -21 573 380 -647 -444 1155 335 -612 -667 -278
6006 -278 348 693 -185 -1247 -205 1420 283 -909 -650 -473 763 858 -573 -1237 552 687 -300 -606
6024 -606 265 -234 -344 502 -114 -131 272 -61 -707 564 635 -406 -350 -324 594 1055 361 -1256 -242 1459
6044 1459 678 -650 -384 40 595 676 14 -1041 -146 919 195 -173 121 -178 -13 550 33 -222 378
6063 378 7 -889 -24 736 -486 -1165 -176 38 316 209 -792 -756 745 1092 -654 -725 -183 12 403
6082 403 -253 -1257 -383 1128 411 -831 -213 235 208 294 18 -311 39 508 -330 50 551 38 -590 -12
6102 -12 225 -56 735 -193 -907 470 1057 -202 -821 -281 470 408 96 -1063 -688 747 923 -817 -425
6121 -425 36 213 276 186 -685 -426 899 -360 -613 293 98 -155 81 419 -111 103 -343 -418 178 1262
6141 1262 -204 -861 123 482 296 520 -187 -865 832 1310 -390 -839 23 472 553 176 -518 -475 722
6160 722 892 -331 48 -7 -354 -31 190 -99 -368 291 -302 -554 680 -234 -1260 -568 233 187 188 -572
6180 -572 -1189 31 855 -169 -1350 -508 183 -3 184 -343 -1022 145 732 -437 -457 360 -12 -70 625
6199 625 26 -370 243 187 -375 661 656 -329 -484 340 415 116 71 -409 209 1258 391 -653 -203 600 314
6220 314 416 63 -703 155 1045 0 -408 -109 74 -2 177 149 -673 1 85 -311 -45 283 -689 -595 439
6241 439 -170 -499 -62 -374 -678 446 -214 -985 -503 409 404 -466 -340 -174 -331 770 81 -893 25 -168
6261 -168 9 278 81 -576 -426 291 -96 -487 -161 -344 -265 498 106 -200 -306 20 142 427 305 -956
6281 -956 -895 1030 538 -528 -641 -280 -260 638 387 -697 -464 461 -27 -162 -37 -843 -167 515 209 -414
6301 -414 58 35 -654 403 689 -81 -832 -112 256 605 505 -684 -551 630 1017 241 -259 -149 -90 1108
6321 1108 663 -612 -470 616 676 30 17 51 -26 430 379 -271 -34 203 -217 125 690 -225 -698 -102 160
6342 160 -274 227 -250 -791 -76 715 -270 -907 -417 41 167 149 -641 -904 275 492 -556 -506 22 -693
6362 -693 -368 722 -434 -286 114 156 -409 221 -98 -384 -242 289 330 126 -63 -902 207 1128 87
6381 87 -767 -39 218 315 213 -264 -641 467 1093 187 -559 -198 290 356 419 -813 -344 587 165 -593 284
6402 284 151 -672 -617 629 96 -599 -257 -679 -263 611 43 -893 -525 -89 547 293 -356 -1368 254
6421 254 1206 -28 -1272 -397 167 -128 -20 -418 -582 -248 79 -143 -445 -30 -359 -305 432 474 -99 122
6441 122 -582 -355 469 633 -607 -919 520 476 -142 -622 -883 -274 1056 283 -890 -676 74 421 403
6460 403 -391 -869 52 1120 33 -1036 138 654 -322 256 266 19 -227 -217 -12 284 506 -301 -98
6479 -98 422 523 43 119 -491 -310 787 1148 -627 -880 514 924 252 -25 -146 164 805 490 -454 -131
6499 -131 218 263 564 305 -228 151 707 -373 -751 739 40 -625 -161 791 292 -438 -481 -277 801 666
6519 666 -822 -783 88 401 253 -12 -920 -431 1053 753 -669 -737 578 711 297 -234 -38 381 616
6538 616 264 12 317 558 -350 425 517 155 269 376 -451 135 933 138 -847 52 970 603 -114 -772
6558 -772 -228 993 405 -777 -1182 604 484 98 77 -479 -401 376 567 -546 -609 483 -307 -566 -112
6577 -112 -141 -193 -269 -536 -112 602 -258 -1398 -350 708 107 -438 -320 -297 -34 1144 -23 -1365 -258
6596 -258 807 361 -441 -505 -334 542 594 -551 -337 452 -7 -135 180 -119 -770 -43 193 -142 -212 290
6616 290 -360 -486 61 842 -77 -874 -727 -125 1152 -100 -1478 -268 800 -12 -322 -572 -241 -139
6634 -139 557 -87 -1179 -261 565 85 -98 -576 -441 -7 244 -425 -435 392 -258 -503 445 429 -520 -515 -133
6655 -133 237 322 242 -697 -612 888 672 -35 -377 -483 316 819 211 -1059 -289 634 234 -535 -77 166
6675 166 -13 564 330 -410 106 250 -76 106 286 -299 -66 315 -141 74 329 -619 -941 750 724 -304
6695 -304 -842 -314 147 484 371 -776 -367 804 662 -200 -372 -524 12 876 174 -1038 -44 422 -262
6714 -262 -255 512 17 -122 248 196 184 -126 -430 -335 -108 681 -255 -591 -288 -196 710 525 -672 -686 567 866
6736 866 -20 -959 -203 -149 370 274 -848 -422 365 -148 67 113 -461 -603 349 535 -405 -210 430 -377 -45
6757 -45 398 73 -575 98 508 511 160 -391 -322 347 985 -332 -308 -21 245 724 841 -238 -382 346 717
6778 717 118 7 72 21 109 342 -191 -274 -213 -398 193 513 -78 -780 170 286 -142 -341 -140 -755 -219 616
6800 616 91 -808 -327 373 335 94 -681 -557 185 185 -405 -350 104 -296 -57 598 -111 -532 173 207 215 166 228
6823 228 -528 -166 571 284 -62 -109 -54 374 835 268 -684 -311 862 373 237 252 -476 204 919 444 -329
6844 -329 -129 368 331 451 133 -366 -19 649 -155 413 467 -276 -581 664 349 -66 -293 -7 25 717 -149
6865 -149 -852 -227 490 744 332 -7 -361 -37 803 381 -273 104 322 -399 307 439 -227 -294 636 37
6885 37 96 42 -241 -376 342 673 -377 -547 -90 -126 438 71 -544 -683 514 125 -424 -595 -41 -98 544
6906 544 381 -568 -520 602 315 34 114 -371 -108 246 -136 -476 -11 -37 -449 -54 641 -499 -629 -383
6926 -383 116 422 319 -479 -709 654 698 -309 -647 17 58 449 360 -619 -507 605 435 -106 -99 16 -308
6947 -308 365 212 35 16 577 -113 -21 584 20 -513 287 443 367 76 -259 -538 469 1190 4 -929
6967 -929 -54 128 416 278 -630 -904 404 856 -185 -184 -82 -126 218 361 -358 -434 316 121 -83 272 66
6988 66 -414 -231 410 44 222 -128 -518 -43 664 110 -509 -341 558 661 257 -264 -465 349 809 121
7008 121 -459 -166 355 516 470 -57 -211 216 374 -220 -3 158 127 125 373 -151 27 257 -427 -104 805
7029 805 438 -547 -460 318 651 472 8 -717 271 1200 525 -222 -167 719 527 752 -321 -371 366 726 103
7050 103 -245 384 237 219 760 9 79 192 160 -131 258 756 -581 -323 219 281 202 -60 -845 -420 688
7071 688 210 -855 -458 299 490 285 -635 -705 -102 454 87 -652 -28 -141 -5 324 -311 -601 25 297
7091 297 -331 -111 477 -193 -210 -108 226 212 -17 -321 -300 518 724 -336 -495 542 441 378 -67 -503 -438
7112 -438 1134 339 -476 -295 366 461 66 -89 -145 -46 438 -108 -296 118 -134 -234 217 14 66 -140 -393
7133 -393 -536 -231 468 -290 -838 -23 293 -65 -439 -777 -276 681 165 -711 -433 -249 -13 -286 22 -751
7153 -751 -325 826 297 -238 -217 488 -3 -145 76 -190 -87 8 -67 32 559 -176 -284 433 546 -31 228
7174 228 -204 -359 775 654 -214 -673 110 904 488 -198 -477 -244 771 381 -168 -307 224 40 126 188
7194 188 -207 -271 555 -116 -537 236 357 -313 -277 177 153 29 -619 -422 337 618 -59 -949 -197 770 178
7215 178 -85 -278 -382 462 1040 -123 -407 226 362 452 194 26 -161 514 245 -396 371 539 -316 123
7235 123 722 310 -301 -142 284 95 409 45 -475 -387 501 365 -78 -527 -270 107 305 -68 -552 56
7255 56 721 82 -138 209 -424 -169 755 -121 -112 82 -27 -77 308 52 -307 39 -10 14 399 432 -612 -461
7277 -461 727 669 -200 -216 251 573 535 104 -371 -260 623 440 -144 175 -416 364 437 -67 -317 92 425
7298 425 114 165 257 -263 -413 -1 47 -117 179 -280 -340 401 16 -536 -278 -12 -78 266 131 -751 -686 240
7320 240 134 -368 -422 114 344 335 142 -330 -9 170 -146 178 248 -414 13 215 88 -119 231 -42 -236
7341 -236 263 769 -152 -613 -16 586 329 -96 -466 -502 531 255 -204 -381 132 -134 358 271 -381 -716
7361 -716 439 390 -363 47 -71 -559 -97 116 -201 64 -171 -168 165 303 -309 -456 202 278 -1 33 302
7382 302 -285 297 393 -40 -158 198 145 374 51 -99 -109 376 -4 -487 290 437 -209 -52 233 344 -385
7403 -385 28 -76 70 680 234 -278 -147 504 193 -86 -194 -713 2 375 -30 -432 -36 49 -106 -14 51
7424 51 -282 -51 239 -321 -106 -134 -116 79 340 -83 -393 72 -4 -210 373 126 -572 -216 606 134 -402
7445 -402 -430 -292 83 290 384 -355 327 258 368 121 -199 -440 441 582 -187 -815 109 320 -439 99 52
7466 52 -287 93 209 2 112 -33 -301 -19 247 115 -281 -268 2 -367 470 109 -641 -455 695 -3
7486 -3 -326 -185 -5 132 570 -62 -390 160 259 193 187 -40 -571 343 791 -216 -595 590 142 -275 248
7507 248 243 105 -434 -258 163 421 56 -542 -372 418 741 -214 -180 -257 -101 211 416 -804 -127 373 274
7528 274 -577 -306 94 -409 114 -213 -193 -1 -294 -449 253 130 -328 -266 38 -193 -192 570 -263 -704 -240
7549 -240 579 51 -711 -119 58 604 332 -759 -50 535 173 -406 160 7 -63 207 220 -458 -362 182 -44
7570 -44 -196 412 33 -196 320 27 -197 148 -455 -776 95 451 -442 -355 208 -45 -1 205 -198 -315 135
7591 135 563 -255 -436 -212 32 477 -34 -557 -262 344 -71 -352 121 133 46 299 3 -247 -95 51 -99
7612 -99 -301 564 -24 -343 -16 -131 -67 376 -182 -436 449 623 -415 -640 -289 58 -22 159 -729 -872 104
7633 104 162 -563 -457 -505 -325 -139 -377 -664 -373 184 -644 -546 32 62 -543 -345 150 -166 53 25 -1045
7654 -1045 -373 260 228 -443 -389 -212 339 555 -164 -580 307 814 -77 -378 415 337 161 64 292 141 323
7675 323 270 -191 165 260 -78 -83 -277 36 342 346 -419 -483 537 105 -325 -488 151 -22 137 151 -703 -288
7697 -288 508 179 -538 -76 171 -243 35 -339 -556 191 247 -415 -571 -35 243 -178 186 188 115 -9 111
7718 111 -430 204 329 -11 17 162 182 -24 269 -248 -106 666 469 -659 -161 295 637 251 116 -318
7738 -318 109 515 -258 254 242 -59 -336 125 124 -232 351 102 -395 -117 474 -234 -604 -68 272 220 -171
7759 -171 -188 -244 301 394 -431 -118 213 272 176 -137 -307 -117 487 247 -338 176 115 26 281 -11 -17 -99 380
7782 380 -47 -1 610 244 -123 492 156 270 252 271 -35 164 703 118 -689 239 98 305 242 -21 -439
7803 -439 264 456 -359 -199 194 175 -181 35 62 -367 -213 -178 -318 8 -42 -542 -87 247 -194 -75 -244
7824 -244 -235 -401 345 39 -495 -183 220 -339 145 -170 -451 80 485 -70 -313 61 435 -49 78 197 21
7845 21 23 81 -200 -108 65 -113 -326 193 -250 4 54 146 -92 196 -5 -211 -90 368 35 -137 -250 -34
7867 -34 5 132 -233 -629 -139 225 -153 -212 -319 -284 241 277 -353 -285 -41 -355 -113 37 -113 -426 -412 -157
7889 -157 -228 152 71 -416 -31 80 27 -214 -86 -103 -336 170 -30 -719 -397 612 -179 -146 11 -183 145
7910 145 -101 94 -336 -142 187 -224 5 265 -487 -45 348 -88 -361 104 -161 -202 264 35 -364 -294 -93
7931 -93 -173 111 65 -368 -369 412 23 -360 41 -174 -164 155 -154 -418 207 575 -410 -395 221 -97 -150 21 -365
7954 -365 42 44 97 -245 330 464 33 108 51 205 -223 241 -198 -321 301 320 -225 -242 281 24 -2 -155 -355
7977 -355 -8 388 -107 -528 5 1 -27 -173 380 -523 -133 111 -162 -530 42 -42 -167 266 -221 -308 -21 -379
7999 -379 -134 146 116 -375 34 452 114 -380 66 -352 -105 243 268 -399 3 421 -97 64 85 -9 179
8020 179 466 -325 -50 457 137 -343 159 24 5 -230 4 -312 -153 234 -167 -442 -126 110 -115 178
8040 178 -228 -157 256 295 -261 -374 247 -145 -296 -101 -14 -87 51 4 -46 131 357 -148 -54 164 194 136 93
8063 93 -486 -263 435 128 -289 -106 294 -133 283 -164 -55 -233 105 -181 -168 138 124 186 -137 -295 -122
8084 -122 222 98 -24 -512 260 -144 -277 25 17 -85 164 -214 -62 166 -93 -531 218 -223 -124 -139 -83 -402
8106 -402 49 529 -142 -328 -285 360 75 -113 -92 -93 27 16 -378 -341 94 232 -283 233 153 -230 344 335 -202
8129 -202 -67 317 -152 -376 215 243 133 -391 -177 -46 275 -73 -175 13 237 -101 -136 155 -99 -354 152
8150 152 12 -518 136 -80 -244 -191 101 295 80 -139 -61 -57 260 -29 -338 159 243 -415 138 -49 -460 -91
8172 -91 381 -80 -333 29 406 -145 -291 102 -241 194 -221 -318 177 323 -356 -214 251 94 -252
8191b52
$$ Imaginary data points
##PAGE= N=2
##DATA TABLE= (X++(I..I)), XYDATA
0 0 0 0 0 0 0 0 0 8 -8 8 -8 8 -16 16 -24 24 -32 32 -40 48 -56 64 -76 87 -100 114 -130 147 -167 188 -212
31 -212 238 -267 296 -331 368 -410 455 -505 556 -618 684 -758 839 -930 1031 -1148 1280 -1434
49 -1434 1615 -1828 2090 -2412 2826 -3378 4155 -5329 7296 -11216 22022 -110846 -383454 -111422
63 -111422 146363 65179 -153321 -158221 -41887 -19240 -132052 -164067 -51043 21914 -67062
74 -67062 -138391 -92069 -38271 -65956 -110101 -97099 -993 59784 -39619 -167751 -100064 50806
86 50806 54205 -32021 -40939 -804 10182 -1759 -8360 3100 24442 38450 57586 55384 -15040
99 -15040 -56675 44027 140492 69713 -27311 6936 69100 51664 13522 18299 59613 86499
111 86499 42076 -21230 4207 70922 61290 8441 4945 46977 68274 16830 -56286 -13085
123 -13085 106971 85824 -56918 -67712 55865 80166 -16960 -59066 7163 69057 29028
134 29028 -58334 -53212 36741 56181 -12197 -42260 -15497 8575 19606 6476 -25241 -13885
146 -13885 20670 786 -22296 13904 28526 -14864 -25297 14414 35423 18474 -10937 -21621
158 -21621 10386 42763 28022 6159 -1904 -18064 1092 61557 49098 -33989 -36545 42115
170 42115 57777 -3346 -40001 -10127 48626 54717 -15778 -57065 -6416 38453 15944 -9600
182 -9600 -8015 -3451 -3050 -16214 -23704 16331 41165 -22497 -70239 -1629 62323 9945 -63399
195 -63399 -46618 31192 67061 4031 -73934 -42406 47326 52972 -6554 -29784 -11816 16452
207 16452 33683 6309 -28305 260 40575 20991 -6236 827 3262 882 14357 21262 19082
220 19082 15488 -9479 -26550 8941 42923 22170 -7213 -14467 -8532 19245 33770 -11149 -41329
233 -41329 11043 54580 14805 -43139 -45644 4906 54722 30566 -42855 -49023 12039 27967
245 27967 -6595 -19553 -8761 1730 5102 -13397 -26259 2349 14639 -20416 -25484 13247
257 13247 14779 -22376 -32732 -9670 19961 24296 -17687 -45492 -3440 34470 3591 -28202
269 -28202 -12208 12847 20597 5901 -26568 -23496 24111 35893 525 -14652 -5205 1170 15653
282 15653 22173 2501 -3212 11115 5876 -71 16419 16047 -583 4210 14568 10614 9897 2351
296 2351 -10186 12307 39748 12144 -25048 -10801 19460 29438 19308 -9742 -23916 12463
308 12463 37762 6297 -17583 159 16586 16680 8603 -8630 -7141 16399 14078 -996 10900
321 10900 12783 -13782 -10846 21952 25324 4294 -11007 -15764 6582 36072 15182 -27940 -17709
334 -17709 21039 28458 8049 -19315 -26149 10669 39682 8263 -25401 -11395 5993 7459 12474
347 12474 4276 -13327 -4902 8844 346 -743 7271 -3331 -8751 6858 10405 1076 -4643 -12406
361 -12406 -4148 28246 23496 -24542 -30130 14237 32313 12760 -12255 -23148 1557 35295 17828
374 17828 -23896 -16820 17210 22525 7721 -8137 -13506 6986 20931 655 -7125 11719 4790
387 4790 -15276 1530 21226 5871 -11304 -10251 69 18118 14818 -20558 -26139 12452 27343
400 27343 1251 -20689 -20832 108 27217 12202 -29164 -22603 14891 15978 -4585 -10205 -10530
413 -10530 -1993 13716 6175 -12215 -4734 3833 -2442 3451 12121 -632 -8059 -948 1974 11039
427 11039 19153 -5592 -24259 6624 33538 12040 -15646 -15095 6133 30953 22490 -20924 -26787
440 -26787 18034 35113 5510 -16528 -11980 8512 25481 8523 -20259 -6279 20623 6729
452 6729 -11120 1409 10056 1002 -4311 -5365 4598 19196 1615 -27603 -6631 31284 17916
465 17916 -18723 -23350 781 28205 24163 -19533 -35346 10675 39625 7548 -23041 -14536 9317
478 9317 25511 12133 -19484 -14124 21538 19521 -8026 -5929 9374 8537 3713 -343 443 15040
492 15040 14205 -12173 -10488 23136 24672 -5262 -15480 -877 21737 28859 -3027 -32799 -971
505 -971 42381 22171 -21561 -23545 6451 29445 19405 -18114 -26147 11927 26742 -2058 -16654
518 -16654 -2777 6437 6729 -1183 -13472 -2810 14146 -3180 -20565 2444 19477 -3907 -23141
531 -23141 -10291 13296 21972 -2907 -34947 -14484 32303 24846 -19069 -27519 -676 24193 22712
544 22712 -11676 -32857 2670 37671 11207 -23742 -12811 12443 17043 4333 -11338 -5840
556 -5840 14410 6575 -13935 -834 18175 2748 -14767 -6516 7398 15789 6947 -21695 -21089
569 -21089 22192 33876 -10112 -34297 -5281 29427 28338 -8161 -32905 -1043 40412 21205
581 21205 -18206 -12330 15476 24768 16009 -3454 -9095 17829 32513 5833 -7633 16162 25836
594 25836 8436 523 11534 27116 24531 -2584 -11805 25730 46261 9919 -18314 1938 31022
607 31022 34916 12272 -17381 -7183 38539 42712 -4678 -23533 8217 35678 27191 -3297 -16858
620 -16858 10060 33416 9463 -14508 4334 20091 6922 -3308 -1006 3712 11831 4869 -15599
633 -15599 -7132 20997 11669 -21241 -22136 4242 20686 7321 -25625 -29983 11670 29007 -9518
646 -9518 -33242 -7394 17940 14638 -5030 -21870 -10520 23096 22471 -9273 -12092 11848 20247
659 20247 10687 1132 2951 21074 27838 5409 -1428 25708 31863 6866 2993 22852 32552 25091
673 25091 6130 -5080 17921 44684 24151 -10135 -2772 25192 30469 10406 -14473 -7811 28678
686 28678 32762 -10431 -27131 2527 18658 6282 -6561 -11185 -5462 4120 -4976 -17105 -3960
699 -3960 6021 -9836 -18614 -6270 16 -5872 -16003 -23450 -5365 19223 357 -38369 -30305
712 -30305 7644 16417 -4236 -25463 -25392 755 16886 -8804 -30476 -11889 9528 5767 -7292
725 -7292 -17979 -16442 3031 8137 -9434 -9990 5427 -1574 -15405 -6469 7744 6797 -2544 -13239
739 -13239 -8537 15112 13873 -16700 -21157 9004 22710 7209 -14725 -23476 -1187 27567 12508
752 12508 -23161 -17085 13061 14772 -5637 -16896 -7749 12666 13738 -12574 -19384 4892 10825
765 10825 -7402 -8782 2996 3766 -817 -7201 -10132 5704 16669 -4430 -21124 -985 18941
778 18941 10040 -9459 -16640 -492 23410 14115 -17840 -14621 13917 16099 -1749 -8244 -4820
791 -4820 5548 15195 1895 -16178 -5164 12368 5762 -5369 -5430 -1892 3835 1296 -10760 -6136
805 -6136 10482 1488 -16816 -5674 10701 1126 -10677 -9244 -3423 7881 8658 -10936 -18219 2518
819 2518 14698 2489 -10812 -12527 1421 18711 7999 -19428 -12535 13294 11524 -1822 15
832 15 227 -3126 1725 4298 2084 5703 4585 -5231 -1902 7828 4730 -516 -433 231 9476 15034 -6343
849 -6343 -20870 5919 27997 9650 -11866 -7949 4216 12448 9680 -4593 -5427 9268 11312
862 11312 1270 -1906 -1968 897 11632 10476 -3023 -640 5609 -5813 -5439 16023 15593 -8745
876 -8745 -14865 525 12376 9827 -6863 -15328 2730 16362 1551 -14119 -9820 -1171 8559
889 8559 11293 -9159 -22799 -1919 13392 -1873 -11499 -2068 -348 -5862 -5557 -2680 1137 382
903 382 -11141 -11298 5117 6095 -9517 -10472 -3027 -1382 4308 2551 -15411 -15090 10458 12140 -11947
918 -11947 -17103 78 10422 3393 -12221 -13522 6069 12851 -6100 -13523 -285 4181 1421
931 1421 2118 -5654 -9421 5166 8561 -7457 -7240 8653 5900 -7682 -7168 3078 8255 1618 -11234
946 -11234 -4593 14041 6578 -15517 -9299 9129 9421 2586 -4513 -14164 -6154 15126 10924 -12022
960 -12022 -12401 3525 7882 -837 -10732 -7077 8341 7846 -9378 -9804 3654 -327 -7259 2431 4889
975 4889 -3932 -4622 -4586 -7747 3326 12761 -1855 -17127 -6367 10752 10656 -6145 -18791 -2864
989 -2864 21945 9813 -19137 -13764 8975 9179 2016 161 -4878 -4317 5368 2950 -3281 3180 6619
1004 6619 -2418 -5700 1191 6173 4802 -5495 -9962 7567 18397 -5944 -22604 -829 17874
1017 17874 6952 -6167 -9231 -6516 5236 9850 -4195 -11779 -22 6647 1908 -5774 -10642
1030 -10642 -910 11066 1110 -12883 -1899 8783 -4636 -9644 3746 6176 -1440 -3602 -4916
1043 -4916 -1451 7686 4057 -8393 -5287 7555 9568 633 -11133 -10363 12239 22498 -3944 -21481
1057 -21481 271 17896 5323 -7149 -4496 3254 9479 4149 -10063 -6832 9778 9588 -2233
1070 -2233 -5597 -2322 2822 4813 -4681 -7238 9809 11360 -12561 -15408 7903 13943 -1796 -11128
1084 -11128 -6000 5882 11262 -3182 -17125 -3607 14961 9198 -6267 -13301 -7259 10733 14922
1097 14922 -7232 -16363 5624 13688 -2852 -9896 322 6323 5944 -499 -6626 1053 9060 289
1111 289 -6403 3688 10085 3406 -3918 -7672 -186 16851 12015 -13512 -12684 12557 16148 -3098
1125 -3098 -11187 -2488 11559 14181 -4016 -16376 -775 15081 6058 -5732 -5911 -1205 5266 4775
1139 4775 -7265 -6695 8961 5598 -11750 -7331 7518 5321 -5293 -8397 -2627 9019 7536 -11719
1153 -11719 -14897 7069 15437 106 -10791 -8537 3098 14479 5489 -14463 -7781 14709 11120
1166 11120 -6611 -7824 2358 8804 7268 -3368 -7131 5572 8939 -4400 -4955 6742 5666
1179 5666 -2620 -5502 -3627 4798 10231 -4078 -16502 -645 13836 1516 -14003 -11160 1660
1192 1660 10282 1825 -17468 -15103 7318 9594 -8676 -13620 -4899 1063 2405 -5300 -13611 -3797
1206 -3797 6927 -2996 -12349 -3276 2686 -2821 -6062 -5813 -1548 5251 -2799 -15838 -5689 12070
1220 12070 4381 -12469 -11732 -356 8522 5932 -11196 -16058 5004 15792 -2553 -15291 -5969
1233 -5969 6201 8867 -56 -12412 -5981 10843 5953 -9502 -5636 5243 3236 -2392 -4661 -2863
1247 -2863 4481 4155 -9560 -9004 7680 7623 -9202 -12709 -2757 5360 5447 -8854 -19405 -3641 12483
1262 12483 -752 -18138 -12589 431 4059 -2361 -15672 -15314 2728 6092 -10953 -15153 -3831
1275 -3831 15 -3828 -6667 -8801 -3774 2470 -5920 -12554 122 7048 -4539 -11096 -4351 3556
1289 3556 6842 -678 -13368 -5742 13547 9088 -10332 -9782 4310 10003 6120 -5990 -10550 4087
1303 4087 14683 892 -9399 1 6751 3812 647 -2843 -959 7275 4130 -6616 -1258 9320
1317 9320 2336 -6183 -1810 4557 5741 1637 -8290 -6157 10351 10908 -7137 -10494 1733 7033
1331 7033 4542 -3209 -10379 -1676 11637 3399 -11842 -7279 4029 4475 54 -4766 -6201 1519
1345 1519 3576 -5992 -4864 4906 1025 -7869 -4003 2344 2056 602 -4657 -7333 4009 10331 -3833
1360 -3833 -12314 -380 9500 6153 -3628 -10748 -2633 12887 7667 -10228 -7819 6453 6700 -250
1374 -250 -2923 -4992 278 7142 648 -7185 235 4262 -2531 -3878 680 2797 1431 -3804 -8644
1389 -8644 1507 10711 -2080 -14209 -2143 9253 3309 -4574 -8375 -4502 7337 8972 -7184
1402 -7184 -12621 1367 9174 2806 -5317 -8763 -739 9750 2243 -9985 -2327 6997 -775 -5715
1416 -5715 1181 2259 -848 -1378 -3493 -2592 5134 1945 -8494 -4984 5553 5578 -2337 -8747 -7670
1431 -7670 7201 13104 -5043 -16160 420 11066 1754 -5324 -3513 -980 4285 4278 -4394 -5634
1445 -5634 3143 3366 -516 -1305 -1269 436 3072 -2629 -5844 4929 6923 -8239 -9282 5656 6890
1460 6890 -4403 -7617 -4130 2491 6697 -1967 -11895 -5659 5368 3900 -3020 -7913 -6717 3734
1474 3734 7008 -7233 -11637 4122 7278 -6402 -6455 2025 1584 -2242 -2106 -1665 2351 3676 -3148
1489 -3148 -5103 3200 5485 362 -1261 -2321 1215 9731 4725 -10576 -4168 14385 10494 -6182
1503 -6182 -5638 3888 7356 5537 -1194 -3802 3793 7358 1019 -1564 59 -609 3647 7004 -1791
1518 -1791 -4567 4180 2614 -6053 708 9176 329 -7649 -3243 2993 5501 677 -7598 -4613 6770
1533 6770 5717 -4787 -7670 -4108 2530 10512 2141 -14583 -7802 10678 7316 -7058 -5863 2687
1547 2687 3863 764 -2557 -2450 3615 2878 -3157 859 5685 -78 -3601 178 2289 5103 6892
1562 6892 -3597 -9672 4850 14887 606 -10659 -1783 8616 8903 -552 -8879 -1996 9573
1575 9573 5199 -4095 -1684 1515 -138 2800 2128 -4720 -1176 5642 -62 -5348 1844 2877 -3650
1590 -3650 -3226 1382 2889 1695 -4351 -7771 1537 8125 -1206 -7019 -1415 1386 2241 2659 -5003 -8239
1606 -8239 5055 10646 -3006 -9964 -1064 6427 5593 -1156 -6229 -354 7580 1699 -5789 1102 5659
1621 5659 -274 -1429 1358 1823 3518 1892 -5718 -2364 10208 5913 -7844 -6103 4839 7721
1635 7721 1472 -7572 -6894 7051 10840 -5308 -12189 27 7112 2903 -2185 -5564 -3993 4212
1649 4212 3377 -5550 -4001 2962 411 -3706 -1371 -1064 -300 828 -3365 -3325 5263 3087 -8192 -6736
1665 -6736 4245 6799 2236 -4067 -8660 -436 11407 4277 -8732 -5072 5627 6543 941 -6084
1679 -6084 -5955 6358 10798 -2592 -8950 1426 6182 864 -1520 -520 1826 3404 -1620 -5581
1693 -5581 3058 7273 -3174 -7010 2428 6094 655 -4487 -6613 -266 10255 4411 -11313 -8967
1707 -8967 5394 7725 -226 -6134 -5990 2772 7318 -2086 -8274 -131 4375 -200 -610 -90 -3623
1722 -3623 -1168 2710 -636 -1112 3465 -92 -5281 -452 4494 2737 -759 -3969 -1941 7093 5336
1737 5336 -7473 -6704 7092 8020 -906 -4525 -4236 713 8457 4364 -7414 -5074 5398 4453 -2319
1752 -2319 -4117 -928 4394 3517 -5431 -5314 4482 2731 -6651 -1482 5891 39 -6011 -4313 -648
1767 -648 4028 4985 -4304 -9435 484 7300 1438 -5982 -5812 1903 9509 1604 -12120 -5635 10355
1782 10355 7166 -4931 -4356 299 1096 3246 1709 -2776 -41 4005 -234 -2565 1684 3499 1436
1797 1436 -1157 -3230 2383 8881 -1791 -11566 798 13133 3494 -8943 -5788 1592 6484 4393
1811 4393 -5409 -8110 2253 7547 294 -5924 -5434 1276 7418 684 -9335 -3248 7489 538
1825 538 -6852 620 4593 -1840 -3581 -816 1135 3161 954 -4978 -2364 5100 3894 -1980 -4593
1840 -4593 -2695 5750 9384 -3749 -12584 954 12783 2875 -7370 -3382 2504 4359 2605 -3307
1854 -3307 -3892 2749 4787 -402 -2140 -1372 214 3139 266 -4345 1081 5601 -3915 -7449 4496
1869 4496 7590 -3763 -7507 -415 4389 2925 -3311 -7184 -275 6770 1874 -5997 -5635 -573 5442
1884 5442 5912 -5090 -10094 2717 9178 -1781 -6497 1080 3006 -303 -853 98 816 1944 -726
1899 -726 -1601 3483 3559 -2588 -2805 1596 3046 4710 1721 -7320 -4029 10200 8007 -6766 -7196 3308
1915 3308 7683 2674 -4791 -6038 2614 8073 78 -5699 -1715 1581 1686 1721 -2872 -3974 2646 2780
1931 2780 -5447 -3082 5782 1408 -6112 -3474 3178 4060 -1123 -7413 -3573 7549 6239 -6066 -8105
1946 -8105 691 5467 4626 -1526 -8319 -2644 9858 5662 -7438 -4982 5000 5644 9 -3632 -2152
1961 -2152 3991 5000 -2016 -2929 3604 2681 -2088 -485 1552 2436 2645 -1347 -5597 1651 9424 334
1977 334 -8695 -2273 6221 5869 -1594 -8274 -3172 8694 6804 -6265 -7582 1685 4885 2424 -1529
1992 -1529 -5317 -637 5993 1152 -6053 -932 4649 584 -2344 -795 1082 2095 -122 -3720 805
2007 805 7231 837 -6642 -1772 5320 4460 777 -4039 -4072 4942 8582 -1493 -7199 596 6901 4024
2023 4024 -1295 -4858 -1554 6653 4318 -4110 -3016 2873 1571 -965 416 -298 -108 1062 -1540
2038 -1540 -2527 2644 2159 -5296 -3813 3382 2677 -1976 -5033 -4502 2695 6616 -2537 -9803 -1812 5558
2054 5558 1884 -3626 -5195 -2592 3997 4447 -4258 -6277 1804 3784 -287 -840 -1133 -1124 1666 1027 -1832
2071 -1832 2049 3467 -2640 -3454 3607 4489 168 -2488 -2578 2252 7710 1713 -7660 -2658 7444 5828
2087 5828 -2114 -5058 -2669 5042 7278 -2375 -7680 938 6330 611 -3595 -2182 9 2664 857
2102 857 -4143 -1687 4178 -730 -5383 33 3852 -52 -3455 -3294 -374 5227 2549 -7249 -5570
2117 -5570 5042 5238 -2213 -4928 -2161 2609 5407 -414 -7146 -899 5940 2069 -3093 -2093 -99
2132 -99 2207 2811 -1761 -3140 2571 2946 -2150 -951 1586 96 -180 419 -908 1066 2970 -2439
2148 -2439 -4787 2278 5206 -635 -4344 -2956 1001 5551 1900 -6916 -4131 5790 4281 -3094 -4227
2163 -4227 -1020 2874 4562 -801 -6021 -414 4746 427 -2060 900 828 -417 -15 -187 1802 3401
2179 3401 -1147 -4773 2888 7148 -632 -5142 -679 4155 5240 1823 -4877 -3923 5403 6188 -1634
2194 -1634 -3905 -459 2159 3535 679 -4106 -1362 3477 650 -2149 687 280 -3001 -312 1718
2209 1718 -305 -421 -1335 -3539 -127 3766 -343 -4711 -2194 730 2775 1616 -4366 -6196 2933
2224 2933 6964 -2017 -6492 -797 2706 2500 631 -3563 -2267 3960 3200 -2192 -1672 1325 1105 1158
2240 1158 648 -1116 1610 2670 -2828 -2193 5559 3764 -4232 -2620 3472 3591 507 -2904 -3268 2396
2256 2396 5404 -580 -5110 -1147 2418 2556 976 -3925 -4453 3305 4458 -3961 -4714 1771 2059 -1449
2272 -1449 -1146 -1496 -1296 521 -500 -1771 352 400 -2535 -1398 837 89 749 205 -4032 -1563 5652
2289 5652 2273 -6618 -2889 5021 4497 -893 -3719 -2376 3756 5236 -1215 -3505 855 3143 1376
2304 1376 1233 -1555 -1440 3614 2998 -3263 -1139 4645 901 -3955 407 3974 1125 -2878 -3382 990
2320 990 5098 277 -6435 -2317 4418 2786 -1861 -3179 -4268 637 6247 179 -7675 -3212 4117
2335 4117 2022 -2666 -3068 -1034 1172 597 -2737 -643 2318 -1321 -3197 1588 2451 -1388 -1784 -1026
2351 -1026 -1416 2800 4683 -3150 -6925 1629 6726 2039 -4450 -4765 1919 6799 427 -6542 -1654
2366 -1654 4914 1978 -1326 -1253 -1941 28 3621 70 -4457 230 3612 -1401 -3306 157 2212 349
2382 349 -3338 -3398 2424 4830 -2853 -6521 1267 5140 -260 -3279 -2305 -688 3349 3458 -3790 -5784
2398 -5784 2668 5325 -694 -4591 -2178 3498 4590 -1918 -6043 1166 5902 -591 -3314 1117 2037
2413 2037 -325 542 74 -788 2633 1631 -2976 -1659 3324 2496 -1736 -2830 -265 4528 2797 -5836
2429 -5836 -5953 4837 6405 -2987 -5479 -1005 1881 2593 502 -4369 -3040 3147 2858 -2463 -3288 -873
2445 -873 1751 1998 -1281 -2763 2149 2157 -3624 -1604 5636 3232 -3784 -2624 1664 3573 3559 -724 -4410
2462 -4410 1119 6337 2554 -2920 -2660 2069 6432 3950 -4840 -4166 6227 6904 -2288 -2917 2679 3075
2478 3075 738 -191 -733 1655 3495 -368 -2688 1494 3069 -274 -2044 -1407 1010 4781 192 -7545
2494 -7545 -3158 7058 3727 -5859 -5315 1152 3573 1399 -4198 -5076 1784 4888 -780 -4319 -1731
2509 -1731 1193 2591 763 -4195 -1946 5152 2381 -5171 -2246 4624 2489 -2129 -1987 892 3351
2524 3351 2072 -2991 -1893 4852 4282 -1811 -2808 461 3510 4801 3 -6131 -445 8173 3475
2539 3475 -5365 -2467 3704 4399 619 -3804 -2573 3583 4525 -1743 -2919 1083 1167 -424 -183 -1315
2555 -1315 -14 2835 -1149 -5385 -61 5119 -668 -5292 -1966 2511 2689 -1453 -5762 -1624 5842
2570 5842 2346 -5099 -3928 1673 2973 1353 -1938 -4384 245 5331 285 -4814 -735 3219 1563
2585 1563 -690 -1833 -475 2509 845 -3075 -185 3812 -485 -3390 324 2204 1076 -230 -2689
2600 -2689 -2703 3097 4122 -2897 -5303 117 3168 1680 -2415 -4836 -418 5249 713 -5991 -2246
2615 -2246 2694 400 -1442 -886 -1177 403 1858 -1811 -2460 2246 2241 -1919 -1457 1234 1967 1679 -1620
2632 -1620 -2911 3098 5948 -1142 -4926 1821 5203 1844 -625 -1736 323 4650 3344 -2616 -1652
2647 -1652 3640 3686 1282 -816 -952 1864 4594 686 -2511 2089 4246 -1129 -1855 2048 2419 967
2663 967 -389 -1873 158 3354 708 -3379 -27 2823 1432 -285 -2705 -2838 2919 5136 -2830
2678 -2830 -5549 1293 4053 -130 -2129 -1378 177 2410 228 -3521 -1251 2678 462 -1329 104
2693 104 -369 -251 1188 -873 -1937 2768 2774 -3555 -3065 2582 2897 -685 -1759 -982 2237 3685 -1393
2710 -1393 -4026 944 4319 842 -1089 -1120 -1471 2405 3977 -1576 -3293 2622 3133 -750 -676 1114
2726 1114 1215 1322 541 -847 1615 1900 -1687 -460 4013 2123 -1258 -377 193 643 3250 1550 -3225
2743 -3225 -874 4148 1663 -2193 -1416 484 2232 2307 -2244 -2882 1462 1686 -1663 -570 970 -1740
2759 -1740 -1425 745 -1401 -2070 737 -368 -3041 -420 383 -2386 -2474 -811 -163 1123 -1388 -5051
2775 -5051 -1876 3556 408 -3647 -1964 -216 -245 830 -364 -3459 -686 3113 -111 -3069 -615
2790 -615 981 1276 784 -1636 -615 2604 311 -2643 1023 3847 -616 -2203 782 1381 1006 881
2806 881 -1502 -1259 3302 2780 -2692 -2703 812 2365 2088 -1206 -4130 181 4468 -170 -4064 94
2822 94 2077 -821 -1230 -925 -1506 367 632 -2552 -1546 1295 -240 -2605 -806 743 527 673 -2499
2839 -2499 -3408 2006 3762 -2334 -3616 984 2185 335 -485 -2391 -619 3861 2423 -2774 -1509
2854 -1509 1968 1697 880 160 -1291 1447 3470 -531 -2097 2439 3025 -732 -317 1641 1363 1022 -298
2871 -298 -1532 1532 4391 -6 -3717 -100 2673 1342 -214 -2262 -2073 2872 3030 -3512 -3534 1864
2887 1864 2101 -919 -1460 -1747 -228 1995 -274 -3876 -201 2154 -1537 -2188 83 192 -78 -97 -2299
2904 -2299 -732 3239 453 -4038 -1135 2753 1304 -735 -2103 -1730 2333 4005 -1795 -4107 1688
2919 1688 4007 734 -1568 -1000 501 3518 2032 -3224 -1053 3465 1372 -1827 -491 1007 1328
2934 1328 1516 -692 -1494 2903 3027 -2826 -2697 2924 2670 -477 -2304 -1590 1603 4110 -1059 -4944
2950 -4944 505 5149 784 -2531 -2075 106 3489 2694 -3080 -3459 2922 3381 -1373 -1788 707 1667
2966 1667 1757 -138 -2229 1582 3905 -945 -2378 1799 3192 160 -921 -1506 545 4414 1780 -4769
2982 -4769 -2497 4265 3085 -1566 -2904 -1031 2658 3232 -2216 -4911 1022 3851 -775 -3168 -1141
2997 -1141 475 1062 -150 -3542 -1678 3253 659 -4214 -1852 2249 1318 -1440 -2504 -1592 2835 2769
3013 2769 -3591 -3982 2498 3812 -577 -2178 -1137 1152 3660 751 -4009 -301 5241 1898 -2674
3028 -2674 -1086 1516 3293 2128 -1984 -2303 3736 4364 -1596 -1867 2146 2730 836 -319 -1228 1360
3044 1360 3725 -261 -3671 974 4265 116 -2859 -1743 717 3562 910 -4594 -2678 4338 2893
3059 2893 -3739 -3487 360 2006 1403 -1732 -4343 320 3385 -1079 -3943 -784 789 18 -590 -2071
3075 -2071 -1567 2158 601 -3456 -827 3086 510 -2898 -1344 768 2486 1984 -2882 -3447 2777 4720
3091 4720 -1031 -2953 -414 2089 3397 1147 -3896 -2000 4294 2471 -2925 -1516 1686 1539 28
3106 28 -1454 -1171 1951 1923 -2710 -1948 2583 1652 -1924 -2027 -587 923 2215 -1416 -4410 283 4703
3123 4703 393 -4066 -1533 1540 2498 -42 -3439 -1632 4078 2543 -3175 -1842 1923 1062 284 -67
3139 -67 -1489 106 3119 10 -2790 1096 3300 684 -1639 -516 748 2464 514 -3161 191
3154 191 4223 969 -3281 -661 1674 1146 1422 -788 -2597 778 3866 -818 -3465 77 2331 1707
3170 1707 -1145 -3383 -353 3755 787 -3973 -704 2683 -360 -1720 -58 -20 -10 1542 -986 -2514
3186 -2514 1130 2254 -1640 -2089 368 1953 1767 -1713 -3551 1775 5028 -598 -4201 390 3311
3201 3311 235 -222 -132 -666 1346 2971 -725 -1857 1019 2117 1230 345 -1142 387 2030 -554
3217 -554 -2167 2118 2912 -2213 -2717 2177 1560 -695 -589 -1020 -1021 1654 991 -2484 -2172 583 1912 989
3235 989 -2479 -4223 457 3485 -1700 -4200 748 1458 -2311 -1641 614 -786 -1167 -220 -1124 -737 525
3252 525 -1071 -1806 -433 196 8 -274 -2898 -2211 3326 2788 -3916 -3274 2618 1923 -1834 -875 17 -54
3270 -54 734 206 -1293 -483 765 176 650 59 -1307 736 2200 -1610 -1756 2912 1503 -2989 -391
3287 -391 2826 648 -1037 -99 413 966 842 -884 -830 1124 751 -148 250 -624 -1305 2296 1566 -3869
3305 -3869 -1917 3682 1103 -3187 -1792 582 152 -471 -928 -1157 -21 -339 -2382 -481 690 -1410
3321 -1410 -1382 -720 -2290 -1469 1634 -1269 -4862 -521 2744 -1766 -4249 -1025 1070 283 -1432 -3312
3337 -3312 -1528 1246 -765 -2248 -292 -752 -1751 482 521 -2919 -801 2540 -199 -2650 618 1654
3353 1654 -767 -654 863 1718 2119 -950 -1683 2063 4017 631 -713 1145 963 1629 3217 231
3369 231 -2130 2277 4408 -77 -1931 994 2373 1223 31 -1047 1020 2055 -1160 -1810 1893
3384 1893 1884 -1740 -1138 60 -498 -74 482 -2601 -2357 1805 896 -3473 -2537 248 963 124 -2880 -3335
3402 -3335 992 2436 -2158 -2753 726 333 -418 403 -603 -1586 1777 2344 -1419 -929 1792 1231 -188
3419 -188 406 686 2011 1789 -1403 -1508 3483 3453 -1053 -809 1579 1624 1155 405 -1587 251 4054 1622
3437 1622 -2791 -1350 1677 2044 86 -2015 -1429 2006 1961 -3108 -2435 1895 1255 -1979 -1137 -563 -392
3454 -392 280 -797 -2584 25 1728 -1584 -2909 -325 994 779 -457 -2894 -1052 3396 1502 -3341
3470 -3341 -1506 2693 1549 -343 -683 -1281 1041 3248 407 -1844 805 2213 476 19 -51 145
3486 145 2458 1444 -2149 -884 3722 1723 -1885 -295 2090 1892 316 -1594 -1278 2781 2913 -2214
3502 -2214 -3291 965 2107 206 -1137 -1922 -103 2882 324 -4512 -1348 2865 1120 -1846 -1556
3517 -1556 -604 841 555 -2503 -2079 2132 1171 -2929 -2331 972 951 -241 -1001 -2313 604 3124 -581
3534 -581 -3796 -420 3348 1563 -1143 -2129 -539 3212 2303 -2653 -1968 2329 1627 -969 -800 -180 634
3551 634 1654 -109 -2595 472 2740 -879 -2547 -297 1384 1002 -965 -2870 -768 3413 530
3566 530 -3869 -2024 1881 1337 -1139 -1968 -1720 1285 2594 -1611 -3682 209 2785 293 -1939 -1422
3582 -1422 542 2356 515 -3109 -726 3387 952 -2202 -87 1621 1018 598 -606 -681 2068 2621
3598 2621 -1058 -1628 1731 2333 680 -655 -1531 1244 3578 203 -3422 146 3646 564 -1767 -947
3614 -947 -10 1377 1695 -1916 -2164 1000 1795 -865 -1457 -637 -18 830 -467 -2386 15 2063 -1249
3631 -1249 -3178 241 1884 -689 -1661 -1492 -426 1755 187 -2964 -1940 2237 1575 -1037 -1847 -967
3647 -967 1373 2196 -1064 -3259 1055 2637 -765 -2191 498 946 618 50 -979 -63 2308 285
3663 285 -2195 326 2294 471 -824 -765 -183 1866 2243 -2310 -2783 2258 2454 -1046 -1453 -184 796
3680 796 1627 43 -2418 -317 2210 -74 -1756 -124 259 344 908 -974 -1378 1530 1615 -1923 -876
3697 -876 2311 1504 -401 -328 -303 1231 2534 -226 -2420 440 3197 941 -1047 -478 686 2348 1441
3714 1441 -1926 -1584 2683 2138 -1578 -1067 507 836 1223 -585 -2060 250 2318 -891 -2496 590
3730 590 1326 -806 -974 -1283 -526 1261 -70 -3045 -1353 1894 64 -2287 -1364 -331 445 723 -2113
3747 -2113 -2493 1020 2087 -1238 -1815 11 343 711 324 -1573 -422 1875 715 -1287 146 1019
3763 1019 -115 519 590 -183 620 1429 -657 -710 2023 1694 -1233 -545 685 971 1290 -9 -1955 977
3781 977 2708 -85 -1897 131 1015 300 880 -748 -1416 1074 1093 -1327 -1099 781 -5 -1211 -140
3798 -140 -191 25 308 -1484 -1083 1353 720 -2173 -1167 846 399 -545 -154 -1799 -370 1990 -227
3815 -227 -2158 -901 1126 465 310 -700 -1027 1029 1382 -902 -803 1665 162 -1533 360 550 -353
3832 -353 260 -53 -1243 431 1391 -545 -1300 482 789 547 81 -1348 -563 2194 980 -2440 -618
3849 -618 1833 721 -308 -382 -866 387 1733 -293 -1874 761 1407 -324 -257 208 -214 944 376
3866 376 -1630 -357 2375 -196 -2254 413 1580 191 -439 -994 -415 1423 1414 -1732 -1485 1165 1158 145
3884 145 -491 -1538 -316 2101 144 -2378 -566 1466 -138 -1160 239 -101 -389 355 -432 -442 1045
3901 1045 -341 -1662 -94 1067 -46 -402 -221 -1381 832 1990 -846 -2645 915 2365 81
3916 81 -1063 -667 293 1885 1034 -1214 -342 1859 618 -153 837 573 28 981 755 -510 1535 2052
3934 2052 -1058 -905 2265 1968 -267 -516 -218 1335 2241 -603 -1987 1264 2250 -66 -1108 -494 -518
3951 -518 846 863 -1658 -2140 1020 1310 -1636 -1733 -134 181 -197 -1379 -2292 -6 1136 -1866 -2419 886
3969 886 371 -1527 -941 -655 -700 592 288 -2678 -1301 2199 1318 -1693 -1505 264 2035 1721 -1341
3986 -1341 -2249 2015 3113 -437 -1231 1007 1055 1209 1122 -290 -192 2273 1378 -1013 158 1874 989 -347
4004 -347 -351 130 1748 1071 -2577 -1730 2751 1870 -1797 -1902 -314 820 1001 -686 -3036 -709 1829
4021 1829 278 -2400 -1824 -466 700 812 -1913 -2458 924 1025 -2119 -1083 1517 -102 -1485 -433
4037 -433 307 762 861 -737 -1581 802 2305 -16 -1325 -8 960 2475 958 -2688 -1390 3336 2316
4054 2316 -1771 -1120 1423 1281 788 -125 -882 618 1981 -306 -1366 173 627 -26 -221 -903 -493
4071 -493 1113 -16 -3196 -421 2475 -273 -3131 -1583 778 871 -595 -2423 -1838 1364 1111 -1858
4087 -1858 -2428 -292 516 1019 127 -2578 -1116 2269 804 -2502 -512 1784 732 -851 -671 147
4103 147 1191 1195 -816 -108 2252 561 -1111 -113 740 828 1804 27 -2214 672 3376 89 -2872
4120 -2872 -367 2237 1656 -540 -2755 -430 2516 1525 -2131 -1667 479 284 264 407 -1448 -882 1859
4137 1859 -328 -2444 -38 2029 -539 -2280 -431 776 631 -1075 -2372 756 2847 -476 -3000
4152 -3000 -645 1334 827 750 -509 -2158 612 3055 -162 -2442 428 2284 1093 -626 -1608 -1
4168 -1 2064 573 -1157 504 1035 -1006 -959 1110 749 46 563 -732 -1657 1398 1692 -1601 -2021 463
4186 463 1470 613 -1957 -2899 442 2827 -782 -2936 -573 1062 -282 -35 -307 -1340 -231 1401
4202 1401 -750 -1737 443 641 -505 -545 -178 306 522 -1224 -1454 2195 2252 -1981 -2367 1333 1680 -365
4220 -365 -210 -602 -53 2029 890 -1790 -977 1471 1712 553 -1006 -1783 1051 2442 -973 -1873 1149
4237 1149 1288 -1541 -660 517 -356 -522 214 -512 -719 630 -789 -1181 -54 914 139 -965 -2085
4254 -2085 -1100 2278 1978 -2776 -2419 1884 1383 -817 -998 -321 319 1501 495 -2003 -633 1393 1240
4271 1240 -10 -403 -1158 342 1537 -808 -1082 1785 614 -1994 -674 1522 117 -772 -51 50
4287 50 686 767 -1645 -1557 448 1521 130 -945 -1810 -1294 1909 980 -3022 -2188 1459 391 -1524 -921
4305 -921 -495 -479 508 -3 -1211 -229 -367 -1159 207 644 -475 -832 313 -792 -116 2024 162 -2207
4323 -2207 458 2985 360 -1668 -353 715 1648 1599 -546 -1306 1046 1494 527 794 389 -302 1158
4340 1158 1433 -715 -157 1868 438 -1000 946 867 -1061 -461 465 712 1109 -435 -2243 -128 1637
4357 1637 -4 -1529 -575 -658 -321 640 -1115 -2555 280 1762 -837 -2102 -743 -173 449 132 -759
4374 -759 -1013 344 -831 -1125 591 587 -1434 -632 661 -196 121 644 -1016 -790 1870 1159 -1617 -1034
4392 -1034 1073 1301 1119 -679 -1797 749 2364 -244 -1448 55 821 471 1081 -506 -1300 604
4408 604 1965 -326 -546 347 -390 -352 604 121 -58 445 -1016 -865 1247 1214 -1711 -1380 705 875 478
4427 478 -469 -1979 -714 2616 1303 -2502 -1463 483 1124 1150 -581 -2003 -138 1913 1 -1226
4443 -1226 238 126 -732 705 429 -729 -440 -170 -370 474 1315 -1378 -1873 654 1295 677 -306 -1549
4461 -1549 -1092 2022 937 -2377 -2016 577 859 -102 -166 -1750 -696 1261 85 -1302 -255 13 -841
4478 -841 27 329 -561 -108 206 -717 90 1680 -174 -1778 575 1605 118 -545 -863 -540 1712 2054
4496 2054 -1363 -1746 1113 1460 265 -272 -744 -248 1724 878 -1545 -588 1112 389 -282 347 -346 -182
4514 -182 783 -365 -706 997 366 -1579 -550 1168 -189 -609 -627 -1094 815 1645 -1461 -2543 440
4531 440 2152 15 -1197 -1538 -509 1639 1317 -2093 -1884 1157 1213 -438 -532 -495 -104 1268 381 -874
4549 -874 309 1158 -735 -147 1596 1006 -404 -476 -168 793 2156 -207 -2417 3 2454 1314 -865
4566 -865 -1395 -492 1632 2618 -967 -2831 834 2037 419 -581 -847 -787 946 1439 -1110 -1302 626
4583 626 -221 -1107 572 224 -958 -608 -395 -240 1293 334 -2533 -1368 1924 1282 -1111 -1668 -585
4600 -585 693 2434 -313 -2869 -425 2487 1021 -904 -1132 -491 1180 1769 -789 -1552 838 1114
4616 1114 -619 462 1012 -315 -355 489 34 748 892 -968 -1277 1390 1469 -622 -1253 -939 388 2078
4634 2078 225 -2734 -730 2400 762 -1614 -1313 -485 371 1073 -564 -2233 -450 1467 -166 -1005
4650 -1005 -247 -645 71 140 -1035 -699 888 -389 -1976 329 1900 -789 -1562 -335 640 1378 429
4667 429 -1489 -1028 2151 1650 -834 -1268 -103 1110 2077 187 -2253 -244 2857 927 -1111 -14
4683 -14 947 7 1041 576 -408 574 298 -509 409 1255 -681 -1058 262 187 499 686 -1804 -2431 1056
4702 1056 2349 -1285 -3006 -730 1002 977 -320 -2617 -1390 1224 1099 -1160 -1143 -561 11 1427 539
4719 539 -1755 -621 1415 -239 -661 622 765 -702 -507 1245 1185 672 -885 -1058 1119 2428 -15
4736 -15 -1476 -253 850 1388 1198 -1440 -2385 1527 3120 -646 -2109 -156 859 885 272 -1014 -519
4753 -519 994 46 -502 408 66 -1180 -95 635 -197 -345 159 -1144 -319 1672 618 -2031 -1135 1330
4771 1330 1214 189 -1576 -1624 1079 2228 -416 -1621 252 583 555 1008 -905 -1534 1061 2011 -78
4788 -78 -921 333 459 -219 668 -274 -187 40 -739 -194 1837 782 -1593 -403 1298 502 -446 -507 -1124
4807 -1124 -25 2092 586 -2328 -1590 1216 1361 -140 -1661 -1658 720 1785 -735 -1387 338 -217 -223
4824 -223 494 159 -934 -173 628 -518 154 564 -803 -1158 840 1161 286 -727 -1482 -100 2453 832
4842 832 -2154 -950 1486 1036 333 -287 -1050 82 1587 461 -1296 -387 733 597 630 -47 -903 272
4860 272 1102 -386 60 779 -730 -1285 822 1711 -543 -658 -21 -61 1186 518 -1544 -1327 1276 1429
4878 1429 249 -590 -1383 -504 2517 844 -2099 -726 1355 635 -260 119 -495 -399 1018 480 -119 254
4896 254 -88 -603 734 1434 -676 -386 293 17 1016 1457 -859 -1668 1179 2097 -20 -1521 -920 503
4914 503 1522 572 -1563 -1118 1045 1142 -25 105 -1237 -847 901 518 -1177 -603 808 -388 -499
4931 -499 651 -103 -951 -165 61 788 373 -915 -1708 851 2354 -259 -1235 -608 4 1340 1533 -879
4949 -879 -1730 771 2118 102 -1035 -267 728 1641 553 -844 -510 682 146 39 1189 189 -1037
4966 -1037 191 1111 191 471 93 -892 -103 1651 732 -1143 -741 325 1568 1223 -1139 -2009 767
4983 767 1969 -461 -1306 -224 -137 309 963 -766 -1403 204 1065 -121 -324 128 -351 212 541 -130
5001 -130 81 207 -1094 -156 2002 1018 -1765 -746 1092 750 563 -296 -1408 107 1945 776 -1121
5018 -1121 -1006 -212 1144 1417 -542 -1485 811 1506 -395 -244 488 -297 -716 835 655 -748 -84 74
5036 74 81 1076 559 -879 -609 416 884 846 165 -2069 -612 2438 1251 -1842 -1141 1282 1188 300 -583
5055 -583 -1011 127 1544 433 -691 -69 -81 761 1201 -188 -701 522 347 -703 229 1642 -382
5072 -382 -1421 773 1579 20 -675 -942 87 1596 1221 -1457 -1470 620 1279 1141 -292 -2009 -597
5089 -597 2287 1123 -1671 -793 806 404 -107 -223 -774 -192 823 259 261 734 -670 -966 716 797 152
5108 152 -27 -528 -798 715 2139 -586 -2135 614 1987 741 -805 -1344 -89 1962 1401 -1400
5124 -1400 -882 273 331 690 452 -658 -721 1251 755 -1040 191 797 -226 -328 732 139 -444 -638
5142 -638 -464 593 1390 -933 -1713 -57 1201 479 -189 -1233 -1022 623 1694 -1422 -2329 189 1657
5159 1657 258 -613 -941 -366 896 474 -692 -303 447 -305 101 1147 -248 -387 365 279 -23 771
5177 771 314 -1265 -301 1775 917 -684 -976 -555 1067 1982 -940 -2185 41 1451 46 -467 -480
5194 -480 -935 401 1112 -740 -1501 159 686 -13 97 -440 -663 12 258 -305 567 198 -1509 -768 1074
5213 1074 558 -786 -1197 -597 639 1283 -367 -2059 -785 1946 997 -467 -1087 -835 1176 1684 -450
5230 -450 -1512 462 982 -119 36 -94 -511 344 902 46 10 307 -704 -633 922 999 -410 -610 -458
5249 -458 161 1460 373 -1853 -949 1725 1161 -1412 -1003 -322 544 1145 -243 -1837 -429 1038 598
5266 598 -246 -351 -957 -154 957 -259 -653 74 189 -761 239 941 -774 -913 -177 338 487 431 -1182
5285 -1182 -1032 918 1449 -701 -1215 -585 713 1452 361 -1379 -226 1811 504 -575 -607 -79 296
5302 296 519 262 -570 326 508 -315 173 983 84 -946 -123 453 141 246 -468 -1256 698 1020 -706
5321 -706 -1537 181 624 907 203 -1645 -1095 1014 968 -980 -1009 -515 -42 498 325 -1096 -670 772 431
5340 431 -418 207 -90 -793 119 803 -76 -157 -239 -1055 216 1739 124 -1211 -482 951 977 300 -1121
5359 -1121 -1393 1127 1689 -510 -1409 -536 376 660 270 -801 -1034 602 521 -433 -92 202 -812 -224
5377 -224 522 -32 -8 -308 -710 92 1355 -197 -1840 -538 913 807 63 -582 -1235 473 1779 -36
5395 -36 -1417 -585 488 594 317 -451 -832 689 1511 -153 -122 139 24 15 830 303 -293 270 9 -411
5415 -411 1040 688 -899 -848 419 690 88 -701 -1183 -93 1725 79 -1937 -707 1031 410 -116
5432 -116 -591 -1143 167 927 -558 -1074 -98 235 -78 84 -408 -655 328 140 -658 8 780 -964 -961 830
5452 830 886 -107 -156 -538 138 1246 770 -1127 -699 1304 935 323 -351 -926 195 1869 659 -1636
5470 -1636 -169 619 383 57 159 -666 -163 1048 -121 -453 221 -214 -479 367 442 -342 -319 -566 -481 846
5490 846 1124 -1114 -1539 604 1349 74 -816 -827 16 1693 557 -1531 -906 861 491 104 -251 -936
5508 -936 -449 1018 103 -994 204 578 -419 217 800 81 -439 -150 258 600 659 -672 -1324 627 1112
5527 1112 -51 -312 -517 -361 1070 1570 -1119 -1362 466 1406 -59 -518 -538 -123 699 349 -432 -235
5545 -235 225 -247 -131 396 -548 -857 166 45 -345 508 530 -1040 -205 983 312 -610 -538 48 1343
5564 1343 1044 -1002 -1354 814 1219 -202 -355 -19 -176 910 1051 -457 -789 542 588 -59 241 383
5582 383 -342 -101 145 -144 415 -121 -1298 -279 1155 -187 -1086 -97 22 205 603 -291 -1240 -277 1236
5601 1236 189 -676 -593 -249 548 650 -1083 -1563 622 518 -523 -601 126 -334 -3 364 -312 -260 340
5620 340 -61 -103 704 461 -333 -270 -198 192 948 -183 -1578 -437 2074 268 -982 -494 222 822 568
5639 568 -67 -879 -72 1064 134 -737 -59 -529 476 690 -418 -792 110 194 -718 556 918 -767 -1329
5658 -1329 381 767 87 -85 -884 -264 1073 308 -731 -274 -505 103 1205 131 -1934 -476 1503
5675 1503 381 -945 -201 -13 57 301 140 -699 -92 214 -7 295 373 -448 -171 202 -218 -100 409 -639
5695 -639 -1102 715 1293 -1035 -1155 351 738 207 -315 -823 -184 840 351 -623 -355 -196 -432 528 -15
5714 -15 -1243 -711 813 -381 -562 527 39 -1014 -301 339 66 -316 -934 -533 959 824 -860 -698
5732 -698 543 257 304 271 -578 -923 876 1301 -783 -781 398 1073 123 -350 -555 -247 834 228 -137 364
5752 364 -231 -532 175 1038 -383 -530 292 -783 -580 715 88 -1319 -314 931 595 -436 -965 -814
5770 -814 859 918 -1011 -1262 232 337 -501 134 -322 -1157 423 703 -650 -592 368 -147 -4 365 -350
5789 -350 17 401 -262 163 1111 400 -1084 229 1029 246 -472 47 -247 145 1070 104 -1082 85 1167
5808 1167 740 363 -758 -676 891 1100 -473 -386 607 58 -514 533 245 -390 199 547 -175 231 463
5827 463 -336 -608 470 223 -227 -376 -876 210 1470 -43 -1696 -451 1404 111 -583 179 -337
5844 -337 106 885 261 -480 94 815 116 123 43 -104 -83 384 -80 140 1067 -320 -843 1043 1214 -325
5864 -325 -794 -133 122 555 588 -1013 -455 907 731 -364 -252 -245 182 1005 370 -1514 -651 1068 84
5883 84 -900 225 -108 -303 -10 -58 -420 80 167 -487 76 597 -290 -398 -162 -376 751 786 -884 -1135
5903 -1135 889 1330 -197 -1189 -63 822 884 110 -1056 -584 1252 450 -223 -260 -239 -107 691 24 -771
5922 -771 78 556 -328 -227 824 230 -663 -49 -11 429 309 -714 -1235 305 1066 -318 -908 -609 -12
5941 -12 254 770 -1024 -1046 561 962 -363 -865 -434 91 157 -152 -549 88 255 -399 -432 531 80 -552
5961 -552 -102 461 6 437 274 -753 -166 1203 654 -618 -330 265 989 765 -944 -1122 559 1080
5979 1080 -194 -822 163 208 252 370 -539 -699 511 707 -631 -78 101 -13 -385 43 -356 281 280 -865
5999 -865 -254 839 635 -965 -929 93 596 154 -371 -973 -37 1429 176 -1050 -393 220 614 508
6017 508 -421 -538 870 1035 -292 -632 686 131 82 428 472 149 635 -6 -186 831 866 -148 -788
6036 -788 296 505 863 161 -1089 -449 1734 910 -1094 -686 376 755 153 -112 -1052 1 1072 188
6054 188 -607 -187 -18 301 313 -136 -760 80 160 -614 -199 831 -220 -627 45 275 279 -298 -616 -410 1162
6075 1162 1024 -914 -696 114 211 702 274 -759 -471 1341 496 -841 -102 530 47 566 248 -468 189
6094 189 557 -7 -196 289 7 -314 -101 474 6 414 -192 -492 176 1096 -64 -980 117 965 -19
6113 -19 -105 -772 -290 1125 944 -860 -655 618 141 253 -120 -593 35 962 180 -489 262 599 -226 -254
6133 -254 604 -18 -60 176 -282 557 803 -113 -1018 93 632 345 -207 -809 -635 655 1025 -424 -808
6152 -808 94 452 120 9 -490 -597 537 558 -545 -468 155 -261 -149 241 0 -258 345 -188 -316 575
6172 575 -51 -864 -180 783 216 111 -171 -582 344 1464 35 -1111 211 871 627 178 -85 -562 666
6191 666 850 -192 -343 566 409 121 813 163 -232 310 612 100 292 527 -367 -192 769 383 -108 -231
6211 -231 -279 45 897 289 -1127 -369 911 273 -503 -160 -716 -345 842 -288 -1108 -208 318 -511 -88
6230 -88 -350 -909 -61 34 -391 -313 83 -307 -475 466 317 -555 -555 90 -31 299 89 -895 -535 663 200
6251 200 -157 -364 -235 164 552 81 -778 -71 941 43 -296 440 69 -747 390 488 -283 -4 -54 -158
6271 -158 324 356 -858 -711 512 227 111 345 -853 -593 678 698 -412 -617 280 163 437 140 -424
6290 -424 -384 883 405 -444 263 -98 -131 462 14 -791 -182 314 -236 550 991 -294 -491 155 437 172
6310 172 249 -305 -444 835 874 -252 -798 -150 1 728 438 -863 -645 822 618 -241 -579 -368 -196
6329 -196 220 207 -355 -625 -199 -184 -86 178 -287 -1003 -258 408 -355 -180 -221 -962 181 708 -91 -1066 -208
6350 -208 488 683 140 -375 -748 579 570 -281 -203 74 -11 489 468 143 -280 276 720 28 299 235 -91 284
6372 284 631 256 25 -8 -652 74 997 37 -490 280 621 124 -50 -120 -598 107 981 149 -745 74 273
6393 273 323 146 -266 -564 612 570 -618 -201 224 -670 -462 500 398 -652 -396 -264 71 631 -84 -981
6413 -981 -568 508 48 -3 -654 -739 421 1079 -66 -1432 16 269 -80 12 7 -332 157 905 -14 -577
6433 -577 -62 209 -65 99 -73 -22 58 -10 -517 240 651 -1065 -997 458 836 -418 -722 -466 -11 481
6453 481 -161 -1108 -446 367 527 -297 -641 -592 -36 777 -229 -1073 -20 922 -320 145 575 -195 -162 207
6473 207 34 383 420 -544 -721 496 523 -406 -197 -581 -484 616 693 -943 -928 596 966 -26 -809 -551
6493 -551 -24 371 -265 -681 -491 14 -47 90 -237 -512 -382 512 -77 -676 576 106 -955 -130 673 96
6513 96 -476 -317 103 598 419 -566 -674 511 782 -6 -71 -452 -311 887 797 -849 -673 681 771 -193
6533 -193 -209 -39 147 296 160 -375 179 336 -93 -30 759 -111 -325 79 -79 -32 435 -219 -1115 -296 998
6554 998 237 -568 -841 206 737 632 -1041 -1084 585 1069 -138 -411 -382 -315 684 446 -513 -640 503
6573 503 462 -700 80 220 -174 -287 -300 524 511 181 -770 131 914 407 -839 -251 166 299 911 -152
6593 -152 -1302 -30 1322 402 -264 -533 57 1050 786 -605 -514 434 334 -303 51 -36 -497 236 381
6612 381 -231 -126 356 -382 -293 519 257 -691 -672 -31 324 597 -293 -1403 -524 988 23 -854 -52 111
6632 111 114 320 -257 -792 -423 607 154 -707 -129 -19 303 91 -467 -20 556 -68 -739 357 525 -386
6652 -386 -765 177 87 257 -59 -765 -400 576 833 -367 -622 -218 223 784 -358 -1264 -352 726 -137
6671 -137 -647 -404 80 111 214 -12 -589 -165 85 -164 190 -32 -368 -194 246 17 -233 452 -117 -329
6691 -329 507 687 -676 -792 224 476 425 -274 -552 -325 571 342 -427 -580 -423 -153 741 139 -640 -459
6711 -459 887 -28 -275 -46 158 -180 63 394 -94 -261 -132 -436 252 399 -263 -697 236 146 249 503
6731 503 -647 -788 708 884 -293 -809 35 413 367 58 -715 -499 655 379 -212 229 -48 -183 376
6750 376 288 -389 -124 150 6 -281 371 -71 -362 131 853 267 77 -167 -419 433 771 -345 -653 -10
6770 -10 10 478 376 -655 -527 241 949 -610 -893 -145 28 -158 303 -265 -672 -347 194 116 170 -360 -1164
6791 -1164 -59 337 -166 -618 -176 -258 -272 281 -143 -911 -358 264 224 -191 -158 -339 371 246 -366 -299 -66
6812 -66 -61 95 350 -126 -454 27 641 201 -64 57 -142 -258 677 406 -239 -211 -213 211 666 158 -1364 -448
6834 -448 741 400 -205 -447 -340 279 527 -291 -859 7 210 -68 115 -179 -450 -122 430 -116 -274 -23
6854 -23 -820 -601 343 485 -567 -734 184 528 758 -339 -811 -504 735 531 -370 -209 -330 -221 1095
6873 1095 307 -697 -128 365 237 -142 -135 -111 -207 123 463 -363 -36 -256 8 362 381 -437 -750 88 13
6894 13 130 26 -47 -573 467 729 -754 -466 -178 235 297 -45 -756 -355 426 155 -64 -248 -147 -380
6914 -380 613 224 -555 156 118 253 163 342 -133 -115 289 336 399 89 -329 -274 833 831 -138 -618 311 372 316
6937 316 720 -342 -512 537 307 -511 -176 -241 207 418 0 -137 -363 92 4 -49 382 -302 -859 -53
6957 -53 41 55 -400 -416 -397 422 687 -326 -1088 -72 545 374 -139 -583 -787 166 534 -563 -743 25 252
6978 252 314 54 -496 -626 169 136 -103 46 33 -546 -64 144 122 -299 -241 -481 33 738 -293 -829 20
6999 20 322 357 -9 -548 -337 290 1050 -266 -559 104 416 371 291 -364 -398 525 663 -140 -182 80 176 66
7021 66 416 72 -17 152 -28 -284 831 280 -293 -263 436 162 -160 -207 -259 196 761 481 -707 -423 350
7042 350 490 57 -99 -517 384 574 -156 -513 98 91 -260 -101 50 -186 158 -223 -334 -31 192 -448 -445
7063 -445 208 582 -120 -183 -234 -171 757 499 -787 -535 607 681 147 -312 -179 122 814 -83 -305 140 664
7084 664 475 331 262 -138 395 882 248 127 703 298 -190 400 866 219 222 -30 318 1058 721 -411 -215
7105 -215 407 802 188 -165 -211 -380 1187 370 -899 -539 695 269 -303 -1 -304 -22 453 -324 -488
7124 -488 7 -77 -487 -298 -88 -178 -428 -61 -259 -207 464 -597 -772 70 774 380 -540 -118 -128 897 187
7145 187 -403 -548 462 354 181 254 -153 -112 556 499 -472 -87 414 113 -456 144 210 135 -204 -253 -153 113
7167 113 -75 -562 -158 461 150 -400 -230 -283 252 375 -312 -1167 84 622 98 -623 -496 -365 464 368
7187 368 -811 -405 209 -225 -272 79 -537 -403 34 118 -495 -47 428 -318 -364 365 357 -348 -433 -159 378 521
7209 521 -329 -648 198 879 -103 -466 -321 -342 417 700 -422 -403 219 531 93 -149 -123 173 413 158 -619
7230 -619 -126 -6 -276 -20 634 220 -689 -1 -78 -254 237 -73 -633 -161 447 31 -268 -397 -586 205
7250 205 723 -296 -838 208 860 -213 -166 35 -254 120 413 5 -249 175 236 68 65 166 158 -59 236
7271 236 125 445 255 -289 -344 541 241 -703 -47 267 87 346 385 -675 -230 438 245 -219 -411 -443 0
7292 0 334 -234 -557 49 412 -130 -187 -13 -290 -609 446 223 -65 73 -131 -341 204 249 -182 -49 40
7313 40 383 207 426 -436 -106 889 268 -489 -310 358 239 311 302 -374 140 447 518 -5 242 -269 -228 416
7335 416 342 -271 -102 133 -272 69 514 -188 -480 81 510 -42 -61 -115 -453 518 292 -405 -614 220 -55
7356 -55 21 154 -642 -76 117 465 -484 -217 1 -70 104 194 101 22 177 0 294 272 -307 -310 517 700 -143
7379 -143 -112 -108 -123 96 592 -154 -303 29 130 220 255 -331 -419 510 436 -236 31 427 -232 -305 598 -34 -199
7402 -199 63 255 -63 252 171 -659 30 113 -224 -326 -356 -240 349 714 20 -560 263 415 -28 -381 217
7423 217 -55 157 635 -43 9 -49 190 80 120 304 -234 372 197 -56 321 378 -241 -3 758 152 -503
7444 -503 -153 302 102 427 38 -534 83 367 364 -98 218 69 208 723 -178 -495 264 577 -184 -259 260
7465 260 25 -43 66 -18 -271 -122 26 -349 641 93 -134 125 85 131 794 229 -533 -379 785 318 -251
7486 -251 -100 247 523 435 -137 -221 85 427 295 348 132 -219 -17 278 9 -74 506 303 -349 -86 858
7507 858 -107 -384 -16 326 -342 -74 -494 -74 580 54 -729 -346 -57 -288 342 370 -718 -506 510 485
7527 485 -396 -495 -484 -315 196 -532 -277 78 111 -374 -78 554 -232 -330 250 -39 165 319 -104 -415 -47
7548 -47 687 -12 -356 115 317 526 226 -664 -212 497 475 -346 49 219 166 375 582 -553 26 993 291
7569 291 -243 305 267 -41 -52 86 219 251 91 -307 58 591 -20 -223 478 396 12 596 28 -218 473
7590 473 919 -153 -577 204 206 441 112 -545 -53 733 472 -288 1 458 -147 305 485 -134 -211 133 -328
7611 -328 -226 603 600 -62 -154 52 151 234 -382 -504 -75 757 -407 -477 333 423 108 154 -337 -569 162 377
7633 377 -208 -324 120 205 183 108 -301 174 516 -84 -57 322 47 -131 138 472 397 242 408 13 71 589
7655 589 325 -330 -282 589 44 393 -20 -324 198 680 -14 -506 398 530 151 -180 151 -91 -21 419 -441
7676 -441 60 136 -162 -413 6 38 63 71 -412 -659 213 252 -613 -792 -135 163 -477 -534 -372 -290 218 -86 -663
7699 -663 42 -54 -189 -17 45 -268 41 80 -181 -424 139 365 -260 180 82 43 -16 55 -125 -60 243 -244 -259
7722 -259 56 143 33 -34 -202 31 546 120 -317 -335 424 369 381 -114 -288 -144 483 -139 -652 47 -67 -71
7744 -71 -481 -51 -380 -146 -41 -260 -234 19 -38 -528 -41 312 -100 19 -342 -44 632 20 -414 -194 199
7765 199 225 -152 167 -40 -19 589 400 -506 -67 258 82 -111 243 -17 60 476 -99 -62 225 8 -87 -76
7787 -76 448 205 -127 34 -426 395 213 -69 -615 261 546 -109 -96 -156 -120 195 184 -298 -371 -149 247 -362
7809 -362 93 -216 -284 246 148 -195 108 288 -171 -400 337 102 -175 218 -148 -34 -20 -146 -553 175 414
7830 414 -163 -26 156 1 -271 692 25 -305 579 226 -80 -184 145 -26 -182 308 13 -305 222 46
7850 46 -81 -116 372 -128 49 232 -507 -113 336 -339 -352 265 265 -144 -17 183 -304 40 -227 -414 -137 233
7872 233 -412 -415 67 49 -45 366 -290 -548 241 -147 -263 -15 450 -171 -306 365 -215 -118 419 -285 -187 656
7894 656 -19 135 167 306 20 193 187 -552 -168 435 -244 -174 -144 126 -197 182 306 -126 -99 265 -259 -312
7916 -312 -25 -191 -96 30 -331 -107 -191 62 -321 44 165 -527 -40 150 126 65 -172 -505 -327 682 114
7937 114 -259 -103 366 172 79 250 -225 152 409 397 -185 439 185 10 -32 183 107 232 105 -91 -117 262
7959 262 -399 -171 310 137 25 87 -72 -490 289 413 -553 -386 155 268 77 180 -200 -231 234 -353 -532
7980 -532 351 78 -171 -223 229 -396 -25 66 -3 -185 299 561 -168 67 155 97 -28 -135 -132 370 631 -215
8002 -215 -304 575 142 -406 232 251 -358 -145 530 -212 -183 218 -411 -142 75 -214 -119 159 -169 -296 500
8023 500 222 -403 11 173 160 -176 229 -308 14 382 169 -409 -92 156 234 -206 -64 -383 183 471 -216
8044 -216 -164 324 -56 -313 90 372 -172 196 132 -356 -98 264 -159 -245 226 25 -253 80 -391 -166 486
8065 486 57 -567 -172 610 -42 -103 -19 -49 236 432 -182 -343 318 -61 -207 -179 -215 -178 368 158 -484 -380
8087 -380 241 204 -428 -275 -5 2 -344 58 -146 114 224 -599 -294 145 -179 -172 240 -108 269 352 35 -359
8109 -359 -103 484 28 -275 109 47 112 77 -115 -99 322 161 -326 35 -175 -276 -52 201 -130 249 326 -39
8131 -39 -542 -62 262 -316 -201 -68 -181 -86 -125 -637 -107 76 213 -127 -284 -67 -172 294 294 -318 -96 221
8153 221 -121 -436 150 127 -188 8 -214 -144 120 214 -309 36 367 72 -107 56 -484 -91 176 -220 -715
8174 -715 16 319 -212 -180 -105 64 -277 -102 -647 -186 159 -260 -383 48 -140 -349 116
8191A16
##END NTUPLES=NMR FID
##END=
