##TITLE=1H_CA-8646-1
 DMSO, 8 sc, 
 17.9.2019
##JCAMPDX= 6.0         $$ Bruker NMR JCAMP-DX V2.0
##DATA TYPE= NMR FID
##DATA CLASS= NTUPLES
##ORIGIN= UXNMR, Bruker Analytische Messtechnik GmbH
##OWNER= root
$$ XWIN-NMR		Version 3.5
$$ Tue Sep 17 14:39:55 2019 Russian Standard Time (UT+4h)  she@DPX200
##.OBSERVE FREQUENCY= 200.1315
##.OBSERVE NUCLEUS= ^1H
##.DELAY= (6, 6)
##.ACQUISITION MODE= SIMULTANEOUS
##.ACQUISITION SCHEME= undefined
##.AVERAGES= 8
##.DIGITISER RES= 18
##SPECTROMETER/DATA SYSTEM= spect
##.PULSE SEQUENCE= zg30
##.SOLVENT NAME= DMSO
##.SHIFT REFERENCE= (INTERNAL, DMSO, 0, 15.7039)
##AUDIT TRAIL= $$ (NUMBER, WHEN, WHO, WHERE, WHAT)
$$ ##TITLE= Audit trail, XWIN-NMR		Version 3.5
$$ ##JCAMPDX= 5.01
$$ ##ORIGIN= Bruker BioSpin GmbH
$$ ##OWNER= she
$$ F:/spectra/data/she/nmr/H-F/1/audita.txt
$$ ##AUDIT TRAIL=  $$ (NUMBER, WHEN, WHO, WHERE, WHAT)
(   1,<2019-09-17 14:38:47.06 +0400>,<she>,<DPX200>,
      <created by zg, POWCHK disabled, PULCHK disabled
       configuration hash MD5:
       00 E9 B6 7A A2 85 ED C7 34 08 36 98 17 FE 4E 26
       data hash MD5: 16K
       1C 09 4A 8E 18 C9 C0 07 44 D8 35 07 03 46 D1 B6>)
$$ ##END=
$$ 
$$ hash MD5
$$ D9 9D A9 19 49 44 C1 68 74 08 76 97 D5 2E F2 22
##$RELAX= 
##$RELAX= 
##$RELAX= 
##$RELAX= 
##$RELAX= 
##$RELAX= 
$$ Bruker specific parameters
$$ --------------------------
##$DU= <F:/spectra>
##$EXPNO= 1
##$NAME= <H-F>
##$PROCNO= 1
##$TYPE= <nmr>
##$USER= <she>
##$AMP= (0..31)
100 100 100 100 100 100 100 100 100 100 100 100 100 100 100 100 100 100 
100 100 100 100 100 100 100 100 100 100 100 100 100 100 
##$AQSEQ= 0
##$AQ_mod= 1
##$AUNM= <au_zg>
##$AUTOPOS= <>
##$BF1= 200.13
##$BF2= 200.13
##$BF3= 200.13
##$BF4= 200.13
##$BF5= 200.13
##$BF6= 200.13
##$BF7= 200.13
##$BF8= 200.13
##$BYTORDA= 1
##$CFDGTYP= 0
##$CFRGTYP= 5
##$CHEMSTR= <none>
##$CNST= (0..31)
1 1 145 1 1 1 1 1 1 1 1 1 1 1 1 1 1 1 1 1 1 1 1 1 1 1 1 1 1 1 1 1 
##$CPDPRG= <>
##$CPDPRG1= <>
##$CPDPRG2= <>
##$CPDPRG3= <>
##$CPDPRG4= <mlev>
##$CPDPRG5= <mlev>
##$CPDPRG6= <mlev>
##$CPDPRG7= <mlev>
##$CPDPRG8= <mlev>
##$CPDPRGB= <>
##$CPDPRGT= <>
##$D= (0..31)
0 1.2 0 0 0 0 0 0 0 0 0 0.03 0 0 0 0 0 0 0 0 0 0 0 0 0 0 0 0 0 0 0 0 
##$DATE= 1568716726
##$DBL= (0..7)
120 120 120 120 120 120 120 120 
##$DBP= (0..7)
150 150 150 150 150 150 150 150 
##$DBP07= 0
##$DBPNAM0= <>
##$DBPNAM1= <>
##$DBPNAM2= <>
##$DBPNAM3= <>
##$DBPNAM4= <>
##$DBPNAM5= <>
##$DBPNAM6= <>
##$DBPNAM7= <>
##$DBPOAL= (0..7)
0.5 0.5 0.5 0.5 0.5 0.5 0.5 0.5 
##$DBPOFFS= (0..7)
0 0 0 0 0 0 0 0 
##$DE= 6
##$DECBNUC= <off>
##$DECIM= 24
##$DECNUC= <off>
##$DECSTAT= 4
##$DIGMOD= 1
##$DIGTYP= 9
##$DL= (0..7)
0 120 120 120 120 120 120 120 
##$DP= (0..7)
150 150 150 150 150 150 150 150 
##$DP07= 0
##$DPNAME0= <>
##$DPNAME1= <>
##$DPNAME2= <>
##$DPNAME3= <>
##$DPNAME4= <>
##$DPNAME5= <>
##$DPNAME6= <>
##$DPNAME7= <>
##$DPOAL= (0..7)
0.5 0.5 0.5 0.5 0.5 0.5 0.5 0.5 
##$DPOFFS= (0..7)
0 0 0 0 0 0 0 0 
##$DQDMODE= 0
##$DR= 18
##$DS= 0
##$DSLIST= <SSSSSSSSSSSSSSS>
##$DSPFIRM= 0
$$ [...]
##$SUBNAM2= <"">
##$SUBNAM3= <"">
##$SUBNAM4= <"">
##$SUBNAM5= <"">
##$SUBNAM6= <"">
##$SUBNAM7= <"">
##$SUBNAM8= <"">
##$SUBNAM9= <"">
##$SW= 24.0689530833862
##$SWIBOX= (0..15)
0 0 2 0 0 0 0 0 0 0 0 0 0 0 0 0 
##$SW_h= 4816.95568400771
##$TD= 16384
##$TD0= 1
##$TE= 0
##$TE2= 300
##$TE3= 300
##$TEG= 300
##$TL= (0..7)
0 120 120 120 120 120 120 120 
##$TP= (0..7)
150 150 150 150 150 150 150 150 
##$TP07= 0
##$TPNAME0= <>
##$TPNAME1= <>
##$TPNAME2= <>
##$TPNAME3= <>
##$TPNAME4= <>
##$TPNAME5= <>
##$TPNAME6= <>
##$TPNAME7= <>
##$TPOAL= (0..7)
0.5 0.5 0.5 0.5 0.5 0.5 0.5 0.5 
##$TPOFFS= (0..7)
0 0 0 0 0 0 0 0 
##$TUNHIN= 0
##$TUNHOUT= 0
##$TUNXOUT= 0
##$USERA1= <user>
##$USERA2= <user>
##$USERA3= <user>
##$USERA4= <user>
##$USERA5= <user>
##$V9= 5
##$VALIST= <valist>
##$VCLIST= <CCCCCCCCCCCCCCC>
##$VD= 0
##$VDLIST= <DDDDDDDDDDDDDDD>
##$VPLIST= <PPPPPPPPPPPPPPP>
##$VTLIST= <TTTTTTTTTTTTTTT>
##$WBST= 1024
##$WBSW= 4
##$XGAIN= (0..3)
0 0 0 0 
##$XL= 0
##$YL= 0
##$YMAX_a= 198875
##$YMIN_a= -234877
##$ZGOPTNS= <>
##$ZL1= 120
##$ZL2= 120
##$ZL3= 120
##$ZL4= 120
##$ABSF1= 10
##$ABSF2= 0
##$ABSG= 5
##$ABSL= 3
##$ALPHA= 0
##$AQORDER= 0
##$ASSFAC= 0
##$ASSFACI= 0
##$ASSFACX= 0
##$ASSWID= 0
##$AUNMP= <proc_1d>
##$AZFE= 0.1
##$AZFW= 0.1
##$BCFW= 1
##$BC_mod= 2
##$BYTORDP= 1
##$COROFFS= 0
##$CY= 11.3945322036743
##$DATMOD= 1
##$DC= 2
##$DFILT= <>
##$DTYPP= 0
##$F1P= 20.1720416913024
##$F2P= 0.152960286110954
##$FCOR= 0.5
##$FTSIZE= 0
##$FT_mod= 4
##$GAMMA= 1
##$GB= 0.15
##$INTBC= 1
##$INTSCL= 1
##$ISEN= 128
##$LB= 0.24
##$LEV0= 0
##$LPBIN= 0
##$MAXI= 10000
##$MC2= 0
##$MEAN= 0
##$ME_mod= 0
##$MI= 1.114404
##$NCOEF= 0
##$NC_proc= 0
##$NLEV= 6
##$NOISF1= 3.799351
##$NOISF2= 2.8
##$NSP= 1
##$NTH_PI= 0
##$NZP= 0
##$OFFSET= 15.70392
##$PC= 1
##$PHC0= -9589.501
##$PHC1= 33.20096
##$PH_mod= 1
##$PKNL= yes
##$PPARMOD= 0
##$PSCAL= 0
##$PSIGN= 0
##$REVERSE= no
##$SF= 200.130013532006
##$SI= 16384
##$SIGF1= 3
##$SIGF2= 2
##$SINO= 400
##$SIOLD= 16384
##$SREGLST= <1H.CDCl3>
##$SSB= 0
##$STSI= 0
##$STSR= 0
##$SW_p= 3612.71676300578
##$SYMM= 0
##$S_DEV= 0
##$TDeff= 0
##$TDoff= 0
##$TI= <>
##$TILT= no
##$TM1= 0
##$TM2= 0
##$TOPLEV= 0
##$USERP1= <user>
##$USERP2= <user>
##$USERP3= <user>
##$USERP4= <user>
##$USERP5= <user>
##$WDW= 1
##$XDIM= 8192
##$YMAX_p= 0
##$YMIN_p= 0
$$ End of Bruker specific parameters
$$ ---------------------------------
##NTUPLES= NMR FID
##VAR_NAME=  TIME,          FID/REAL,        FID/IMAG
##SYMBOL=    X,             R,               I
##VAR_TYPE=  INDEPENDENT,   DEPENDENT,       DEPENDENT
##VAR_FORM=  AFFN,          ASDF,            ASDF
##VAR_DIM=   8192,          8192,            8192
##UNITS=     SECONDS,       ARBITRARY UNITS, ARBITRARY UNITS
##FACTOR=    0.0002076,     1,               1
##FIRST=     0,             0,               0
##LAST=      1.7004516,     0,               0
##MIN=       0,             -234877,         0
##MAX=       1.7004516,     198875,          0
$$ Real data points
##PAGE= N=1
##DATA TABLE= (X++(R..R)), XYDATA
$$ [...]
$$ plain form
2611 3795 -132 -4211 -3946 213 4136 3927 -259 -4112 -3810 432 4298 3767 -483 -4514 -3834 708
2627 708 4630 3556 -994 -4791 -3532 1081 4444 3179 -1471 -4615 -3070 1395 4283 2857 -1194
2642 -1194 -4402 -2982 1266 4225 2984 -1621 -4509 -3052 1814 4639 2642 -1986 -4759 -2478 2199
2657 2199 4553 2231 -2391 -4489 -2157 2297 4290 2056 -2438 -4314 -2006 2377 4298 1922 -2208
2672 -2208 -4498 -1887 2600 4394 1926 -2681 -4553 -1507 2937 4606 1298 -3390 -4433 -1074 3201
2687 3201 4129 968 -3254 -3906 -1052 3109 3871 829 -3230 -3922 -875 3170 4027 991 -3230 -4250
2703 -4250 -490 3544 4142 370 -3790 -3962 -101 3650 3691 -2 -3886 -3800 80 3656 3463 -139 -3434
2720 -3434 -3438 172 3752 3635 -201 -3731 -3534 355 3947 3414 -590 -4271 -3349 804 3939 3135 -921
$$ packed form
2611C795l927m079K65M159L923k09m186l853L02M242L866n31m250m031O80M542
2627G08L922j074m550l797J259M613L363j265m650l144J545M465K888j426m051
2642a194l208J420M248K959j241m605k888J457M866K825j997m628k773K281M677
2657B199K354k322m622k098K332M454J993k234m494j876K308M383J921k376m130
2672b208k290K611M487J794k468m607j872L046M444J669l308m688j043L359M275
2687C201R28l161m222o52K854M161P62l042m059o92L047M045Q57l036m221j020
2703d250L760M034N98l772m160j72L861L751M1l693l884Q6L880L576j93l602l295
2720c434mL610L580j17l836l530J97L889L592n33m004l681R22M153L135q04m056
$$ plain form
2737 -921 -4044 -2624 1192 4151 2645 -1392 -3933 -2727 1271 3859 2663 -1238 -3836 -2847 1533
2752 1533 3932 2676 -1395 -4159 -2453 1812 4252 2446 -1882 -4125 -2083 1961 4206 1816 -2196
2767 -2196 -4008 -1770 2227 4060 1571 -2102 -3706 -1673 2083 3855 1644 -2642 -4041 -1658 2332
2782 2332 4037 1553 -2707 -4149 -1196 2902 4117 1070 -2882 -3889 -770 2808 3730 787 -2802
2797 -2802 -3620 -763 2920 3676 928 -2895 -3650 -861 3243 3706 686 -3182 -3758 -493 3424 3560
2813 3560 126 -3337 -3554 -109 3295 3204 -182 -3214 -3097 199 3288 3025 -120 -3493 -3104 282
2829 282 3405 3127 -366 -3587 -2860 532 3602 2964 -676 -3558 -2858 1031 3732 2761 -901 -3634
2845 -3634 -2441 1183 3489 2639 -1139 -3540 -2458 1135 3591 2371 -1244 -3457 -2490 1350 3819
$$ packed form
2737i21l123J420L816K959j506m037k541J206L998K588j196l901k598R89M380
2752A533K399j256m071k764J706M265K440j806m328k243K042M044K245k390m012
2767b196j812K238L997J833k489l673j604K033L756J772k211m286j399K383L990
2782B332J705k484m260j442K953M098J215l047l952j007L119L578R22k943l589
2797b802q18K857L683P56k748l823p55K789M104M63l020l868n76L265L917J36
2813C560l434l463k17L445L404r1l386l032J17L296L089k63l145l373L89L386
2829B82L123k78l493l221P27L392L070o38l640k882P00L889K701r71l662k733
2845c634J193L624K306q50l778k401J082L593K456j220l615k213R67L840K469
$$ plain form
2860 3819 2510 -1460 -3811 -2166 1726 3835 1960 -2032 -3638 -1790 2042 3382 1482 -1953 -3463
2875 -3463 -1604 1978 3535 1613 -2058 -3564 -1761 2078 3703 1346 -2361 -3573 -1331 2416 3658
2890 3658 1008 -2414 -3579 -938 2798 3437 864 -2825 -3259 -773 2373 3253 705 -2600 -3178 -567
2906 -567 2813 3325 630 -2755 -3395 -525 2773 3272 334 -2987 -3270 -265 3220 3128 80 -3102 -2944
2923 -2944 179 2897 2859 -352 -2959 -2778 301 2986 2816 -434 -3082 -2846 350 3148 2778 -495
2939 -495 -3298 -2844 725 3611 2699 -944 -3280 -2364 1081 3384 2377 -1012 -3350 -2274 1262 3414
2955 3414 2098 -1223 -3143 -2117 1141 3229 2100 -1290 -3474 -1853 1425 3544 1993 -1432 -3428
2970 -3428 -1811 1758 3554 1622 -1904 -3339 -1564 1736 3301 1310 -2006 -3199 -1516 2069 3202
$$ packed form
2860C819j309l970k351J645L892K109j875l992j606J848L832J340j900l435j510
2875c463J859L582J557j922l671j506J803L839J625k357l707j212K242L747J242
2890C658k650l422j165K641L736O39k573l689m34K486L146Q80k548l305n78K611
2906e67L380N12k695l385o40K870L298M99k938l321k83L005L485r2l048l182J58
2923b944L123K718l8l211k607J81L079K685j70l250k648K36L196K798l70l273
2939d95k803M54L569K886r12l643k336R16L445K303j007l389k338J076L536K152
2955C414j316l321j920J026L258K088j129l390k184J621L278K119j551l425j996
2970c428J617L569J796j932l526j435J775L300J565j991l316j193J683L585J133
$$ plain form
2985 3202 1296 -2080 -3135 -1218 1993 3233 1121 -2205 -3436 -1097 2207 3309 700 -2197 -3299
3000 -3299 -683 2403 3084 494 -2421 -3057 -581 2577 2755 448 -2253 -3095 -479 2598 3004 318
3016 318 -2622 -2899 -343 2825 2819 53 -2770 -2674 245 2932 2805 -144 -2969 -2582 -81 2619 2693 -231
3034 -231 -2845 -2619 363 2723 2521 -437 -2937 -2463 514 2935 2488 -487 -3033 -2389 677 2935
3050 2935 2247 -792 -2986 -2094 910 2944 1983 -914 -2964 -2079 1067 2951 1864 -1185 -2965 -1933
3066 -1933 1182 3095 1790 -1269 -2851 -1577 1390 3363 1749 -1634 -2986 -1429 1658 3098 1494
3081 1494 -1591 -2990 -1382 1753 2996 1301 -1785 -3014 -1093 1801 3014 1371 -1905 -3120 -1033
3096 -1033 1972 2772 902 -2137 -3116 -914 2200 2974 742 -2183 -2830 -741 2304 2805 615 -2098
$$ packed form
2985C202j906l376j055J917L211J240k112l326j231K339L304J102k609k897j102
3000c299K616L086O81k590k915o36K476L158J78k307k701q42K616L077M06k686
3016C18k940k77K556L168ok766k823R6K919K687j27k949k825L87K501K700P4k924
3034b31k614K26K982K360k02k958k500M74K977K421m47k975k546O44L066K258
3050B935o88l039k194Q92L004K034r61k897k050Q85L146J884j087l049j780J032
3066a933L115J913j305l059j582J274K967J973j614l383j352J557L087J440j604
3081A494l085j399J608L135J243j695l086j229J921K894J213j643l276j215K087
3096a033L005Q00j870l039r79K202L114P74k232k925o47K089L045N01k190k713
$$ plain form
3112 -2098 -2881 -571 2310 2855 530 -2291 -2687 -431 2445 2745 197 -2349 -2733 -108 2556 2631 -4
3129 -4 -2485 -2533 -74 2569 2570 -213 -2626 -2301 229 2804 2390 -399 -2675 -2360 453 2887 2260 -359
3147 -359 -2707 -2233 572 2767 2115 -652 -2849 -1958 544 2783 1994 -986 -2770 -1922 810 2655
3163 2655 1845 -982 -2881 -1670 1111 2665 1902 -1051 -2843 -1665 1241 2916 1470 -1126 -2849
3178 -2849 -1684 1394 2830 1672 -1471 -2778 -1420 1429 2847 1485 -1562 -2798 -1197 1656 2938
3193 2938 1244 -1848 -2674 -1059 1712 2835 862 -1824 -2659 -887 1802 2681 785 -1901 -2762 -591
3209 -591 1788 2534 656 -2056 -2825 -658 2158 2699 401 -2108 -2613 -185 2211 2447 313 -2378
3225 -2378 -2650 -350 2329 2341 271 -2370 -2362 -3 2426 2364 35 -2409 -2324 166 2408 2318 -175 -2284
$$ packed form
3112b098p83K310K881N45k325k821l96K256K876L00k548k546l84K625K664P5k635
3129dk481m8K459K643Jk783k413L25K530K575m14k789k276L15K813K434o27k619
3147c59k348M74K805K195o52k767k197Q91K502K239p89k980j784Q48K732J845
3163B655q10k827j899J211K781J554p63k953j792J178K906J675j446k596j723
3178b849J165L078J436j158l143j307J358K849J418j362l047j236J601K853J282
3193B938j694l092q26J615K771J123j973k686q35J772K689Q79j896k686q61K171
3209e91K379P46j878k712p69K167K816N41k298k509n05K428K396K36k134k691
3225b378k72K300K679J2k070k641QK359K429o2k329k444Q5K490K242r0k493k109
$$ plain form
3243 -2284 -2180 310 2339 2202 -341 -2447 -2127 425 2343 2155 -652 -2467 -1830 607 2552 1948
3259 1948 -709 -2474 -1883 846 2355 1559 -886 -2540 -1735 934 2652 1674 -1029 -2369 -1767 986
3275 986 2611 1601 -1079 -2680 -1409 1304 2589 1251 -1136 -2594 -1503 1169 2694 1344 -1361
3290 -1361 -2649 -1039 1462 2583 1131 -1576 -2440 -1090 1429 2489 941 -1445 -2481 -885 1506
3305 1506 2716 826 -1713 -2454 -755 1802 2463 633 -1932 -2560 -351 2024 2289 317 -1898 -2115
3321 -2115 -558 1937 2270 250 -1820 -2369 -270 1900 2156 301 -2010 -2308 -429 2131 2403 160
3337 160 -2266 -1966 -34 2233 2081 40 -2248 -2052 79 2255 1983 -279 -2169 -1963 278 2342
3353 2342 1938 -493 -2423 -1763 509 2140 1780 -493 -2385 -1804 665 2309 1762 -578 -2361 -1615
$$ packed form
3243b284J04K490K029j37k543k106L20K552J918j88k807j815O37K437J945o04
3259A948k657j765N91K729J509p96k445j654Q05K669J718r78k703j340O02K753
3275I86J625j010k680j601J271K713J285j338k387j458J091K672J525j350k705
3290a361j288J610K501J121j452k707q64J350K519J060j548k386j036J596K391
3305A506J210j890k539p41J699K557O61j830k565o28K209K375K65j972k215k17
3321b115J557K495L33k020k070n49K099K170K56j855k311k98J879K560K72k243
3337A60k426L00J932K267j52k041k288J96K131K176k72k262j890K06K241K064
3353B342m04k431j930O60K272J631l60k273j892N81K469J644n47k340j783P46
$$ plain form
3369 -1615 707 2253 1648 -1015 -2285 -1352 869 2272 1463 -922 -2477 -1524 858 2432 1419 -863
3385 -863 -2475 -1154 990 2375 1188 -1326 -2290 -1158 1205 2308 977 -1476 -2330 -980 1307 2306
3401 2306 998 -1425 -2417 -1008 1418 2340 761 -1680 -2404 -696 1553 2295 722 -1674 -2336 -695
3417 -695 1738 2185 358 -1743 -2228 -460 1637 2111 490 -1898 -2118 -302 2105 2325 411 -1833
3433 -1833 -2112 -201 1891 1985 217 -1713 -2135 -223 1867 1951 -134 -1861 -2020 -73 2052 2001 -66
3450 -66 -2040 -1958 130 1916 1644 -269 -2124 -1775 455 1963 1709 -329 -1999 -1670 623 2202 1690
3467 1690 -571 -1938 -1568 722 2322 1500 -796 -2107 -1499 614 2342 1249 -741 -2027 -1390 767
3483 767 2165 1152 -800 -2309 -1310 829 2038 1205 -1006 -2098 -1113 1189 1893 1004 -1168 -2174
$$ packed form
3369a615K322J546o05k663j270R33K221J403q09k385j555R53K382J574j013k282
3385h63j612J321K144J385j187k514r64J132K363J103j331k453q54J350K287R99
3401B306j308k423r92J409K426R22j579k441p24J708K249P42j573k396o62J641
3417f95K433M47j827k101m85J768K097M74j621k388k20J816K407K20j914k244
3433a833k79J911K092R4j768j930m22J912K090Q4k085j727j59J947K125n1k067
3450f6j974Q2K088J786k72j913j855L49K230J508k54k038j670L29K293J579n12
3467A690k261j367L70K290J600q22k296j311O08K113J728j093j990j286O37K157
3483G67J398j013j952j509R99K139J209q33k211j092R85K302P04q89k172j006
$$ plain form
3499 -2174 -855 1223 2253 954 -1240 -2202 -940 1328 2233 767 -1190 -2143 -701 1312 2186 849
3515 849 -1464 -2018 -765 1482 1910 581 -1420 -2034 -579 1512 2067 507 -1744 -1971 -352 1709
3531 1709 1846 453 -1584 -1790 -202 1785 1846 213 -1662 -1785 -185 1824 1818 144 -1643 -1933 100
3548 100 1764 1835 -110 -1997 -1750 146 1704 1621 -141 -1995 -1692 258 1757 1663 -305 -1875 -1697
3565 -1697 393 2063 1613 -490 -2242 -1534 550 2010 1576 -596 -1999 -1221 490 2099 1425 -647
3581 -647 -2031 -1275 791 2033 1378 -745 -1999 -1244 687 1948 1160 -984 -2005 -1112 1015 2173
3597 2173 1141 -880 -1957 -1050 992 2108 937 -988 -1923 -1086 1281 1824 652 -1301 -2094 -912
3613 -912 1205 1962 829 -1388 -2049 -719 1271 1809 490 -1199 -1871 -557 1360 1900 504 -1517
$$ packed form
3499b174J319K078J030j299k194r62J262K268R05j466j957r53J442K013Q74j337
3515H49k313n54J253K247M28j329k001o14J455K091N55j560k251k27J619K061
3531A709J37j393k037k06J588J987O1j633j875j23J600K009oj674j787k90K033
3548A00J664P1j945j887K47J896J558q3j762j854L03J950J499r4j968j570J78
3565a697K090J670m50k103j752P08K084J460m34k172j403P78J711J609o74k072
3581f47j384P56K066J242o55k123j254P55J931J261p88k144j021Q93K127J158
3597B173j032k021j077R07K042J116j171j925r35Q37K367N43j172j953p93J182
3613i12K117P57j133k217o61J330J990N38j319j689o72J314J917N40j396k021
$$ plain form
3629 -1517 -1921 -397 1593 2031 209 -1417 -1874 -425 1511 1985 414 -1840 -1709 -159 1528 1859
3645 1859 201 -1704 -1696 -68 1891 1650 2 -1616 -1734 -101 1697 1636 61 -1769 -1700 66 1900
3662 1900 1527 -48 -1767 -1735 120 1782 1516 -221 -1763 -1502 468 1839 1480 -274 -1840 -1375 545
3679 545 1792 1309 -531 -2048 -1246 584 1947 1303 -697 -1737 -1048 869 2039 1247 -857 -1869
3695 -1869 -1150 948 1828 937 -905 -1832 -843 793 1966 937 -986 -1904 -979 1086 2062 837 -1196
3712 -1196 -1759 -571 1128 1833 679 -1141 -1799 -573 1261 1828 644 -1187 -1805 -596 1394 1743
3728 1743 416 -1257 -1745 -533 1398 1757 389 -1374 -1771 -428 1379 1752 278 -1515 -1677 -263
3744 -263 1642 1723 286 -1599 -1522 14 1431 1661 79 -1624 -1517 99 1592 1630 -22 -1657 -1444
$$ packed form
3629a517m04J524J990M38j822j626m57J449J936M74j571k254J31J550J687L31
3645A859j658j905QJ628J959k41j648j618j18J633J798o1j575j830O9J766J834
3662A900l73j575j719L2J855J662k66j737j542K61J970J371l59j754j566M65J920
3679E45J247m83j840j517Q02J830J363o44k000j040O89J917J170p92k104j012
3695a869P19K098Q80q91j842r27R89J636J173j029j923r18R25K065R76j225k033
3712a196n63J188J699P05j154j820o58J226J834N67j184j831o18J209J990L49
3728A743j327j673m88J212J931L59j368j763l97J343J807L73j474j793j62J414
3744b63J905Q1j437j885P7J536J417K30j582j703J07J616J493L8j652j635K13
$$ plain form
3761 -1444 347 1777 1496 -244 -1838 -1359 151 1427 1425 -467 -1834 -1504 290 1535 1357 -371 -1792
3778 -1792 -1311 461 1796 1072 -385 -1609 -1215 746 1871 1285 -639 -1590 -1117 646 1715 1046 -691
3795 -691 -1605 -1211 758 1848 1087 -856 -1673 -1025 756 1940 1140 -856 -1742 -950 905 1913 863
3812 863 -965 -1658 -730 890 1889 661 -885 -1764 -578 1192 1715 755 -1166 -1769 -522 1111 1681
3829 1681 586 -1070 -1890 -359 1197 1710 539 -1325 -1658 -463 1349 1724 539 -1338 -1627 -326
3845 -326 1317 1656 366 -1362 -1557 -196 1321 1656 179 -1589 -1432 -96 1364 1526 -92 -1353
3861 -1353 -1472 -94 1505 1434 -108 -1362 -1386 114 1534 1388 -145 -1472 -1318 242 1596 1312 -198
3878 -198 -1717 -1171 68 1609 1346 -476 -1528 -1242 335 1633 1260 -350 -1651 -1033 478 1725
$$ packed form
3761a444J791J430k81j740j594M79J510J276kj892j367L30J794J245j78j728j421
3778a792M81J772J335p24j457j224L94J961J125n86j924r51M73J763J069o69j737
3795f91r14L94J969J090p61j943q17O48J781J184q00j996q86P92J855J008j050
3812H63j828o93R28J620R99j228j546q79J186J770N23r60j921o03J247J633N70
3829A681j095j656q20J531J556N13j171j864l33J195J812L75j185j877k89J301
3845c26J643L39j290j728j95J361J517L35j477j768J57J336J460J62j618j261
3861a353j19J378J599p1j542j254k4J500J420j46j533j327J54J560J354k84j510
3878a98j519N46J239J541k63j822j052K86J577J298l73j610j301O18J511J247
$$ plain form
3894 1725 1043 -496 -1537 -1140 666 1605 907 -817 -1508 -1016 754 1433 1005 -962 -1621 -823 757
3911 757 1617 808 -646 -1571 -809 847 1753 739 -871 -1677 -711 848 1570 529 -1082 -1536 -570 885
3929 885 1809 425 -1092 -1779 -584 1089 1644 494 -1139 -1499 -792 1045 1397 309 -1334 -1321 -458
3946 -458 1098 1530 72 -1208 -1462 -327 1298 1506 259 -1262 -1676 -53 1228 1617 167 -1570
3962 -1570 -1585 -53 1480 1322 153 -1243 -1210 20 1272 1382 -8 -1422 -1405 308 1526 1151 -338
3979 -338 -1507 -1233 478 1365 1238 -358 -1649 -1238 263 1688 1102 -252 -1421 -890 294 1528 1120
3996 1120 -511 -1663 -1116 378 1532 1135 -578 -1456 -1095 608 1546 804 -563 -1623 -1083 502 1582
4013 1582 852 -706 -1608 -864 725 1490 724 -648 -1462 -848 887 1440 759 -835 -1651 -538 875
$$ packed form
3894A725o82j539j041L97J806R39o98j724o91M92J770O79m28j967o59P98J580
3911G57Q60q09j454r25P62J656R06j014j610q06R66J559P22j041j611m54R66J455
3929H85R24j384j517o87J195J673N55j150j633l60P07J837L52j088j643J3Q63
3946d58J556M32j458j280k54J135J625K08j247j521m14J623J281L89j450j737
3962a570j5J532J533j58j169j396L3J230J252J10j390j414J7J713J218l75j489
3979c38j169K74J711Q87j27j596j291M11J501J425n86j354j169N31J184J234m08
3996A120j631j152N47J494J154l97j713q78L61J703R38p42j367j060N40J585J080
4013A582p30j558r02P44J589P65p66j372q14O14J735N53o81j594q16J113J413
$$ plain form
4030 875 1496 677 -965 -1831 -446 1107 1463 533 -855 -1504 -428 1028 1418 437 -1017 -1445 -415
4047 -415 1026 1479 423 -1039 -1382 -263 1289 1431 301 -1165 -1437 -172 1227 1424 279 -1184
4063 -1184 -1292 -72 1172 1383 14 -1529 -1198 -31 1360 1272 -6 -1343 -1185 -55 1192 1238 3
4080 3 -1242 -1242 290 1380 1176 -141 -1369 -1248 214 1282 1092 -253 -1341 -1134 410 1442 1067 -633
4098 -633 -1308 -1056 464 1457 1031 -496 -1245 -941 334 1478 799 -465 -1638 -851 550 1435 982 -589
4116 -589 -1432 -754 444 1403 814 -623 -1372 -572 770 1435 801 -904 -1315 -725 677 1429 600 -838
4134 -838 -1522 -566 994 1376 561 -817 -1435 -311 945 1502 463 -840 -1336 -587 832 1516 313
4151 313 -1044 -1249 -561 1102 1431 98 -1199 -1316 -391 1052 1254 214 -898 -1167 -217 1248 1207 186
$$ packed form
4030H75O21q19j642q66J385J553L56r30j388o49J076J456L90r81j454m28J030
4047d15J441M53j056j462l43J119J552J42j130j466k72J265J399J97j145j463
4063a184j08J220J244K11j369j543L31J167J391q8j278j337J58J130J247M6j235
4080Cj245%J532J090k04j317j228J21J462J068j90j345j088K07J544J032l75j700
4098f33o75K52J520R93m26j527p49L04J275J144o79j264j173P87J401Q85m53j571
4116e89q43O78J198R59n89j437p49Q00J342O65o34j705m11N90J402P52q29j438
4134h38o84R56J560L82q15j378o18J124J256N57j039j303m96P49J419O84j203
4151C13j357k05O88J663L29j333j297j17R25J443K02j040j112k69R50J465m1j021
$$ plain form
4169 186 -1222 -1233 -21 1121 1255 198 -1093 -1132 -24 1157 1026 -85 -977 -1266 70 1251 987
4186 987 -128 -1272 -1123 11 1245 1078 -185 -1215 -976 373 1411 1124 -272 -1167 -842 141 1272
4203 1272 987 -267 -1234 -1013 283 1525 734 -610 -1258 -917 388 1309 834 -523 -1223 -785 665
4220 665 1175 743 -509 -1295 -962 493 1290 871 -664 -1362 -840 542 1329 624 -781 -1132 -639 659
4238 659 1199 484 -725 -1229 -488 738 1140 517 -711 -1082 -447 907 1480 316 -849 -1162 -353 815
4256 815 1293 403 -803 -1230 -286 932 1122 248 -1035 -1262 -309 1088 1200 160 -917 -1095 -165 1056
4274 1056 1100 66 -1035 -1143 -131 1179 940 166 -1013 -1242 25 1123 1156 6 -1166 -1152 174
4291 174 1153 1133 16 -1105 -1012 78 1144 1087 -4 -1206 -959 122 1297 988 -190 -1130 -1156 211
$$ packed form
4169A86j408j1J212J142J34j057j291l9J108J181j31j111q92k89J336J181k64
4186I87j115j144J49J134J234j67j263j030K39J349J038k87j396q95L25R83J131
4203A272k85j254r67K21J296J242p91j344o48L41J305R21m75j357p00M38J450
4220F65N10m32j252p86L33J455P97m19j535o98N22J382P87p05j405l51M93J298
4238F59N40p15j209n04P41J226M02o23j228l71O35J354N73j164j165l13Q09J168
4256H15M78q90j206m27R44J218J90q74j283k27R53J397J12j040j077j78R30J221
4274A056M4j034j101j08J012J310k39p74j179k29J267J098L3j150j172J4J326
4291A74R79k0j117j121R3J090J066n7j091j202K47J081J175l09j178r40k6J367
$$ plain form
4309 211 1076 952 -204 -1254 -898 297 1323 928 -482 -1072 -831 512 1190 878 -408 -1164 -741 625
4327 625 1418 842 -358 -1404 -754 376 1249 517 -477 -1174 -617 476 1217 606 -666 -1294 -516 679
4345 679 1308 547 -598 -1330 -596 950 1286 492 -865 -1203 -432 779 1206 537 -1039 -1199 -366 933
4363 933 1049 339 -814 -1245 -173 941 1263 236 -1033 -1256 -141 817 1100 119 -871 -1067 -179 1091
4381 1091 958 255 -1136 -1046 -93 1092 994 94 -1028 -988 77 1206 1055 -132 -1193 -1042 -58 955
4399 955 1090 -11 -1124 -1099 146 1113 864 -79 -1181 -804 335 1178 813 -220 -1311 -863 324 1265
4417 1265 905 -244 -1289 -869 286 1161 775 -219 -1037 -663 314 1009 694 -421 -1078 -732 562 1206
4435 1206 472 -320 -1026 -552 431 1230 598 -469 -1131 -590 534 1122 511 -486 -1090 -699 753 980 460
$$ packed form
4309B11Q65j24j156j050L56J195J026l95j410n90K41J343O78l12j286p56M23J366
4327F25P93n76j200j046O50J130Q73p32r94o97N57J093P41o11j272o28P78J195
4345F79O29p61j145p32P34J546L36p94j357l38P71J211M27o69j576j60Q33J299
4363I33J16p10j153m31J072J114L22j027j269k23J115R58K83r81r90j96Q88J270
4381A091j33p03j391R0R53J185r8r00j122M0J065J129j51j187j061J51R84J013
4399I55J35j101j113K5J245R67k49r43j102L77J139Q43l65j033j091M48J187R41
4417A265l60j149j045M20J155Q75l86r94q18L74R77O95l15j115o57L46J294O44
4435A206p34p92p06M74R83P99o32j067o62N41J124N88o11r97o04L91J452K27n20
$$ plain form
4454 460 -639 -1197 -293 858 1094 384 -776 -1128 -579 698 1217 303 -846 -1002 -297 891 967 334
4472 334 -748 -1217 -351 580 947 295 -836 -1157 -324 855 1155 86 -789 -1084 -77 1082 1151 122
4490 122 -722 -1166 -57 945 1009 -53 -880 -910 -64 894 1012 -82 -943 -1204 70 1107 929 -115
4508 -115 -992 -978 17 946 974 -140 -1013 -755 100 1087 768 -176 -914 -837 197 1112 733 -251 -1027 -541
4528 -541 328 1104 718 -154 -1056 -638 477 1145 704 -262 -1201 -719 410 1252 602 -424 -1038 -700 628
4547 628 1071 588 -558 -996 -576 476 987 584 -568 -1183 -484 639 1201 431 -719 -987 -549 640
4565 640 1002 476 -689 -1243 -229 671 1129 384 -767 -926 -274 639 1109 96 -803 -1061 -221 646 1014
4584 1014 304 -715 -960 -162 698 1012 90 -725 -851 -23 848 917 -77 -901 -831 -121 902 880 2 -837
$$ packed form
4454D60j099n58R04J151K36p10j160l52N49J277N19r14j149j56P05J188P6o33
4472C34j082m69Q66R31L67o52j131l21Q33J179L00j069q75k95J007J159O9j029
4490A22q44m44J109J002O4j062q27l0Q46R58J18j094q61k61J274J037j78j044
4508a15q77J4R95R29K8j114q73K58Q55R87l19r44p38P7J034R15l79r84p76M86
4528e41Q69P76l86q72r02M18J115O68m41r66r39M82J129Q42o50j026o14L38J328
4547F28M43m83j146m38M20J052N11m03j152o15O99J123N62p70j150k68M38J189
4565F40L62n26j165n54J014R00M58p45j151j59O52R13M70j013q99k58Q40Q67L68
4584A014p10j019k45P98Q60L14r22q15j26Q28Q71O9r94q24P0P10J023k2q78q39
$$ plain form
4604 -837 -803 67 1037 955 30 -994 -823 131 960 923 -254 -993 -829 250 904 883 -200 -880 -792 288
4624 288 1006 779 -207 -953 -747 134 1226 791 -213 -1189 -657 249 1045 526 -364 -1151 -648 232 1013
4643 1013 723 -267 -845 -514 317 1010 803 -527 -939 -640 566 907 605 -371 -911 -324 472 840 420
4662 420 -463 -844 -468 588 1205 586 -657 -937 -351 551 1015 292 -622 -996 -218 605 946 533 -567
4681 -567 -846 -172 612 909 90 -667 -945 -344 641 895 8 -775 -986 -271 745 888 427 -689 -987
4700 -987 -105 771 794 151 -988 -977 -156 811 877 202 -1032 -875 46 767 826 88 -790 -703 -123 934 870
4721 870 -68 -896 -757 255 887 812 -151 -969 -721 223 1008 578 -163 -753 -704 272 888 772 -333 -798
4741 -798 -617 368 1125 737 -384 -1103 -614 372 884 505 -389 -930 -501 281 992 610 -353 -1048 -380 240
$$ packed form
4604h37L4Q70R70q2r25j024J71R54Q29l7j177p39J64J079O54k1j083o80Q8J080
4624B88P18k27r86p46K06Q81J092m35j004r76N32R06P96n19q90p87N03Q80P81
4643A013k90r90n78L31Q31O93k07j330m12K99J206L41l02r76n40N87P96L68m20
4662D20q83l81L76J056O17o19j243k80N86R02M64p23r14l74P78Q23L41m13j100
4681e67k79O74P84K97q19p57k78O01R85K54q87p83k11P15J016J43m61j116k98
4700i87Q82Q76K3o43j139J1Q21R67O6o75j234J57R21P21N9p38q78Q7N80J057o4
4721H70r38q28J39J012O32p5r63q18K48R44P85m30p41n90M9R76O16j16j105m65
4741g98J81R85P57l88j121p19M89R86N12l79q94n41M29P82P11l82r63o95O68O20
$$ plain form
4761 240 819 534 -468 -832 -400 433 821 327 -502 -922 -486 511 640 392 -456 -777 -237 532 979 280
4781 280 -601 -866 -498 479 961 232 -523 -759 -455 564 840 244 -701 -730 -335 548 686 315 -688 -939
4801 -939 -67 845 1065 160 -573 -909 119 850 751 110 -780 -953 -179 706 929 32 -769 -742 70 915
4821 915 666 75 -768 -754 -87 746 771 -88 -854 -735 111 763 696 -37 -880 -642 283 851 656 -194 -765
4842 -765 -643 174 901 803 -316 -560 -682 171 690 596 -125 -863 -420 71 965 521 -144 -804 -423 432
4862 432 747 559 -600 -831 -519 296 778 473 -562 -912 -360 460 904 306 -545 -1030 -440 367 909
4881 909 347 -472 -781 -389 673 851 384 -343 -924 -305 573 790 295 -527 -743 -140 584 779 198 -360
4901 -360 -910 -320 449 778 412 -761 -745 -74 684 725 124 -625 -790 17 561 835 79 -657 -787 -98
$$ packed form
4761B40N79k85j002l64M32Q33L88m94q29m20M36R97J29k48q48l21N40P69M47o99
4781B80q81k65L68R77M82p29p55k36L04J019K76n96r45k9L95Q83J38l71j003k51
4801i39Q72R12K20r05p33l36J028P31r9o41q90j73P74Q85K23q97q01K7Q12Q45
4821I15k49n91q43J4O67Q33K5q59p66J19Q46O52o7p33q43K38R25N68j95q50n71
4842g65J22Q17P27r8j119k44j22Q53N19r4p21p38M43M91Q94m44o65o60L81Q55
4862D32L15j88j159k31L12Q15M82l05j035l50N52Q20M44n98q51m85N90Q07N42
4881I09n62q19l09L92J062J78m67p27n81O19Q78K17m95q22k16O03P24J95n81n58
4901c60n50N90P69L29l66j173J6O71P58M1o01p49j65Q07N44K74p56p36j30O89
$$ plain form
4921 -98 594 665 96 -528 -668 55 856 841 15 -718 -776 -30 706 526 47 -739 -652 67 656 573 -127 -694
4943 -694 -677 173 829 622 -50 -766 -625 210 660 603 -205 -862 -684 389 850 669 -321 -676 -481 395
4963 395 632 418 -343 -825 -467 228 912 444 -480 -633 -474 430 750 479 -386 -745 -390 363 653 404
4983 404 -373 -756 -217 398 961 267 -553 -765 -289 417 710 524 -611 -631 -285 475 848 384 -633 -894
5003 -894 -250 470 697 149 -407 -470 -217 653 911 252 -668 -543 -332 642 520 172 -561 -788 -12 460
5023 460 634 2 -397 -573 68 412 680 20 -605 -617 17 650 727 11 -666 -496 -95 675 577 -83 -809
5044 -809 -714 -39 554 554 -46 -581 -645 73 808 510 -145 -650 -609 18 779 602 -124 -701 -571 218 712 380
5066 380 -262 -759 -433 193 727 787 -61 -817 -523 240 555 385 -351 -813 -534 220 786 278 -332 -654
$$ packed form
4921i8O92P1n69o24j40P23Q01j5q26p33n8P46P36j80m79p86Q7P19N89q3p00n67
4943f94J7Q50O56k07o72p16J41Q35M50n7q08o57J78J073M61j81r90l55J95Q76
4963C95K37k14p61m82L58O95O84m68r24j53J59R04L20k71q65l59L55P53K90k49
4983D04p77l83N39O15N63o94q20k12M76P06K93j86j135k0L46P60L73m64j017k61
5003h94O44P20K27n48n56o3K53Q70K58o59r20J25K11R74j22l48p33k27P76M72
5023D60J74o32l99j76O41L44K68o60o25j2O34O33P7p16o77J70M01P70r8o60p26
5044h09R5O75N93%o00n35o4P18P35k98o55n05M1O27P61j77p26n77J30P89M94l32
5066C80o42m97L26O26N34O0q48p56K94P63L15j70p36m62K79P54N66n08o10l22
$$ plain form
5086 -654 -356 352 739 190 -314 -690 -284 258 790 349 -206 -776 -323 372 626 189 -467 -559 -388 476
5106 476 646 94 -494 -654 -258 517 779 362 -347 -739 -285 591 777 244 -587 -695 -150 565 606 129
5126 129 -429 -465 -172 444 763 123 -613 -535 -24 702 443 119 -401 -537 25 740 720 17 -499 -491 124 784
5148 784 464 1 -539 -726 134 637 364 -84 -659 -471 70 690 490 135 -733 -663 236 629 545 -351 -610
5169 -610 -481 200 714 428 -131 -490 -460 188 652 574 -269 -634 -190 254 610 343 -204 -449 -336 78 797
5190 797 326 -116 -565 -380 191 488 375 -516 -698 -405 458 814 258 -303 -611 -288 491 523 393 -392
5210 -392 -617 -200 235 536 185 -614 -583 -312 399 581 249 -414 -607 -344 426 690 44 -510 -464 -48 524
5231 524 524 188 -502 -569 87 346 664 260 -633 -642 69 414 484 8 -376 -499 -171 502 737 92 -566 -647
$$ packed form
5086f54K98P08L87n49n04l76M06N42N32m41n55n70M53O95K54m37o56r2J71Q64
5106D76J70n52n88j60L96P75K62m17p09l92M54Q76J86n33q31j08N45P15M1m77
5126A29n58l6K93O16L19o40p36P8N11P26k59l24n20j36N62P15k0p03n16QO15O60
5148G84l20m63n40j87Q60N03k73m48n75J88N41O20k00l55q68P0Q99L93q4q96k59
5169f10J29O81N14k86n59l59L0O48M64p8q43l65M44M44L56k67n47k45J13M14P19
5190G97m71m42m49J85N71K97j13q91j82K93Q63L56n56n61l08L23P79L2j30p85
5210c92k25M17M35L01l51p99L1K71P11J82l32o63j93K63P70K64o46n54M6M16N72
5231E24%l36o90o7O56K59L18m04q93rP11L45P0m76l84j23L28O73K35o45o58q1
$$ plain form
5253 -647 -78 495 507 -127 -407 -452 218 593 653 -180 -580 -605 73 793 591 146 -426 -498 -16 654 310 -112
5275 -112 -548 -415 12 485 447 -140 -652 -534 368 469 316 -168 -577 -359 392 677 292 -339 -653 -434
5295 -434 259 647 358 -238 -489 -150 189 546 275 -349 -736 -81 203 581 433 -325 -573 -175 243 697
5315 697 210 -338 -581 -75 493 535 177 -430 -482 -206 400 465 114 -530 -659 -192 579 714 74 -394 -573
5336 -573 -197 416 525 124 -319 -323 -87 252 497 36 -394 -600 25 446 526 54 -468 -535 140 453 604
5357 604 289 -592 -431 -33 394 376 -81 -380 -547 -94 634 600 -348 -532 -361 -37 502 574 -59 -458 -294
5378 -294 -7 539 288 -101 -601 -305 135 415 382 -291 -622 -422 204 513 412 9 -675 -488 300 550
5398 550 519 -275 -510 -260 207 500 321 -306 -695 -189 166 643 275 -390 -540 -311 96 446 509 -246 -491
$$ packed form
5253f47N69N73J2o34k80m5O70L75O0q33m00k5O78P20k02m45n72p2M82O70l44m22
5275a12m36J33M27M73l8n87n12J18R02J01j53m84m09K18P51K85l85o31l14K19
5295d34O93L88k89n96k51L39L39L57k71o24l87O55K84L78j48p58k48L98M18M54
5315F97m87n48k43N06N68M2l58o07n2K76O06O5l51o44j29M67P71J35o40m68j79
5336e73L76O13J09m01m43mK36L39K45m61m30k06O25M21Q0m72n22o7O75L13J51
5357F04l15q81J61L98M27j8m57k99j67M53P28l4r48j84J71L24N39P2o33l99J64
5378b94K87N46k51l89n00K96M40K80l3o73l31K00O26L09j01m03o84J87P88K50
5398E50l1p94k35K50M67K93j79o27l89N06L55M77l68o65j50K29M07L50O3p55k45
$$ plain form
5419 -491 -375 125 461 288 -88 -288 -231 404 608 240 -330 -487 -283 472 373 169 -215 -540 -327 281 511
5440 511 46 -441 -491 68 398 460 169 -210 -363 -103 244 596 43 -552 -484 -4 494 422 -22 -383 -375 46
5462 46 501 649 -65 -555 -599 -68 412 533 -141 -521 -383 -133 412 531 79 -530 -287 148 312 340 -138
5483 -138 -414 -382 86 471 230 -167 -356 -299 200 512 387 -121 -659 -411 222 300 312 -233 -557 -379 113
5504 113 453 112 -161 -646 -333 204 546 367 -156 -560 -81 248 701 383 -297 -668 -301 139 490 330
5524 330 -199 -374 -292 415 479 247 -330 -578 -227 262 389 326 -337 -392 -196 209 475 65 -206 -473 -190
5545 -190 386 542 84 -305 -316 -244 538 525 134 -459 -437 -148 271 520 -33 -578 -656 -2 415 350 192 -543
5567 -543 -483 6 440 587 -122 -292 -306 -22 523 301 190 -463 -292 109 427 543 -198 -298 -408 67 473
$$ packed form
5419d91J16N00L36j73l76k00N7O35K04l68n70j57K04P55r9k04l84l25K13O08K30
5440E11m65m87n0N59L30O2k91l79j53K60L47L52n53n95O8M80M98p2m44l61QM21
5462D6M55J48p14m90m4N31M80J21o74l80J38K50N45J19m52o09K43M35J64K8m78
5483a38k76L2M68L85k41l97j89N7M99L12j25n08n38K48O33P8J2n45l24J78M92
5504A13L40l41k73m85L13N37L42j79n23m04M79L29M53l18o80l71L67M40L51j60
5524C30n29j75Q2P07O4k32n77k48L51M89J27o3o63n5J96M05K66m10k71k67K83
5545a90N76J56m58l89j1P2P82j3l91n93K2K89M19K49n53n45p8O54M17o5j58p35
5567e43O0M89M34J47p09j70j4K84N45k22j11o53J71M01L18J16p41j00j10M75M06
$$ plain form
5588 473 470 -27 -272 -504 79 401 209 -201 -499 -294 183 387 503 -128 -373 -296 231 368 372 15 -252 -329
5610 -329 270 428 171 -457 -582 -485 138 529 290 -101 -489 -348 192 383 282 -166 -496 -110 279 456
5630 456 168 -96 -402 -162 201 497 250 -250 -434 -125 331 612 222 -188 -556 -159 267 258 204 -358 -558
5651 -558 -145 159 608 94 -371 -462 28 206 307 200 -444 -490 -95 482 374 52 -362 -486 -138 234 252
5672 252 -106 -417 -397 -16 368 288 20 -378 -444 9 259 308 136 -359 -457 -36 442 370 -42 -424 -446 19
5694 19 473 259 -12 -344 -307 56 393 447 -225 -459 -287 160 198 338 -248 -538 -232 15 498 399 -150 -556
5716 -556 -430 35 553 292 -62 -400 -369 173 496 225 -91 -423 -276 149 159 135 -124 -284 -263 354 353 371
5738 371 -287 -411 -228 350 446 408 -265 -549 -172 194 536 198 -214 -327 -146 168 494 125 -242 -499 -142
$$ packed form
5588D73lm97k45k32N83L22j92m10k98K05M77K04J16o31k45P7N27J37Ml57k67p7
5610c29N99J58k57o28j25R7O23L91k39l91l88J41N40J91j01m48l30L86L89J77
5630D56k88k64l06K40L63K96k47n00j84L09M56K81l90m10l68L97M26rn4n62k00
5651e58M13L04M49n14m65r1M90J78J01j07o44m6L95N77j08l22m14j24L48L72J8
5672B52l58l11K0L81L84q0k68l98o6M53K50M9j72m95r8M21M78p2m12l82k2M65
5694A9M54k14k71l32L7L63L37N4o72k34J72M47L8J40n86k90L06K47M83r9n49m06
5716e56J26M65N18k61l54l38L1N42L23k71l16l32J47M25J0k4k59j60K1O17jJ8
5738C71o58j24J83N78R6l8o73k84L77L66L42l38m12j13J81L14L26l69l67k57L57
$$ plain form
5759 -142 461 517 -74 -190 -551 -184 345 314 59 -146 -399 -79 337 302 91 -383 -436 -27 184 327 14
5780 14 -471 -359 25 176 308 -122 -267 -367 11 438 183 -27 -352 -261 14 372 353 61 -361 -290 -71
5801 -71 303 439 -118 -406 -384 204 475 397 -4 -333 -312 161 487 369 -147 -234 -228 4 438 387 -61 -347 -247
5824 -247 210 331 249 -83 -398 -347 110 509 234 78 -285 -210 290 469 369 -161 -399 -344 166 403 430 -143
5846 -143 -522 -128 247 303 89 -218 -437 6 233 484 242 -511 -254 -35 256 403 65 -276 -322 -1 189
5867 189 290 80 -298 -504 -95 336 461 136 -455 -334 -31 427 373 30 -211 -444 57 182 454 195
5887 195 -154 -194 7 229 433 -131 -297 -334 -18 430 317 -13 -318 -199 106 291 243 80 -415 -380 -9
5908 -9 473 384 -108 -301 -349 115 217 324 49 -257 -246 192 278 223 -123 -304 -232 121 549 344 -72 -291 -149
$$ packed form
5759a42O03N6n91j16l61L67N29l1k55k05k53L20M16l5k11m74n3M09K11J43l13
5780A4m85J12L84J51J32m30j45j00L78M27k55k10l25R1K75L58j9k92m22P1K19
5801g1L74J36n57k88K2N88K71p8m01l29K1M73L26j18n16q7OK32M34n1m48k86J00
5824b47M57J21q2l32l15N1M57L99k75j56l63P5N00J79j00n30k38N5N10K37K7n73
5846a43l79L94L75N6k14l07k19M43K27K51k42p53K57K19K91J47l38l41m6L21J90
5867A89J01k10l78k06M09M31J25l25n91J21L03M58n4l43k41k33N01J25K72k59
5887A95l49m0K01K22K04n64j66l7L16M48j13l30l05J19L05J85m8j63m95L5L71
5908iM82q9m92j93m8M64J02J07k75l06J1M38Q6n5l46j81P2L53M28k05m16k19J42
$$ plain form
5931 -149 155 280 186 -265 -413 -204 188 397 192 -262 -563 -254 111 540 224 -98 -184 -161 15 394 151
5952 151 -202 -140 -189 162 311 29 -73 -444 -122 220 379 68 -298 -502 -36 359 373 193 -313 -428 -108
5973 -108 389 303 245 0 -389 -435 33 313 14 -223 -247 -46 256 451 2 -212 -344 -95 201 351 189
5994 189 -118 -94 -28 405 -58 -1 -369 -275 -10 358 310 -149 -396 -288 191 279 262 32 -396 -191 49 176
6016 176 265 -26 -407 -270 133 413 365 -190 -378 -236 243 544 257 -127 -218 -151 41 116 134 -144 -147 -309 94
6039 94 332 214 -271 -515 -217 95 155 75 -76 -340 -40 168 306 178 -133 -301 -225 318 295 221 -210 -332
6061 -332 -47 333 291 246 -181 -360 -149 126 360 -8 -222 -298 -125 151 238 157 -374 -408 -116 215 240 293 -191
6084 -191 -390 203 264 349 173 -365 -345 107 335 377 139 -256 -365 45 314 300 3 -442 -547 234 247 248 -168
$$ packed form
5931a49L04J25r4m51j48K09L92K09k05m54l01L09L65M29l16l22q6K3J76L79k43
5952A51l53O2m9L51J49k82j02l71L22L42J59l11l66k04M66L95J4j80n06j15L20
5973a08M97q6n8k45l89m6M68K80k99k37k4K01L02J95m49k14j32K49K96J50j62
5994A89l07K4O6M33m63N7l68R4K65L68m8m59k47J08M79Q8j7k30m28K05K40J27
6016A76Q9k91l81J37M03K80m8n55j88J42M79L01k87l84r1O7J92P5J8k78lj62M03
6039I4K38j18m85k44K98L12O0q0j51k64L00K08J38j28l11j68P6N43k3p4m31j22
6061c32K85L80m2m5m27j79K11K75K34l68k14p6J73K76Q7q1n31l4K92L31K5N3m84
6084a91j99N93O1Q5j76n38K0M52K28M2k38l95j09M10K69j4k97m45j05P81J3Jm16
$$ plain form
6107 -168 -273 -367 46 190 163 -75 -433 -246 147 430 304 58 -346 -396 40 150 242 -148 -126 -363 153 446
6129 446 192 71 -402 -73 7 357 182 19 -210 -269 142 298 269 26 -287 -59 238 270 287 -43 -454 -113
6151 -113 282 475 234 -142 -328 -261 36 258 224 -175 -103 -73 195 333 44 -269 -227 -151 15 206 152 -302
6173 -302 -440 12 -2 404 287 -156 -124 -277 144 230 114 -150 -317 -5 134 304 72 -239 -275 -36 235
6194 235 231 50 -38 -118 69 316 411 138 -167 -175 45 108 205 -119 -146 -185 -202 265 321 -116 -235 -305 -42 412 276
6219 276 139 -213 -131 13 270 253 -26 -292 -241 93 284 275 -127 -59 -403 64 274 162 -125 -426 -115 108
6241 108 182 375 -181 -249 -103 -12 246 363 -244 -207 -208 100 315 243 -87 -403 -182 -4 196 186 -108 -357 -310
6264 -310 86 453 236 -88 -442 -293 289 193 60 -264 -144 -75 166 517 68 103 -384 -55 80 282 -10
$$ packed form
6107a68j05r4M13J44k7k38l58J87L93K83j26k46m04n0M36J10R2l90K2k37N16K93
6129D46k54j21m73L29Q0L50j75j63k29n9M11J56k9k43l13K28K97L2J7l30m11L41
6151a13L95J93k41l76j86O7K97K22l4l99P2L0K68J38k89l13M2P6J66J91n4m54
6173c02j38M52j4M06j17m43L2j53M21Q6j16k64j67L12J39J70k32l11l6K39K71
6194B35mj81q8q0J87K47R5k73l05qK20O3R7l24k7l9j7M67N6m37j19p0K63M54j36
6219B76j37l52Q2J44K57j7k79k66N1L34J91rm02O8l44M67K10j12k87l01L11K23
6241A08P4J93n56o8J46R1K58J17o07L7jL08K15p2l30l16K21J78K00j0k94k49M7
6264c10L96L67k17l24l54J49N82r6j33l24J20O9K41L51m49L5m87L29J35K02k92
$$ plain form
6285 -10 -58 -240 -32 78 89 121 -180 -181 -194 263 148 107 -224 -268 -40 73 263 115 -33 -283 -96 285 274
6308 274 92 -169 -124 -152 240 354 72 -158 -235 -131 223 342 -48 -293 -157 79 382 218 -114 -370 -314
6329 -314 2 230 260 25 -286 -323 -104 225 326 7 -164 -128 -73 332 224 -27 -212 -185 22 352 168 -216
6351 -216 -433 -198 -20 119 104 -32 -285 -83 51 238 304 25 -142 -205 81 242 176 -62 -320 -119 41
6372 41 364 33 -56 -385 -291 48 349 155 -132 -384 -372 73 401 143 -102 -259 -9 260 183 237 -159 -258
6394 -258 -98 104 327 2 -176 -227 -137 230 265 48 -197 -249 -43 330 302 -36 -212 -140 -210 396 374 -99 -160
6417 -160 -326 -54 327 230 170 -259 -323 -361 275 394 28 -168 -414 -17 231 281 -91 -240 -341 45 198 74
6439 74 -122 -312 -284 0 66 339 -212 -230 -117 211 213 100 170 -236 -164 108 133 200 44 -276 -229 -4 194 282
$$ packed form
6285a0m8j82K08J10J1L2l01jj3M57j15m1l31m4K28J13J90j48j48k50J87L81j1
6308B74j82k61M5k8L92J14k82k30p7J04L54J19l90k45J36K36L03j64l32k56N6
6329c14L16K28L0k35l11l7K19L29J01l19j71L6N5M05j08k51j85K7K07L30j84l84
6351b16k17K35J78J39j5j36k53K02J34J87O6k79j67o3K86J61o6k38k58K01J60
6372D1L23l31q9l29R4L39L01j94k87k52J2M45L28k58k45j57K50K69p7N4l96r9
6394b58J60K02K23l25j78n1R0L67L5k17k45n2K06L73k8l38j76P2p0O06k2m73o1
6417a60j66K72L81r7o0m29o4l8O36J19l66j96k46L97K48N0l72j49j01L86J53j24
6439G4j96j90K8K84O6K73n51j8J13L28Kj13P0m06P2K72K5O7j56l20M7K25J98Q8
$$ plain form
6463 282 -23 -116 -276 -114 383 159 -70 -269 -77 132 359 235 86 -251 -222 172 182 166 -160 -246 60 -31
6485 -31 190 91 -55 -135 -215 -19 376 224 62 -144 -285 246 72 212 -240 -302 -56 158 463 82 -229 -351
6507 -351 -175 -32 252 126 -101 -318 -51 260 123 -51 -249 -219 -192 127 185 -61 -61 -381 -100 12 307 -9
6529 -9 -256 -137 -60 278 363 -171 -272 -343 93 245 160 105 -224 8 -36 155 171 -31 47 -120 -89 70 147 7
6553 7 -262 -261 23 211 243 -83 -137 -257 10 114 298 43 -295 -257 30 229 151 -115 -200 -129 -7 218 224 94
6577 94 -210 -88 -6 39 113 -193 -315 -119 44 214 84 12 -168 -116 91 294 94 93 -332 -185 180 124 145
6600 145 -142 -209 -140 -18 44 181 -41 -111 20 63 233 357 -150 -22 -251 103 248 15 -122 -257 234 204
6622 204 212 109 -15 -220 93 225 320 111 -229 -13 31 147 238 158 -256 -203 -149 217 272 69 -222 -253 120
$$ packed form
6463B82l05r3j60J62M97k24k29j99J92K09K27j24j49l37K9L94J0j6l26q6L06r1
6485c1K21r9j46q0q0J96L95j52j62k06j41N31j74J40m52o2K46K14L05l81l11j22
6507c51J76J43K84j26k27k17K67L11j37j74j98L0K7L19N8k46%l20K81J12K95l16
6529ik47J19P7L38Q5n34j01p1M36J52q5n5l29K32m4J91J6k02P8j67L1J59P7j40
6553Gk69JK84J88L2l26n4j20K67J04J84k55l38L8K87J99p8k66q5P1J22K25Oj30
6577I4l04J22Q2M5P4l06j22J96J63J70j30p2j80N2K07K03k00jm25J47L65n6K1
6600A45k87o7O9J22O2J37k22p0J31M3J70J24n07J28k29L54J45k33j37j35M91l0
6622B04Qj03j24k05L13J32R5k09l40K16M4J16R1q0m14N3N4L66N5k03k91l1L73
$$ plain form
6645 120 4 112 62 -100 -186 -94 52 258 133 -150 -202 -57 97 213 -96 -204 -144 191 253 92 -31 -175
6667 -175 -328 69 434 43 30 -256 -151 -111 70 84 -40 -91 -233 61 -6 168 46 -287 -135 72 264 285
6689 285 -131 -178 -42 172 83 92 126 -235 -100 -83 154 10 -96 -276 -181 227 211 152 -128 -351 -152 10 215
6712 215 50 -329 -146 -69 61 166 170 -176 -93 -69 169 -51 -69 -174 72 -85 40 92 134 -108 -60 -36 -11 116
6736 116 -10 -165 -269 -152 259 221 123 -181 -131 -34 163 82 149 -142 -324 35 143 198 -125 -79 -244 -120 88
6759 88 243 -74 -205 -204 67 149 222 -11 -183 60 -75 85 107 15 -148 -228 -59 -72 245 -160 -197 -297 -22
6782 -22 252 123 82 -210 -209 12 248 104 -100 -229 -111 78 332 130 151 -368 -52 22 251 249 -145 68 -97
6805 -97 182 161 -35 -132 -202 -71 -21 -50 172 -119 -218 -78 89 160 85 -141 -207 6 129 261 174 10 -165 -59
$$ packed form
6645A20j16J08n0j62q6R2J46K06j25k83n2J45J54J16l09j08O0L35O2j61j23j44
6667a75j53L97L65l91j3k86J05M0J81J4j24n1j42K94o7J74j22l33J52K07J92K1
6689B85m16m7J36K14q9RL4l61J35J7K37j44j06j80R5M08j6n9k80k23J99J62K05
6712B15j65l79J83P7J30J05Ml46Q3K4K38k20j8j05K46j57J25N2M2k42M8K4K5J27
6736A16j26j55j04J17M11l8r8l04N0R7J97q1O7k91j82L59J08N5l23M6j65J24K08
6759H8J55l17j31JK71Q2P3k33j72K43j35J60K2r2j63q0J69j3L17m05l7j00K75
6782b2K74j29m1k92JK21K36j44k04j29J18J89K54k02K1n19L16P4K29kl94K13j65
6805i7K79k1j96r7p0J31N0k9K22k91r9J40J67P1p5k26o6K13J23J32q7j64j75J06
$$ plain form
6829 -59 105 114 193 -139 -167 -112 100 196 131 -231 -167 -122 130 288 11 -69 -171 74 82 157 -39 -8 -320 -81 -71
6854 -71 16 108 -276 -175 -137 157 194 -103 -123 -278 -118 223 129 88 -50 -294 6 130 131 -57 -12 -105 68 210
6878 210 -26 -52 -123 -80 13 0 8 -50 -22 -50 -17 270 39 1 -194 25 -50 215 240 -139 -216 -84 88 124 28 -47
6904 -47 -126 -68 184 265 250 -75 -114 -29 12 29 -19 -227 -35 -200 30 163 177 -91 -274 -96 -1 280 110 -249
6928 -249 -226 75 -152 106 -42 -75 -209 18 93 57 45 -203 -155 15 -31 25 -2 -71 -163 -80 264 226 -207 -124 -28
6953 -28 -127 122 318 -51 -13 -255 18 77 190 97 24 -271 -79 297 211 14 -36 -188 65 114 189 -232 -182 -91
6977 -91 212 40 50 -52 -75 -296 -136 122 152 72 -193 -73 93 21 50 33 -237 -276 -57 291 192 -44 -193
7000 -193 -83 -8 143 128 123 -185 -234 -212 -31 127 19 -83 -110 159 197 85 -43 -121 -156 -141 203 175 74 -455
$$ packed form
6829e9J64RP9l32k8N5K12R6o5l62O4M5K52J58k77q0j02K45QP5j96L1l12K39J0
6854g1Q7R2l84J01L8K94L7k97k0j55J60L41r4m1j38k44L00J24Jj88M5r3J73J42
6878B10k36k6p1M3R3j3Qn8K8k8L3K87k31l8j95K19p5K65K5l79p7J32J72L6r6p5
6904d7p9N8K52Q1j5l25l9Q5M1J7m8k08J92j65K30J33J4k68j83J78R5K81j70l59
6928b49K3L01k27K58j48l3j34K27P5l6j2k48M8J70m6N6k7o9r2Q3L44l8m33Q3R6
6953b8r9K49J96l69L8k42K73N9J13r3p3k95J92L76q6j97n0j52K53M9P5m21N0R1
6977i1L03j72J0j02k3k21J60K58L0q0k65J20J66p2K9j7k70l9K19L48r9k36j49
7000a93J10P5J51j5nl08m9K2J81J58j08j02k7K69L8j12j28p8l5J5L44k8j01n29
$$ plain form
7024 -455 -225 88 352 178 -259 -329 -157 -8 177 104 -126 -86 -94 23 81 175 -195 -199 -15 84 154 -162 69 -50
7048 -50 -203 109 146 335 -168 -104 8 113 130 4 -103 39 -404 85 162 90 -23 -62 0 137 34 -34 -86
7071 -86 1 -121 182 164 136 -62 -75 67 127 -44 108 -63 -202 -20 24 225 29 -177 -196 -35 109 18 96
7094 96 222 -301 21 -13 35 103 -232 -139 -73 128 127 16 105 -92 28 72 171 30 -242 -32 -2 82 166 22 -215
7119 -215 -125 8 74 136 -265 -302 6 128 75 335 -140 -39 -199 56 109 5 93 43 -123 27 143 86 59
7142 59 -52 -48 161 243 22 -85 -231 -36 226 -43 73 -43 -238 -146 231 17 66 -59 -85 47 -63 152
7164 152 57 -69 -120 -160 26 4 79 -78 -185 -166 137 149 119 -141 -180 -13 163 330 228 -130 -203 10 151
7187 151 189 54 -208 -115 43 -24 140 -101 -268 -30 -60 4 302 49 -75 -203 -113 90 212 1 -4 -151 -181
$$ packed form
7024d55K30L13K64j74m37p0J72J49J85p3k30M0qJ17N8R4l70mJ84R9P0l16K31j19
7048e0j53L12L7J89n03O4J12J05J7j26j07J42m43M89P7p2j13l9O2J37j03o8n2
7071h6Q7j22L03j8k8j98j3J42O0j71J52j71j39J82M4K01j96k06j9J61J44r1P8
7094I6J26n23L22l4M8O8l35R3O6K01jj11Q9j97J20M4R9j41k72K10L0Q4Q4j44k37
7119b15R0J33O6O2m01l7L08J22n3K60m75J01j60K55N3j04Q8n0j66J50J16n7k7
7142E9j11MK09Q2k21j07j46J95K62k69J16j16j95R2L77k14M9j25k6J32j10K15
7164A52r5j26n1m0J86k2P5j57j07J9L03J2l0k60l9J67J76J67j02l58p3K13J41
7187A51L8j35k62R3J58o7J64k41j67K38l0O4K98k53j24j28R0K03J22k11nj47l0
$$ plain form
7210 -181 96 -12 -3 15 -237 56 -58 8 -19 -33 -249 -73 0 125 -83 -48 -252 -42 112 16 22 -181 -21 -8
7234 -8 41 49 -86 -39 -160 193 -11 222 -12 -216 -19 144 260 186 41 -139 -113 -79 174 9 -91 42 -249
7257 -249 -176 267 226 14 -72 38 20 244 197 33 -181 -165 -94 123 151 -86 -168 -30 -24 184 132 -88 -117 -66 41
7282 41 167 88 122 49 -49 28 32 110 64 -39 -154 12 157 39 21 -119 -29 90 228 2 -103 -118 97 138 383
7307 383 98 -154 -156 -155 29 111 22 -194 -19 -38 92 106 47 -190 -165 62 85 -58 -157 -95 -10 -179 101 4 -30
7332 -30 -33 9 -33 136 319 71 -15 -139 158 104 345 -95 -261 -100 24 172 110 -86 -146 -119 -63 224 41 -22
7356 -22 -210 -57 -5 183 -36 95 -222 19 84 290 77 91 -13 -4 -88 211 163 71 -100 -166 52 -68 -74 -80 -100
7381 -100 -194 141 261 48 -116 -174 -287 16 152 223 -6 -127 -150 41 -162 44 103 -1 25 63 281 67
$$ packed form
7210a81K77j08RJ8k52K93j14O6k7j4k16J76P3J25k08L5k04K10J54r6Ok03J60J3
7234hM9Qj35M7j21L53k04K33k34k04J97J63J16p4j45j80K6L4K53j65j00J33k91
7257b49P3M43m1k12q6J10j8K24m7j64k14J6P1K17K8k37q2J38OK08n2k20k9N1J07
7282D1J26p9L4p3r8P7MP8m6j03j15J66J45j18j8j40R0J19J38k26j05j5K15M1K45
7307C83k85k52kJJ84Q2q9k16J75j9J30J4n9k37K5K27K3j43r9O2Q5j69K80r7l4
7332c0lM2m2J69J83k48q6j24K97n4K41m40j66J61J24J48o2j96o0K7N6K87j83o3
7356b2j88J53N2J88k19J31l17K41O5K06k13J4j04Rq4K99m8r2j71o6K18j20ook0
7381a00r4L35J20k13j64n8j13L03J36P1k29j21k3J91k03K06N9j04K6L8K18k14
$$ plain form
7403 67 -214 -27 -98 163 51 -197 -74 -132 -156 72 174 -31 -275 -105 110 -66 89 43 26 -42 -83 -146 198
7426 198 33 24 15 88 -24 63 179 -52 -46 -84 140 -108 -68 -63 -64 145 148 56 133 49 -207 56 53 110 -52 -83 -146 -29
7454 -29 127 92 116 -235 -194 47 114 7 9 -147 -177 -80 155 87 14 -91 50 -85 153 121 20 -61 -200 49
7478 49 273 40 -119 -59 -39 254 157 -86 12 -242 -121 -54 51 -32 -205 -75 -3 -59 -13 -40 -6 -130 -157 86
7502 86 -56 162 -23 79 2 131 203 122 -144 -34 -95 20 122 105 -69 -205 -193 33 174 47 -12 5 -102
7525 -102 147 141 148 -290 -55 -33 103 26 92 -147 -120 128 106 191 -127 52 -118 -83 196 343 17 -73 -81 38 229
7550 229 146 77 -72 -75 -243 31 -19 105 -332 -54 11 124 138 64 -94 17 -28 153 259 -199 -130 -185 -30 48
7574 48 32 -106 -69 33 110 243 71 -101 8 -67 123 63 102 -60 -134 -132 197 53 59 86 -210 -5 -18 44 112
$$ packed form
7403F7k81J87p1K61j12k48J23n8k4K28J02k05k44J70K15j76J55m6j7o8m1o3L44
7426A98j65rrP3j12Q7J16k31Ol8K24k48M0NjK09Lr2P7q4k56K63lN7j62l1o3J17
7454b9J56l5K4l51M1K41O7j07Kj56l0R7K35o8p3j05J41j35K38l2j01q1j39K49
7478D9K24k33j59O0K0K93r7k43R8k54J21O7J05q3j73J30P2n6M6k7L4j24k7K43
7502H6j42K18j85J02p7J29P2q1k66J10o1J15J02j7j74j36J2K26J41j27n9J7j07
7525a02K49oPm38K35K2J36p7O6k39K7K48k2Q5l18J79j70L5K79J47l26r0qJ19J91
7550B29q3o9j49lj68K74n0J24m37K78O5J13J4p4j58J11m5J81J06m58O9n5J55P8
7574D8j6j38L7J02P7J33j72j72J09p5J90o0L9j62p4KL29j44OK7k96K05j3O2O8
$$ plain form
7599 112 50 -144 3 40 173 81 -132 -74 -160 40 235 35 -27 38 -135 92 146 55 -26 -251 -109 213 10
7622 10 -48 -196 -34 9 -24 116 -238 -137 -26 57 -11 134 114 -269 -163 56 96 91 132 -194 -216 -46 116 65
7646 65 79 -88 -161 -150 -45 111 10 -170 -89 38 -1 -35 254 -76 -42 -20 236 96 -141 -53 -91 134 41 235
7670 235 -95 2 -146 29 4 302 -5 -75 14 -10 157 150 50 -40 56 166 126 120 100 -37 -231 93 16 194 -232
7695 -232 36 48 -154 148 213 -50 -70 116 23 388 -47 -166 12 -94 92 189 185 -143 0 -77 -27 240 -57
7718 -57 123 -228 121 67 66 -6 -50 -180 -3 202 180 36 -107 -70 -67 -3 90 -24 -55 -314 -83 28 -52 -35 -94
7743 -94 -75 -128 69 104 21 -137 -161 -29 -26 108 269 -113 75 -112 110 91 -133 -100 -89 -7 296 -53 -38 -48 -114
7768 -114 -94 107 260 162 -246 -14 71 140 -19 -46 -150 -215 -89 40 -12 46 15 -325 -210 196 319 -34 -64
$$ packed form
7599A12o2j94J47L7J33r2k13N8q6K00J95k00o2O5j73K27N4r1q1k25J42L22k03
7622A0n8j48J62M3l3J40l54J01J11Q3o8J45k0l83J06K19M0nM1l26k2J70J62n1
7646F5J4j67p3J1J05J56j01j80Q1J27l9l4K89l30L4K2K56j40k37Q8l8K25r3J94
7670B35l30R7j48J75k5K98l07p0Q9k4J67pj00r0R6J10m0ok0j37j94L24p7J78m26
7695b32K68J2k02L02O5k63k0J86r3L65m35j19J78j06J86R7ml28J43p7N0K67k97
7718e7J80l51L49n4jp2m4j30J77K05k2j44j43L7LO4R3j14l1k59K31J11q0J7n9
7743i4J9n3J97L5q3j58k4J32LJ34J61l82J88j87K22j9k24L3J1Q2L03l49J5j0o6
7768a14K0K01J53r8m08K32Q5O9j59k7j04o5J26J29n2N8l1l40J15M06J23l53l0
$$ plain form
7791 -64 -178 11 -4 246 116 -174 -128 -224 149 305 -199 18 -170 -38 246 240 -98 -132 -118 -81 316 60 -36
7814 -36 -162 -127 93 78 135 -119 -104 113 -56 87 -142 -85 -180 -91 14 104 200 -90 64 173 88 89 19 83 -123
7839 -123 117 152 -135 140 98 -257 -44 233 3 55 -52 -73 4 44 63 133 -24 89 -236 41 216 15 -39
7862 -39 -184 147 -13 171 16 -120 -144 -171 143 96 -56 -127 -111 163 200 113 158 -141 -36 -35 103 48 -33 -72 -164
7887 -164 -101 299 172 71 -12 -83 -55 124 65 -45 -149 104 16 89 242 -30 -50 -130 155 17 212 89 -151
7910 -151 -113 -268 290 192 -68 -101 81 7 248 74 -135 -159 -227 -62 219 33 296 -252 -106 42 78 59 -16
7933 -16 -75 -229 -139 154 86 87 -94 -110 71 139 -22 66 -170 -217 105 171 61 47 -279 -147 58 -103 256 -32
7957 -32 -80 92 16 49 186 -106 88 10 -69 123 97 33 -222 -87 78 217 54 -173 -85 40 106 -105 111
$$ packed form
7791f4j14J89j5K50j30k90M6r6L73J56n04K17j88J32K84ol38l4J4L7L97k56r6
7814c6j26L5K20j5N7k54J5K17j69J43k29N7r5Q9J05R0R6k90J54J09q5Jp0O4k06
7839a23K40L5k87K75m2l55K13K77k30N2j07k1P7M0J9P0j57J13l25K77J75k01n4
7862c9j45L31j60J84j55j36k4k7L14m7j52p1J6K74L7q7M5k99J05JJ38n5q1l9r2
7887a64O3M00j27j01q3p1K8J79n9j10j04K53q8P3J53k72k0q0K85j38J95j23k40
7910a51L8j55N58r8k60l3J82p4K41j74k09k4o8J65K81j86K63n48J46J48L6j9p5
7933a6n9j54R0K93o8Jj81j6J81O8j61Q8k36m7L22O6j10j4l26J32K05j61L59k88
7957c2m8J72p6L3J37k92J94p8p9J92k6o4k55J35J65J39j63k27Q8J25O6k11K16
$$ plain form
7980 111 -95 -17 9 203 44 58 -149 -17 -68 97 15 -68 -30 -172 128 196 -43 -116 18 -178 12 170 187
8003 187 15 -79 -5 230 136 163 132 -28 -58 15 -14 30 17 -80 -115 60 -118 188 108 -149 -50 -100 107 -19 -133
8028 -133 -51 -220 -51 203 297 -27 -50 -197 59 -6 59 23 -229 24 -35 -23 -27 -51 -202 -7 -125 72 5 -130
8052 -130 -16 4 73 143 111 47 -186 -94 102 169 104 77 -113 -20 157 289 -27 84 137 -168 -109 187 -128 -55
8076 -55 -18 -146 126 86 154 -89 -89 -124 -13 133 -20 26 -178 -222 126 112 -77 -98 -201 -216 41 184 246 -162
8100 -162 -234 -358 11 249 -57 -173 -109 35 87 88 -18 -124 -308 18 38 256 140 -7 -170 -201 92 35 45
8123 45 25 18 92 141 115 92 44 -270 -171 105 134 -164 15 -65 58 -10 117 25 -95 -268 -13 -52 86 107 -33
8148 -33 -32 -69 264 55 -27 -175 -79 159 -66 144 -83 12 112 99 127 132 145 -108 -55 22 193 146 85 -120 -178 33
$$ packed form
7980A11k06P8K6J94j59J4k07J32n1J65q2q3L8j42L00O8k39p3J34j96J90J58J7
8003A87j72r4P4K35r4K7l1j60l0P3k9M4j3r7l5J75j78L06q0k57R9n0K07j26j14
8028a33Q2j69J69K54R4l24k3j47K56o5O5l6k52K53n9J2mk4j51J95j18J97o7j35
8052a30J14K0O9P0l2o4k33R2J96O7o5k7j90R3J77J32l16J11N3l05N9K96l15P3
8076e5L7j28K72m0O8k43%l5J11J46j53M6k04m4L48j4j89k1j03j5K57J43O2m08
8100a62p2j24L69K38l06j16O4J44N2Jj06j06j84L26K0K18j16j47j63l1K93n7J0
8123D5k0pP4M9k6k3m8l14R9K76K9k98J79q0J23o8J27r2j20j73K55l9J38K1j40
8148c3Jl7L33k09q2j48R6K38k25K10k27R5J00j3K8NJ3k53N3P7J71m7o1k05n8K11
$$ plain form
8174 33 142 25 26 -218 -130 98 94 175 -157 -126 33 183 145 150 -132 -81 -105
$$ packed form
8174C3J09j17Jk44Q8K28mQ1l32L1J59J50l8Nk82N1k4
8191a05
$$ Imaginary data points
##PAGE= N=2
##DATA TABLE= (X++(I..I)), XYDATA
$$ plain form
0 0 0 0 0 0 0 0 0 0 0 8 -8 8 -8 8 -8 16 -16 16 -24 26 -32 38 -42 48 -56 64 -72 82 -92 105 -118 132 -147
33 -147 167 -183 205 -229 253 -279 312 -344 380 -421 469 -516 576 -638 712 -798 898 -1016 1162
52 1162 -1339 1568 -1872 2302 -2946 4027 -6181 12158 -62690 -234877 -120001 93153 198875
65 198875 88462 -94038 -178321 -86463 75133 160425 85971 -72288 -165028 -92458 74658
76 74658 171131 91826 -84486 -180352 -90212 94253 184724 85005 -101253 -185181 -79214
87 -79214 107724 182203 66116 -114906 -171644 -52473 111364 154108 41464 -107017 -147810
98 -147810 -45448 99010 145397 45154 -106452 -156100 -49246 108031 155480 41227 -120232
109 -120232 -162296 -39283 121538 154091 25982 -130488 -153429 -19684 130566 141097 3976
$$ packed form
0@%%%%%%%%%Qj6J6j6J6j6K4l2L2m0N0n8P0q0R0j04J20j36J54j74J97k23K50k79
33a47L14l50L88m34M82n32N91o56P24q01Q90r85J092j214J350j510J696j914K178
52A162k501K907l440M174n248O973j0208J8339p4848j72187J14876K13154J05722
65A98875j10413j82500q4283R1858J61596Q5292p4454j58259r2740P2570J67116
76G4658R6473p9305j76312r5866R0140J84465R0471r9719j86258q3928J05967
87g9214J86938P4479j16087j81022n6738J19171J63837M2744j12644j48481m0793
98a47810J02362J44458M6387j00243j51606m9648J06854J57277M7449j14253j61459
109a20232m2064J23013J60821L2553j28109j56470k2941J33745J50250J0531j37121
$$ plain form
120 3976 -134528 -132507 1814 126289 118937 -3472 -117786 -118926 -7921 112828 127362
131 127362 13107 -121489 -137368 -9015 134813 138563 -6777 -146120 -128220 24578 146291
142 146291 111798 -34644 -138370 -99554 34421 129232 95916 -29167 -125281 -98502 25318
153 25318 124684 100964 -24114 -127952 -104528 27471 134658 102960 -37789 -140527 -96053
164 -96053 49455 142081 85079 -58934 -138467 -75446 61915 132784 69226 -60641 -126358
175 -126358 -66996 56428 123838 69782 -54587 -124880 -69037 57488 126201 67142 -60712
186 -60712 -127498 -63358 67272 130798 59632 -74818 -132641 -51020 84148 130429 41908
197 41908 -86198 -122656 -34396 84649 115266 31898 -77880 -108061 -33827 72799 110161
$$ packed form
120C976j38504K021J34321J24475p352j22409j14314j140J11005J20749J4534
131A27362j14255j34596j5879J28353J43828L750j45340j39343J7900J52798J21713
142A46291l4493j46442j03726L8816J33975R4811l3316j25083r6114K6779J23820
153B5318R9366k3720j25078j03838K3424J31999J07187l1698j40749j02738M4474
164i6053J45508R2626n7002j44013p9533O3021J37361P0869o3558j29867o5717
175a26358N9362J23424O7410n4056j24369p0293N5843J26525O8713n9059j27854
186f0712o6786O4140J30630O3526p1166j34450n7823Q1621J35168M6281q8521
197D1908j28106l6458Q8260J19045L0617q3368j09778l0181P4234J06626L7362
$$ plain form
208 110161 39144 -73816 -115530 -38518 83234 122261 32390 -93499 -121277 -20635 100674
219 100674 116319 11599 -101604 -107252 -4787 97190 98701 4025 -90884 -95594 -7524 87368
231 87368 96110 8986 -90044 -100607 -8501 94772 101419 1745 -102618 -101977 4808 106340
243 106340 95465 -14511 -107748 -89813 17349 103570 82922 -20432 -101220 -80038 19994
254 19994 98150 76970 -21359 -98292 -77067 21601 98844 76872 -23761 -101950 -76827 27299
266 27299 104842 75841 -31661 -107785 -72314 38853 109293 65803 -44238 -105974 -58097
277 -58097 47279 101352 52353 -46714 -96610 -50845 43900 94862 52319 -42986 -97312 -55403
289 -55403 44271 101753 54915 -51533 -106453 -50396 58190 105068 41555 -64542 -102358
$$ packed form
208A10161p1017j12960m1714P7012J21752L9027q9871j25889k7778J00642J21309
219A00674J5645j04720j13203n648J02465J01977J511r4676r4909m710Q8070R4892
231H7368Q742q7124r9030j0563R2106J03273O647r9674j04363O41J06785J01532
243A06340j0875j09976r3237J7935J07162Q6221k0648j03354q0788K1182J00032
254A9994P8156k1180r8329p6933K1225R8668P7243k1972j00633p8189K5123J04126
266B7299P7543k9001j07502p6124L5471J11167P0440m3490j10041o1736M7877
277e8097J05376N4073m8999r9067m9896M5765R4745N0962m2543r5305n4326M1909
289e5403R9674N7482m6838j06448n4920N6057J08586M6878o3513j06097l7816
$$ plain form
300 -102358 -34675 65284 95081 28727 -64077 -91104 -28363 60542 89086 29996 -59676 -91718
312 -91718 -31743 62549 94473 29524 -66955 -95813 -25303 72112 94877 19113 -75297 -91052
324 -91052 -13293 76827 87479 9465 -76308 -83330 -6563 75805 81496 5942 -74650 -79430 -4532
337 -4532 74591 79595 4963 -75323 -80106 -3040 78517 80456 -317 -81694 -79359 5558 84991
350 84991 76296 -11236 -86194 -71837 15816 85169 66499 -18044 -81840 -62948 17390 79353
362 79353 62321 -16341 -78959 -63369 16031 81200 65010 -19072 -85130 -64000 24203 88264
374 88264 60520 -30413 -89115 -54746 35160 86489 49189 -36157 -83057 -46266 35516 80384
386 80384 45165 -34284 -80110 -45862 34819 81526 45874 -37381 -83344 -44610 41101 85038
$$ packed form
300a02358O7683R9959K9797o6354r2804k7027O2741Q8905K8544n9090q9672l2042
312i1718N9975R4292L1924o4949r6479k8858P0510R7415K2765p5764r4410j5755
324i1052P7759R0120J0652p8014q5773p022P6767Q2368N691p5554q0592m780P4898
337d532P9123N004p4632q0286m783P7066Q1557J939q0773q1377K335Q4917P9433
350H4991q695q7532p4958J4357Q7653O9353j8670q4543o3796J8892Q0338O1963
362G9353j7032p8662o2618J5590P9400O5169j6190q4082o6058K1130Q8203O4061
374H8264k7744r0933n8702L4369Q9906N1329l7300q5346m6900L6791Q1782M4868
386H0384l5219p9449m5826L4248Q0681M6707l5652q3255m5963L8734Q5711M3937
$$ plain form
398 85038 41053 -45232 -85039 -37175 48540 83894 33106 -50610 -81433 -29165 51467 79090
410 79090 26835 -51288 -76665 -24870 51074 75759 24889 -51261 -75929 -24152 53264 77052
422 77052 23005 -55639 -78253 -20003 59685 78029 15958 -62152 -75744 -10924 64354 72683
434 72683 6860 -63475 -68083 -4728 62208 66088 4665 -60333 -65192 -5208 61323 67234 4804
447 4804 -63927 -68241 -1759 67602 67863 -2480 -70471 -64617 7694 70791 60385 -11024 -69555
460 -69555 -56808 12550 67706 54424 -12607 -66693 -54108 12805 67038 53990 -13836 -68367
472 -68367 -54290 15862 70613 53282 -19298 -71870 -50692 22417 72409 47969 -25444 -71847
484 -71847 -44328 27808 71148 42038 -28971 -69181 -39176 29887 68551 38470 -29514 -68066
$$ packed form
398H5038m3985q6285l9807M7864Q5715L5354n0788q3716l0823N2268Q0632K7623
410G9090n2255p8123k5377N1795P5944K4685n0870p6150k4668N1777P7416K3788
422G7052n4047p8644k2614N8250P9688J8344o2071p8110j3592O4820P5278Q329
434G2683o5823p0335m608O3355O6936L880o1423o4998m859N9984O6531N911o2430
447D804o8731m314O6482O9361K61p0343o7991N854P2311O3097j0406p1409n8531
460f9555J2747O9358N5156j3282o7031n4086J2585O6913N4233j3048o7826n4531
472f8367J4077P0152N4751j7331p2580n2572K1178P3109M9992k4440p3413m6403
484g1847K7519P2136M3340k9110p1009m0210L0005O9063L8664l0081o7984l8552
$$ plain form
496 -68066 -37425 30892 68438 37331 -32121 -69620 -36396 35183 70908 33835 -38311 -71105
508 -71105 -30388 41501 69995 25957 -43479 -67245 -23272 42914 64596 21222 -42547 -63567
520 -63567 -21708 41670 63824 21402 -43882 -65431 -20510 46033 65999 17479 -49566 -65418
532 -65418 -13661 51789 63326 10474 -52002 -60765 -7096 52871 58915 6624 -50941 -56722 -4889
545 -4889 52296 57440 5047 -51802 -56177 -2949 54768 57104 1690 -55192 -55154 1456 57846
558 57846 54955 -3930 -58091 -51868 7051 58547 50220 -8757 -58254 -47923 10328 57348 46034
571 46034 -11305 -57079 -45549 11626 56720 44968 -12851 -58544 -45464 14661 59872 43622
583 43622 -17776 -61190 -41939 20747 61623 38631 -23308 -60332 -35379 24524 58956 33890
$$ packed form
496f8066L0641O8317L7546l1107o9452l7499L3224P1579L5725l7073p2146l2794
508g1105M0717P1889K8494m4038o9436k3766M3973O6186K1682m3374o3769k1020
520f3567M1859O3378K2154m2422o5284k1549M4921O6543J9966m8520o7045j5852
532f5418N1757O5450J1537n2852o2476q763N3669N9967O044n2291n7565n781N1833
545d889N7185N144n2393n6849m375N3228N7717K336n5414n6882L8N6610N6390
558E7846k891n8885n4161O223N8919N1496q327n8977m9497J0331N8251M7020j1314
571D6034n7339m5774J1530N7175M5094j1752n7819m5693J3080O0125M5211j6250
583D3622o1398m3414J9251O2686M0876k2992o1939l7024K4953N9903L4432k5066
$$ plain form
595 33890 -24158 -57146 -32754 24558 57979 33292 -25278 -58326 -31945 27859 60131 31260
607 31260 -29962 -60171 -28133 32969 60218 25869 -33787 -58451 -22785 35113 57080 21430
619 21430 -35312 -55730 -19867 36084 55673 19178 -36500 -55346 -18051 38130 56146 16572
631 16572 -39646 -55209 -14641 41215 55024 12812 -42165 -53675 -10090 43708 52831 8376
643 8376 -43917 -50701 -5910 44674 50036 5301 -44215 -48472 -3414 45185 48682 3653 -44930
656 -44930 -47798 -1514 47220 48507 590 -47672 -46694 3025 49849 45704 -4581 -49171 -42473
669 -42473 7610 50190 41820 -7580 -47909 -39395 8826 48876 40641 -8446 -48751 -39179 11124
682 11124 50867 39565 -12047 -50756 -36832 15264 52080 35845 -16358 -51068 -33044 18925
$$ packed form
595C3890n8048l2988K4392N7312L3421k4687n8570l3048K6381N9804L2272k8871
607C1260o1222l0209L2038O1102K7249l4349n9656k4664L5666N7898K1967l5650
619B1430n6742k0418L5863N5951J9589l6495n5678j8846L7295N6181J8016l9574
631A6572n6218j5563M0568N5856J3809m2212n4977j1510M3585N3798R123m4455
643H376n2293o784M4791N0584N362m4735m9516m257M5058M8599L497m5029m8583
656d4930k868M6284M8734J287m7917m8262R78M9719M6824m145n0285m4590O698
669d2473N0083M2580q370m9400m0329Q514M8221M0050q235m9087m0305R572N0303
682A1124L9743j1302n1612l8709J3924N2096L6816j6235n2203l4710J8024N1969
$$ plain form
694 18925 50902 31915 -18759 -50027 -30314 20007 50380 29856 -20287 -50376 -29001 21768
706 21768 50665 27655 -23708 -50745 -26200 24712 50496 24247 -26852 -50580 -23170 27184
718 27184 49667 21130 -29161 -49969 -19967 29442 48411 18060 -30740 -48433 -17427 30825
730 30825 47320 15702 -31998 -47513 -14926 32789 46884 13495 -34300 -47205 -11664 36033
742 36033 46429 9563 -36594 -44831 -7927 36816 43915 6738 -37141 -42917 -5548 37126 42514
755 42514 4721 -37922 -42291 -3734 38946 41739 1731 -40458 -41166 77 40798 39524 -1784
768 -1784 -41290 -38672 3206 41279 37286 -4096 -41230 -36569 5239 41548 36108 -6034 -41977
781 -41977 -34897 8070 43045 33893 -9076 -42607 -32349 11105 43823 32290 -11647 -42868
$$ packed form
694A8925L1977j8987n0674l1268J9713N0321L0373k0524n0143l0089K1375N0769
706B1768K8897k3010n1363k7037K4545N0912K5784k6249n1099k3728K7410N0354
718B7184K2483k8537n0291k0808L0002M9409J8969l0351m8800j7693L1006M8252
730C0825J6495l1618m7700j5515L2587M7715J4095l3389m7795j2905L5541M7697
742C6033J0396l6866m6157q237L6904M4743P099l7177m3879n776L7369M2674N388
755D2514l7793m2643m369L8557M2680K793m0008m2189p08M1243M0721j274m1308
768a784l9506K618M1878L8073l993m1382l7134M661M1808L6309n440m2142l5943
781d1977P080M2967L4975r152m2969l3531J0258M3454L2718j1533m3937l1221
$$ plain form
793 -42868 -30125 13614 43786 30182 -13368 -42847 -28015 15651 43969 27892 -16044 -42713
805 -42713 -25448 17825 43160 25320 -17905 -42834 -24020 20045 43409 23021 -20539 -42962
817 -42962 -21557 22054 43350 20383 -22960 -42492 -18656 23800 42072 17445 -24403 -41255
829 -41255 -16618 25027 41178 15659 -26283 -41033 -14513 26941 40960 13250 -28143 -41007
841 -41007 -11654 29080 40032 10176 -29672 -39090 -8995 29932 38441 8191 -30465 -38049 -7107
854 -7107 31390 37510 5942 -31738 -37252 -4753 32707 36730 3222 -33310 -35692 -1981 33708
867 33708 35258 947 -33918 -34128 69 34503 33501 -1404 -34698 -32546 2516 34784 32169
880 32169 -3380 -35737 -31614 4768 35767 30514 -5703 -36175 -29889 7033 36397 28675 -8372
$$ packed form
793d2868J2743M3739L0172j3604m3550k9479J4832M3666K8318j6077m3936k6669
805d2713J7265M3273K5335j7840m3225k4929J8814M4065K3364k0388m3560k2423
817d2962K1405M3611K1296k2967m3343j9532K3836M2456J8272k4627m1848j6852
829d1255K4637M1645J6151k5519m1942j4750K6520M1454J4019k7710m1393j2864
841d1007K9353M0734J0952k9856l9848r418L0095L8927Q509l0250l8656p584L0942
854g107L8497O120l1568l7680n514L2499L7460M023l3508l6532k382L3711L5689
867C3708J550l4311l4865k10L4197L4434j002l4905l3294K152L5062L2268k615
880C2169l5549l2357M123L6382L0999n253l6217l0472O286L6922K9364p722l7047
$$ plain form
893 -8372 -36787 -28079 9245 36533 26750 -10287 -36690 -25985 10963 36817 24868 -12341 -36872
906 -36872 -24121 12686 36926 23445 -14172 -37135 -22392 15127 37257 21250 -16331 -36960
918 -36960 -20006 17110 36669 19026 -18012 -36645 -17936 18846 35989 17212 -19268 -36260
930 -36260 -16294 20261 36300 15368 -21114 -35994 -14043 22068 35741 12997 -22674 -35100
942 -35100 -11758 23361 34700 10716 -23988 -34297 -9889 24693 34029 8968 -25357 -33819
954 -33819 -7861 25627 33196 6978 -26489 -32838 -5783 27056 32266 4764 -27697 -31649 -3749
967 -3749 27756 30833 2880 -28435 -30802 -1807 28906 29640 468 -29234 -29197 196 29368 28724
981 28724 -1324 -29724 -27984 1997 29950 27566 -3033 -30513 -27022 4056 31024 26036 -5379
$$ packed form
893h372k8415Q708L7324K7288r783l7037k6403J0705L6948K5854j1949l7209k4531
906c6872J2751L6807K4240j3481l7617k2963J4743L7519K2130j6007l7581k0629
918c6960J6954L7116J9559j7643l7038j8633J8709L6782J7143j8777l6480j6992
930c6260J9966L6555J6039k0932l6482j4880K1951L6111J3673k2744l5671j2426
942c5100K3342L5119J1339k3984l4704j0309K4408L4582R336k5061l4325q462
954c3819K5958L3488P569k6218l3467o349K7055L2839N210k7502l2461l952K7900
967c749L1505L077k7953l1315k367K8995L0713P34k9172k9702L7K9393K9172o44
981B8724l0048k8400J740K9981K7953k384l0599k7480L491L1078K6968m988l1415
$$ plain form
994 -5379 -31379 -25156 6609 31053 24245 -7130 -31165 -23779 8018 31218 22832 -8471 -31436
1007 -31436 -22505 9560 31980 21679 -10573 -32204 -20689 11796 32039 19598 -12768 -31627
1019 -31627 -18601 12954 31592 17974 -13987 -31506 -17111 14352 31521 16741 -15236 -31584
1031 -31584 -15727 16173 31542 14555 -17143 -31342 -13673 17786 30801 12830 -18199 -30775
1043 -30775 -12139 18962 30495 10849 -19441 -30516 -10273 20192 30096 9030 -20915 -29579
1055 -29579 -8439 21065 29099 7509 -21708 -28883 -6887 22010 28578 5925 -23088 -28322 -5008
1068 -5008 23248 27943 3951 -24028 -27364 -2745 24078 26366 2161 -24368 -26006 -1519 24622
1081 24622 25697 878 -24762 -25365 56 25595 25006 -1235 -25914 -24434 2197 26457 23477
$$ packed form
994e379k6000O223L1765K4444o808l1375k4035P386L1797K3200q386l1303k2965
1007c1436Q931L2065K2420j0301l2252k1631J1515L2485K0243j2441l2366j8859
1019c1627J3026L1555J8638j3618l1961j7519J4395L1463J7169j4780l1977j6348
1031c1584J5857L1900J5369j6987l1698j4199J7669L1459J3015j7971l1029j2576
1043c0775J8636L1101J1533j9646l0290j1075K0243L0465R904k1066k9945q664
1055b9579K1140K9504Q034k1590k9217p175K1996K8897O568k2653k9013n234K3314
1068e008K8256M695k3992k7979l336K4619K6823K288k4205k6529j638K4487K6141
1081B4622J075k4819k5640o03K5421K5539n89k6241k4679J480K6631K4260k980
$$ plain form
1094 23477 -3239 -26260 -22748 3674 26291 22071 -4384 -26326 -21768 4917 27018 21204 -6046
1107 -6046 -27188 -20729 6899 27419 20123 -7823 -27614 -18739 8742 27478 18237 -8973 -27002
1120 -27002 -17599 9958 27138 16961 -10519 -27378 -16341 11329 27492 15604 -12056 -27211
1132 -27211 -14600 13058 27457 13800 -13545 -26713 -13107 13757 27079 12846 -14504 -26806
1144 -26806 -11777 15300 26937 11071 -15974 -26703 -9937 16615 26353 9151 -17049 -25680
1156 -25680 -8491 17474 25577 8080 -17526 -25575 -7204 18510 25639 6521 -19277 -24969 -5393
1169 -5393 19867 24492 4278 -19977 -23816 -3615 19973 23333 2978 -20377 -23242 -2895 20564
1182 20564 22966 1818 -21639 -23095 -1057 21876 22127 -258 -22507 -21596 1158 22126 20572
$$ packed form
1094B3477k6716k3021L512K6422K2617m220k6455k1942M558K6685K2101n814k7250
1107f046k1142O459K7628K0520p296k7946j9791Q875K7481J8736r241k7210j8029
1120b7002R403K7557J7180j0177k7480j6859J1037K7670J6163j1888k7660j5155
1132b7211J2611K7658J4399j3657k7345j3168J3606K6864J3322j4233k7350j2302
1144b6806J5029K7077J1637j5866k7045j0729J6766K6552R738j7202k6200q631
1156b5680J7189K5965Q103j7497k5606q049J8371K5714P129j9118k5798n692J9576
1169e393K5260M625k0214k4255l839K0201K3588L360k0355k3355k865K0347K3459
1182B0564K402k1148k3457j456K2038K2933K51k2385k2249R11K2754K0968j554
$$ plain form
1195 20572 -2008 -22524 -20490 1964 22182 19928 -2521 -22783 -19889 3241 23260 19504 -4333
1208 -4333 -23804 -18897 5117 23728 17880 -5993 -23382 -17007 6374 23591 16651 -7074 -23492
1221 -23492 -16120 7487 23824 16143 -8235 -23972 -14993 9349 23960 14241 -9769 -23692 -13456
1234 -13456 10568 23599 12828 -10637 -23525 -12499 11458 23666 11905 -12067 -23746 -11160
1246 -11160 12943 23735 10224 -13369 -23103 -9515 13763 22898 9036 -14082 -22302 -8332
1258 -8332 14348 22836 8105 -14610 -22799 -7011 15929 22725 6444 -16384 -21874 -5058 16959
1271 16959 21703 4882 -16608 -20900 -4005 16799 20991 4076 -16931 -20855 -3253 18072 20884
1284 20884 2688 -18352 -20458 -1397 18984 20027 662 -18812 -19014 73 18927 18839 -381
$$ packed form
1195B0572k2580k0516K034K2454K0218k254k2449k0262K894K3130K0019l756k3837
1208d333j9471M907K4014J8611n848k3873j7389O375K3381J7217o940k3725j6418
1221b3492P372K3607J6337p681k4378j5737Q979K4342J4611r719k4010j3923J0236
1234a3456K4024J3031j0771k3465j2888J1026K3957J2208j1761k3972j1679J2586
1246a1160K4103J0792j3511k3593r734J3588K3278R135j3862k3118q220J3970
1258h332K2680Q488j4731k2715q189J5788K2940O796j6281k2828n490J6816K2017
1271A6959M744j6821k1490m292J6895K0804M192j6915k1007l924J7602K1325K812
1284B0884j8196k1040k106J9061K0381J043j9365j9474k02J9087J8854q8j9220
$$ plain form
1297 -381 -19147 -18618 624 19157 18197 -1530 -19869 -17835 2368 20103 17391 -3247 -20147
1310 -20147 -16629 3823 20060 16281 -4123 -20137 -15819 4569 20597 15523 -5345 -20724 -14796
1323 -14796 6030 20879 14212 -6758 -20725 -13691 7358 20642 13138 -7854 -20429 -12395 7939
1336 7939 20691 12299 -8435 -20749 -11737 9290 20962 11097 -10225 -20695 -10383 10737 20593
1349 20593 9511 -10976 -20337 -8934 11093 19880 8484 -11283 -20062 -8816 11832 19997 7644
1362 7644 -12887 -20382 -7076 13324 19864 6102 -13792 -19437 -5536 13767 18930 4735 -14119
1375 -14119 -18889 -4860 14052 18885 4266 -14958 -18861 -3461 15390 18333 2767 -15775 -17917
1388 -17917 -1746 15810 17519 1368 -15868 -17050 -934 16110 16982 785 -16128 -16818 49
$$ packed form
1297c81j8766N29J9242J8533r60j9727j8339K034K0203J7735k712k0638j6900
1310b0147L518K0452J6237l779k0404j6014M318K0388J6028n074k0868j5379N928
1323a4796K0826J4849o667k0970j3967P034K1049J3284p504k0992j2575Q034K0334
1336G939J2752q392k0734j2314R012K1027J1672r865k1322j0470J0312K1120R856
1349B0593j1082k0487r361J1403K0027Q787j1396j9767q779J1246K0648Q165j2353
1362G644k0531p495J3306K0400O540j3762j9894n645J3901J9303N163j4195j8854
1375a4119m770J4029J8912M833j4619j9224l903J5400J8851K943j5566j8542k142
1388a7917J6171J7556J709j6151j7236j182J6116J7044Q72j6197j6913o90J6867
$$ plain form
1401 49 17171 16492 -656 -17159 -15782 1554 17546 15497 -1986 -17206 -14856 2535 17531
1414 17531 14675 -2940 -17225 -14452 3220 17678 14217 -4144 -18347 -13528 4865 17931 12873
1427 12873 -5528 -18114 -12269 5821 17776 11728 -6162 -17982 -11819 6289 18018 11360 -7142
1440 -7142 -18405 -11052 7779 18434 10162 -8339 -18188 -9343 8628 17956 8906 -8925 -17660
1453 -17660 -8464 9092 17636 8301 -9476 -18034 -7885 10453 18025 7378 -10774 -17516 -6513
1466 -6513 11179 17227 6015 -11047 -17049 -5617 11534 16968 5164 -11672 -17043 -4955 12313
1479 12313 16790 4063 -12913 -16809 -3532 13273 16262 2718 -13350 -15863 -2492 13578 15632
1492 15632 1905 -13839 -15389 -1780 13943 15185 1210 -14393 -15266 -270 14700 14873 -168
$$ packed form
1401D9J7122o79j7148j6503J377J7336J5992k049j7483j5220K350J7391J4996
1414A7531k856j7615j4285K773J7672J4458l461j8361j4203M819J8393J3066n058
1427A2873j8401j2586N845J8090J1955o048j7890j1820O163J8108J1729o658j8502
1440g142j1263P353J8831J0655q272j8501r849Q845J7971R328r050j7831q735
1453a7660R196J7556Q544r335j7777q558J0149J8338P572j0647j8152o742J1003
1466f513J7692O048j1212j7062o002J1432J7151N434j1804j6836n371J2088J7268
1479A2313M477j2727j6976l896J3277J6805K989j3544j6068k513J3371J6070K054
1492A5632j3727j5744j550J3609J5723J242j3975j5603q73J4996J4970J73j5041
$$ plain form
1505 -168 -14660 -14295 707 14594 13823 -1050 -14844 -13724 1228 15176 13473 -1862 -15192
1518 -15192 -13379 2314 15651 12973 -3331 -15616 -12107 3915 15660 11729 -4089 -15854 -11598
1531 -11598 4254 15657 11222 -4804 -15892 -10791 5233 15994 10387 -5889 -16211 -9870 6463
1544 6463 16022 9243 -6619 -15474 -9028 6851 15626 8496 -7007 -15846 -8544 7668 15877 8135
1558 8135 -8476 -15905 -7627 8676 15851 6628 -9129 -15430 -6033 9076 15312 5926 -9235 -15141
1572 -15141 -5643 9422 15478 5208 -10097 -15201 -4781 10439 15226 4344 -10926 -14947 -3371
1585 -3371 11354 14413 3309 -11163 -14312 -2836 11422 14265 2518 -11727 -14163 -2081 12216
1598 12216 13717 1566 -12349 -13578 -915 12582 13155 516 -12583 -12887 -216 12647 12693 30
$$ packed form
1505a68j4492L65J5002J3887p71j4873j3794J120J4952J3948j703j5335j3330
1518a5192J813J5693J3337k678j6304j2285L509J6022J1745l931j5818j1765M256
1531a1598J5852J1403m435j6026j1088N101J6024J0761n607j6276j0322O341J6333
1544F463R559o779j5862q855O446J5879Q775p130j5503q839P302J6212Q209p742
1558H135j6611p429Q278J6303P175r223j5757o301R397J5109O236r386j5161n906
1572a5141R498J5065O056j0270j5305n104J0420J5220M787j0882j5270m021J1576
1585c371J4725L059j1104j4472l149J1476J4258K843j1747j4245k436J2082J4297
1598A2216J501j2151j3915j229J2663J3497N73j2639j3099l04J2671J2863M6j2663
$$ plain form
1612 30 -12989 -12585 532 13075 12309 -1262 -13459 -11989 1697 13583 11570 -2080 -13470 -11090
1626 -11090 2442 13293 10937 -2630 -13402 -10690 2907 13795 10512 -3562 -14094 -10189 4035
1639 4035 14213 9741 -4585 -14205 -9001 4864 13766 8800 -5020 -13749 -8395 5301 13842 8402
1653 8402 -5669 -14232 -8054 6286 14055 7674 -6622 -14246 -7145 7152 13796 6517 -7455 -13844
1667 -13844 -6206 7504 13777 6099 -7757 -13827 -5775 8166 13851 5179 -8400 -13460 -4905 8898
1681 8898 13432 4273 -9065 -13080 -3657 9132 13052 3821 -9371 -12927 -3318 9712 12815 2871
1695 2871 -9823 -12732 -2211 10560 12423 1859 -10507 -12176 -1575 10565 11959 1024 -10647
1708 -10647 -11798 -874 10666 11779 610 -11293 -11750 19 11493 11123 -525 -11446 -10546
$$ packed form
1612C0j3019M04J3117J2543p66j3571j2197J470J3686J1886k013j3650j1390K380
1626a1090J3532J0851k356j3567j0772K712J3597J0888l283j4074j0532L905J4224
1639D035J0178m472j4326r620N204J3865Q902m966j3820q729N354J3696Q541n440
1653H402j4071q563O178J4340P769o381j4296p624P101J4297O644p279j3972o389
1667a3844P638J3710O273p678j3856o070Q052J3941N685q672j3579n060Q555J3803
1681H898M534r159j3338m015R423J2789L920r231j3192l556R609J3030L103r944
1695B871j2694k909J0521J2771J863j0564j2366j669J0601J2140J394j0935j1671
1708a0647j151J0924J1540J113j1169j1903m57J1769J1474l70j1648j0921R00
$$ plain form
1721 -10546 811 11451 10459 -1263 -11543 -10296 1515 11685 10028 -1647 -11832 -10012 2281
1734 2281 12181 9536 -2672 -12095 -9215 3254 11973 8778 -3357 -12169 -8463 3531 12071 8375
1748 8375 -3913 -12071 -8119 4310 12316 7822 -4702 -12372 -7476 4940 12397 7001 -5239 -12130
1762 -12130 -6690 5508 12241 6349 -5818 -12219 -6208 5970 12034 5880 -6372 -12345 -5352 6703
1776 6703 12183 5049 -7206 -11984 -4764 7296 11703 4273 -7364 -11474 -4139 7678 11469 3625
1790 3625 -7867 -11793 -3421 8272 11646 2930 -8573 -11394 -2272 8632 10870 2223 -8805 -10855
1804 -10855 -1863 8896 10665 1751 -9206 -10591 -1408 9231 10669 1169 -9605 -10285 -434 9762
1818 9762 9935 121 -9631 -9856 190 9927 9479 -233 -9978 -9498 417 10216 9546 -1114 -10261 -8995
$$ packed form
1721a0546J1357J0640r92j1722j0280J247J1811J0170j657j1675j0185J820J2293
1734B281R900k645j2208r423K880J2469Q719l195j2135q812L706J1994Q540l696
1748H375j2288q158L952J2429Q006m494j2524p670M896J2416P457n396j2240o891
1762a2130N440J2198O733n892j2167o401O011J2178O064o154j2252n973O993J2055
1776F703N480p134j2255m778P220J2060M407p430j1637m110P335J1817L791p844
1790C625j1492l926Q372J1693L374q716j1503k821R122J0904K238q647j1028k050
1804a0855Q992J0759J769q914j0957j385R183J0639J438r500j0774o80R851J0196
1818I762J73r814r752k25J0046R737m48r712r745M80R915R799o70j0660r147J266
$$ plain form
1834 -8995 1463 10576 8802 -1929 -10438 -8454 1985 10538 8031 -2304 -10527 -7872 2648 10602
1848 10602 7758 -2846 -10632 -7571 3369 10862 7093 -3843 -10771 -6894 4147 10775 6548 -4152
1862 -4152 -10542 -6245 4546 10801 6248 -4841 -10771 -5906 5017 11048 5462 -5483 -10795 -5181
1876 -5181 5611 10583 4688 -5772 -10414 -4417 6001 10501 4295 -6274 -10372 -4215 6600 10375
1890 10375 3696 -6764 -10399 -3239 7119 10270 2949 -7169 -9938 -2758 7084 9968 2664 -7346
1904 -7346 -9900 -2177 7586 9567 1965 -7887 -9700 -1658 8142 9414 1117 -8244 -9031 -885 8366
1919 8366 8986 765 -8387 -8761 -441 8552 8834 183 -8834 -8672 133 8986 8464 -589 -8974 -8129
1935 -8129 949 9143 8064 -1115 -9050 -7721 1353 9212 7769 -1666 -9161 -7692 1956 9354 7289
$$ packed form
1834h995J0458R113j774j0731q509J984J0439Q553k507j0335q223K655J0520P954
1848A0602k844j0604p786L061J0940P493l769j0936o928L877J1041O628m227j0700
1862d152o390M297J0791O255m553j1089n930M865J0923O031n586j0945n312N614
1876e181J0792M972n895j0460m642N997J0418M500o206j0569m098O157J0815L775
1890A0375o679j0460l635P160J0358L151p321j0118k769P180R842K884p304j0010
1904g346k554P723R763J981p602r852j813Q042R800J272q297r361p87Q146R251
1919H366O20q221r152l74Q320Q993K82q651r017J62Q805Q853n22r053q385Q45
1935h129R078Q194j079r179p935J329R074P859j443r435p495J469R648P398k065
$$ plain form
1950 7289 -2379 -9290 -6857 2571 9500 6508 -2963 -9407 -6285 3032 9348 6276 -3313 -9658 -6158
1965 -6158 3719 9419 6083 -3868 -9596 -5407 4151 9762 5192 -4521 -9541 -4835 4514 9330 4603
1980 4603 -4526 -9330 -4609 4939 9460 4023 -5367 -9370 -3817 5603 9214 3391 -5671 -9083 -3331
1995 -3331 5912 9168 3291 -6038 -8953 -2703 6143 8823 2638 -6417 -8892 -2389 6615 8545 1932
2010 1932 -6735 -8614 -1781 6921 8445 1348 -7065 -8391 -1245 7221 8140 960 -7224 -8290 -761
2025 -761 7557 8122 535 -7745 -8058 -41 7616 7708 -152 -7813 -7369 507 7820 7261 -528 -7819 -7277
2042 -7277 807 7787 7164 -955 -8134 -6826 1394 8279 6669 -1555 -8265 -6425 1950 8280 6021
2057 6021 -1981 -8186 -6053 2355 8392 5861 -2566 -8387 -5590 2918 8510 5305 -3114 -8411 -5323
$$ packed form
1950G289r668o911K433R428O929k992r471o444L122R317O316l072r589o345L500
1965f158R877N700l336r951n728M189R558N611m570r713n020M706R349M816m727
1980D603r129m804M721R548M521n437r390m003N553R420L611n823r062l412N752
1995c331R243L256n877r329k915O250Q846K680o185r055k475O503R004J930o613
2010A932q667j879O833Q702J524p097q413j326P146Q466R19p180q184j066P529
2025g61Q318N65p587q280l13Q017P657R2p860p661M44P876P313n59p789p291N42
2042g277Q084O980o23q119p179J308Q220O885j610q224o710J840Q375O330k259
2057F021q002o205K133Q408O037k531q427n821K797Q508N592l205q419n297L088
$$ plain form
2072 -5323 3262 8295 4901 -3475 -8357 -4694 3623 8521 4536 -4134 -8411 -4399 4317 8411 3992
2087 3992 -4325 -8178 -3646 4496 8170 3436 -4651 -8004 -3381 4861 8009 3201 -4929 -7922 -2826
2102 -2826 5331 8117 2598 -5523 -7939 -2254 5680 7933 1925 -5690 -7715 -1727 5812 7545 1619
2117 1619 -5969 -7466 -1487 6092 7555 1325 -6350 -7448 -1198 6612 7408 802 -6690 -7191 -392
2132 -392 6819 6857 149 -6676 -6710 127 6871 6706 -322 -6981 -6463 566 6922 6099 -715 -6906 -6210
2149 -6210 1014 7030 5947 -1140 -7155 -5914 1379 7057 5869 -1619 -7521 -5633 1962 7448 5255
2164 5255 -2264 -7338 -4964 2605 7211 4880 -2440 -7063 -4790 2609 7224 4687 -2576 -7517 -4582
2179 -4582 2953 7703 4300 -3410 -7749 -4167 3551 7691 3709 -3838 -7291 -3471 3800 7146 3188
$$ packed form
2072e323Q585N033l394q376m882L663Q317M898l985q670m277M012Q716M094m419
2087C992q317l853M532Q142L674m734q087l353M623Q242L148m808q130k993N096
2102b826Q157K786n519q121k416N685P934K253o008p615k025N988P539J733n926
2117A619p588j497N979P579J463o230p675j098O250P810P96o606p492n01O799
2132c92P211L8o708o825l4O837O744j65p028o659N18P029O356q23o814o191O96
2149f210P224O016j083p087o015J241P293N678j188p488n902J888P595N486k193
2164E255p519n074K374P569M606k331p320m623K273P399M615k537p263m941K935
2179d582P535M750l403p710m339L582P718M140l982p547l453L820P271L346l958
$$ plain form
2194 3188 -3940 -7041 -3174 4050 7194 3258 -4145 -7407 -2851 4460 7338 2862 -4580 -7279 -2274
2209 -2274 4774 7004 2090 -5130 -6973 -1759 5235 6845 1414 -5090 -6546 -1441 5197 6889 1338
2224 1338 -5509 -6578 -1233 5487 6549 1168 -5535 -6792 -710 5838 6607 478 -5924 -6317 -95
2239 -95 5968 6085 -58 -6148 -6069 301 5878 5593 -352 -6031 -5484 455 6069 5531 -805 -6265 -5592
2256 -5592 699 6331 5729 -1237 -6653 -5303 1475 6678 5065 -1857 -6590 -4603 1883 6621 4450
2271 4450 -2032 -6497 -4360 2197 6411 4365 -2115 -6665 -4177 2294 6735 4022 -2708 -6710 -3904
2286 -3904 2906 6693 3662 -3155 -6767 -3494 3463 6644 3011 -3330 -6466 -2835 3445 6269 2944
2301 2944 -3616 -6322 -2757 3655 6467 2687 -3864 -6571 -2687 3806 6387 2309 -4379 -6317 -1894
$$ packed form
2194C188p128l101L867P224L144l936p403l262M556P311K878m476p442k699N005
2209b274P048K230m914p220j843N214O994J610n431o504j456N105O638J692n551
2224A338o847j069N345O720J062n381o703j257O082O548P69o129o402l93O222
2239i5O063J17o143o090P9O370N577k85n945n679N47N939N614n38o336n460O73
2256e592O291N632o02o966n416J350O778N203j613o922m733J987O486M738k171
2271D450o482m465K137O557M214k046o480m550K488O471M441k713o730m002K806
2286c904O810L787l031o817l612L273O957L181l633o341l136L631O280K824l325
2301B944o560k706L565O412K812l780o551k707L884O493K581m078o688j938M423
$$ plain form
2316 -1894 4741 6308 1789 -4744 -6201 -1489 4785 5986 1273 -4601 -5848 -1131 4566 5754 1215
2331 1215 -4551 -5751 -1227 4880 6201 725 -5198 -5970 -651 5366 5974 132 -5572 -5319 -2 5476
2347 5476 5078 -191 -5302 -5103 234 5155 4991 -206 -5403 -5077 301 5432 5163 -613 -5809 -4953
2363 -4953 944 5872 4761 -1383 -5989 -4304 1710 5961 4279 -1717 -5865 -4087 2005 5741 4086
2378 4086 -1729 -5533 -3881 2007 5765 3970 -2029 -5979 -3512 2334 6084 3672 -2691 -6159 -3421
2393 -3421 2750 6123 3298 -2912 -6074 -2670 2895 5708 2639 -3041 -5848 -2655 3140 5641 2482
2408 2482 -3075 -5739 -2561 3256 5849 2458 -3523 -5799 -2417 3831 5855 1769 -4017 -5716 -1415
2423 -1415 4078 5463 1354 -4241 -5319 -1268 4049 5258 1168 -4158 -5375 -1200 4151 5386 1092
$$ packed form
2316a894O635J567m519o533j457M712O274J201m713n874j247M717N697J188m539
2331A215n766j200M524O107J321n476n923p72N319O017O08n842n704K53N317N478
2347E476l98n269n111J99N337M921j64n197n197L26N378N131k69n776n196Q56
2363d953N897M928j111o144m606J685O014M251j682n996m148J778O092L736j655
2378D086n815l804J652N888L758j795n999l950K467N846L750k412o363l468K738
2393c421O171L373k825o210l162L404N565K813l069n680k807L193N795K501l159
2408B482n557k664L178N817K593l391n981k276L382O248K024m086n786j699M301
2423a415N493J385m109n595j078M051N317J209m090n326j217M175N351J235m294
$$ plain form
2438 1092 -4572 -5410 -825 4641 5398 583 -4805 -5338 -155 4898 4919 -79 -4807 -4702 -4 4864
2454 4864 4394 -172 -4734 -4420 314 4793 4594 -476 -4798 -4400 271 5013 4435 -722 -5268 -4402
2470 -4402 1119 5331 4188 -1370 -5488 -3904 1386 5342 3504 -1556 -5239 -3412 1548 5047 3701
2485 3701 -1474 -5116 -3301 1725 5235 3667 -1856 -5580 -3450 2255 5516 3156 -2436 -5412 -2915
2500 -2915 2729 5314 2509 -2741 -5220 -2504 2824 5236 2301 -2595 -5113 -2439 2662 5202 2277
2515 2277 -2893 -5169 -2287 3007 5124 2158 -3499 -5187 -1818 3552 5223 1581 -3724 -5099 -1302
2530 -1302 3732 4828 940 -3793 -4579 -1098 3509 4668 823 -3787 -4612 -800 3818 4758 790 -4098
2546 -4098 -4822 -513 4226 4660 407 -4308 -4486 -96 4651 4396 -285 -4364 -3929 201 4226 3927
$$ packed form
2438A092n664q38M585N466P57m815n388n33N183N053K1m998m728J05M698M868
2454D864m70m566m562L14M734M479j99n070m322L98M671M742n78n157m546Q66
2470d402N521M212j143n558m118J584N290L956j838n060l683J827M960L499j346
2485C701n175l642J815N026L510j568n523l724K130N705L261k360n592k976K497
2500b915N644K585k805n250k479K716N328K412k935m896k518K674N101K540k925
2515B277n170k276K882N294K117k966n657j688L369N370J671l642n305j375L797
2530a302N034J096l888m733p86L481M607J159l845m610q25L812M618R40l968m888
2546d098p24M309M739M34m253m715j78M390M747k55m681m079M35M130M025k99
$$ plain form
2562 3927 -209 -4278 -4060 320 4194 4115 -415 -4465 -4231 352 4801 3938 -801 -4556 -3843 1140
2578 1140 4832 3665 -1308 -4851 -3288 1303 4583 3239 -1672 -4752 -3315 1286 4612 3048 -1410
2593 -1410 -4754 -3091 1499 4650 2962 -1759 -4792 -3028 2103 4737 2824 -2378 -4978 -2442 2426
2608 2426 4674 2470 -2641 -4583 -2093 2465 4621 1937 -2430 -4691 -2006 2541 4691 2062 -2761
2623 -2761 -4844 -1829 3096 4875 1604 -3174 -4885 -1425 3243 4543 1144 -3226 -4493 -842 3190
2638 3190 4375 990 -3263 -4288 -1219 3334 4091 788 -3595 -4203 -840 3668 4545 572 -3662 -4306
2654 -4306 -281 3979 4014 199 -3946 -4000 21 3985 3873 -95 -3745 -3674 297 3820 3677 -40 -3822
2671 -3822 -3498 280 4081 3657 -706 -4342 -3656 464 4327 3469 -802 -4285 -3262 1139 4304 3192
$$ packed form
2562C927m136m069K18M380L874p9m530m050K34M583M449q63m739l755P13M983
2578A140L692j167m973l543J563M591L280j344m911l080J437M601L326j564m458
2593a410l344J663M590L151j688m721l033J764N131K634j913n202k600K536M868
2608B426K248k204n111j942K490M558K156k684m367k261K685M547K150k629m823
2623b761k083L015M925J779l271m778j711L460M668J300l399m370j267L651M032
2638C190J185l385m253j025L069M553P57l303m383o08L363M508Q77l973m234o44
2654d306M025M260L5l815m145n4M021L964j12l968l650P1L971L523j43l717l782
2671c822L24L778L801m24m363l636O86M120L863q58m271l483J023M401L165j112
$$ plain form
2687 3192 -1270 -4279 -3015 1283 3964 2847 -1241 -4119 -2895 1379 4208 2944 -1416 -4372 -2748
2702 -2748 1502 4419 2912 -1800 -4671 -2465 2177 4431 2386 -2189 -4392 -2103 2290 3988 1865
2717 1865 -2235 -4074 -1833 2055 3964 2027 -2317 -4231 -1768 2379 4483 1891 -2667 -4314 -1383
2732 -1383 2699 4257 1189 -2936 -4146 -1102 2741 4081 965 -2869 -3892 -828 2909 3685 844
2747 844 -2974 -3783 -783 3139 3702 454 -3213 -4033 -702 3366 3911 541 -3538 -3685 -183 3612
2763 3612 3565 -169 -3645 -3647 168 3649 3287 -406 -3726 -3331 294 3442 3221 -203 -3478 -3284 517
2780 517 3711 3334 -452 -3780 -3222 829 3999 3060 -1122 -4059 -2858 1278 3843 2510 -1245 -3818
2796 -3818 -2632 1157 3561 2479 -1137 -3781 -2443 1335 3744 2529 -1457 -4018 -2462 1651 3865
$$ packed form
2687C192m462l009J264M298K681j117m088k878J224M274K829j264m360k956J624
2702b748M250K917j507m712k871K206M642K254k045m575k203K289M393J698k123
2717A865m100j839K241L888J909j937m344j914K463M147K104k592m558j647K931
2732a383M082J558l068m125j210L044L843J340l116l834j023L064L737P76k841
2747H44l818q09L000L922N63l248l667q20L331M068N45l370m079j47L502L795
2763C612m7l734l476kL815L481l62l693l320L95L625L148k21l424l275J94L801
2780E17L194l77l786l328N58M051L170r39m182k937J201M136K565j333l755k573
2796c818J186L789K404j082l616k644J338L778K409j215l986k561J556M113K214
$$ plain form
2811 3865 2331 -1828 -3988 -1983 1988 3862 1875 -1996 -3671 -1668 1993 3684 1736 -1891 -3695
2826 -3695 -1792 2059 3686 1637 -2112 -3737 -1537 2373 3795 1486 -2509 -3809 -1198 2542 3936
2841 3936 1047 -2541 -3690 -746 2957 3529 827 -2815 -3516 -663 2718 3128 678 -2583 -3578 -567
2857 -567 2800 3603 514 -3018 -3771 -238 3182 3508 110 -3328 -3256 2 3358 3032 -67 -3325 -2828
2874 -2828 155 3059 3101 -120 -3289 -2970 364 3193 3117 -321 -3319 -3025 664 3600 2884 -554 -3555
2891 -3555 -2684 907 3347 2641 -1105 -3569 -2497 981 3493 2384 -955 -3533 -2395 1151 3448
2906 3448 2307 -1203 -3501 -2085 1394 3567 2120 -1261 -3685 -2091 1721 3773 1868 -1789 -3647
2921 -3647 -1770 1928 3499 1617 -2114 -3356 -1628 1687 3266 1379 -1970 -3418 -1430 1956 3449
$$ packed form
2811C865j534m159k160K005L971J874j987l871j675K003L661J691j948l627j804
2826c695J903L851J627k049l749j625K200L910J422k309l995j300K611L740J394
2841C936k889l588j149K944L703N72k702l642p01K853L381M10k450l261r95L011
2857e67L367Q03l089l532p53L533L420L26l398l438P2L258L356l26l099l258M97
2874b828K983K904M2l221l169L19L334K829p6l438k998K94L689K936p16l438l001
2891c555Q71L591K440p06l746k464J072L478K512j109l339k578J138L546K297
2906C448j141l510k298J416L479K173j447l381k424J594L812K052j905l657j858
2921c647J877L698J571j882l731j242J728L315J579j887l349j448J988L386J493
$$ plain form
2936 3449 1383 -1934 -3501 -1392 2297 3336 1111 -2377 -3481 -963 2456 3402 503 -2500 -3158
2951 -3158 -683 2451 3087 674 -2456 -3038 -771 2421 3277 909 -2756 -3174 -387 2748 3346 458
2967 458 -3012 -3070 -243 2810 3013 -196 -2903 -2736 104 2846 2823 -106 -2781 -2632 186 2878 2707
2984 2707 -277 -2919 -3005 266 3084 2582 -470 -3080 -2626 636 3298 2412 -811 -3225 -2416 671
3000 671 3231 2172 -1021 -3062 -1913 843 3124 2030 -996 -3346 -1973 1098 3324 1943 -1285
3015 -1285 -3327 -2159 1372 3230 1976 -1491 -3239 -1693 1782 3255 1580 -1900 -3144 -1509 1636
3030 1636 2949 1254 -1621 -3220 -1501 1793 3240 1313 -1909 -2965 -1352 1936 3225 1016 -2218
3045 -2218 -3112 -941 2180 2892 928 -2173 -2969 -641 2159 2777 603 -2375 -3083 -735 2317 2797
$$ packed form
2936C449k066l317j567K109L689J039k225l488j104K518L419R46k899l003o58
2951c158K475L134O36k413l130n82K267L192Q56k368l665m18K787L135N98k888
2967D58l470n8K827L053K03l209k707J67K840K742k3k929k675J49K818K692j71
2984B707k984k642q6L271K818n02l052k610M54L262K662q86l223k414Q09L087
3000F71K560j059l193k041J149K756K281j094l026k350J373L071K226j381l228
3015a285k042J168L531J858j254l467j748J546L475J473j675l480j244J635L145
3030A636J313j695k875j599J719L294J447j927l222j056J613L288J289k209l234
3045b218q94K171L121P12j964l101p96K328K800O18k174k978p08K348L052M80
$$ plain form
3061 2797 497 -2395 -3058 -459 2330 2791 307 -2461 -2735 -269 2642 2781 260 -2615 -2690 -24
3077 -24 2721 2698 -90 -2698 -2497 -14 2662 2560 -260 -2564 -2145 370 2748 2503 -527 -2823 -2449
3094 -2449 344 2928 2410 -590 -2861 -2339 627 2980 2149 -778 -2914 -2034 941 2797 1880 -857
3110 -857 -2770 -1949 956 2959 1868 -1007 -2942 -1728 1071 3025 1823 -1177 -3134 -1642 1315
3125 1315 2772 1546 -1492 -2878 -1424 1534 2834 1432 -1613 -3094 -1522 1697 3092 1131 -1787
3140 -1787 -2734 -983 1736 2835 1099 -1847 -2815 -1053 1782 2731 922 -2077 -2838 -904 2113 2645
3156 2645 509 -2169 -2754 -578 2209 2816 440 -2182 -2865 -417 2310 2653 508 -2213 -2530 -320
3172 -320 2264 2624 341 -2418 -2629 -146 2326 2487 22 -2468 -2388 77 2235 2295 5 -2625 -2453
$$ packed form
3061B797k300k892o63K599K789M61k484k768k74K466K911J39k521k875p5K666
3077b4K745k3k788k608K01K483K676j02k820k304M19K515K378k45l030k296L74
3094b449K793K584n18l000k271N22K966K353q31k927k136Q80K975J856r17k737
3110h57j913Q21K905K003j091k875j935J214K799J954j202l000j957J492K957
3125A315J457j226l038j386J454K958J300j402l045j481J572L219J395j961k918
3140a787r47J751K719J099j736k946r68J762K835R49j809k999p61J934L017N32
3156B645k136k678n85K176K787O07k376k622o83K448K727L43k145k721l17K210
3172c20K584L60k283k759k11K483K472J61k465k490Q0K465K158O0k290k630J72
$$ plain form
3189 -2453 189 2469 2343 -311 -2591 -2207 297 2636 2028 -499 -2558 -2206 528 2623 1922 -593
3205 -593 -2643 -2033 521 2661 2152 -704 -2769 -1782 751 2829 1762 -1051 -2702 -1844 1040 2629
3221 2629 1824 -884 -2785 -1690 1220 2507 1480 -999 -2672 -1593 1343 2655 1341 -1267 -2737
3236 -2737 -1204 1308 2703 1213 -1518 -2643 -1144 1412 2702 1169 -1419 -2717 -1001 1788 2656
3251 2656 741 -1767 -2675 -991 1696 2739 761 -1931 -2473 -588 1974 2384 617 -2114 -2558 -601
3267 -601 1937 2404 404 -2041 -2595 -156 2018 2304 383 -2044 -2265 -311 2106 2456 166 -2240
3283 -2240 -2239 4 2226 2189 74 -2182 -2161 158 2105 2060 -8 -2304 -2150 214 2392 2304 -304 -2300
3301 -2300 -2072 371 2346 1959 -425 -2255 -1825 761 2547 2018 -628 -2456 -1873 708 2387 1771
$$ packed form
3189b453K642K280j26k654k280L84K504K339o08k527k059L52K734K095p01k515
3205e93k050O10K554K140n09k856k065R87K533K078j067k813j651Q58K884J589
3221B629q05k708j901J095K910J287j027k479j673J079K936J312j314k608j470
3236b737J533K512J395j490k731j125J499K556J290j533k588j298J716K789Q68
3251B656j915k508r08J684K687J043j978k692n42J885K562M10j767k731m44J957
3267f01K538M67k000k445n54K439K174K86j921k427k21J954K417L50k290k406
3283b240JK243K222l7k115k256K1K319J947m5k068k296J54K364K178q8k608j996
3301b300K28K443J975l87k384j830M30K586J786n29k646j828N83K581J679o16
$$ plain form
3317 1771 -938 -2367 -1620 809 2503 1552 -954 -2128 -1536 1085 2342 1432 -1057 -2569 -1339 952
3333 952 2488 1365 -1102 -2508 -1277 1333 2561 1137 -1362 -2491 -1136 1281 2461 1108 -1240
3348 -1240 -2409 -1058 1442 2450 822 -1492 -2474 -912 1547 2444 850 -1523 -2235 -534 1596 2507
3364 2507 643 -1731 -2325 -560 1789 2286 519 -1723 -2438 -387 1791 2280 431 -1844 -2094 -241
3380 -241 1879 2188 213 -2179 -2182 -186 2254 2005 87 -1987 -2112 -42 2070 2020 -252 -2180 -2019
3397 -2019 91 2039 1958 -222 -2081 -1942 297 2087 1857 -353 -2246 -1737 364 2252 1690 -371
3413 -371 -2339 -1713 637 2243 1617 -506 -2164 -1640 661 2240 1598 -771 -2318 -1445 933 2406
3429 2406 1534 -737 -2360 -1291 1012 2306 1361 -955 -2211 -1528 1113 2143 939 -1236 -2356 -1235
$$ packed form
3317A771k709j429P47K429J694r51k506j174N92K621J257r10k489j512J230K291
3333I52J536j123k467j406J231K610J228j424k499j129J355K417J180j353k348
3348a240j169J351K500J008j628k314r82J562K459Q97j594k373p12J701K130R11
3364B507j864k374n94J765K349M97j767k242p15K051K178M89j849k275k50J853
3380b41K120L09j975k392lJ996K440k49j918k074j25K070K112n0k272j928J61
3397b019K110J948q1k180j859J39K239J790k30k210j893N09K101J888n62k061
3413c71j968O26K350J606o26k123j658N24K301J579o42k369j547Q73K378J473
3429B406q72k271j623J069K303J294r45k316j256O83K641J030j204k175j120J121
$$ plain form
3445 -1235 1029 2315 1309 -1445 -2356 -779 1203 2155 742 -1300 -2299 -747 1426 2247 875 -1419
3461 -1419 -2181 -647 1451 2303 650 -1524 -2008 -699 1756 2164 585 -1467 -2113 -481 1606 2086
3477 2086 354 -1886 -1960 -408 1826 2090 213 -1874 -2009 -171 1704 2060 255 -1952 -1950 -26 2095
3494 2095 1798 -48 -1941 -1892 68 1882 1788 -173 -2114 -1722 119 1968 1960 -242 -1954 -1916 319 1936
3512 1936 1659 -453 -2121 -1486 495 2049 1558 -377 -2031 -1593 727 2143 1542 -593 -2027 -1462
3528 -1462 760 2203 1399 -886 -2088 -1217 781 2092 1331 -904 -2116 -1169 907 2128 1225 -989
3544 -989 -1995 -1074 864 2161 1082 -991 -2103 -1042 1244 2064 852 -902 -1966 -848 1104 2013
3560 2013 959 -1261 -2001 -609 1591 2092 638 -1236 -2119 -725 1502 1983 459 -1395 -1778 -471
$$ packed form
3445a235K264J286j006k754r11J577J982R52j413k042r99J552K173Q21j372k294
3461a419p62J534K098Q52j653k174m84J309K455M08j579k052o46J632K087M80
3477B086j732k240p4J552K234K64j877k087j35J838J875L56j805k207KJ924K121
3494B095k97j846j893M9J960J814r4j961j941L92J841J849qk202j712L8K235J617
3512A936k77k112j668O35J981J554m91j935j654M38K320J416o01k135j434N65
3528a462K222J443q04k285j202Q71J998J311p61k235j212R47K076J221r03k214
3544i89j006R21J938J297j079k073j112J061K286Q20j212j754j064J118J952R09
3560B013j054k220p40J392K200N01j454j874q83J394K227M81j524j854l83J307
$$ plain form
3576 -471 1563 1933 454 -1474 -2156 -352 1512 1982 488 -1621 -1932 -252 1680 1892 104 -1558
3592 -1558 -1761 -178 1685 1820 106 -1896 -1807 -72 1815 1702 -1 -1709 -1761 91 1782 1732 -180
3609 -180 -1944 -1619 284 1915 1581 -246 -1703 -1432 499 1991 1326 -526 -1992 -1340 337 2088
3625 2088 1363 -670 -1994 -1326 628 1661 1387 -729 -2043 -1140 873 1922 1278 -765 -2246 -945
3641 -945 893 1804 1227 -1027 -1899 -1029 844 1812 1117 -1096 -2045 -977 1014 1946 1025 -1233 -1878 -974
3659 -974 1096 1922 737 -1174 -1761 -677 1099 2198 555 -1316 -1898 -424 1440 1785 606 -1206
3675 -1206 -1921 -425 1369 1633 603 -1207 -1715 -334 1414 1762 510 -1347 -1844 -124 1346 1793
3691 1793 71 -1449 -1739 -142 1566 1808 98 -1640 -1621 -54 1610 1635 97 -1699 -1489 -69 1573
$$ packed form
3576d71K034L70j479j928o82J804J864M70j494k109l11J680J932K12j788j662
3592a558k03J583J863J35j714k002Q9J735J887j13j703j708n2J852J691n0j912
3609a80j764L25J903J631l34j827j457K71J931J492o65j852j466O52J677J751
3625B088p25k033j324O68J954J033k74k116j314R03K013J049o44k043j481J301
3641i45J838R11n77k254q72Q70J873R68o95k213r49J068J991R32r21k258o45R04
3659i74K070Q26j185j911n87J084J776J099j643j871n82J474J864L45j179j812
3675a206p15J496J794K64j030j810n08J381J748L48j252j857m97J720J470M47
3691A793j722j520k90J597J708K42j710j738J9J567J664K5j538j796K10J420J642
$$ plain form
3708 1573 1645 62 -1787 -1502 49 1743 1478 -367 -1758 -1404 293 1771 1431 -459 -1900 -1296 305
3725 305 1882 1336 -577 -1745 -1361 408 1733 1283 -611 -1920 -1144 409 1699 1305 -604 -1928
3741 -1928 -1278 800 1691 1140 -790 -1624 -915 861 1829 902 -908 -1743 -908 905 1791 866 -923 -1887
3759 -1887 -1010 868 1587 774 -998 -1930 -710 814 1821 750 -1234 -1673 -767 1282 2001 539 -1204
3776 -1204 -1616 -513 1179 1950 629 -1301 -1714 -402 1217 1711 360 -1478 -1699 -377 1356 1628
3792 1628 204 -1383 -1430 -250 1388 1718 -6 -1445 -1649 -167 1496 1591 -20 -1695 -1600 99 1437
3809 1437 1768 135 -1288 -1658 108 1895 1492 -38 -1631 -1424 182 1589 1492 -427 -1685 -1268 381
3826 381 1701 1273 -192 -1477 -1343 368 1697 1166 -308 -1578 -1263 600 1707 1287 -573 -1763
$$ packed form
3708A573P2j583j849K85J551J694k65j845j391L54J697J478l40j890j441O04J601
3725C05J577n46j913j168L84J769J325m50j894j309P76J553J290l94j909j324
3741a928O50K078Q91n51j930q34P09J776R68r27j810q35Q35J813Q86r25j789r64
3759a887Q77J878P19q13j772r32J220J524J007j071j984m39R06K049P19j462j743
3776a204m12J103J692P71j321j930m13J312J619M94j351j838k21J322J733K72
3792A628j424j587m7J180J638L30j724j439k04J482J663R5j611j675R5J699J338
3809A437L31j633j423l70J766J787m03j530j593K07J606J407r7j919j258M17J649
3826C81J320m28j465j285J34J711J329n31j474j270L15J863J107m20j860j190
$$ plain form
3842 -1763 -942 496 1698 1005 -766 -1593 -957 502 1769 980 -693 -1612 -1046 780 1646 958 -927
3859 -927 -1779 -785 819 1584 975 -791 -1549 -674 768 1594 817 -1017 -1636 -676 913 1751 785 -1047
3877 -1047 -1805 -617 1195 1615 423 -1086 -1590 -444 1124 1655 291 -1245 -1561 -373 1143 1704
3893 1704 283 -1381 -1511 -540 1349 1529 298 -1326 -1601 -65 1258 1509 97 -1356 -1458 -149
3909 -149 1254 1399 36 -1515 -1457 -78 1507 1384 -161 -1373 -1376 193 1616 1298 36 -1589 -1463
3926 -1463 333 1541 1409 -325 -1413 -1118 376 1576 1346 -301 -1629 -1114 362 1496 1118 -576
3942 -576 -1495 -1181 477 1594 1089 -670 -1596 -965 628 1665 1012 -481 -1674 -986 838 1683 919
3959 919 -579 -1574 -867 723 1484 824 -921 -1654 -804 835 1465 686 -593 -1652 -648 741 1771
$$ packed form
3842a763Q21J438J202o93j771q27O36J459J267p89j673r19N66J826Q66o88j885
3859i27q52R94J604P65o09j766p58Q75J442Q26p77j834o19R60J589Q38r66j832
3877a047p58J188J812M20j192j509n04J146J568N31j364j536l16J188J516N61
3893A704j421j664j30R71J889J80j231j624k75J536J323K51j412j453j02J309
3909a49J403J45j363j551N8J379J585j23j545j212lJ569J423l18j262j625J26
3926a463J796J208j32j734j088K95J494J200k30j647j328N15J476J134l78j694
3942e76r19L14J658J117n05j759r26O31J593J037o53j493j193O88J824Q45p64
3959I19j498r95P07J590P61o60j745p33Q50J639O30p79j279j059J004J389J030
$$ plain form
3976 1771 600 -937 -1530 -711 926 1371 753 -945 -1642 -467 899 1452 494 -1171 -1621 -442 1168
3993 1168 1525 514 -1144 -1452 -53 1154 1690 184 -1219 -1610 -430 1110 1415 107 -1282 -1313 -92
4010 -92 1165 1493 -21 -1452 -1378 7 1501 1377 -14 -1354 -1038 193 1421 1262 -10 -1466 -1284
4027 -1284 152 1391 1196 -230 -1303 -1303 204 1542 1099 -258 -1299 -904 463 1534 1182 -503 -1427
4044 -1427 -1077 273 1558 1099 -454 -1554 -1041 484 1346 1036 -627 -1422 -933 492 1414 798 -714
4061 -714 -1429 -992 688 1470 852 -567 -1627 -904 789 1405 647 -838 -1470 -599 931 1529 894 -753
4079 -753 -1636 -513 543 1313 779 -824 -1331 -578 979 1519 479 -927 -1303 -369 913 1396 237
4096 237 -1122 -1368 -563 1034 1337 395 -1102 -1566 -273 1136 1501 123 -1099 -1338 -152 1136 1243
$$ packed form
3976A771j171j537n93Q19J637M45o18j698o97J175J366N53r58j665m50J179J610
3993A168L57j011j658l08J399J207N36j506j403l91J180J540L05j308j389l1J221
4010i2J257L28j514j431P4J385J494j24j391j340L16J231J228j59j272j456J82
4027a284J436J239j95j426j073%J507J338m43j357j041L95J367J071l52j685r24
4044a427L50J350J285m59j553j100N13J525Q62l10j663p95M89J425R22o16j512
4061g14p15M37J680P82o18j419j060P23J693O16p58j485o32Q71J530N98o35j647
4079g53q83J123J056P70n34j603n07P53J557N40j040j406l76R34J282M83j159
4096B37j359k46Q05J597L03r42j497m64J293J409L65j378j222k39J186J288J07
$$ plain form
4113 1243 77 -1059 -1062 -82 1189 1402 -40 -1316 -1312 29 1138 1235 48 -1340 -1286 91 1415 1164
4131 1164 -94 -1250 -1246 279 1137 1161 -158 -1295 -1063 274 1370 1114 -141 -1306 -974 240 1416
4148 1416 1090 -293 -1242 -984 202 1334 1136 -397 -1335 -992 404 1453 819 -345 -1326 -923 466
4165 466 1413 922 -388 -1467 -697 523 1387 725 -693 -1480 -718 572 1486 693 -722 -1296 -718 737
4183 737 1279 638 -806 -1501 -702 765 1504 678 -779 -1282 -478 941 1429 448 -969 -1305 -608 865
$$ packed form
4113A243j166j136lR80J271K13j442j276MJ341J109R7j187j388N4J377J324k51
4131A164j258j156MJ525Q58K4j319j137K32J337J096k56j255j165L32J214J176
4148A416l26j383r49K58J186J132j98j533r38L43J396J049o34j164r81M03J389
4165D66R47m91j310j079P70J220Q64o62j418p87P62J290R14p93j415n74N78J455
4183G37N42o41j444o95P99J467P39q26j457n03Q04J419M88r81j417l36O97J473
$$ [...]
8191g9
##END NTUPLES=NMR FID
##END=
