##TITLE=1H_CA-8639-3
 DMSO, 8 sc, 
 16.9.2019
##JCAMPDX= 6.0         $$ Bruker NMR JCAMP-DX V2.0
##DATA TYPE= NMR FID
##DATA CLASS= NTUPLES
##ORIGIN= UXNMR, Bruker Analytische Messtechnik GmbH
##OWNER= root
$$ XWIN-NMR		Version 3.5
$$ Mon Sep 16 13:54:03 2019 Russian Standard Time (UT+4h)  she@DPX200
##.OBSERVE FREQUENCY= 200.13155
##.OBSERVE NUCLEUS= ^1H
##.DELAY= (6, 6)
##.ACQUISITION MODE= SIMULTANEOUS
##.ACQUISITION SCHEME= undefined
##.AVERAGES= 8
##.DIGITISER RES= 18
##SPECTROMETER/DATA SYSTEM= spect
##.PULSE SEQUENCE= zg30
##.SOLVENT NAME= DMSO
##.SHIFT REFERENCE= (INTERNAL, DMSO, 0, 15.7039)
##AUDIT TRAIL= $$ (NUMBER, WHEN, WHO, WHERE, WHAT)
$$ ##TITLE= Audit trail, XWIN-NMR		Version 3.5
$$ ##JCAMPDX= 5.01
$$ ##ORIGIN= Bruker BioSpin GmbH
$$ ##OWNER= she
$$ F:/spectra/data/she/nmr/H-F/1/audita.txt
$$ ##AUDIT TRAIL=  $$ (NUMBER, WHEN, WHO, WHERE, WHAT)
(   1,<2019-09-16 13:52:41.48 +0400>,<she>,<DPX200>,
      <created by zg, POWCHK disabled, PULCHK disabled
       configuration hash MD5:
       00 E9 B6 7A A2 85 ED C7 34 08 36 98 17 FE 4E 26
       data hash MD5: 16K
       71 BF AB 33 A0 7F 5E EB 97 EE F3 D6 9F 9C E1 9A>)
$$ ##END=
$$ 
$$ hash MD5
$$ 98 1B FA CB CE A8 2B 45 16 F8 93 E9 4F B9 B0 01
##$RELAX= 
##$RELAX= 
##$RELAX= 
##$RELAX= 
##$RELAX= 
##$RELAX= 
$$ Bruker specific parameters
$$ --------------------------
##$DU= <F:/spectra>
##$EXPNO= 1
##$NAME= <H-F>
##$PROCNO= 1
##$TYPE= <nmr>
##$USER= <she>
##$AMP= (0..31)
100 100 100 100 100 100 100 100 100 100 100 100 100 100 100 100 100 100 
100 100 100 100 100 100 100 100 100 100 100 100 100 100 
##$AQSEQ= 0
##$AQ_mod= 1
##$AUNM= <au_zg>
##$AUTOPOS= <>
##$BF1= 200.13
##$BF2= 200.13
##$BF3= 200.13
##$BF4= 200.13
##$BF5= 200.13
##$BF6= 200.13
##$BF7= 200.13
##$BF8= 200.13
##$BYTORDA= 1
##$CFDGTYP= 0
##$CFRGTYP= 5
##$CHEMSTR= <none>
##$CNST= (0..31)
1 1 145 1 1 1 1 1 1 1 1 1 1 1 1 1 1 1 1 1 1 1 1 1 1 1 1 1 1 1 1 1 
##$CPDPRG= <>
##$CPDPRG1= <>
##$CPDPRG2= <>
##$CPDPRG3= <>
##$CPDPRG4= <mlev>
##$CPDPRG5= <mlev>
##$CPDPRG6= <mlev>
##$CPDPRG7= <mlev>
##$CPDPRG8= <mlev>
##$CPDPRGB= <>
##$CPDPRGT= <>
##$D= (0..31)
0 1.2 0 0 0 0 0 0 0 0 0 0.03 0 0 0 0 0 0 0 0 0 0 0 0 0 0 0 0 0 0 0 0 
##$DATE= 1568627560
##$DBL= (0..7)
120 120 120 120 120 120 120 120 
##$DBP= (0..7)
150 150 150 150 150 150 150 150 
##$DBP07= 0
##$DBPNAM0= <>
##$DBPNAM1= <>
##$DBPNAM2= <>
##$DBPNAM3= <>
##$DBPNAM4= <>
##$DBPNAM5= <>
##$DBPNAM6= <>
##$DBPNAM7= <>
##$DBPOAL= (0..7)
0.5 0.5 0.5 0.5 0.5 0.5 0.5 0.5 
##$DBPOFFS= (0..7)
0 0 0 0 0 0 0 0 
##$DE= 6
##$DECBNUC= <off>
##$DECIM= 24
##$DECNUC= <off>
##$DECSTAT= 4
##$DIGMOD= 1
##$DIGTYP= 9
##$DL= (0..7)
0 120 120 120 120 120 120 120 
##$DP= (0..7)
150 150 150 150 150 150 150 150 
##$DP07= 0
##$DPNAME0= <>
##$DPNAME1= <>
##$DPNAME2= <>
##$DPNAME3= <>
##$DPNAME4= <>
##$DPNAME5= <>
##$DPNAME6= <>
##$DPNAME7= <>
##$DPOAL= (0..7)
0.5 0.5 0.5 0.5 0.5 0.5 0.5 0.5 
##$DPOFFS= (0..7)
0 0 0 0 0 0 0 0 
##$DQDMODE= 0
##$DR= 18
##$DS= 0
##$DSLIST= <SSSSSSSSSSSSSSS>
##$DSPFIRM= 0
$$ [...]
##$SUBNAM2= <"">
##$SUBNAM3= <"">
##$SUBNAM4= <"">
##$SUBNAM5= <"">
##$SUBNAM6= <"">
##$SUBNAM7= <"">
##$SUBNAM8= <"">
##$SUBNAM9= <"">
##$SW= 24.9336996594482
##$SWIBOX= (0..15)
0 0 2 0 0 0 0 0 0 0 0 0 0 0 0 0 
##$SW_h= 4990.01996007984
##$TD= 16384
##$TD0= 1
##$TE= 0
##$TE2= 300
##$TE3= 300
##$TEG= 300
##$TL= (0..7)
0 120 120 120 120 120 120 120 
##$TP= (0..7)
150 150 150 150 150 150 150 150 
##$TP07= 0
##$TPNAME0= <>
##$TPNAME1= <>
##$TPNAME2= <>
##$TPNAME3= <>
##$TPNAME4= <>
##$TPNAME5= <>
##$TPNAME6= <>
##$TPNAME7= <>
##$TPOAL= (0..7)
0.5 0.5 0.5 0.5 0.5 0.5 0.5 0.5 
##$TPOFFS= (0..7)
0 0 0 0 0 0 0 0 
##$TUNHIN= 0
##$TUNHOUT= 0
##$TUNXOUT= 0
##$USERA1= <user>
##$USERA2= <user>
##$USERA3= <user>
##$USERA4= <user>
##$USERA5= <user>
##$V9= 5
##$VALIST= <valist>
##$VCLIST= <CCCCCCCCCCCCCCC>
##$VD= 0
##$VDLIST= <DDDDDDDDDDDDDDD>
##$VPLIST= <PPPPPPPPPPPPPPP>
##$VTLIST= <TTTTTTTTTTTTTTT>
##$WBST= 1024
##$WBSW= 4
##$XGAIN= (0..3)
0 0 0 0 
##$XL= 0
##$YL= 0
##$YMAX_a= 529667
##$YMIN_a= -709032
##$ZGOPTNS= <>
##$ZL1= 120
##$ZL2= 120
##$ZL3= 120
##$ZL4= 120
##$ABSF1= 10
##$ABSF2= 0
##$ABSG= 5
##$ABSL= 3
##$ALPHA= 0
##$AQORDER= 0
##$ASSFAC= 0
##$ASSFACI= 0
##$ASSFACX= 0
##$ASSWID= 0
##$AUNMP= <proc_1d>
##$AZFE= 0.1
##$AZFW= 0.1
##$BCFW= 1
##$BC_mod= 2
##$BYTORDP= 1
##$COROFFS= 0
##$CY= 11.3945322036743
##$DATMOD= 1
##$DC= 2
##$DFILT= <>
##$DTYPP= 0
##$F1P= 20.1720416913024
##$F2P= 0.152960286110954
##$FCOR= 0.5
##$FTSIZE= 0
##$FT_mod= 4
##$GAMMA= 1
##$GB= 0.15
##$INTBC= 1
##$INTSCL= 1
##$ISEN= 128
##$LB= 0.24
##$LEV0= 0
##$LPBIN= 0
##$MAXI= 10000
##$MC2= 0
##$MEAN= 0
##$ME_mod= 0
##$MI= 1.114404
##$NCOEF= 0
##$NC_proc= 0
##$NLEV= 6
##$NOISF1= 3.799351
##$NOISF2= 2.8
##$NSP= 1
##$NTH_PI= 0
##$NZP= 0
##$OFFSET= 15.70392
##$PC= 1
##$PHC0= -9216.117
##$PHC1= 15.20096
##$PH_mod= 1
##$PKNL= yes
##$PPARMOD= 0
##$PSCAL= 0
##$PSIGN= 0
##$REVERSE= no
##$SF= 200.130013532006
##$SI= 16384
##$SIGF1= 3
##$SIGF2= 2
##$SINO= 400
##$SIOLD= 16384
##$SREGLST= <1H.CDCl3>
##$SSB= 0
##$STSI= 0
##$STSR= 0
##$SW_p= 3612.71676300578
##$SYMM= 0
##$S_DEV= 0
##$TDeff= 0
##$TDoff= 0
##$TI= <>
##$TILT= no
##$TM1= 0
##$TM2= 0
##$TOPLEV= 0
##$USERP1= <user>
##$USERP2= <user>
##$USERP3= <user>
##$USERP4= <user>
##$USERP5= <user>
##$WDW= 1
##$XDIM= 8192
##$YMAX_p= 0
##$YMIN_p= 0
$$ End of Bruker specific parameters
$$ ---------------------------------
##NTUPLES= NMR FID
##VAR_NAME=  TIME,          FID/REAL,        FID/IMAG
##SYMBOL=    X,             R,               I
##VAR_TYPE=  INDEPENDENT,   DEPENDENT,       DEPENDENT
##VAR_FORM=  AFFN,          ASDF,            ASDF
##VAR_DIM=   8192,          8192,            8192
##UNITS=     SECONDS,       ARBITRARY UNITS, ARBITRARY UNITS
##FACTOR=    0.0002004,     1,               1
##FIRST=     0,             0,               0
##LAST=      1.6414764,     0,               0
##MIN=       0,             -709032,         0
##MAX=       1.6414764,     529667,          0
$$ Real data points
##PAGE= N=1
##DATA TABLE= (X++(R..R)), XYDATA
0@%%%qJ6j6J6k4L4m2N6p2Q8j12J43j70K04k47K91l43M04m70N47o35P28q37R60
27E11j089J237j402J580j779J997k236K500k787L101l449L831m247M707n214N770
43C031o388P077p844Q710r692J0809j2101J3615j5413J7595k0311K3790k8445
56a5567L5040m5164O2892j02896L49088m7123p21062J15162N04125L95172k07249
67C22418l75656j89259J51183J77550Q1697p8277j28511j31698L4769J86709J65022
78B15947j16399k90059j33336K28478L24756O6459k48332k53485k3708J86837
88d2842K04203R1699p6443j93403j68820L8406K44268K11919o9107k82070j78787
99b20977J21468K67559J08707j64006k48923o5192J87573K40754K9882k33497
$$ plain form
0 0 0 0 0 -8 8 -8 8 -16 18 -24 32 -40 48 -64 79 -91 113 -134 157 -186 218 -252 295 -340 388 -449 511
27 511 -578 659 -743 837 -942 1055 -1181 1319 -1468 1633 -1816 2015 -2232 2475 -2739 3031
43 3031 -3357 3720 -4124 4586 -5106 5703 -6398 7217 -8196 9399 -10912 12878 -15567
56 -15567 19473 -25691 37201 -65695 283393 236270 -484792 -369630 134495 529667 322418
67 322418 -53238 -242497 -91314 86236 167933 89656 -38855 -170553 -135784 50925 215947
78 215947 99548 -190511 -323847 -95369 229387 295846 47514 -205971 -229679 -42842
88 -42842 161361 253060 176617 -16786 -185606 -147200 97068 308987 239880 -42190 -220977
99 -220977 -99509 168050 276757 112751 -136172 -201364 -13791 226963 256845 23348
109B3348k52028K2119K93986K38750r3438l14907j68302J57141K78755R1213j50626
120A26011j95194o3816Q0037J44466J07358l5859j91648j76875N1241K53533J60919
131B60173j46819k95582r7399J99248K41289J5685j89866j73596o418J36954J63722
142A07391O3590j13942k17742q2694K02982K96428K6578l02617k62526J13706
152a68846L48750J54114k02520k76198l4225J82251J54923L018r2489j09706q1851
163a22779J5132J45928J49814m8473k39141j57402J28108K61575P7040j81367
173B8435k04073n824J51793J28745J6012o8164j06293q3899M0837J81733J43138
184B22440r6387k61947j13960K01129K89555K1495k80153k49230O5999K87560
$$ plain form
109 23348 -228680 -206561 87425 326175 232737 -82170 -250472 -93331 185424 276637 126011
120 126011 -69183 -132999 -52962 91504 198862 163003 -28645 -205520 -154279 99254 260173
131 260173 113354 -182228 -279627 -80379 160910 176595 -13271 -186867 -193285 -56331 107391
142 107391 170981 57039 -160703 -243397 -40415 256013 282591 -20026 -282552 -168846
152 -168846 179904 334018 131498 -144700 -178925 3326 158249 161267 68778 -40928 -122779
163 -122779 -107647 38281 188095 139622 -99519 -256921 -128813 132762 209802 28435
173 28435 -175638 -181462 -29669 99076 115088 46924 -59369 -143268 -102431 79302 222440
184 222440 126053 -135894 -249854 -48725 240830 262325 -17828 -267058 -201059 86501
194H6501J77894j13196k64253j38616J12897K35356J18765j12119k24203r9758
204b20732J26129K06429O3831j22896j56652l4041R9329J27436M9069o6773j33528
215f2399p7726Q0423J82634Q0251j40784k14926l2014J91900J83720l4729j90826
226c4476j23495M4062J24479Q9241J1702p6167j36596p6700J08665K21840P2374
237B24929k03952k49930L3257K94214J84777j51095k76931n4788K00961J85316
247A86758k1855j46508r7787J177N9081R0047P4475l7055j64780j27661Q4878
258i9230K22978Q9347j67452k23471j3246J89896J52489l7786j49828r8660K2263
269a12700J07922J08910K0721j10123j52107j7123J73733J84570k9421k20233
$$ plain form
194 86501 264395 151199 -113054 -251670 -138773 96583 215348 103229 -120974 -220732
204 -220732 -94603 111826 175657 52761 -103891 -137932 -38603 88833 137902 71129 -62399
215 -62399 -140125 -59702 122932 203183 62399 -152527 -184541 7359 191079 156350 -34476
226 -34476 -157971 -113909 10570 99811 111513 35346 -101250 -177950 -69285 152555 224929
237 224929 20977 -228953 -195696 98518 283295 132200 -144731 -199519 1442 186758
247 186758 164903 18395 -79392 -78215 -19134 70913 145388 108333 -56447 -184108 -99230
258 -99230 123748 213095 45643 -177828 -191074 -1178 151311 113525 -36303 -134963 -112700
269 -112700 -4778 104132 124853 14730 -137377 -154500 19233 203803 174382 -45851
279d5851j51189R4930K24942R8801j16652j84634o3176R7405J50479O5022q0503
290H9574j56093p6988R1475J67438N2920j27967j63086j3099J39418J26410j3570
301A16432j18934j03963m256R6557J22061L4055j08608j60638l4243J51886J76655
312A67004n815j83386j45834M8980J68161R7456n6308j33456q4852K9130J21890
323B2970J13023k1437j67453j41597P0929K26338J12758j49042k30557k8958J94378
334A352J70544l6458j55362q4777L7660Q1430O3925K8907l8492j11917q2252P5755
346d9685J81675O2106j63053j98352J5957K04874J32888q9772j81510o4442Q2763
357f6551J06428M0433k7495p7304r1537j7424J14497J46192n439j80365j44812
$$ plain form
279 -45851 -197040 -102110 122832 221633 104981 -79653 -142829 -45424 105055 170077 89574
290 89574 -66519 -143507 -52032 115406 168326 40359 -122727 -135826 3592 130002 116432
301 116432 -2502 -106465 -110721 -14164 107897 141952 33344 -127294 -161537 -9651 167004
312 167004 161189 -22197 -168031 -119051 49110 146566 90258 -43198 -128050 -98920 22970
323 22970 135993 114556 -52897 -194494 -123565 102773 215531 66489 -164068 -193026 1352
334 1352 171896 135438 -19924 -104701 -67041 14389 78314 107221 68729 -43188 -125440 -49685
346 -49685 131990 194096 31043 -167309 -151352 53522 186410 96638 -84872 -149314 -66551
357 -66551 39877 80310 52815 -24489 -116026 -133450 -18953 127239 121800 -58565 -203377
368b03377Q2191K20643R0919j40275j90075j8625J53391J43400l575j20469j11443
379i7295q215R8361J17793K4508j06251j33076j5417J18946J19520r887j21836
390a2849j02224J2888J04912R4492n164j08540j16112M796J40129J30949l6501
401A06776j73147j10165Q3196J76292O5485j02585j36429l1025P8063R9408M3901
412I9770m2919j09189q2915M6501J55226R0343j06762j93570m1048J69829J68182
423A53448l6271j78435r7203P5108J28329M4465m1827o0996n0019j7262N7661
434b3002J11988M3640j07978j50593J516J69893J29012p4404j80457o6872J04579
445d2678J30124J7500q3793r2285l8465L4506R2951P8542l6107j47182r9362Q3307
$$ plain form
368 -203377 -121186 99457 190376 50101 -139974 -158599 -5208 138192 134617 14148 -97295
379 -97295 -105510 -7149 110644 135152 28901 -104175 -119592 -646 118874 108987 -12849
390 -12849 -115073 -102185 2727 97219 92055 -16485 -132597 -127801 12328 143277 106776
401 106776 -66371 -176536 -93340 82952 148437 45852 -90577 -121602 -43539 55869 99770
412 99770 56851 -52338 -135253 -88752 66474 156817 50055 -143515 -184563 -14734 153448
423 153448 117177 -61258 -158461 -83353 44976 89441 47614 -13382 -63401 -80663 -23002
434 -23002 88986 132626 24648 -125945 -124429 45464 174476 100072 -80385 -147257 -42678
445 -42678 87446 104946 21153 -71132 -109597 -75091 17860 96402 60295 -86887 -186249 -102942
457a02942J82741N9846j38260j63933O634J56595J14631l8158j18196o6965L1412
468g6595Q9056P7240K348q6508j01255k421J18632J15358k5938j41972r4630N3142
480g3543J29130O1433n8300j08863n7667L9528J00154O9312l8704j22864p8928
491a39312O4014J44284N8844r6200j36450k3436J05040J11788R779q5568r5992
502h3209k4847P2890J13528M0207r7703j43672k1575J39562J36153l5509j62975
513f7150q9992P8798J31818L3688p1101p5925k1974K4390N6945O9524J5742q7327
525b564j13969J2551J57081J18353p5511j78028n4706J30288J43566q948j20943
536G170q0231K1327O5788M9628J4914l6615q7670o1978N4049J33475M9744j17777
$$ plain form
457 -102942 79799 139645 1385 -162548 -155914 681 115312 77154 -41042 -108007 -76595
468 -76595 12461 89701 92049 5541 -95714 -98135 20497 135855 109917 -32055 -126685 -73543
480 -73543 55587 117020 58720 -50143 -107810 -68282 31872 101184 62480 -60384 -139312
491 -139312 -75298 68986 127830 31630 -104820 -128256 -23216 88572 98351 12783 -83209
502 -83209 -108056 -35166 78362 118569 20866 -122806 -144381 -4819 131334 95825 -67150
513 -67150 -157142 -78344 53474 87162 16061 -59864 -81838 -57448 -503 69021 84763 -2564
525 -2564 -116533 -103982 53099 171452 95941 -82087 -136793 -6505 137061 128113 7170
536 7170 -73061 -51734 14054 63682 78596 41981 -45689 -107667 -53618 79857 129601 11824
548A1824j54455J676J55242J13934n6422j42009n9596O7787J02499L9085l7399
559D2166p1719n2412J6500Q9100Q1702k3421j15097p6954N4758J25639N2757p4289
571D8730j12467l2944O7697R4610L3713o0221j03893m5424P1448J21333L6196
582A18778r9683j24720k851J21512J01590k5894j06370o7877K7941Q2842O5506
593I0774m113p7247q7834m030J05251J05468k7867j42244q7984P1346J37671L4880
605A14071r6298j01552k754O7732N6439J1982k6863n9402n4614J9235J02649P9267
617A09892n5549j39563m8013J11633J35383n160j23243q3446L8904R1827M5915
628G8580k0219n1679n3931k1507N0160R4293K9634r8022j24772N973J40100J00777
$$ plain form
548 11824 -142631 -140955 14287 128221 71799 -70210 -129806 -62019 40480 79565 42166
559 42166 -29553 -81965 -65465 23635 105337 81916 -33181 -110135 -55377 70262 123019 48730
571 48730 -63737 -96681 -28984 65626 99339 39118 -64775 -110199 -38751 82582 118778
582 118778 19095 -105625 -108476 13036 114626 88732 -17638 -85515 -57574 25268 90774
593 90774 86661 9414 -78420 -82450 22801 128269 100402 -41842 -129826 -58480 79191 114071
605 114071 17773 -83779 -86533 -18801 37638 49620 22757 -36645 -91259 -72024 30625 109892
617 109892 54343 -85220 -133233 -21600 113783 108623 -14620 -98066 -59162 32665 78580
628 78580 58361 6682 -47249 -68756 -18596 75697 105331 7309 -117463 -111490 28610 129387
640A29387o3805j45509m9961Q8328J06588J3470o5358o7402j9806L3523P0487
651B9942N4782k5850r8920o5512N9592J26785M2292r4513j16490l238J01708Q4384
663I4962j7089q7070o6524O760O7980O9780L002p9808q8375L861R9346Q3568k9566
676F0827j06112o1216M4571R1683M4139l3936p2759m8230K0581Q3194O8429k7102
688F4069j07390o6379O1388J22279L4333r0889j01363L212Q4221O2493j0118n2094
700C762m8476j9528K9962P4581N1342n0142j16835m1592J03412J29618o721j34018
712b4635r0533N7476J20693L9962o1865p3273j8901K6935M6661M4526J973o7543
724A476q3442O636J09465Q4317n7228j35876m7244R4680J11128l175r4278o9242
$$ plain form
640 129387 65582 -79927 -129888 -41560 65028 78498 13140 -54262 -74068 -40545 29942
651 29942 84724 58874 -40046 -105558 -45966 80819 123111 28598 -87892 -91130 10578 94962
663 94962 77873 -9197 -75721 -68961 -981 68799 71801 -8007 -96382 -92521 6825 90393 60827
676 60827 -45285 -106501 -61930 29753 73892 39956 -32803 -81033 -60452 22742 91171 64069
688 64069 -43321 -109700 -48312 73967 108300 17411 -83952 -80740 3481 65974 55856 3762
700 3762 -44714 -64242 -34280 40301 91643 41501 -75334 -116926 -13514 116104 109383 -24635
712 -24635 -115168 -57692 63001 102963 41098 -32175 -51076 -24141 22520 67046 69019 1476
724 1476 -81966 -75330 34135 118452 61224 -74652 -121896 -27216 83912 80737 -13541 -82783
736h2783J5579O0840M7856Q825l4674o3934l4003N0402R6928L2623q0548j00835
748h3724L247J03333P9102k9923q9608m7277L1138O7635M3200j3624o3106o0482
760f0089P963Q2283P1269k8587j04331n9466N4606J00690L1939o1884q1298k1382
772f8287M7855O9283L1816l8053q1658m4890N3007J01600L1838q3518j01520J539
784h0988R7177P3192k9179q3278m4837K2850N4650M3785L375n2357p2201j2786
796h0597Q1307R3291j2522j14176p5870N7909J16550L3076p5426p8745K065N6212
808C074M3765Q383j7791m1735m4224J0186P9007O5227m3345j14645m4432Q6950
820i580J09766l597j04292p2632L0975P5619L5364k1018m3452l8694j2382L7460
$$ plain form
736 -82783 -67204 -6364 41492 50317 15643 -48291 -82294 -31892 65036 97659 17111 -83724
748 -83724 -80477 22856 101958 72035 -17573 -64850 -33712 33923 77123 63499 393 -60089
760 -60089 -52126 30157 101426 72839 -31492 -90958 -36352 64338 96277 34393 -46905 -68287
772 -68287 -20432 48851 80667 42614 -39044 -83934 -30927 70673 102511 18993 -82527 -80988
784 -80988 16189 89381 60202 -23076 -67913 -45063 9587 53372 56747 4390 -67811 -80597
796 -80597 710 94001 81479 -32697 -108567 -50658 65892 98968 23542 -55203 -53138 3074
808 3074 46839 55222 37431 -4304 -48528 -38342 40665 105892 62547 -52098 -96530 -9580
820 -9580 100186 96589 -7703 -80335 -49360 26259 61623 40605 -2847 -41541 -53923 -16463
832a6463O7936K2938o7906r1085K160J02083P8569m0854j05328m3244N9368Q3549
844E1723K0645m6945o0138k4904K8553O4151M3693l0879q3404m4363N2877R3024
856F4033K3530p1161p9249l58O7079N7779k588n1540n4485j0085N0317O9013J3841
869G6126o8894q1370N106R0792O9302l4062q9610m0635M2514O5977K4183k6883
881C2546m7332l6105M248N6351O0350j0423q7422o5123M4413J04604L5426p5670
893A5863q8565K618P5405N2421j3893m4280l3689r693K2829N3322L9391l4610
905C7119q7811l6798P5121J02254j244j03487p4787M0768R3479L3080m7581n9165
917b9052j6459K1247L6156L4526K586n2979o3917O120Q5674O5388m2000j03466
$$ plain form
832 -16463 51473 74411 6505 -84580 -82420 19663 98232 57378 -47950 -91194 -31826 51723
844 51723 72368 25423 -34715 -59619 -31066 33085 76778 45899 -37505 -81868 -28991 64033
856 64033 87563 16402 -62847 -63205 3874 61653 59065 7525 -46960 -57045 -6728 62285 76126
869 76126 7232 -74138 -69032 21760 91062 57000 -32610 -73245 -30731 35246 59429 32546
881 32546 -14786 -50891 -46643 9708 70058 59635 -27787 -92910 -48497 56107 91533 15863
893 15863 -72702 -70084 5321 57742 43849 -431 -34120 -43813 -20984 32338 71729 37119
905 37119 -50692 -87490 -12369 89885 88641 -14846 -89633 -48865 44614 77694 30113 -29052
917 -29052 -45511 -24264 11892 46418 49004 -3975 -67892 -61772 23902 89290 47290 -56176
929e6176l6584P1671Q5714K414o7735n4058N743M3875M1902J2666k8672n4426
941c3666k8174M1105P5153K1088o4621p5538L923P5266N6464k0210o5084m0224
953e4518J5720N1169M2916m063n6513n8111P570P5097N9894k9398q7455m1097
965g8789N0132P6294J6329m8541n2785j1429K9378M5846K8200k0761o3612m2199
977g1937L8654Q6560K9326p0847q5965M215Q3856N7159k9285o5918k8152K1604
989c0730L6102K7031O711k7927n5075k1281N5749P9244M82q8342o9371L9855R6783
1002D9231L3085o1275o9374j750M6958L8631N930j8675l5867l3480R165O1930
1014B4509M9244l3939q8894l4239O6785Q4029j846p7805n5634K2168N9257L0160
$$ plain form
929 -56176 -92760 -21089 64625 67039 -696 -54754 -49011 -5136 36766 49432 20760 -33666
941 -33666 -61840 -20735 54418 75506 10885 -64653 -60730 14536 71000 50790 -14294 -54518
953 -54518 -38798 12371 55287 51224 -5289 -63400 -55830 19267 79161 49763 -37692 -78789
965 -78789 -28657 47637 63966 15425 -37360 -48789 -19411 26435 54635 33874 -29738 -71937
977 -71937 -33283 53277 82603 11756 -74209 -69994 13862 71021 41736 -24182 -52334 -30730
989 -30730 5372 32403 39114 11187 -43888 -65169 -9420 69824 70306 -18036 -87407 -47552 49231
1002 49231 82316 21041 -48333 -50083 -3125 35506 41436 22761 -13106 -46586 -37421 24509
1014 24509 73753 39814 -49080 -83319 -16534 67495 65649 -12156 -67790 -45622 13635 43795
1026D3795j3962l4590l2558p993L4071N4749J4042n5241o6994N557P6976N6140
1038G3992l0724p5387l1954L8012N7737K0848k7057m8304k9656J7968N5748M0261
1050F1484k6929p3393l4700M8854P5000J1447n9552n7330N002N0525L9844p32
1062C9520l3473m0853j5019L4928O0516J8208n6504p0370K953P6861N6104l1088
1074D1783p3698k6809L8006M6808J1957j8486k9382k7190l729L9368N2637o65
1086E0600p0311n9808L3007R0072L3786o3535p6379K201O4799M4238j4469l9183
1098d982k5142m046J7613L8302K7917k6242o6146k8003N5677P6657p58p8996n7399
1111g5548L0794P0998K5764l5203m4988j4316J6538L0563K8715J729m1606m8390
$$ plain form
1026 43795 29833 -4757 -37315 -45308 -11237 43512 57554 2313 -64681 -59124 17852 73992
1038 73992 43268 -32119 -64073 -26061 31676 52524 25467 -22837 -52493 -34525 21223 61484
1050 61484 34555 -38838 -73538 -24684 50316 61763 2211 -55119 -50117 408 40252 39520
1062 39520 6047 -34806 -49825 -14897 45619 63827 7323 -63047 -60094 16767 72871 41783
1074 41783 -31915 -58724 -20718 26090 38047 19561 -9821 -37011 -40740 -1372 51265 50600
1086 50600 -19711 -79519 -46512 43560 77346 13811 -62568 -60367 4432 48670 34201 -4982
1098 -4982 -30124 -34170 -16557 21745 49662 23420 -42726 -70729 -15052 61605 60847 -18149 -75548
1111 -75548 -44754 26244 52008 16805 -28183 -42499 -25961 4602 33317 35046 -6560 -54950
1123e4950P250O6159M9036l0811p5009k6945M9045O2573O220m4865m2915m616
1135c9828K9203L9033J7521k6710n4165k3630M1144O4202R862o0705n8160J1685
1147e0548O1505L6908k0621m6388k6183R633L4633L4824K614m2493n0364L792
1159e2688O3865M9878k7386p1625k8512M4546N8373N979l9104l4808n303J8339
1171a8446L0067K5725r193n0535l9914K7841P4048K9462n8127p3534L127P1732
1183A2253M8009k5588n4639k0382K0111K8414J8926M366k1115m1843j7640M2214
1195f914O1428l97p0718n4626L0468P5192K4957m8877n5254k640L7002K9625N080
1208B4326j4292k8326k6750P559M8731L9077k5266o7234k6114N0690O4938J150
$$ plain form
1123 -54950 -47700 18459 67495 36684 -38325 -65270 -16225 46348 52568 7703 -35212 -39828
1135 -39828 -10625 28408 45929 19219 -34946 -58576 -17432 46770 56632 -4073 -62233 -50548
1147 -50548 10957 47865 27244 -19144 -45327 -35694 -1061 33763 36377 -6116 -56480 -52688
1159 -52688 11177 61055 33669 -37956 -66468 -21922 36451 42430 3326 -31482 -36785 -18446
1171 -18446 11621 37346 28153 -22382 -62296 -34455 39593 69055 10928 -62606 -59479 12253
1183 12253 60262 34674 -19965 -40347 -20236 8178 27104 31470 10355 -31488 -49128 -6914
1195 -6914 54514 54117 -16601 -71227 -40759 34433 59390 10513 -44741 -47381 -10379 19246 24326
1208 24326 10034 -18292 -45042 -37483 11248 50325 25059 -42175 -68289 -17599 47339 48489
1220D8489n6146m3550J2692M4087K9214m827k9827l3381p727L4538M9017N884
1232D8463n2950n1466J3117O3689L6701l0279n5410j7869K9237L8300J4171j3752
1244B1952l3932k8206Q826M6959L7725k2822o3153k7871M4112O0539L696n1230
1256c405m1458Q527L6828K5070o46k0783l0929j7900K2236N1149K1336m5550o3402
1269e8927K09O6233M9657k6486o2917k1292L5126M0138P423j7063k1826j8272
1281b7997j346L0354M1179r77n5199m6061K6487P1675K5466n0995o0111K405N0403
1294E283L3173j0782k9367j9885m725J1983L1096K4303k0337n4126k2957M5308
1306a1033O0708k81o2076m5283K3570N5884K1788k6289l6557j5067J1238K7968
$$ plain form
1220 48489 -7657 -51207 -38515 5572 34786 29959 132 -33249 -40976 -6438 42579 48463
1232 48463 -4487 -55953 -42836 20853 57554 27275 -28135 -46004 -16767 21533 35704 21952
1244 21952 -11980 -40186 -31360 15599 53324 30502 -32651 -60522 -16410 44129 47825 -3405
1256 -3405 -44863 -36336 492 25562 24916 4133 -26796 -44696 -22460 28689 50025 4475 -58927
1269 -58927 -58718 7515 57172 30686 -32231 -53523 -18397 21741 29164 12101 -9725 -27997
1281 -27997 -29343 1011 42190 41213 -13986 -60047 -33560 38115 63581 12586 -47525 -45120 5283
1294 5283 38456 27674 -1693 -21578 -26303 -14320 16776 41079 20742 -33384 -56341 -11033
1306 -11033 49675 49394 -12682 -57965 -34395 21489 43277 16988 -19569 -34636 -23398 4570
1318D570K6584j970l8499l9410J0431N5088L5020l0428n7380j5864L9433M3404
1330C0979K861l0634k9715o257J8911L2506J9010k0008m6722j9990L7705N4566
1342D3212M380n1367m3465J4081M8305K4304j6574l0856j7978J676K1943L0934
1354B8595R944l4173m8057j135N6322M6107k4533o5067k3020M2465M9185P40l6407
1367I66k7207J051J5865K0335J7867n875l7640l2660J9875N8433K4627m5643n9770
1380d9776J076N6814L8409k1059m3120j5757J5627K1723J5022M363j7290l3193
1392b7161j3065L4616M9285o33n5936m2523K6315N8903J9810l6634m2237l114
1404c2374K7158K5061P878j0473k6125k4472R563M3075K8857k6512n4053j5159
$$ plain form
1318 4570 31154 29184 -9315 -48725 -38294 16794 51814 21386 -35994 -51858 -12425 30979
1330 30979 33840 3206 -26509 -32766 -13855 18651 37661 17653 -29069 -49059 -11354 43212
1342 43212 47592 -3775 -47240 -33159 15146 39450 22876 -7980 -25958 -24282 -2339 28595
1354 28595 38539 4366 -43691 -44826 11496 57603 33070 -31997 -55017 -12552 36633 37373 966
1367 966 -26241 -25190 -9325 11010 28877 23002 -14638 -47298 -27423 31010 55637 9994 -49776
1380 -49776 -48700 8114 46523 25464 -17656 -33413 -17786 3937 18959 23322 6032 -27161
1392 -27161 -40226 -5610 43675 43042 -12894 -55417 -29102 29801 49611 12977 -29260 -32374
1404 -32374 -5216 19845 27723 17250 -8875 -33347 -23784 19291 48148 21636 -32417 -47576
1416d7576M2629M7326m458m4366k8989J0288L0386K0518q52k1304k9248r115K8316
1429f445M2391M231m5268m2277J3772N1660K6632k5975m1435j1612K1090K6785
1441A3549J2337o999k6218k6894N034M1993L4006k1132n5912k1154M1204N1814
1453D1628j442m5513l0489J2732K9907J5352j760j2146k1748j6700J4966M2005
1465B6792J9607l5734n3145m54N5502L9623k4052n2509j5335K9988L0876K940
1477B4099j4315j5875j4231l218K2697L4224N97m4831l8457K0693N7597K1340
1489E0320l9989m8685Q97L9824K8352p237k3731j8195m709J3165K7692J6920k0383
1502A4241m3109j3257L9300M5011n351m7967l0506J9320L9816J4849j6691k5271
$$ plain form
1416 -47576 -4947 42379 37921 -6445 -35434 -25146 5240 25758 24906 3602 -25646 -34761 -6445
1429 -6445 35946 40177 -5091 -47368 -33596 18064 44696 18721 -22714 -34326 -13236 13549
1441 13549 25886 18887 -7331 -34225 -29191 12802 46808 25676 -30236 -51390 -10186 41628
1453 41628 40186 -5327 -35816 -23084 6823 22175 20415 8269 -13479 -30179 -15213 26792
1465 26792 46399 10665 -42480 -42934 12568 52191 28139 -24370 -39705 -9717 21159 24099
1477 24099 9784 -6091 -20322 -23540 -843 33381 33978 -10853 -49310 -28617 28980 50320
1489 50320 10331 -38354 -37457 2367 30719 23482 -249 -18444 -23153 -9988 17704 34624 14241
1502 14241 -28868 -42125 -2825 42186 36835 -11132 -41638 -22318 17498 32347 15656 -9615
1514i615j4009L834K2697K6332Q47l5710l3805J1372M8029K5971k8320m6276q107
1527c6760L3136L0944j252k1712k0602o908J0926K6873J9290j5963m2528j9267
1539d3823L4201M8404J329m6664l4889J6098M0709J5924j7060k2630j0550J750
1551a7201J4692K3839R698k6088l9585p79M6591L7686k1269n3553j7465L6046
1563g388L9373j776k9486j9169Q60J0416J5307J6015k871l1303k8392J6012M9129
1576B6727J9794l7955m9320L041M6425L0543j7513l5348j2580J3052J8170J2702
1588A7738L153j5168k7593r180K9962L7996k723m5279l1660K1476M5323J3706
1600C7751k7892l0752l531J8082J9964R656p659k4290k1146R842L7755K2812k5282
$$ plain form
1514 -9615 -23624 -19790 2907 29239 30086 -5624 -39429 -28057 19972 45943 17623 -28653 -36760
1527 -36760 -3624 27320 26068 4356 -16246 -23154 -12228 14645 33935 17972 -24556 -43823
1539 -43823 -9622 38782 40111 -6553 -41442 -25344 15365 31289 14229 -8401 -18951 -17201
1551 -17201 -2509 21330 31028 4940 -34645 -35424 11167 48853 27584 -25969 -43434 -7388
1563 -7388 31985 30209 723 -18446 -17586 -7170 8137 24152 21281 -10022 -38414 -22402 26727
1576 26727 46521 8566 -40754 -37713 8712 39255 21742 -13606 -26186 -13134 5036 17738
1588 17738 20891 5723 -21870 -31050 -1088 36908 34185 -11094 -42754 -21278 24045 37751
1600 37751 9859 -20893 -24424 -6342 13622 23278 15619 -8671 -29817 -19975 17780 40592 15310
1613A5310m4320q351L6968L4761o334l3257j9523P089K0003J6379L669j4699k8025
1626b0330j1391K6062L8875K178m1962l5429J5915M5570J7465k6175l2159l495
1638b4876J8191J6545P933l345j7592k2621N93L4211L0458j6057m7544j8507L4805
1651g806M3343j894l8107k4424J1636K4115J1167j964q912j7330j4506J1885L4864
1664B2067J6123l0647m3997O90M6141L2343k0942m2472j1681K4541K4506L238
1676A9910j1500j3394j2593j558K0203K7549j326l8025k9177J9083M5677J4220
1688C9069l3604l6274K679L0140K0451m970j7307j5000o476J0441K5132J5033
1700B9314j9333l6877q904L4272L6456p397l8907k1635J7040K9230J0485j1196
$$ plain form
1613 15310 -29010 -37361 -393 34368 28034 -5223 -24746 -17657 2346 18725 22394 7695 -20330
1626 -20330 -31721 -5659 33216 35394 -6568 -41997 -26082 19488 36953 10778 -21381 -24876
1638 -24876 -6685 9860 17793 14448 -3144 -25765 -25172 9039 39497 23440 -24104 -42611 -7806
1651 -7806 35537 33643 -4464 -28888 -17252 6863 18030 16066 7154 -10176 -24682 -12797 22067
1664 22067 38190 7543 -36454 -35764 10377 42720 21778 -20694 -32375 -7834 16672 19910
1676 19910 8410 -4984 -17577 -19135 1068 28617 27291 -10734 -39911 -20828 24849 39069
1688 39069 5465 -30809 -28130 2010 22461 17491 184 -14816 -21292 -10851 14281 29314
1700 29314 9981 -26896 -35800 -1528 34928 27531 -11376 -33011 -15971 13259 23744 12548
1712A2548j7585j3207M33J9276K5129N73l2769k9888J3013M2738J8598k7913l7292
1725b6346j959K8182K1318l784j5543j3022p323N076K1678J9591j1545l7591j7555
1738c8823K9496M1971j36m1075k8085J5839L4089J0880j5738j7273p068J571R992
1751d360J9266R213k1117l3748j526L9333L1389j7997m4252j4192L0129L1926
1763B4064r59k4282j5521J288Q865J2799J3312k906k6282k2112J5285L9504J4317
1776C7372l1814l8417M257L6898K1950j3724k6620r656P614J3051J2263M889j3855
1789D208k5712p763K7428L2416n895l8984k3450K0194L5670Q267k2910k2149k263
1802b0943J2545J5023J0350m225k1868j9620R358L4289J7778k3534l7394l790
$$ plain form
1712 12548 -5037 -18244 -17811 1465 26594 27167 -5602 -35490 -22477 20261 38859 10946 -26346
1725 -26346 -28305 -123 21195 17411 1868 -11154 -18477 -13401 8277 27868 16323 -21268 -38823
1738 -38823 -9327 32644 32508 -8567 -36652 -20813 13276 24156 8418 -8855 -15923 -14352 -4360
1751 -4360 14906 24119 3002 -30746 -32272 7061 38450 20453 -23799 -37991 -7862 24064
1763 24064 23105 -1177 -16698 -15410 -6545 6254 19566 16660 -9622 -31734 -16449 23055 37372
1776 37372 5558 -32859 -28602 8296 30246 16522 -10098 -19754 -12140 911 13174 18063 4208
1789 4208 -21504 -29267 -1839 30577 24682 -14302 -37752 -17558 18112 26379 3469 -18680 -20943
1802 -20943 -8398 6625 16975 12750 -9118 -28738 -19380 14909 32687 9153 -28241 -32031
1814c2031L3108K6313q875k5733j3340O586J3536J2386N558j0536k3888j1803
1826b8719K2632L5052J673l7582k9029J6036L8669J2132k3551k4985n16J4342
1838c846J1662N603o93j3585k0682j040K8972K6745j3753m1683j5961L0816L5984
1851B8539l229l2670j9398J0959J9489Q032j701o540j4534j1889J0319K9239J2821
1864B9437k5750l4997J763L7474K5286j6983l3457q736J9190J8932L337p094j1842
1877c440j2375j470J9726K3077m020l2378k2611J9057L6884Q265k7754k6754L466
1890b0327K2660J4361k617j1387j2588q474P950K3618J4161j8995l3120n437L1932
1903A737K8378r516l3173j5000J6045K1732N458q222j1897j1124k156J5208K2537
$$ plain form
1814 -32031 1077 27390 18515 -7218 -20558 -13972 -436 11950 17508 6972 -16916 -28719
1826 -28719 -6087 28965 30638 -6944 -35973 -19937 18732 30864 7313 -17672 -18188 -3846
1838 -3846 7816 13419 12726 -859 -21541 -22581 6391 33136 19383 -22300 -38261 -7445 28539
1851 28539 25310 -7360 -26758 -15799 3690 11722 10021 3481 -11053 -22942 -12623 16616 29437
1864 29437 3687 -31310 -29547 7927 33213 16230 -17227 -25963 -6773 12159 15496 8402 -3440
1877 -3440 -15815 -17285 2441 25518 21498 -10880 -33491 -14434 22450 30715 2961 -23793 -20327
1890 -20327 2333 16694 14077 2690 -9898 -18372 -10422 13196 27357 8362 -24758 -30195 1737
1903 1737 30115 20599 -12574 -27574 -11529 10203 15661 7439 -4458 -15582 -17738 -2530 20007
1916B0007J716k8582k6112J1918L7427J4939k5039l0831M96K3927J6988m225j1711
1929I18r096o419K891J8199J7825r881l2456j4530K6438L5431j765l5278k2885
1942c0608J5160K8265O857j3685j2807m614k45P427J7296Q107j8472k8658n52
1955b6529L3447K5685j6117l7397j0063K5638K5089k070j9427j2067M2O623J1208
1968D062J1399k695k3405j7914J4159L2647R937k7054k9799M570K9910J6349j1065
1981A1101j9387p637L864J0538J2416N854j3527k3533m579K6011K6768p885l3614
1994a3610j6572J9784K7493L240j7766j5218j033P350J0728J0326q49j9469k0048
2007b5644Q726L1441J5857k3348l2833p82K9787K0847j0076k2224p978O171R262
$$ plain form
1916 20007 21723 -6859 -32971 -21053 16374 31313 6274 -24557 -24061 -134 16854 12629 918
1929 918 -8178 -14597 -11706 6493 24318 14437 -18019 -32549 -6111 29320 27555 -7723 -30608
1942 -30608 -15448 12817 19674 5989 -6818 -11432 -11677 -4250 13046 21153 2681 -25977 -26529
1955 -26529 6918 32603 16486 -20911 -30974 -5336 19753 17683 -1744 -13811 -13769 -7146 4062
1968 4062 15461 12766 -10639 -28553 -14394 18253 28190 1136 -28663 -24093 5817 22166 11101
1981 11101 -8286 -15923 -12059 -1521 10895 16749 3222 -20311 -24890 1121 27889 20004 -13610
1994 -13610 -30182 -10398 17095 20335 2569 -12649 -13682 -6332 4396 14722 13873 -5596 -25644
2007 -25644 -16918 14523 30380 7032 -25801 -26583 3204 24051 13975 -8249 -16227 -10056 -794
2020g94Q792N578p306k0494j0925J8560L0310J426l2320k4979J5067L2199R451
2033B4565j9979k0574K34J1883R071M691M79j1292j8117j22K5270K2013j2912
2046A5210l4439j1175K6207K9148l964k6832j4162R234J4479O420K50n086j3341
2059h051j0846R411K5296J0355k3088k9638L375L1908J9494j5760k6735o059J4902
2072e436J4434L015m866r202j2148j910J7684K0361m200k9302j7306J7461L0482
2085A9067N115k3420k0708M312J7506J0420q74p610j1316r183O873K2309J2027
2098B4518j7760k9130k252K8813K3059j1423k7297r164J4186J5709K702n232p157
2111d28r894m781J2182K1616K602k5837k3710J1118L3523J2136k3245k6270K299
$$ plain form
2020 -794 7998 13576 6270 -14224 -25149 -6589 23721 25147 -7173 -32152 -17085 15114 24565
2033 24565 4586 -15988 -15754 -3871 5200 9891 10370 -922 -19039 -19161 6109 28122 15210
2046 15210 -19229 -30404 -4197 24951 20987 -5845 -20007 -10773 3706 10126 10376 5290 -8051
2059 -8051 -18897 -9486 15810 26165 3077 -26561 -23186 8722 28216 12456 -14279 -20338 -5436
2072 -5436 8998 12013 7147 -2055 -14203 -16113 1571 21932 17732 -11570 -28876 -11415 19067
2085 19067 24182 762 -19946 -15634 1872 12292 11418 3808 -7508 -16691 -9818 12491 24518
2098 24518 6758 -22372 -24624 4189 27248 15825 -11472 -20636 -6450 9259 11961 6729 -428
2111 -428 -10322 -15103 -2921 18695 21297 -4540 -28250 -17132 16391 28527 5282 -20988 -18689
2124a8689K1854J1329m849r092o354n186J162J4784J5545p516k7905j2510K2067
2137e360L0155j716k9823j8538J2688K2924O301j0934j0781m414n94P556J4624
2150A2088O565j6723k3597J605K8223J9839j4965k9503o660K0748J8704k183j3547
2163E94r019j826L034J1305J1787l234k1749j5778J4395K9040O279k5270k3474
2176b3916O816K4111J1295r997j4091m821K013O605J1442P032j1789k1764m189
2189b1253K3637K3028p776k9573j2606J7531K2747J049j5326j0881m85M463Q138
2202B693J0095M80j7141j7933P537K7850J3087k0969k7322Q88K5233J5842q940
2215A1400j7490n618N318N578P602O052n420j9321r708J7141K6168J05k8370k0258
$$ plain form
2124 -18689 3165 14494 9645 553 -5801 -10987 -9825 4959 20504 12988 -14917 -27427 -5360
2137 -5360 24795 23079 -6744 -25282 -12594 10330 16631 5697 -5084 -9498 -10092 -2536 12088
2150 12088 18653 1930 -21667 -20062 8161 28000 13035 -16468 -23128 -2380 16324 14141 594
2163 594 -8425 -10251 -7217 4088 15875 12641 -9108 -24886 -10491 18549 24828 -442 -23916
2176 -23916 -17100 7011 18306 8309 -5782 -10603 -8590 -1985 9457 16489 4700 -17064 -21253
2189 -21253 2384 25412 17636 -11937 -24543 -7012 15735 16784 1458 -9423 -9908 -5445 2693
2202 2693 12788 13268 -3873 -21806 -14269 13581 26668 5699 -21623 -20735 4498 20340 11400
2215 11400 -6090 -11708 -6390 -812 6790 12842 7422 -11899 -21607 -4466 21702 21807 -6563 -26821
2229b6821J3486K7744O023j8004j5167J180R057O569M133J247r581j5507l65K1749
2243E743J8897j1291k9407q331K2248K3814m254k1518j0988O877J1090N784O81
2256I345l705j2566r826R419K2356O606k0682k3850M778K6816J3581j3559k0847
2269a2134l114J0945J0191L648j818q216j1979k379J7118J8423n609k6077j4047
2282b5048J7579K5641J000k0557j4825N342J2632O503l72l181r436j0203M966
2295i959K0510J1677j6622k5751j533K6131J9662j1047k3977n964J3302J1994
2307H423J490m207m931q330m515R748J8880K628k2999k0186J0193K8714R316k0873
2321C351k1069K703J7519R252m061p034n465n523J181J4037J3070p585k3875r672
$$ plain form
2229 -26821 -13335 14409 20432 2428 -12739 -11559 -2502 4067 8200 9447 -134 -15641 -16006 5743
2243 5743 24640 13349 -16058 -24389 -2141 21673 17419 -4099 -15087 -8210 2880 8664 9345
2256 9345 5640 -6926 -16752 -7333 15023 21629 947 -22903 -18125 8691 22272 8713 -12134
2269 -12134 -15248 -4303 5888 9536 7718 -498 -12477 -14856 2262 20685 15076 -11001 -25048
2282 -25048 -7469 18172 19172 -1385 -16210 -10868 1764 8267 7895 4714 -4722 -14925 -9959
2295 -9959 10551 22228 5606 -20145 -21678 4453 24115 13068 -10909 -16873 -3571 8423
2307 8423 9913 5706 775 -7555 -12070 -2322 16558 19186 -3813 -23999 -13806 14908 24224 3351
2321 3351 -17718 -15015 2504 11756 7695 661 -4804 -10327 -9146 4891 17961 10376 -13499 -23171
2335b3171J9803K4856k947k4724j4066J1536J7529L939p560p487m715k602O651
2348b958J4574N364j6096k0984K874K5830J5361j4731k4597l134J7918J4042k694
2361A0769j0404n596k476J589R203J1948k635j9742j3791J3686K5279M181k2689
2374f78j9056P105K0454P314q712j0425l870N35M805J0336O657j0397j9918l101
2388a8951K1395J9520q414k5308r331J6199J7949m5j2487q130j61K849O664R921
2402A1670K83j5877j5192P588K4789R896j9622k2784K533K2128J1815r335j3632
2415e740l012L799L454O085O906m108j7241r238J5465K3441o05k5347j6603J2661
2429a0083K3943M317j5904j2900J924P336M514M177J314r091j3722N12J9049J5100
$$ plain form
2335 -23171 -3368 21488 18541 -6183 -20249 -8713 8816 12755 5195 -2292 -7007 -9609 -2958
2348 -2958 11616 16980 884 -20100 -17226 8604 23965 9234 -15363 -18497 -579 13463 10769
2361 10769 365 -5231 -7707 -6118 3085 15033 12398 -7344 -21135 -7449 17830 22011 -678
2374 -678 -19734 -12629 7825 15139 6427 -3998 -7868 -7333 -2528 7808 14465 4068 -15850 -18951
2388 -18951 2444 21964 13550 -11758 -21089 -4890 13059 13014 527 -7603 -7764 -4915 1749 11670
2402 11670 11953 -3924 -19116 -11528 13261 23157 3535 -19249 -16716 5412 17227 7892 -5740
2415 -5740 -8752 -4953 -1499 4586 11492 7384 -9857 -19095 -3630 19811 19206 -6141 -22744 -10083
2429 -10083 13860 18177 2273 -10627 -8703 -1367 3147 7324 8638 -453 -14175 -13663 5386 20486
2443B0486j0781k4413o293J9365J8387m533j6902q246N144Q101N574K630m079
2456D440j1671q401R540K0454M267k0005j8320O342K2578Q566j2311j5055p58
2469a0334P605O065L390J372o705j2783k952J6065J7854n996k4487j1642J7488
2482e060K2189o89j9293j1307O730J0117L537o06j442o877r263K832J7541J0841
2496A9250j4340k2380j670K2834J6294r813k0427n332J1576J0258M75k588m630
2509d93p620m162R891J6041N38j9399j5829J0432K3546N535j7092j5680L088J3267
2523B063O488k294l790n057o822O10J3870J2769q772k2497o853J9206K0774m914
2537A4781k2152j0001J1545J4176Q87o705l981l561l333M491J3206N500j3849
$$ plain form
2443 20486 9705 -14708 -21001 -1636 16751 12218 -4684 -12930 -7786 315 5889 8519 4440
2456 4440 -7231 -15632 -6092 14362 18629 -1376 -19696 -13354 9224 17790 5479 -9576 -10334
2469 -10334 -2729 3336 6726 8098 1393 -11390 -14342 1723 19577 13581 -10906 -22548 -5060
2482 -5060 17129 16440 -2853 -14160 -7430 2687 6224 5618 4176 -2701 -11964 -9132 8409 19250
2496 19250 4910 -17470 -19140 3694 19988 10175 -10252 -15584 -4008 6250 6725 4137 -493
2509 -493 -8113 -12275 -2384 13657 14195 -5204 -21033 -10601 12945 18480 1388 -14292 -11204 2063
2523 2063 8551 6257 2467 -2590 -9412 -8802 5068 17837 9065 -13432 -20285 -1079 19695 14781
2537 14781 -7371 -17372 -5827 8349 9236 2531 -1450 -5011 -8344 -3853 9353 14853 1004
2550A004j8681K283K3228J2816j3427k0676k449J5349J1651k697q447m973k831
2563g850J281Q743J0435l363j7850j0329J3107K1171J125j8884j4439P128J5754
2576F029M967o410o354l665j867L567J1442P234j1098j8681j602K0868J6708j0436
2590A0702k2606n462J5957J3725k978j0448m400Q66K3L631J0030K357j3779j5094
2604a7476O020K2461R485j7258k1078K542K0023J0327q354j2239k584M031L164
2617i36N159N212m291j3829o824J3481J8056j406k0652j2533J0866J7817K947
2630A3067j1275r009j49M059M619O006J878j0084j3388K693J8791J1922j2676
2643F454k1102j851J8266J3050n928j3912l511M400L735L422M335j291j1258j0135
$$ plain form
2550 1004 -17677 -15394 7834 20650 7223 -13453 -15902 -553 11098 8401 -46 -5019 -7850
2563 -7850 -6569 2174 12609 9246 -8604 -18933 -5826 15345 16470 -2414 -16853 -9725 6029
2576 6029 10996 4586 -1768 -5433 -7300 -3733 7709 14943 3845 -14836 -16438 4430 21138 10702
2590 10702 -11904 -17366 -1409 12316 9338 -1110 -5510 -4644 -4621 -990 9040 11397 -2382 -17476
2604 -17476 -11456 11005 20490 3232 -17846 -15304 4719 15046 6692 -5547 -8131 -4100 -936
2617 -936 4223 9435 5144 -8685 -15509 -2028 16028 14622 -6030 -18563 -7697 10120 13067
2630 13067 1792 -7217 -7366 -3307 1312 7318 9196 -888 -14276 -11583 7208 19130 6454
2643 6454 -14648 -16499 1767 14817 8889 -5023 -8534 -4134 -399 3023 7358 6067 -5191 -15326
2657a5326Q624K0150M103j9222j7796P108K1601P123j2952j3530Q64Q120M215
2670C082J604R84m488j0459k681J3186J4837n030k0275r107J4091J8346j302j5097
2684b309q769M450P517M018Q47j040q333q377M438J6626P781j4437j9140K060
2698a4668K0203J1235j0183j5566j801R137N937L10m41j986q327n967R670J6000
2712A3553J079j9529j4642J0520K1568M375j6720j4261N158J1647M666l570k512
2725A332l278n650k7J1107J0900o681j9200n706J6306J6666m069j7769q022R293
2739d798J0711J666m246m159m696k967N780J2631L093j4162j4969M730J9864Q681
2753A7159j3208j5768Q25J2487O344k917l851k409n092j348R289J1278k684j8376
$$ plain form
2657 -15326 -6702 13448 17551 -1671 -19467 -12359 9242 16365 3413 -10117 -9253 -1133 3082
2670 3082 4686 5670 1182 -9277 -11958 1228 16065 11035 -9240 -18347 -4256 14090 12788 -2309
2684 -2309 -11078 -6628 889 4907 5754 4714 -3619 -11996 -7558 9068 16849 2412 -16728 -14668
2698 -14668 5535 16770 6587 -8979 -10780 -1643 4294 4604 4163 2177 -6150 -12117 -2447 13553
2712 13553 14632 -4897 -19539 -9019 12549 16924 204 -14057 -8899 2748 7414 3844 1332
2725 1332 -1946 -7596 -7623 3484 14384 7703 -11497 -17203 -897 15769 11700 -6069 -14091 -4798
2739 -4798 5913 7579 3333 -826 -5522 -8489 -2709 9922 13015 -1147 -16116 -11386 8478 17159
2753 17159 3951 -11817 -10992 1495 7839 4922 1071 -1338 -6430 -7778 1511 12789 10105 -8271
2767h271r558J3348J9991n15j9163j1608Q493J4331K457p362m660r47j424J017
2781c871R011P018q013j6387k593J7594J4918p926j9702n183J3286J2056j978
2794H230q596m265r3M63M719Q157N65j2301j2077O915J8888N795j5506j5260L554
2809a0812J5378O731o689p831j641L71J720O140O978m856j5011n446J4114J6730
2823A5876l472j9657r451J1863J5088n6j0842n178J214K560J849N567L208p916
2837F53j2294K68J7446J1376j1342j8903j859J6393J1911o058j1571l490M300
2850c170L033L365L350j276j0466q057Q778J6301K271j6200j3839O626J6989N039
2864A2744j0742r088M94M393L280L128K683n088j0995k025J3502J3887o790j9256
$$ plain form
2767 -8271 -17829 -4481 15510 14995 -4168 -15776 -7283 7048 9505 2143 -2517 -3464 -4888 -3871
2781 -3871 5140 12158 4145 -12242 -14835 2759 17677 9751 -9951 -15134 -1848 10208 8230
2794 8230 -366 -4631 -4724 -4261 458 8615 9180 -3121 -15198 -8283 10605 16400 894 -14366 -10812
2809 -10812 4566 11297 4608 -3223 -4864 -4493 -2773 3367 10345 5489 -9522 -14968 -854 15876
2823 15876 12404 -7253 -16704 -4841 10247 10191 -651 -5829 -4615 -2055 -206 5361 8569 653
2837 653 -11641 -11373 6073 17449 6107 -12796 -14655 1738 13649 7591 -3980 -7470 -3170
2850 -3170 -137 3228 6578 5302 -5164 -13221 -4443 11858 14129 -2071 -15910 -9284 7705 12744
2864 12744 2002 -7086 -6592 -2199 1081 4209 6892 1804 -9191 -11216 2286 16173 9383 -9873
2878i873o013J4310J4881l074j3668n723N384N251J013J613J079o709r453L249
2892g733J5653P742j2846j7404J673J8447J0073r937j3783q56Q483M659k10k17
2906C744k020o672m612Q030J3474l9j6252j1612R022J7645K284j3276j0649L942
2920f991Q663L103r49j229m310o427Q22J1756R229p855j7465k567J5610J3096
2934A4486n646j5236m323Q284P203m00j596j505m632n078M723J2349M122j3547
2948g96j4462N244J8188P043j2373j3902J969J0960N038l084l273j567l554k009
2962f578P627J0240k504j5468q566J1665J7203p42j6438r235O905J1641J605n148
2976B207l747j514k482J606Q734O201q742j4241n33J6185J1294q365j6022k466
$$ plain form
2878 -9873 -15886 -1576 13305 10231 -3437 -9160 -3776 1475 2488 4101 5180 -1529 -10982 -7733
2892 -7733 7920 15662 2816 -14588 -12915 5532 15605 5668 -8115 -8971 -488 4171 3961 3744
2906 3744 1724 -4948 -9560 -1530 11944 11905 -4347 -15959 -6937 10708 12992 -284 -10933 -6991
2920 -6991 1672 4775 3826 2597 -1713 -8140 -7318 4438 13667 5812 -11653 -14220 1390 14486
2934 14486 8840 -6396 -10719 -2435 4768 4368 2772 1267 -3365 -8443 -3720 8629 12751 -796
2948 -796 -15258 -10014 8174 15217 2844 -11058 -9089 1871 6909 3825 552 -1015 -4569 -6578
2962 -6578 1049 11289 8785 -6683 -15249 -3584 13619 12877 -3561 -12796 -5891 5750 7355 2207
2976 2207 -1540 -3054 -5536 -3930 4804 11005 2263 -11978 -12511 3674 14968 6603 -9419 -11885
2990a1885J1484Q516k685n676k033j016j490M442Q749R05j2622j1002P668J7450
3004A0805L765j4474j3513M806J3880M030o878n144l50q4L22N201O835l739j3432
3019g970n720J2994J5415m083j7037p487J0345J2745n25r153m336J548J043J885
3033c36N576K589q151j0945J837J5328Q714j0494j5796l58J4233Q391n885q420
3047c717j639K373J580L190N026j409j0641p130R200J5083Q34j6105j0735P621
3061f469J4660K383r524o952K019L155P19L030M097n067j0179k460J2556J2398
3075A4366o463j7135m984J3327J2944m129j1656l692M692M154L79J970O45n918
3089a500q064L310J3514O053j1860j4255K534J4998P491q364j0892p6O209L096
$$ plain form
2990 -11885 -401 8115 5430 -246 -2279 -3295 -4785 -343 8406 9311 -3311 -14313 -6645 10805
3004 10805 14570 96 -13417 -8611 5269 9299 2421 -2723 -3073 -3157 -2835 2366 9201 5462 -7970
3019 -7970 -13690 -696 14719 10636 -6401 -13888 -3543 9202 8677 -476 -4812 -3264 -2221 -336
3033 -336 5240 7829 -322 -11267 -9430 5898 14612 4118 -11678 -12036 2197 10588 4703 -3717
3047 -3717 -5356 -2983 -1403 1787 6813 5404 -5237 -12367 -3167 11916 12750 -3355 -14090 -6469
3061 -6469 8191 10574 1050 -5902 -3883 -728 -9 3021 7118 2051 -8128 -10588 1968 14366
3075 14366 7903 -9232 -14216 -889 12055 7926 -3730 -7422 -2730 1424 1803 3773 4418 -1500
3089 -1500 -9564 -6254 7260 13313 1453 -12802 -10268 4730 12221 3857 -7035 -7111 -902 2194
3103B194L45J574k203p561m122R100J2025j654j5261q539R887J4482K71j1991
3117a453o802M105O139J473n35P84l748p230k12J1553R236q308j5980k088J5117
3132B051J1325o837j3469k056P617N647j488j066l34m116m520L963J1335L241
3146A1293j2528j2298N245J5931N263j0981j1340K084R082L869k545k199j606
3159g30l962j914P803R015l171j4254o133J1836J3454k282j3906o441P298Q506
3173E119k92l582j045j711l839J409R282N424q534j3707N84J5566R327r169j3991
3188i159m38J0559O330l729m286q22o40k407L358Q527J208j1929r275O779J5217
3203I293L006j2934j1224M771J1852K820n794l991j51r73Q15N155N680m405j1935
$$ plain form
3103 2194 2539 4113 1910 -5651 -9773 -673 11352 9698 -5563 -14102 -4215 10267 10538 -1453
3117 -1453 -8255 -4150 1989 3462 2927 3711 -37 -7267 -7479 4074 13310 5002 -10978 -13066 2051
3132 2051 13376 6539 -6930 -8986 -1369 4278 2790 1724 1390 -2726 -7246 -3283 8052 11293
3146 11293 -1235 -13533 -8288 7643 12906 1925 -9415 -7331 1751 5620 3075 876 -730
3159 -730 -4692 -6606 1197 10212 7041 -7213 -13346 -1510 11944 9662 -4244 -10685 -3387 5119
3173 5119 4827 1245 200 -1511 -5350 -3941 5341 10765 2231 -11476 -10892 4674 14001 4832 -9159
3188 -9159 -9597 962 7292 3563 -723 -1545 -2185 -4592 -1234 7293 8501 -3428 -12703 -5924 9293
3203 9293 12299 -635 -11859 -7088 4764 7584 1790 -2201 -2352 -3325 -2510 2645 8325 3920 -8015
3218h015l229J1831J1957m427j4692n006R611R252j583o364k230N73p30J575O650
3233E173K702p874j1220L181J4875O742j1437j3239K026J2440O027o440o446R1
3247c399J913j05K006N674p00r480p222P867J3938Q84j4617r730P643J2545J577
3262H794q519n495J970K219J000K589L346m053r546j142J1586R500o265j4305
3276h321k907J1454R657m170q610k332L102J903R10L571O89o824p636M199J3270
3291G955M268j2038j2369M079J3926M343q297p811J194M966J136j45K628q06p764
3306d735m223P789J1926j776j4150p623R372J3201p60j1352n331M320N155N85
3320B398m75J076k889o697K03J0061P674p136j4047j066J3263Q957o228j0766
$$ plain form
3218 -8015 -11244 587 12544 8117 -6575 -11581 -1970 7282 5699 -665 -2895 -2322 -3052 -1477 5173
3233 5173 7875 1 -11219 -8038 6837 13579 2142 -11097 -9071 3369 9396 2956 -3490 -3399
3247 -3399 -1486 -1591 415 6089 5389 -4091 -11313 -3446 10492 11376 -3241 -12971 -5328 7217 8794
3262 8794 275 -5220 -3250 -1031 -31 2558 5904 1851 -7695 -8837 2749 12249 5984 -8321
3276 -8321 -11228 226 9883 5713 -2897 -5229 -2127 -224 686 4257 4946 -1878 -9514 -5315 7955
3291 7955 12223 185 -12184 -8105 5821 10164 1867 -5944 -4750 216 1352 1207 3835 3029 -4735
3306 -4735 -8958 -1169 10757 8981 -5169 -12792 -3420 9781 9021 -2331 -7662 -3342 1813 2398
3320 2398 1923 2999 110 -6587 -6384 3677 11351 4215 -9832 -10898 2365 11322 5094 -5672
3334e672j379O275L588p14L9k79m172m929M308J0939K143j2008j0644O157J4263
3349G915L018j0599q813L599P250J245k020p5q93m893j983O940Q975k876j3612
3364f822n381J1021J2426k928j2561m699O591O770m61l428j16j652l440J105Q481
3379D906M613q078j1784J340J3402P417q168j1581J69Q761M280k567k677n01k192
3394b660k104L879Q234M27j1281q174P675J3142J233j2511p756N358R071P41m561
3409G13k011J81j465j035N269O403m029j1569k944J1357J1045n083j3538l307
3423a0013R141P818k494n374j131N47p05O77N876K993p574r414K818J3005N570
3438A1740r753j1334K003J0532M255m957n058L06R66o92K555N516j226r321n726
$$ plain form
3334 -5672 -7051 -776 2812 2098 2137 1858 -2314 -7243 -2935 8004 10147 -1861 -12505 -6348 7915
3349 7915 10933 334 -8479 -4880 2370 3615 1595 1520 627 -4266 -6249 691 9666 6790 -6822
3364 -6822 -12203 -1182 11244 8316 -4245 -8944 -2353 4417 3956 528 412 -1240 -4680 -3575 4906
3379 4906 9519 1441 -10343 -9003 4399 11816 3648 -7933 -7764 997 5277 2710 33 -468 -2660
3394 -2660 -4764 -885 7349 7776 -3505 -11679 -4004 9138 10371 -2140 -9896 -4538 4533 5274 713
3409 713 -1298 -1117 -2582 -3617 1652 8055 4026 -7543 -10487 870 11915 6832 -6706 -10013
3423 -10013 -872 6946 4452 -922 -2053 -1506 -2211 -1534 4342 7335 -239 -9653 -6835 6170 11740
3438 11740 1987 -9347 -7344 3188 7443 2486 -2572 -2266 -1300 -1992 563 6079 4853 -4468 -10194
3453a0194Q128J1846o82j3108p312P441J0602j3p243l576K215P21Q1L629L371
3468E906l901r399r96J1473Q639o597j3464j683J0988P591m113p794o94L083J107
3483A46p2L476J236o577o904M001J1803L202j0539j0709M236J2015L360p416o128
3498d870J434L516L10J094K853j503p380l664P748J0700k587j3043n862R463J0242
3513H451j415r415l792M061L416n75O96K197l167o910K37R918O789p564j2241
3528i314K12J1662P584o302r339jN471K566j235P61M74m663m778M178R891J521
3544H688j0931q760N959J2064K288r639o960L531N581P45j600Q29r84n324j642
3559f155P469P936l596j2689l450J0356J0131l531j1109k980O360M832j391j708
$$ plain form
3453 -10194 -2066 9780 9098 -4010 -11322 -3881 6721 6708 -535 -4111 -1896 -1175 -1094 2535 5906
3468 5906 2005 -7394 -8390 3083 11722 5125 -8339 -10022 966 8557 4444 -3350 -4044 -961 146
3483 146 74 3550 4786 -1791 -8695 -4694 7109 10311 -228 -10937 -6701 5314 8674 1258 -4870
3498 -4870 -3436 80 390 1484 4337 2834 -4546 -8210 -462 10238 7651 -5392 -11254 -1791 8451
3513 8451 7036 -2379 -6171 -2110 1306 731 1427 3624 457 -6453 -6216 3702 10491 2927 -9314
3528 -9314 -9102 2560 10144 3842 -5497 -5498 -27 2539 1304 2065 2539 -2124 -6902 -2724 7167 8688
3544 8688 -2243 -11003 -5044 7020 9308 -331 -7291 -3760 1821 2566 966 1795 811 -4513 -6155
3559 -6155 1314 9250 5654 -7035 -10485 -129 10002 6471 -4638 -7618 -1258 3574 2183 475
3573D75Q08j750m763J108Q283M767p723j0837J754J2401N961q144r575P36Q150
3588A651K960l029j530L48k476k562L606P669K17j0411o822P035J1669K98j0720
3603b097o512N140P529o4l587q75j85k363q57N734N736m143j1145j631J0660R296
3619A0636n572j1429j682Q055N982k906m112k44L79j881J009O134K591p108r027
3634i175L001J2069M238r061j0115K879R570K651m929l226M95J99r23K534M888
3649E095n51q960m983P872J0592j498j1545n498P020Q226p28n814j882J244Q6
3664a324k42L838L517m264q837m28J1057P155p140j1170j94R600N578m521n655
3679c030K07K215l16K51L771J774o587o690L952J1333K107r924r087M687J0465
$$ plain form
3573 475 1283 -467 -5230 -4122 4161 8928 1205 -9632 -7878 4523 10484 2340 -7235 -6499 1651
3588 1651 4611 1582 52 400 -2076 -4638 -1032 6637 6854 -3557 -10379 -3344 8325 8623 -2097
3603 -2097 -8609 -3469 4060 3996 409 -466 -651 -3014 -3871 1863 7599 3456 -7689 -9320 1340 10636
3619 10636 5064 -6365 -8047 8 5990 3084 -1028 -1272 -893 -2774 -1765 4369 6960 -148 -9175
3634 -9175 -6174 5895 10133 1072 -9043 -6164 3406 6057 1128 -2098 -1603 -1404 -2327 207 5095
3649 5095 4544 -4416 -9399 -1527 9065 7567 -3978 -9476 -2456 5770 5042 -772 -2654 -1410 -1324
3664 -1324 -1566 2272 5789 1525 -7312 -7740 3317 10472 3332 -7838 -8032 1568 7146 2625 -3030
3679 -3030 -2823 -608 -924 -673 3098 4872 -1715 -8405 -4453 6880 8987 -937 -10024 -5337 5128
3694E128K245p287m440K035K099j52R77L410j146p273l075P134R244k921j1078
3709e100m595Q402Q831k239p698k330L357K069o74J542J988l433o230M45R684
3724D019N457p594j0606J170J0613N430o348p125O38M536J376r99J374O91m951
3739b319m364M273R407R93j0578p157N696J0577Q40q131n471L472M502k02r15
3754F23J122j000m915j537O931P195l700j1150k366Q982Q021l673q634j670N077
3769f94L254j534k81P74k234m378J113Q177L885p680r321K308J1255M085p483
3784A246p794J960O138J680k531o10O66k839k957L809P643j49r899n995O728J0596
3800G692m49r730n327N185O117l18l390J3K70l182n41N428N232m216r830p93R597
$$ plain form
3694 5128 7373 86 -4354 -2319 -220 -372 605 4015 2869 -4404 -7479 -345 8899 5978 -5100
3709 -5100 -9695 -1293 7538 5299 -2399 -4729 -1372 697 23 1565 3553 120 -6110 -5665 4019
3724 4019 9476 1882 -8724 -7554 3059 8489 2141 -4984 -4346 190 1566 567 1941 2632 -2319
3739 -2319 -6683 -2410 6997 7990 -2588 -9745 -4049 6528 7368 -763 -6234 -2762 1740 1538 623
3754 623 1745 745 -4170 -5707 1224 8419 4719 -6431 -8797 185 8206 4533 -4101 -5771 -694
3769 -694 2560 1026 745 1519 -715 -5093 -3980 4197 8082 402 -8919 -6611 4644 8729 1246
3784 1246 -6548 -4588 1550 3230 699 89 755 -2084 -5041 -1232 6411 6262 -3637 -9632 -2904 7692
3800 7692 7243 -2487 -7814 -2629 3488 3170 -220 -207 63 -3119 -3660 1768 7000 2784 -7046 -7839 1758
3817A758P315n190r455j163O840M337k765k426N01p20k286J153O506J782o978
3832g91q058L929J0771K737r010p775L604Q219J278m534j885Q69l64j904L200
3847B86M862j001q446m128P163R696k059j0344m535P035O562j354m860j018J640
3862e01r41n21L968L351m187p684k43J0050N802o373r550J0R034M056m602m203
3878b534P35J262r87Q53M095R13o252o236M481R816K000r496p279N023Q406O72
3894E472n824l373K329J464j135J482L355j023p204k695P374Q359k965j0474l814
3909h672Q284O987k315o755j389K944J667q01J723J937l355n952Q13Q714M334
3924H164o940q963J826R059L807n483n721J339L338K11m45K056O88m776m622M601
$$ plain form
3817 1758 9073 3883 -5572 -6735 105 4442 1677 -749 -248 -968 -3254 -2101 4405 6187 -791
3832 -791 -8849 -4920 5851 8588 -422 -8197 -4593 3626 4904 370 -1515 -646 -1010 -2914 286
3847 286 5148 4147 -4299 -8427 -1264 8432 6373 -3971 -8506 -1471 5091 3737 -1123 -2141 -501
3862 -501 -1442 -1963 2005 5356 1169 -6515 -6758 3292 9094 2721 -6829 -6819 2215 6271 1669 -2534
3878 -2534 -1799 -537 -1524 -671 3424 4337 -1915 -8151 -3670 6146 8146 -1350 -8629 -3606 4800 5472
3894 5472 -352 -3725 -1396 68 -1067 415 3770 2747 -4457 -7152 222 8581 5616 -4858 -8672
3909 -8672 -388 6599 4284 -2471 -3860 -916 751 -50 1673 3610 255 -5697 -4884 3830 8164
3924 8164 1224 -7739 -5913 3146 6953 1470 -4251 -2912 426 637 192 2248 2936 -1840 -6462 -1861
3940a861Q621j63r447n926N906Q967n2p518l558L380L204j039p7J915r76n226
3956c850j490O563O598l850j0008k277R144P102m315p839o85M855K467j619l32
3971D64J302j904m752J611P506L211p391q064K899R641K943o941o232K286N422
3986B001lj577L11N10l293k711M145O852o90r177n018P037Q996k000q222l158
4002e997M599M461j025k408Q03j01l087r26N398N031m403q659n30Q791O396n063
4018C280q698j29O584K867k681j969P95p72k331J145N683J895o919o370L721R538
4034E639J958q121o541L909O253M88l605j023J054j228j933L418N247j690q147
4049d322l311P163Q361k718r374k892O468N602k361l875R7J377j731n88L731L750
$$ plain form
3940 -1861 6760 6597 -2850 -8776 -2870 6097 6045 -1473 -5031 -1651 1553 514 437 2352 1376 -3850
3956 -3850 -5340 1223 7821 3971 -6037 -8314 830 7932 3617 -4222 -4907 -52 2415 796 464
3971 464 1766 -138 -4890 -3279 4227 7438 47 -8017 -5118 4523 7466 525 -5707 -3421 2001
3986 2001 1998 421 732 1242 -2051 -4762 -617 6235 5545 -3632 -8650 -1613 7383 5383 -2839 -5997
4002 -5997 -1398 3063 2038 -370 433 332 -2755 -3681 1717 6748 2345 -6314 -6844 1947 8343 3280
4018 3280 -5418 -5547 1037 3904 1223 -746 49 -723 -3054 -1909 3774 5669 -1250 -7620 -3899 5639
4034 5639 7597 -524 -7065 -3156 3097 3585 -20 -1043 11 -1217 -3150 268 5515 3825 -4322
4049 -4322 -7633 -470 7891 5173 -4201 -7093 -625 4977 2616 -1259 -1162 215 -1516 -2104 1627 5377
4065E377m005p581K20R370M980o204q613J050P393L334m060l571J071J315j530
4080a454N31L947J790o659n064M396Q530Q61q800n511M528P188J67n130j899J858
4096g21N94j042J863L397j492o858k082P135P132l686r444j801P297N497k814
4111B975n481J29K621Q6r76K380K069l422o365J429Q396M125p281p807K132Q477
4127C487K650n428m312J661K709n34l81K532K77m645l972M563P641j31r065m633
4143g581N821P352p52o162k591L348J602p25J63K081j243m928j322O362N918m194
4159C149q684j584Q493N561m252o476L32M072J066j469M14J795k311m758J606
4174c046P085K570p170o886L124Q931J964o654n066K544M267k38j594R43N58l135
$$ plain form
4065 5377 1372 -6209 -5989 3381 8361 2157 -6456 -5406 1987 5321 1261 -2310 -1239 76 -1454
4080 -1454 -923 3024 4814 -1845 -6909 -2513 6017 6878 -1922 -7433 -2905 4283 4450 -680 -2579 -721
4096 -721 -127 -1169 694 4091 2599 -4259 -6341 794 7926 4240 -5204 -7005 292 5789 2975
4111 2975 -2506 -2377 244 330 -646 1734 3803 381 -5984 -4555 3841 7966 685 -7122 -4990 3487
4127 3487 6137 709 -3603 -1942 767 233 -148 2384 2661 -1984 -5956 -1393 6248 6117 -2948 -7581
4143 -7581 -1760 5592 4840 -1322 -3913 -565 1037 312 475 2556 1313 -3615 -4937 1425 7343 3149
4159 3149 -5535 -7119 1374 6935 2683 -3793 -3461 611 1677 208 622 2417 106 -4652 -3046
4174 -3046 4039 6609 -561 -7447 -4323 4608 6572 -82 -5148 -2604 1663 1425 -169 774 1332 -1803
4190a803k519L957O099j137q178l617O029P438j478p746k100M344L403j330j673
4205c11J384n01l522n39N693M130m467q336N63Q553M504n161o804P78N479J550
4221B993k389j141J481j222l214J844N498J766o842o010L904Q631J135p704m890
4236f160L562N563j33k775p73R17j101j828L104M749j737p720k137O595O876l131
4252C871p693j750N334M158k061k984M44R60k109l22M442L115m711o695J085Q584
4268C668L807o322p411J840O831J703l839k285J344P86k102R19M273J086o064
4283a766m727M256Q039k2p979m185M220O295n84m380r01J662m66p52J638L624
4299C972j923o024j630O704N612l337q092j094O733M165l260l789L11J548l77
$$ plain form
4190 -1803 -4322 -365 5734 4597 -3581 -7198 -1169 6269 4791 -2955 -5055 -711 2692 1362 -311
4205 -311 1073 572 -2950 -3489 2204 6334 1867 -6469 -5906 2647 7151 1990 -4814 -4036 1443 2993
4221 2993 604 -537 944 -278 -3492 -1648 3850 5616 -1226 -7236 -3332 5299 6434 -1270 -6160
4236 -6160 -2598 2965 2832 57 -716 201 -900 -2728 376 5125 3388 -4332 -6469 126 7002 3871
4252 3871 -3822 -5572 -238 3920 1859 -1125 -681 279 -1830 -2152 2290 5405 694 -6001 -4916 3668
4268 3668 7475 1153 -6258 -4418 2413 4116 277 -2008 -664 122 -1980 -1061 3212 4298 -1766
4283 -1766 -6493 -2237 5802 5780 -2199 -6384 -2164 4131 3547 -833 -1734 -72 -538 -1290 348 3972
4299 3972 2049 -3975 -5605 1099 6711 3374 -4718 -5812 921 5086 1826 -1963 -1652 -104 -481
4314d81p16K837J970l625n650J871P861K563o749o963K981P826J249n052l425
4329c503K549J638j233k57L166N16n088l732M968P186j123q021m069N537O761
4344E295j766n430j300K875J392j379N25K083j066m859j039O336M971m505p578
4359e445m06P497M152m019n227O38L732l49j062J629Q87k667l837J954O686J580
4375E743o720n950L312Q020R36o216l330K660L350j091j171J521O31l491k659
4390d455M444N620j792p460k799O133O109k023o535j743M238K448j585j010J365
4405I55m11l732MN430L223m212p065Q59P561L619n334n485J548M040J290k258
4421C2n96J604j659k867J604O102O75o835m713M248P482K67p370l344L712M325
$$ plain form
4314 -481 -1197 1640 3610 -15 -5665 -3794 4067 6630 -119 -7082 -4101 3725 4974 -78 -3503
4329 -3503 -954 684 -549 -806 2360 2876 -2212 -5944 -976 6210 5087 -2934 -7003 -1466 5295
4344 5295 3529 -1901 -3201 -326 1066 -313 212 2295 1229 -3630 -4669 1667 6638 2133 -5445
4359 -5445 -5851 1646 5798 1779 -3448 -2810 922 573 -489 1140 2027 -640 -4477 -2523 4163 5743
4375 5743 -977 -6927 -3615 4405 5341 -875 -4205 -1545 1805 714 -457 1064 1695 -1796 -4455
4390 -4455 -11 5609 3817 -3643 -6442 -309 5800 3777 -2758 -4501 -263 2185 600 -410 955
4405 955 544 -3188 -3184 2246 5469 1257 -5808 -4949 2612 6231 897 -4588 -3040 1000 2290 32
4421 32 -564 1040 -619 -3486 -1882 4220 4895 -1940 -6653 -2405 5077 5344 -2026 -5370 -1658 2667
4437B667p42k930Q96O53j816j976L491M530j978o743k005O662N488k915p519o37
4453d874N132L254k350k443J278M26k364l01M101K623m253n791J399P534K908
4468F279n927n784J939O097Q15l573j202J559n82j706J300M034N52n753m139M721
4484a370O749m24p365l443M491N170j468l655k27J687m13j702K157L819k050o097
4500d141j115O555N259l949p295k38N999L272l224l119Q12J311n75r50L159J840
4516C601l872m921J931P142J890o215n225K814O459J64m332j819J977Q09j408
4531a005M54L124K8m969k809M710O053j407p508l055O148N120k211m786o23L013
4547B77K95j340O52K720j363m900m09N643M392m583o906O07O860L157m438l605
$$ plain form
4437 2667 1925 -1005 -109 544 -1272 -3248 243 4773 2795 -3948 -5953 709 6197 3282 -4237 -4874
4453 -4874 258 3512 1162 -1281 -3 423 -1941 -2242 1859 4482 229 -5562 -4163 3371 6279
4468 6279 352 -5432 -3493 2604 3419 -154 -1356 203 -379 -2085 -785 3249 3801 -1952 -6091 -1370
4484 -1370 5379 4955 -2410 -5853 -1362 3808 2340 -1315 -1542 145 -268 -1970 187 4006 1956 -4141
4500 -4141 -5256 1299 6558 2609 -4686 -4924 1075 4347 1123 -1996 -1184 127 -448 -1398 1761 3601
4516 3601 -271 -5192 -3261 3881 5771 -444 -5669 -2855 3604 3768 -564 -2383 -406 403 -1005
4531 -1005 -551 2573 2601 -2368 -5177 -467 5586 4179 -3329 -6384 -236 4884 2673 -2113 -2736 277
4547 277 572 -768 -116 2604 1241 -3659 -4068 1575 5967 1384 -5522 -4915 1945 5102 664 -2941
4563b941J025K752m15j174J621J462k945l782K369N892J238o565m599L555O750
4578D243R8n533k582K740K482j289n99J908L35l701k247M391M690j902o895j944
4594e805O248M776k587n547l58L635J498j976n17K380q12m066o8N419L058m493
4610G85n922J128O744K961n303m384J358M208k1k032N98J090j582k843J625N440
4626C850M20o008m267M491O200o20n861k595L621L319j239j779P21O05k274j676
4642c092L344M499k343o320j251O016M971l399o342rM886K074k863j324J788J0
4658F45k610j65M258K500m393n495K034O768K084n605m454K036M833R7k794o89
4674i50J297n70j803J281M135j63n344l294M444O041j366o198k282M285L920k016
$$ plain form
4563 -2941 -1916 836 421 -753 868 2330 -615 -4397 -2028 3864 5102 -1463 -6062 -2507 4243
4578 4243 4341 -1192 -3774 -1034 1448 159 -440 1468 1803 -1898 -4145 246 4936 3034 -3861 -5805
4594 -5805 443 5219 2632 -2915 -3273 362 1860 -116 -633 1747 935 -3131 -3199 2220 5278 785
4610 785 -5137 -4009 2735 5696 393 -3991 -2633 1575 1554 -478 120 1210 -372 -3215 -1590 3850
4626 3850 4270 -1738 -6005 -1514 4686 4066 -1795 -4390 -769 2550 1311 -468 253 858 -1416 -3092
4642 -3092 252 4751 2408 -3912 -5163 853 5824 2425 -3917 -3926 960 3034 171 -1153 635 645
4658 645 -1965 -2130 2128 4628 235 -5260 -3226 3542 5626 21 -4433 -2397 2436 2533 -261 -950
4674 -950 347 -223 -2026 -745 3390 3227 -2117 -5411 -967 5074 3708 -2490 -4772 -487 3433 1417
4690A417k770N92J540j314j380K710L097k390n525m28O092L981m055o080O10N566
4706A663K046l380k382J531J303j767m53L250J717l668m851K384O500J414o177
4721h70m282L096N338l70l833j024J675O60j390L17L165J42m769k528M334N587
4737E248j855o730j830N028M541k500l990L85K413l03j621J466K391j678m673
4752c708o2O033L401n029n417J121O139J790l864l086J538K333j241r12K120J553
4768B709k791m063K138N946P03n970m172M007N545p09m733j850L126J732j786
4783a68m66K499j36l555j996L870N092k284o175j444N562L907k914m537N73L181
4799A009J02j719N24J973j331l306j34N159K976n055n325J786O364J910n078l490
$$ plain form
4690 1417 -1353 -761 779 -535 -1915 795 3892 1502 -4023 -4451 1641 5622 1567 -4513 -3903 1663
4706 1663 3709 329 -2053 -522 781 -986 -1439 1811 3528 -140 -4991 -2607 3893 5307 -870
4721 -870 -5152 -2056 3282 2912 -921 -1945 -270 390 -1000 -683 2482 2624 -2145 -4673 -339 5248
4737 5248 3393 -3337 -5167 -139 4402 1902 -2088 -1703 710 407 -1214 252 2643 965 -3708
4752 -3708 -3770 2263 5664 635 -4782 -3661 2478 4268 404 -2682 -1144 1189 -52 -964 1156 2709
4768 2709 -82 -4145 -2007 3939 4642 -1328 -5500 -1493 4052 3343 -1390 -3240 -114 1618 -168
4783 -168 -634 1865 1729 -1826 -3822 48 5140 2856 -3319 -4763 799 4706 1792 -2745 -2172 1009
4799 1009 1111 -608 -84 1889 558 -2748 -2882 2277 5253 198 -5127 -3341 3023 4933 -145 -3635
4815c635K151L422q51j939J088J447k121k985K101M966L68n640l853M384N774
4830D677j189n319j891L397K761j805j442J148Q42k837j195L327M051k713n892
4845d080m08N883L785l664m899K59M460R84k575p51K028n61k857N22M290J717
4861D133m313m710K250O106J315n304l676K770L663k64k661L6J634j147k121J633
4877f56M077j07n585k691M703N110j486o086j335M436K694k182k130P76J340j964
4893a086j039K735L277k700n047k64O119L455m545m938J218M811J120l134j369
4908a387J594O97k041k85L588J358l789m236K331O116O03n792l644L488M464p44
4924B321l252n09J777K75j743P53K952j72m842j989M557M789k277o079o81M652
$$ plain form
4815 -3635 -1484 1938 1087 -852 236 1683 -438 -3423 -1322 3644 4012 -1628 -5481 -1097 4677
4830 4677 3488 -1831 -3722 -325 2436 631 -811 337 1179 -1658 -2853 474 4525 1812 -4080
4845 -4080 -4488 1395 5180 1516 -3383 -3124 1336 2320 -255 -1006 1022 461 -2396 -1874 2416 4133
4861 4133 -180 -4890 -2640 3466 4781 -523 -4199 -1429 2234 1970 -691 -655 979 -168 -2289 -656
4877 -656 3421 3314 -2271 -4962 -259 4851 3365 -2721 -4056 380 3074 892 -1238 -462 878 -1086
4893 -1086 -2125 610 3887 1187 -3860 -4124 1995 5450 905 -4033 -2815 1996 3116 -18 -1387
4908 -1387 207 904 -1137 -1422 2166 3524 -265 -4501 -2170 3946 4549 -1243 -4887 -1399 3065 2321
4924 2321 -931 -1440 337 612 -1131 -378 2574 2402 -2440 -4429 128 4917 2640 -3439 -4120 532
4940E32L236k630k833O33J711o78j171J795K252k013m489M24N557K779m520m981
4956d396J606N209R87l490k214J824J723j717l68K380Q46l232l093K822N005O1
4972C953n616l350M067M711j303m243n77K997K14j447K65K274l98l506j828M266
4988D79M202k759n742l02N197L389l166l777P35K762j51j526J027J652j714l126
5004b820P47M598K026m911m531K365N687Q57m630k409K341K125r84j454J735J259
5020B001k637k591K214N053l02o082k601M422M666j250m979r34L397J743j906
5035B14r55J708L25k852j299L564L474l016m862j86N568K975l654m136P50L721
5051A339J56j563n83J678p17k599O37M047J249m342m089L151N241J6m699k870
$$ plain form
4940 532 3768 1138 -1695 -1062 649 -29 -1200 595 2847 834 -3655 -3231 2326 5105 585 -4396
4956 -4396 -2790 2419 3406 -84 -2298 -474 1249 -468 -836 1544 2390 -842 -3935 -1113 3892 3953
4972 3953 -1663 -5013 -946 3765 2462 -1781 -2358 639 853 -594 -329 1945 1547 -1959 -3787 479
4988 479 4681 1922 -3820 -4122 1075 4464 1298 -2479 -1744 1018 867 -659 368 2020 306 -2820
5004 -2820 -2073 2525 4551 -360 -4891 -2526 3161 4018 -612 -3021 -680 1445 461 -993 742 2001
5020 2001 -636 -3227 -1013 4040 3738 -2344 -4945 -523 4143 2893 -2086 -3020 377 2120 214
5035 214 -741 967 1292 -1560 -2859 705 4179 1163 -3699 -3885 1683 4658 1004 -3132 -2382 1339
5051 1339 1495 -68 -651 1027 310 -2289 -1652 2395 3644 -698 -4787 -1636 3605 3621 -1078 -3948
5067c948L009K942r89k402J337J117j401k026J898L853q47n053k189M797M510
5082D608k118n595j83L767K184k345j818J603R57k048j155L143K398k135m932
5097c669J35N614K559l947m299J145M757j6k572j125J688N60k436K31L444R93
5113C062l923l289K777N130M2n445k527L438L474j171l094P92J609p02k104J488
5129d43L273o94m641j584M718M051k600n426m75M681K414k904k222J066K140j617
5145b63j396K083K419j841m526Q31M700K399m205m581J951M749N99l508j454J755
5161b88J130j772MK301J158l730k545K590N116p70n307k155M142L338j654l028
5177a470j59K365j64j418L45K711p47l985j107M638L441k830n614N06N408J904
$$ plain form
5067 -3948 -939 2003 1014 -1388 -51 1066 -335 -2361 -463 3390 2543 -2510 -4699 98 4608
5082 4608 2490 -3105 -3288 479 2663 318 -1500 103 1060 -988 -2143 1000 3398 1263 -3669
5097 -3669 -3534 2080 4639 692 -3607 -2462 2295 2279 -293 -1418 270 830 -1606 -1375 2069 3062
5113 3062 -861 -4150 -1373 3757 3799 -1646 -4173 -735 2739 1568 -1526 -734 875 173 -1931 -443
5129 -443 2830 2136 -2505 -4089 629 4680 2080 -3346 -3821 860 3274 370 -1852 -786 1354 -263
5145 -263 -1659 424 2843 1002 -3524 -2693 2007 4406 201 -4380 -2429 2320 2919 -589 -2043 -288
5161 -288 842 -930 -926 1375 2533 -1197 -3742 -1152 3964 3194 -2113 -4268 -126 3212 1558 -1470
5177 -1470 -1629 736 572 -846 -501 2210 1463 -2522 -3629 1009 4450 1620 -3994 -3488 1920 3824
5193C824l382k957J502K205m35j908J026K428j893l458P30M665J759m913l580
5208d387K261M798Q51m462j794K075K081j283j041J711O98k479j775K228M109
5223C591p71n204j654M285L573k214l591k44K981L59j532k0J757k94k932o22L893
5240A361K881l225m886O49N191K358l962l403J676L132n06k117K09K271j154k775
5256b300N40M218J116m625l535K719N330R8m886k108K746K892j334k059J138Q82
5272H32j696j598J677L664r15m312j833M589L700k415m431n0L744J130k220q15
5288i49J845j18k201r23L656K370l078m248Q08N230J641m003l792K153L612m7
5304A956k914k61K068k66k332N03L282Q86l860l063K739M835n16m863k135L757
$$ plain form
5193 3824 442 -2515 -1013 1192 757 -1151 -125 2303 410 -3048 -2318 2347 4106 -807 -4387
5208 -4387 -2126 2672 3523 -939 -2733 -658 1423 140 -901 810 1508 -971 -2746 -518 3591
5223 3591 2820 -2384 -4038 247 3820 1606 -1985 -2229 752 1111 -421 -441 1316 1022 -1910 -2532 1361
5240 1361 4242 1017 -3869 -3220 1971 4329 367 -3036 -1360 1772 1266 -851 -642 1629 475 -2300
5256 -2300 -1760 2458 3574 -1051 -4586 -1867 3463 3561 -1325 -3433 -687 2205 871 -1188 -50 832
5272 832 -864 -2462 -785 2879 1964 -2348 -4181 408 4108 1693 -2738 -2788 956 2086 -134 -949
5288 -949 896 778 -1423 -2346 1310 3680 602 -3646 -2838 2392 4033 30 -3762 -1609 2003 1956
5304 1956 -958 -1219 849 583 -1749 -1246 2036 2922 -938 -4001 -1262 3573 3057 -1806 -3941 -184
5320a84K842j651k381O37J713r90j627J474K943q00m220j489M504L249k375m846
5336c201M68M092J194k548j556J627J021j868r18K931J889k913l654J100N000
5351B664J053m227l216K428L648j23l074p23K092M31k139J43K858L75l265k689
5367c764L470M035r78n126j476L900L322k066l133J95K360j75k086J347K313r39
5383A199l393n96L666L138k774m545O45M349J480l034k008J355J522j019j166
5398a181J338K038j793l446J200M698P14m993k379K479M157l18l878q56K558J182
5414A520j790q53K615O76l183k133L083L783j178m925j688M386L338k156l698
5429b203L88K588N58k165K16K088l40l023n88L809K635l063m289Q08M466J317
$$ plain form
5320 -184 2658 1007 -1374 -737 976 -14 -1641 -167 2776 1976 -2244 -3733 771 4020 1645 -3201
5336 -3201 -2733 1359 2553 5 -1551 76 1097 -771 -1689 1242 3131 218 -3436 -2336 2664
5351 2664 3717 -510 -3726 -1298 2350 2227 -847 -1570 522 953 -1186 -1043 1815 2190 -1075 -3764
5367 -3764 -294 3741 2763 -2363 -3839 61 3383 1317 -1816 -1621 739 564 -1522 -175 2138 1199
5383 1199 -2194 -2790 876 4014 1240 -3305 -2660 1689 3169 135 -1873 -518 1004 -15 -1181
5398 -1181 157 2195 402 -3044 -1844 2854 3568 -1425 -3804 -1325 2832 2514 -1364 -2220 338 1520
5414 1520 -270 -1123 1492 2168 -1015 -3148 -65 3718 2540 -2385 -4073 313 3651 1495 -2203
5429 -2203 -1815 773 1331 -834 -618 1470 1130 -1893 -2481 1328 3963 900 -3389 -2581 1885 3202
5445C202l192k553J447K984r82j862J017J335j310k572J148L730P12m199k548
5460c643K633M492q14m325j015K695J947j620j393J578Q96j999j779K189L542
5475C384j498m492p39M323K645k154m438O38L630N78k220m66J511L04k225o83
5491a902L011K096l049l616J070N001Q48l754l051K416L053j048k184M84J727
5506A102q80j955P64L189N62m056k457L082M279q85m947p70L193K088j636j976
5522a303J137J570j888j031J483K740j115m107n09M132K671k791m213R49L653
5537A378J153k822r68J486O19j543r15K638K067l028l525J472M758P39m382k639
5553c512K632L561r27k990J15J858j15j681K69K770j0l469j944K827M349j434
$$ plain form
5445 3202 10 -2543 -1096 1888 906 -956 61 1396 86 -2486 -1338 2392 3104 -1095 -3643
5460 -3643 -1010 3482 2668 -1657 -2672 23 1970 350 -1043 535 1431 -568 -2347 -158 3384
5475 3384 1886 -2606 -3345 978 3623 1469 -2969 -2331 1299 1877 -343 -809 702 1006 -1219 -1902
5491 -1902 1109 3205 156 -3460 -2390 2611 3459 -295 -3346 -930 2123 1075 -1109 -625 1102
5506 1102 222 -1733 -969 2220 2782 -1274 -3731 -649 3630 2745 -2202 -2972 221 2309 673 -1303
5522 -1303 -166 1404 -484 -1515 -32 2708 1593 -2514 -3023 1109 3780 989 -3224 -2275 1378
5537 1378 2531 -291 -1259 227 846 -697 -1612 1026 3093 65 -3460 -1988 2770 3509 -873 -3512
5553 -3512 -880 2681 1754 -1236 -1121 737 622 -1059 -790 1980 1970 -1499 -3443 -616 3733 2299
5569B299m392r03L404K324k011k329N99K082p21j723J436K060j067l160m47M052
5585A503K361l392l757J094M146P75k878j533J251J641j442r86J928J230j936
5600El139J705M326J72m472k232K711L750q56l459j24K071Q36j955l74K348L58
5617A671k770j865K897L612j711m238j046M147K868k706k736O34K335k05j730
5632h43M17J907o87k999m1L385K342l221l634J193M280O27l084k200K158J796
5648A396o53j449P01J631j913k373J654L659M3m026k255L066L717j319l572k76
5664a969K479J180j753j013J797J058k670j499K278L557j907m062p96M387K482
5679C549l081l041R85K919J97k169m47J827k5k271l05L209J714k871l818K050
$$ plain form
5569 2299 -2093 -2996 408 2732 721 -1608 -1009 1073 352 -1371 65 2125 1058 -2102 -2549 1503
5585 1503 3864 472 -3285 -2191 1955 2730 -148 -1681 -430 1211 -231 -1217 711 1941 5
5600 5 -3134 -1429 2897 3069 -1403 -3635 -924 2826 1970 -1489 -1613 458 1294 -661 -1035 1313 1671
5617 1671 -1099 -2964 -67 3545 1834 -2404 -3450 697 3565 859 -1877 -1243 1092 887 -843
5632 -843 -426 1481 794 -2205 -2246 1139 3481 260 -3374 -2181 2099 2726 -358 -2558 -400 1396
5648 1396 743 -706 -5 1626 -287 -2660 -1006 2653 2696 -1330 -3585 -519 3198 1879 -1693 -1969
5664 -1969 510 1690 -63 -1076 721 1779 -891 -2390 -112 3445 1538 -2524 -3320 1067 3549
5679 3549 468 -2573 -1588 1331 1528 -641 -1088 739 714 -1557 -1862 1347 3061 190 -3628 -1578
5695a578M198K68l497k331K388K338q40j910R01J099j009j686J081L145j52m001
5711a586j622K987L612j430m105j36L029J222j858j286J315P58j518j448K507
5726D41K148j459l876l2M162K138l218l524J474L211L92k410q86K124M65j880
5742g30p03K805J084k767k585J050M362K01l800k174K625L048j106k347K16J544
5758G23k12j940P69K409J49l440j462L121L169j735l649m79L251J936k412j524
5774a326J142J348j074j551J545K309j375l442k33M161J766l010l231J142L874
5789B045J14k597j294K036O33j520o03K098J214k440k492J635L671J21l770k224
5805c373K850L045j014k857k47K270K76j670J97J802J41k798j268K963K796j606
$$ plain form
5695 -1578 2620 2888 -609 -2940 -552 1786 946 -964 -63 1036 27 -1659 -578 2567 2415 -1586
5711 -1586 -3208 -221 3391 1961 -2144 -2280 749 1971 113 -1173 142 900 -618 -2066 441
5726 441 2589 1130 -2746 -2778 1384 3522 304 -3220 -1746 1465 1857 -553 -1439 685 1150 -730
5742 -730 -1433 1372 2456 -311 -2896 -1846 2516 2717 -1083 -3257 -632 2416 1310 -1037 -821 723
5758 723 511 -1429 -660 1749 1898 -1542 -3004 117 3286 1551 -2098 -2577 674 2610 198 -1326
5774 -1326 -184 1164 90 -1461 84 2393 1018 -2424 -2657 1504 3270 260 -2971 -1829 2045
5789 2045 2159 -438 -1732 304 937 -583 -1186 912 2126 -314 -2806 -1171 2500 2621 -1149 -3373
5805 -3373 -523 2522 1508 -1349 -1596 674 950 -720 -523 1279 1420 -1378 -2646 317 3113 1507
5821A507m259J86L672J826k690k350J074K185n13j630Q22K000j315l195O61L601
5837A582J203l068k976J627M009O3l508q28K145J266j584j373J515J760j963k301
5853b431J708L605o12l550k002K963L157j293l272k53K436P45j377m13J352M31
5869A194k295p94K522K155j709l529l91L963J759k633k590J202K603q59j660P85
5885b77J492m79k579M40L256Q52l106l056K056M141l18l692j207K010K418j621
5901C30j452J124J449j512j640J167L114l52l819j482L238L131k240l079l18L241
5917I00Q21j840j109J658L84j593j215K355K189j625l815M30L819J304k605k519
5933b461J017K774J86k464J31J762m09j768j93K669J408l233k564K064L841m19
$$ plain form
5821 1507 -2752 -2566 1106 2932 242 -2108 -1034 1151 638 -992 -170 1830 515 -2680 -2019 1582
5837 1582 2785 -283 -3259 -1632 2377 2440 -1068 -1896 249 1515 -69 -1442 73 1833 -130 -2431
5853 -2431 -723 2882 2270 -1280 -3282 -319 2838 1545 -1727 -1980 456 1201 -176 -589 763 1194
5869 1194 -1101 -1895 627 2782 1073 -2456 -2847 1116 2875 242 -2348 -1146 1457 598 -1062 -277
5885 -277 1215 736 -1843 -1403 1853 2705 -401 -3457 -1401 2740 2422 -1270 -2477 -467 1951 330
5901 330 -1122 2 1451 -61 -1701 -534 2580 2228 -1591 -3073 165 3296 1056 -2023 -2341 900
5917 900 1721 -119 -1228 430 814 -779 -1994 361 2550 925 -2890 -2460 1359 2663 58 -2461
5933 -2461 -1444 1330 1516 -948 -817 945 536 -1232 -1425 1244 2652 -581 -3145 -1081 2760 2341
5949B341l441j824L017K259j685j974P98J623p23j530N00K493j59l350j452L342
5965B35K952k187l316L5L270J102k096j539J493J125j312j166J872J975j918k903
5981b378M94L694J056k939k964K051K973j10k448m96J436L82j519j44J746J174
5997B008k496k596J941M012o53l705j227K520K653j197k816M02K067j1k160O06
6013f52K245l84k870q88K837L036k367l330k0L669J085k338k043J628J470j163
6029h5j159J309J628q34k972L91L409R38l311k345J588L522k05k737q28K086J011
6046A406j701r36J592J263k306j645J705L241n85l689j499L115K657j859k587
6061a828N36K143J88j896L36J609J3k654n66K956J707j488l579K07L855J005k544
$$ plain form
5949 2341 -1100 -2924 93 2352 667 -1307 -509 1114 391 -1139 -639 1854 1695 -1655 -3107 235
5965 235 3187 1000 -2316 -2281 989 2091 -5 -1544 -51 1074 -238 -1404 468 2443 525 -2378
5981 -2378 -1884 1810 2866 -73 -3037 -986 1987 1877 -571 -1067 369 751 -768 -912 834 2008
5997 2008 -488 -3084 -1143 2869 2216 -1489 -2716 -196 2457 1260 -1556 -1154 913 902 -1258 -652
6013 -652 1593 1209 -1661 -2549 288 3324 957 -2373 -2393 1276 2361 23 -2020 -392 1078 -85
6029 -85 -1244 65 1693 859 -2113 -1722 1687 2625 -686 -3031 -1443 2079 1874 -863 -1691 395 1406
6046 1406 -295 -1231 361 1624 -682 -2327 -622 2619 2034 -1655 -3154 -39 2618 759 -1828
6061 -1828 -1292 851 1039 -857 -521 1088 1101 -1553 -2119 837 2544 1056 -2523 -2316 1539 2544 0
6078@k127J212J906j12j756M00J806p86k431O20L060N38l259k032K112L363k62
6095B252l520o85K203J595j617j253R94J051j461j521J517K799p42l673p15L191
6111D15K520k134l042M50K841L32j846n13J563L75j570j174K284K269k065l508
6127b803N27L769J408l072k233J709K614q23k010K55J696m65k040L26K534P52
6143B144k723k180J953L453m95l738q55K684J762j773j363R56J191j082j823J488
6159d01K225m28l140r49L402K074j849l015O02K568O52k036j146J593Q37j589
6175f00p98J851J845j947k852O65L631Q73l054k388J747K956n52k147p2J403K99
6192H60j584l48K331M95k442k085K106L455j146l238q83K735K096j973k045P79
$$ plain form
6078 0 -2127 -915 991 879 -877 -477 1329 543 -1888 -1268 1792 2330 -929 -2961 -849 2514 2252
6095 2252 -1268 -1953 250 1845 228 -1025 -31 1020 -441 -1962 -445 2354 1612 -2061 -2776 415
6111 415 2935 801 -2241 -1791 1050 1382 -464 -977 586 961 -609 -1783 501 2770 705 -2803
6127 -2803 -2276 1493 2901 -171 -2404 -695 1919 1096 -914 -659 1037 572 -1468 -1142 1392 2144
6143 2144 -579 -2759 -806 2647 2152 -1586 -2441 243 2005 232 -1131 -175 1016 -66 -1889 -401
6159 -401 1824 1396 -1744 -2693 709 2783 934 -2081 -1479 1089 1741 -295 -1441 152 989 -600
6175 -600 -1398 453 2298 351 -2501 -1836 1795 2668 -386 -2774 -1027 1929 1377 -770 -842 561 860
6192 860 -724 -1072 1259 1754 -688 -2773 -667 2788 1642 -1596 -2479 256 2352 379 -1666 -887
6208h87J947p94j214N50K300r50l003l19K890K271k292k976O69L217O65k454j371
6225a751J881R63j175j131J343J647j426k834J476K908M97l164j986K166K704
6240B118m92k558o45K024P84j681m46J548N87j755j703K214K600r07l624l35K883
6257F12J827k080k110P98J912m9j913N00J623l84k335k71L092J552k303l101Q79
6274a751L293Q21k491j883J902J592j393j147P44J830j044k180M34L134L64k839
6290f14k461K395L107q79l025l04K023J214j729o61J547P60j691j626J506K688
6306B250p83l146o79K805J788j841k267N87K297l71j467J03J331L56k165k42K456
6323A012J316j972k978J147L251Q05l190j789J981K205j152j467M40J530j119
$$ plain form
6208 -887 1060 266 -948 -398 1902 952 -2051 -2370 520 2791 499 -2477 -1808 1409 2074 -380 -1751
6225 -1751 130 1093 -82 -1213 130 1777 351 -2483 -1007 1901 2398 -766 -2752 -586 2118
6240 2118 1626 -932 -1577 447 1231 -450 -896 652 1239 -516 -2219 -5 2595 1688 -1936 -2271 612
6257 612 2439 359 -1751 -953 959 910 -1003 -503 1120 736 -1599 -1870 1222 2774 471 -2630 -1751
6274 -1751 1542 2363 -128 -2011 -109 1483 90 -1057 -313 1517 473 -1707 -1273 1861 2225 -614
6290 -614 -3075 -680 2427 1548 -1477 -1781 242 1456 -273 -934 613 1373 -318 -1944 -438 2250
6306 2250 1467 -1679 -2358 447 2235 394 -1873 -1286 1011 640 -827 -724 607 963 -1202 -1444 1012
6323 1012 2328 356 -2622 -1475 1776 2581 -609 -2398 -417 1788 636 -831 -391 1139 20
6338B0j685N48K626L96k877j721K284K647p89k786m80K120J256j613j042J041
6354e5J184j434j525J758J929r11l098k15L285J558j988k860R39K879L4k123m92
6371a135J839N40k073m91K016J214j944k304P85L500L95l249j405J680K428q97
6387H99k081K16K006l67j623k00K437N98k766j521K150K732j096l159o24L071
6403F72J184j786j625J145J539j219j124R88K025q83k708n5K694J857k468k717
6419b481J581K690j40k174p90J461J173j998m39J576J116j321k799J383L051J47
6435B036l022j799K241K803r26k487k95J947K71j450l22J913N20k276j223K045
6451b4K224o10l574j90K990J439j949j916J045J720p89j623R12J502m08k396l40
$$ plain form
6338 20 -1665 -1117 1509 1905 -972 -2693 -409 2238 1449 -1337 -1817 303 1559 -54 -1096 -55
6354 -55 1129 -305 -1830 -72 1857 946 -2152 -2367 918 2476 488 -2372 -1433 1446 1480 -643 -1135
6371 -1135 704 1244 -829 -1320 696 1910 -34 -2338 -1553 1947 2342 -907 -2312 -632 1796 899
6387 899 -1182 -966 1040 673 -950 -1150 1287 1885 -881 -2402 -252 2480 1384 -1775 -2399 672
6403 672 1856 70 -1555 -410 1129 -90 -1214 -226 1799 916 -1792 -1847 847 2704 236 -2481
6419 -2481 -900 1790 1650 -524 -1314 147 1320 -678 -1117 459 1575 254 -2545 -1162 1889 2036
6435 2036 -986 -2785 -544 2259 1333 -1154 -1449 498 769 -681 -1003 910 1430 -846 -2069 -24
6451 -24 2200 1590 -1984 -2174 816 2255 306 -1610 -565 1155 366 -1257 -345 1157 749 -1647 -1987
6468a987L097J721k677k649J217L035K00k685j106J926J308j605o55J107J544
6483A791j744j802P56K791K02k926j857K670K249j042k921K93J999Q35j883k33
6499h22J548L90j702j738K383K194j073l102j24L240J101j979k157R11K186l89
6515H67j584M33J415l54k001k16K516J100k413k204J136L396o5k837j093K014
6531A10J411j174j562J426J090j105j594P74K347J88l145j215K315K527j362k787
6547a756j20K240P30j651n52J687Q27j905j023J604K059r18l308j7L125J102k229
6564a05j889J139K225q1j973m44J967J21j849p67K447J174k025k638J840K829
6580A971K0l222j239K416J834j619j408P11J578n04j809N90K221n3k619j082K259
$$ plain form
6468 -1987 1110 2831 154 -2495 -1278 1757 1957 -728 -1834 92 1400 -205 -860 247 1791
6483 1791 47 -1755 -999 1792 1994 -932 -2789 -119 2130 1088 -1833 -1540 459 1294 -589 -822
6499 -822 726 1116 -586 -2324 59 2253 1180 -1922 -2046 1194 2295 316 -1841 -930 1256 867
6515 867 -717 -284 1131 777 -1224 -1440 1076 2176 -237 -2441 -1305 2091 2026 -811 -1904 110
6531 110 1521 347 -1215 211 1301 196 -1398 -624 1723 1911 -1234 -2449 -134 2393 1031 -1756
6547 -1756 -1876 364 1094 -557 -1109 578 1405 -500 -1523 81 2140 1222 -2086 -2103 1022 2124 -105
6564 -105 -1994 -855 1370 1289 -684 -1128 839 960 -889 -1656 791 1965 -60 -2698 -858 1971
6580 1971 1991 -1231 -2470 -54 1780 161 -1247 -536 1042 538 -1271 -681 1540 1487 -1132 -2214 45
6597D5K451j286l289Q6K917Q99k057j290J640J191j346j261J287J715o58k755
6613a711KK749J422k536j997J024K412k72j778l72J230P33j304p39J876J123k144
6630b82j977J347K985l26k514j457K184J763q94k175N85J716k61j731J49K104
6646A216L56k407j308K439K369j630l094L60K513J267k245j461J307J730j442
6661c0j149R50J552m97k355k43K999J016k503k008J294K563l6k855m28J949P10
6678I29j066p70J254J115j456k140J187K847l38k873j008K229K377j558k202N62
6694i11J892J28j699j69J581K36j950j202K557J806j487k480k02K844J013j952
6710Ej928J482J459n42j646Q11J585p71j836L6K529Q65k243k417J860K544j78
$$ plain form
6597 45 2496 1210 -2079 -1993 924 1823 -234 -1524 116 1307 -39 -1300 -13 1702 1044 -1711
6613 -1711 -1709 1040 2462 -74 -2071 -1047 1365 1093 -685 -1057 173 906 -398 -1137 739 1862 -282
6630 -282 -2259 -912 2073 1747 -767 -2224 -40 1723 829 -1346 -761 955 694 -1037 -888 1216
6646 1216 1572 -835 -2143 296 2665 1035 -2059 -1699 814 2081 -164 -1625 -318 1412 -30
6661 -30 -1179 -229 1323 826 -1529 -1772 1227 2243 -260 -2268 -974 1589 1553 -1302 -1730 219 929
6678 929 -137 -907 347 1462 6 -2134 -947 1900 1562 -1311 -2319 -90 2287 729 -1473 -911
6694 -911 981 1109 -590 -759 822 1058 -892 -2094 463 2269 782 -1698 -1900 944 1957 5
6710 5 -1923 -441 1018 476 -1170 -359 1226 455 -1381 -1345 1184 2049 -194 -2611 -751 1793 1615
6727A615k462o30J688J001j096j165J264J249j719j394J110K226p3l014o17K130
6743A13K244j740k051R2K221K50j401p06J541N35j665j143K242J729j699k630
6759b068K24L046J123k340j788J020K324n96k137O31J569m7j954j88J890J237
6775A946k262j881J119L098k64l105n01K351J199j429j377J035R33p52j234M55
6791f69K149j48k383r64K424J670j404k660N22K441K98j710n10J231R09j427j212
6808a443J321J925j331k526N96K983L92k244j731J359K150o03j676k06J383N38
6824H87j680k01J729R62k258j716J682K478j56k783p74K050J646j503k030J275
6840c92J085l36j229J41J835K63k498j015K670J755j622k437N82K091R25k367
$$ plain form
6727 1615 -847 -1477 211 1212 116 -1049 215 1464 -255 -1649 -539 1687 1614 -1400 -2017 113
6743 113 2357 617 -1434 -1342 879 1129 -272 -978 563 1098 -567 -1710 532 2261 562 -2068
6759 -2068 -1844 1202 2325 -15 -1803 -783 1541 945 -1192 -561 1008 961 -993 -1181 709 1946
6775 1946 -316 -2197 -1078 2020 1756 -1349 -1850 501 1700 271 -1106 -71 862 110 -1124 -669
6791 -669 1480 1332 -1051 -2015 409 2079 675 -1985 -1463 978 1276 -434 -944 287 1196 -231 -1443
6808 -1443 -122 1803 472 -2054 -1458 1525 1917 -327 -2058 -699 1451 848 -828 -1034 349 887
6824 887 -793 -994 735 1697 -561 -2277 -595 1883 1727 -1056 -1830 220 1866 363 -1667 -392
6840 -392 693 357 -872 -731 1104 1367 -1131 -2146 524 2279 657 -1780 -1198 893 1818 -549
6856e49q47J461J040j367r42J160J712j059k306K95K622P29k337j914J514K683
6872A895j085j844k94J731N65j396p73J833P21j676j400J530J964n48k433q01
6888b011K246J573j331k018N55J937j92j522j0J888j65k133n81K189J660j699
6904C86k594R17K535O18k439j374K029J020o56j583P95J211k96k163M92K606M18
6921A922k396j795J665K554o20k522k22J911P16j524j054J341J317j355j574J053
6937e83K374k97k987m43K469J473j769j864O39J870K73j729j73J361N90k250n00
6954a546J768J989j909k179N45K538O70k156j210J234J359p76j707J015J450o34
6970D51j562o6K349M32j858j793J846K275o84k509o24K304O41j355r88R82J301
$$ plain form
6856 -549 -1396 65 1105 -262 -1204 -44 1668 609 -1697 -1402 1220 1949 -388 -2302 -788 1895
6872 1895 810 -1034 -1328 403 968 -428 -1201 632 1353 -323 -1723 -193 1771 1223 -1210 -2011
6888 -2011 235 1808 477 -1541 -986 951 759 -763 -773 1115 950 -1183 -1764 425 2085 386
6904 386 -2208 -1291 1244 1862 -577 -1951 78 1098 442 -1141 -346 865 569 -1594 -1102 1504 1922
6921 1922 -474 -2269 -604 1950 1330 -1192 -1414 497 1213 -311 -1365 -24 1293 -62 -1636 -583
6937 -583 1791 1494 -1493 -1936 533 2006 237 -1627 -988 882 1155 -574 -747 614 1204 -1046 -1546
6954 -1546 222 2211 302 -1877 -1332 1206 1876 -280 -1490 -256 1103 327 -1380 -365 1085 451
6970 451 -1111 -1177 1172 1604 -254 -2047 -201 2074 1390 -1119 -1743 561 1202 -153 -1141 -159 1142
6987A142j300j381J137J923k24k654n90K349J676j810k081P41K090Qj651n76J810
7004F09J62j531n19J618J185j127k257O96K404O62k444j538J988J505l52k441
7020a380M51J959l77j589lK038M84j949j847J913K273q95k448l54K285J090j557
7037I4j506J087J407q43j037L16J946m85k156k95K038J646j745k141N30K245J85
7054A286j757p42J467P93j028j184J157J526j369j796O60K334M22k432j465J926
7070b02J818q13j912K08J670P9j506m35J434Q27j610j484J517K277p68k456m79
7087a835K474J242j774j607Q40J664m81j526K99J671k85j649m36J983J445j676
7103C49k358P46K460M79k130j106J557J073j205p92P82J343q12j896O67K261R8
$$ plain form
6987 1142 -158 -1539 -402 1521 1297 -1357 -1947 402 2078 268 -1813 -1072 1018 1026 -625 -1201 609
7004 609 771 -760 -1279 339 1524 397 -1860 -1164 1240 1902 -542 -2080 -92 1413 1061 -1380
7020 -1380 -929 1030 653 -936 -939 1099 1583 -366 -2213 -300 1973 1078 -1370 -1724 561 1651 94
7037 94 -1412 -325 1082 239 -798 -482 1464 979 -1177 -1472 566 2212 467 -1674 -1144 1101 1286
7054 1286 -471 -1213 254 1047 19 -1165 -8 1518 149 -1647 -987 1347 1769 -663 -2128 -202
7070 -202 1616 803 -1109 -901 769 848 -658 -1093 341 1168 -442 -1926 -409 1868 1100 -1356 -1835
7087 -1835 639 1881 107 -1500 -660 1004 523 -1003 -704 967 682 -967 -1403 580 2025 349
7103 349 -2009 -1263 1197 1676 -454 -1560 -3 1070 -135 -927 -145 1198 386 -1510 -843 1418 1516
7120A516k351j185J867K079r14k209J34J655J90j191o22J662L40j454j280J467
7136b96J983q19k357k40K426J481j944j592O15J914l84j398q3J688N0j882m31
7153a269J673J562j680k169P19K386K35j947r27J567R95p47j342N60J685r27j535
7170a161L59J946K50k250j063J847K044r92k226J67J458R87k004k83J420M76j242
7187b67r58J111J744p97k437m6K454J161j599k113P45K063j71j524k11J420M81
7204A056j723p29J658J456j821j805R07K565J29k126j070J389J591j183j413N38
7220e81J535n25j481J98K031J06j877j303J982J839q14k447m1K417N23j771j146
7237a355J328J219j030j469Q54J814l86k166q2K015J352j804k042P42K505l41
$$ plain form
7120 1516 -835 -2020 -153 1926 1012 -1197 -1063 592 782 -409 -1031 631 971 -483 -1763 -296
7136 -296 1687 868 -1489 -1729 697 2178 234 -1358 -743 1171 787 -611 -694 994 1044 -838 -1269
7153 -1269 404 1966 286 -1883 -1164 1222 1457 -490 -1417 150 1145 398 -944 -384 1301 374 -1161
7170 -1161 -802 1144 1394 -856 -1919 -72 1972 980 -1246 -1079 379 1366 -638 -921 499 975 -267
7187 -267 -1225 -114 1630 833 -1604 -1650 804 1965 366 -1747 -1002 1061 890 -634 -845 575 1056
7204 1056 -667 -1396 262 1718 -103 -1908 -1001 1564 1693 -433 -1503 -114 1477 294 -1119 -581
7220 -581 954 429 -1052 -854 1177 1283 -594 -1897 85 1924 1110 -1337 -1378 1039 1562 -209 -1355
7237 -1355 -27 1192 162 -1307 -453 1361 975 -1191 -1273 742 2094 290 -1752 -1010 1495 1154
7253A154k036j93J377M94j190p26J418J122j419j533O34K233L34k393j462K236
7269E0J638j313j410M09J325J5j784J17J795O4j522r92J703J701r13k176J6K473
7287A196K29j626j005J062J465r36j639R42J423j27k272j15K110J210j963k077
7303b123J308K096J05k192p29J757Q55j326p67P67J500j270j419N74K186O3k383
7320i98q20J724J521p40j832J93J734k97r59l40J568N01j709r76J285J726p13
7337H68k295K42J938Q66j865j113R71J392l49j661L82J489J44k229k7J753J099
7354A605j943j545J182K122o8k264o87J646J267j103j020Q26J073q32j557M89
7370h09K158l6k232r48K090J501j228j842K15K009K02j554p00J729O34j508j079
$$ plain form
7253 1154 -882 -1075 302 796 -394 -1120 298 1420 1 -1532 -898 1335 1669 -724 -2186 50
7269 50 1688 375 -1035 -626 699 714 -1070 -953 842 906 -616 -1608 95 1796 883 -1293 -1277 1196
7287 1196 1425 -201 -1206 -144 1321 385 -1254 -312 1111 984 -1288 -1403 707 1917 -46 -2123
7303 -2123 -815 1281 1386 -806 -1535 222 1077 -249 -1016 -249 1251 -19 -1438 -864 1322 1385 -998
7320 -998 -1818 -94 1427 687 -1145 -952 782 485 -474 -814 754 1255 -454 -1430 -145 1581 868
7337 868 -1427 -1185 753 1619 -246 -1359 -388 1004 655 -1006 -624 865 1009 -1220 -1247 506 1605
7354 1605 -338 -1883 -701 1421 1353 -911 -1598 48 1315 212 -808 18 1091 259 -1298 -809
7370 -809 1349 1313 -919 -1867 223 1724 496 -1346 -1131 878 1080 -474 -1174 555 1189 -319 -1398
7387a398J481J418p95j958k18K111R31j604j570J213J573m54j462j1J284J55j309
7404f13m45J340J190j418j868J179K181l07k136m84J461J123j031j275N91J323
7420H11p04j144O54J619j95j995n33J571J490p86j919n4K168J53j551l51O99J036
7438I69j021j207J315J270n78k089P7K187Q16j700j858J405J614n40j548q4J608
7455F36K39j497k73J113J142j516j557P75K291r4k182r18K056J190r11j583M22
7472f67J672l55j433Q7J697p9j727p82J935J398j041k097K07J840N56j597p86
7489a172J350N27n65j068N87J354p00j777J47K294R30j992j348Q00J955k37j781
7506f96j33J476M71j316o58J268P14r54j744J125K010o45j623q83J365J927j312
$$ plain form
7387 -1398 83 1501 706 -1252 -1470 641 1572 -32 -1602 -389 1184 730 -732 -743 541 696 -613
7404 -613 -1058 282 1472 54 -1814 -635 1546 1239 -897 -1381 80 1203 172 -1103 -512 811
7420 811 107 -1037 -383 1236 1041 -954 -1487 84 1574 788 -1131 -1185 983 1136 -415 -766 -67 969
7438 969 -52 -1259 56 1326 748 -1341 -1264 923 1739 39 -1819 -414 1200 660 -888 -972 636
7455 636 875 -622 -895 218 1360 -156 -1713 -938 1353 1259 -923 -1841 215 1405 494 -1089 -667
7472 -667 1005 650 -783 -696 1001 922 -805 -1587 348 1746 705 -1392 -1185 655 1211 -386 -1172
7489 -1172 178 705 140 -928 -341 1013 313 -1464 -1317 977 1907 -85 -1433 -633 1322 1085 -696
7506 -696 -829 647 1118 -198 -856 412 1126 172 -1572 -447 1563 918 -705 -1588 -223 1704 392
7523C92j504K60J335K74j161k87J535J00j549p03J446J421p49j814n54K733M20
7540A595j789j267J495Q40n70r68J49J941r77j350JJ981M70j842j607J144K215
7557A461l77j905l39J712N54j150r77R13J230r19j534R31J771j22k368p98K468
7574E51Q53j166j783P80J472K63j349o64J520L69j233p54J625R22r02k066L52
7591a210K247M70j662j241J162J232l95j587K45J415j37j374J05J326Q39j572
7607a37j753J282K087j44k364j9J546P05j059r81N71J181p89j070M99J624k01
7624I78k088l48J533J538j378j488J51J950K82j600n60J233O81j069j048J348
7640A15R96p68j497K08K057K33j578j299J111J670n08j628L13J307K49j689q6
$$ plain form
7523 392 -1112 -852 483 757 -404 -691 844 944 -605 -1308 138 1559 810 -1004 -1558 1175 1595
7540 1595 -194 -1461 34 874 304 -664 -515 1426 449 -901 -900 1081 1551 -291 -1898 -754 1461
7557 1461 1084 -821 -1160 552 1106 -44 -1021 -108 1122 203 -1331 -400 1371 1249 -1119 -1917 551
7574 551 1404 238 -1545 -765 707 970 -379 -1043 477 846 -387 -1141 484 1406 504 -1562 -1210
7591 -1210 1037 1507 -155 -1396 -234 998 603 -984 -739 676 539 -835 -730 596 1435 -137
7607 -137 -1890 -608 1479 1335 -1029 -1048 498 1203 144 -837 -266 915 126 -944 -445 1179 978
7624 978 -1110 -1458 75 1613 235 -1253 -1102 848 1130 -470 -1030 203 884 -185 -1233 115
7640 115 1111 343 -1154 -946 1111 1344 -234 -1533 -422 1248 740 -888 -575 732 981 -708 -794
7657g94J158R17j547j382J396J897n22k235j89J708J131j466j002N61J154o72
7673A13j209O75J739l24j879o22J580J564j110k275P98J894L58j664q99J469R59
7690A167r47j179J145R38m38k089P17J650P20k093r29O87K345q62j780J8J424
7707D94J50j106n23J437R61j667j323J449J667p23j736m67J670J187j340j218
7723a088J020R58n41j121J70J329K54j789o16J569J678j565j924O32K226R9j678
7740c87j068J307R36m66j291N33J343l81j274k59J849N61j718j627J532J838m22
7757A006j753j69J738m2j203l58J083P23j265j181J299J464m81j956j93J959Q28
7774A499j403j265P01J726m67j562K7J178K71j280n74J346J225j309j267K29K021
$$ plain form
7657 -794 364 1281 -266 -1648 -252 1645 1123 -1112 -1301 407 1538 72 -930 -369 785 113
7673 113 -1096 -421 1318 994 -885 -1507 73 1637 527 -1748 -950 944 1302 -362 -1261 208 1167
7690 1167 220 -959 186 1124 686 -1403 -686 964 1684 -409 -1338 -651 1694 832 -948 -930 494
7707 494 644 -462 -985 452 1413 -254 -1577 -128 1539 816 -920 -1387 283 1470 130 -1088
7723 -1088 -68 890 349 -772 -602 727 981 -808 -1424 145 1823 258 -1666 -1034 1192 1291 -387
7740 -387 -1455 -148 788 322 -969 -436 907 526 -748 -1007 842 1403 -315 -1942 -410 1428 1006
7757 1006 -747 -916 822 780 -423 -781 302 1025 -240 -1421 -122 1342 861 -1095 -1288 671 1499
7774 1499 96 -1169 -468 1258 791 -771 -744 434 705 -575 -1149 197 1422 113 -1154 -925 1096
7791A096L23k328l31J073J220m74j356L43J377o00j203O4J615N38j475j568J026
7808f60K286p62j712l75J432P91j230n81R51P44j023j018Q39J346k88j628l64
7825a252J795Q27j149j598M80J782j35j262j42R51M82j555%R90J186j324j395
7842a319J58K225K35j533j166J369J169n30j457J41J578n09j063j36J541M77j581
7859d01p54J035J513n33j987L0J255J277j451p94N73J236r86q43O65J562n88j690
7877h81m18J844R48j376j687N59J895j82j028o19J527L30j292n57J214J234j185
7894C26j861P31K008J28j640j378J226J816n83j737L29J099M26j633k41J625M19
7911A060j182j154R23J609k84k111k20J660J096j523q97O73J100l98r17q4J258
$$ plain form
7791 1096 1419 -909 -1240 -167 1053 579 -777 -434 943 343 -860 -796 819 1357 -118 -1686 -660
7808 -660 1626 864 -848 -1223 209 1000 -230 -811 140 884 -139 -1157 -318 1028 740 -888 -1252
7825 -1252 543 1370 221 -1377 -897 885 750 -512 -654 297 779 -776 -776 214 1400 76 -1319
7842 -1319 -1161 1064 1299 -234 -1400 -31 1138 608 -849 -708 870 361 -702 -838 703 1180 -401
7859 -401 -1155 -120 1393 860 -1127 -1097 158 1435 -16 -810 -237 999 13 -830 -165 1397 809 -881
7877 -881 -1299 545 1493 117 -1570 -1011 884 702 -326 -945 582 912 -380 -937 277 1511 326
7894 326 -1535 -804 1204 1332 -308 -1686 -460 1356 773 -964 -635 464 890 -743 -984 641 1060
7911 1060 -122 -1276 -353 1256 972 -1139 -1359 301 1397 -126 -1023 -350 750 352 -565 -649 609
7928F09K19j636l56J451J196j606j386Q01J591L71j802p39J555N63p37j088Q83
7945a11J356p00j739L33J865L15k057q09J305J732j023j436J18J351M59j366m15
7962h22J264O54j143j277Q63J780l41k154J20J569P08j167j387J127J289l62j594
7979h73j64J815j45j421l96J411J110j436j117N37K128k60j364j270J510J167
7995A232j321r68N88J172j97j772L44J702K06j648r06J635J223m85j557k51J441
8012D38N16j425p49J206O93o97j037O82J537l51j585n04J928P04j464j106Q78
8029c36J191l93r86j26J259K29j175o05J219J081j374j316R90J500N1j593j101
8046a485J564J015q27j140O46J136n35j158L08J384Q6j486j220J606J623q78j681
$$ plain form
7928 609 828 -808 -1164 287 1483 -123 -1509 -708 883 1254 -548 -1287 268 831 94 -994 -111
7945 -111 1245 545 -1194 -861 1004 1319 -738 -1547 -242 1490 467 -969 -851 500 959 -407 -822
7962 -822 442 1096 -47 -1324 -461 1319 978 -1176 -1056 513 1221 54 -1333 -206 1083 721 -873
7979 -873 -1037 778 633 -788 -1184 227 1337 -99 -1216 -679 1449 1189 -175 -1445 65 1232
7995 1232 -89 -1057 -469 703 506 -1266 -922 780 986 -662 -1568 67 1290 805 -752 -1003 438
8012 438 954 -471 -1220 -14 679 -18 -1055 -373 1164 813 -772 -1276 652 1356 -108 -1214 -336
8029 -336 855 462 -524 -650 609 838 -337 -942 277 1358 -16 -1332 -342 1158 1209 -384 -1485
8046 -1485 79 1094 267 -873 -227 909 374 -784 -476 908 994 -492 -1712 -106 1517 639 -1042
8063a042J28J504J52j128p57J405P28r47j127Q71J922j039j614j40J560P52j106
8080A22j370P52J331j27j263q0J422o2o53j089J203J112j149j627O10K055Q6j966
8098f93k13Q52J270p86j454N40J319m06j031R3J100M88j586q60J031J663n46j977
8116a196R7J655O90j414j108J040J210p94j036N12J146m06j183k26J728Q52j626
8133e9j407J024J720n15j487r6R64R44j477n27Q97R73o76j635Q65J774k36j863
8151h17o99J698R40p02j464K69J656O8j452l98J549K70j540p33J153J468m84j784
8169a002J16J189J105j527r63P68J518r53j196M51J411l34j596j71J583J035j356
8186G8j471Q16J672k30j489
$$ plain form
8063 -1042 -914 590 742 -386 -1143 262 990 43 -1084 -213 1709 670 -944 -1084 476 1228 122
8080 122 -1248 -496 835 708 -555 -635 787 725 72 -1017 186 1298 149 -1478 -868 1187 1273 -693
8098 -693 -906 -54 1216 430 -1024 -484 835 429 -602 -509 591 1079 -507 -1367 -336 1327 781 -1196
8116 -1196 -1099 556 1246 -168 -1276 -236 974 180 -856 -344 802 396 -787 -1013 715 1567 -59
8133 -59 -1466 -442 1278 763 -724 -820 144 1088 -389 -916 -19 954 278 -1357 -492 1282 1046 -817
8151 -817 -1516 182 1122 420 -1044 -775 881 949 -503 -901 648 918 -622 -1355 -202 1266 782 -1002
8169 -1002 -886 303 1408 -119 -1082 -314 1204 251 -945 -494 917 583 -1013 -1184 399 1434 78
8186 78 -1393 -577 1095 865 -624
8191f24
$$ Imaginary data points
##PAGE= N=2
##DATA TABLE= (X++(I..I)), XYDATA
0@%%%Mm%qJ6j6K4l2L2m0N6o4P2q9J07j30J56j79K07k44K80l19L67m17M73n40O09
30C21o83P71q64R65j080J203j338J487j648J827k025K240k480K748l041L374l755
47a978M180m669N245n921O731p732Q994j0643J2910j6227K1567l1588N6757k33010
61a95384n13648L83397O17263J86134m21280m24433j2795L20445K30669j2250
71A58118j70295j44963m1729J22549K02937Q5264j82668k66086k5287K88706K66837
82B93383o3096l07987j90275R7652K37132J40098l1666j47889j56431n2847J25912
93e6014K21158R2359j63883k50797m3750K22984K31191k3320k44496j87338P6097
104a25809K57982J64292j13605k90028j64400J54200L20283J26878k25416l31172
$$ plain form
0 0 0 0 0 4 0 0 -8 8 -8 16 -16 16 -24 32 -32 40 -49 58 -72 84 -95 112 -132 148 -171 196 -221 252 -288 321
30 321 -362 409 -455 510 -570 633 -705 782 -866 961 -1064 1176 -1304 1444 -1597 1777 -1978
47 -1978 2202 -2467 2778 -3143 3588 -4144 4850 -5793 7117 -9110 12457 -19131 37626 -195384
61 -195384 -709032 -325635 291628 477762 56482 -367951 -380746 -60301 170368 158118
71 158118 -12177 -157140 -198869 -76320 126617 211881 29213 -236873 -262160 26546 293383
82 293383 230287 -77700 -267975 -170323 66809 206907 175241 27352 -129079 -181926 -56014
93 -56014 165144 257503 93620 -157177 -200927 22057 253248 229928 -14568 -201906 -125809
104 -125809 132173 296465 182860 -107168 -271568 -117368 202915 329793 104377 -226795
114b26795o8410K49299K60418j2242k27883j74141K3254J42229J24083K8699r1092
125B7419j57370o9831J34505K27760N4258k10417k30006M4021K76922J81722j09542
136A69441k45345j05484J15287J93727J00974o0026j82752j65402L1615K49891
146A01926K11042j09259l43314j70526K20398L38934L6405k89822k42187P1902
156a74501K41311J13638q2750j32324o6627O806P5195J25901O3881j13017k04520
167a47007m6110K05364K21334l8614k51138j59161R7844K04925Q3457q0866j31392
178d1364q5603l580J01619J57754M6961j67663k28353l538K62777K27665r2977
189A73698l10203j51257J86908K97787P0732k12858k43422j7377K08036K09015
$$ plain form
114 -226795 -295205 -45906 214512 202270 -25613 -199754 -176500 -34271 89812 118511 27419
125 27419 -129951 -199782 -65277 162483 216741 6324 -223682 -179661 97261 278983 169441
136 169441 -75904 -181388 -66101 127626 228600 168574 -14178 -179580 -147965 101926
146 101926 312968 203709 -139605 -310131 -89733 249201 285606 -4216 -246403 -174501
156 -174501 66810 180448 97698 -34626 -101253 -94447 -19252 106649 170530 57513 -147007
167 -147007 -193117 12247 233581 194967 -56171 -215332 -117488 87437 170894 90028 -41364
178 -41364 -126967 -130547 -28928 128826 175787 8124 -220229 -223767 39010 266675 173698
189 173698 -136505 -287762 -100854 196933 267665 54807 -188615 -205992 2044 211059
199B11059K156j96392j93274P082J94686J67444l9854j90970j31615M6742J47681
210B4745R4980l2454j21416j10052o77J31439J49464l505j83260j62833O4354
221a49215K30899J28259j16357k06339n6355J26532J46790L7728o2013j01111
231b1182q6979N741J40196J57039l1791k36240j72043J30264K89926P5041k45901
242D071k54227M8150K59572J38172j16034j89421n5116Q0091J03172O4719O629
253H9778q1826j35562m0561J48773J97078K410k14044j72282Q1827K26875R7226
264A99692j19859j70546m2388R2648J19143M9902n5887j28902r3322N8302J81661
$$ plain form
199 211059 213215 16823 -176451 -169369 25317 192761 152907 -38063 -169678 -122936 24745
210 24745 119725 87271 -34145 -144197 -144874 -13435 136029 132524 -50736 -213569 -149215
221 -149215 81684 209943 93586 -112753 -169108 -42576 104214 141942 79929 -21182
231 -21182 -108161 -102420 37776 194815 163024 -73216 -245259 -114995 174931 249972 4071
242 4071 -250156 -202006 57566 195738 79704 -109717 -164833 -84742 18430 83149 89778
253 89778 7952 -127610 -168171 -19398 177680 180090 -33954 -206236 -124409 102466 199692
264 199692 79833 -90713 -133101 -40453 78690 128592 72705 -56197 -149519 -91217 90444
$$ [...]
##END NTUPLES=NMR FID
##END=
