##TITLE=1H_CA-8639-2k
 CDCl3, 8 sc, 
 30.8.2019
##JCAMPDX= 6.0         $$ Bruker NMR JCAMP-DX V2.0
##DATA TYPE= NMR FID
##DATA CLASS= NTUPLES
##ORIGIN= UXNMR, Bruker Analytische Messtechnik GmbH
##OWNER= root
$$ XWIN-NMR		Version 3.5
$$ Fri Aug 30 13:45:45 2019 Russian Standard Time (UT+4h)  she@DPX200
##.OBSERVE FREQUENCY= 200.13155
##.OBSERVE NUCLEUS= ^1H
##.DELAY= (6, 6)
##.ACQUISITION MODE= SIMULTANEOUS
##.ACQUISITION SCHEME= undefined
##.AVERAGES= 8
##.DIGITISER RES= 18
##SPECTROMETER/DATA SYSTEM= spect
##.PULSE SEQUENCE= zg30
##.SOLVENT NAME= CDCl3
##.SHIFT REFERENCE= (INTERNAL, CDCl3, 0, 15.7039)
##AUDIT TRAIL= $$ (NUMBER, WHEN, WHO, WHERE, WHAT)
$$ ##TITLE= Audit trail, XWIN-NMR		Version 3.5
$$ ##JCAMPDX= 5.01
$$ ##ORIGIN= Bruker BioSpin GmbH
$$ ##OWNER= she
$$ F:/spectra/data/she/nmr/H-F/1/audita.txt
$$ ##AUDIT TRAIL=  $$ (NUMBER, WHEN, WHO, WHERE, WHAT)
(   1,<2019-08-30 13:44:14.81 +0400>,<she>,<DPX200>,
      <created by zg, POWCHK disabled, PULCHK disabled
       configuration hash MD5:
       00 E9 B6 7A A2 85 ED C7 34 08 36 98 17 FE 4E 26
       data hash MD5: 16K
       94 67 68 F3 5D E8 C3 A5 C9 DB B8 2D 91 D1 51 1C>)
$$ ##END=
$$ 
$$ hash MD5
$$ 84 5E DB F8 48 9E 12 81 96 91 85 06 F0 44 11 27
##$RELAX= 
##$RELAX= 
##$RELAX= 
##$RELAX= 
##$RELAX= 
##$RELAX= 
$$ Bruker specific parameters
$$ --------------------------
##$DU= <F:/spectra>
##$EXPNO= 1
##$NAME= <H-F>
##$PROCNO= 1
##$TYPE= <nmr>
##$USER= <she>
##$AMP= (0..31)
100 100 100 100 100 100 100 100 100 100 100 100 100 100 100 100 100 100 
100 100 100 100 100 100 100 100 100 100 100 100 100 100 
##$AQSEQ= 0
##$AQ_mod= 1
##$AUNM= <au_zg>
##$AUTOPOS= <>
##$BF1= 200.13
##$BF2= 200.13
##$BF3= 200.13
##$BF4= 200.13
##$BF5= 200.13
##$BF6= 200.13
##$BF7= 200.13
##$BF8= 200.13
##$BYTORDA= 1
##$CFDGTYP= 0
##$CFRGTYP= 5
##$CHEMSTR= <none>
##$CNST= (0..31)
1 1 145 1 1 1 1 1 1 1 1 1 1 1 1 1 1 1 1 1 1 1 1 1 1 1 1 1 1 1 1 1 
##$CPDPRG= <>
##$CPDPRG1= <>
##$CPDPRG2= <>
##$CPDPRG3= <>
##$CPDPRG4= <mlev>
##$CPDPRG5= <mlev>
##$CPDPRG6= <mlev>
##$CPDPRG7= <mlev>
##$CPDPRG8= <mlev>
##$CPDPRGB= <>
##$CPDPRGT= <>
##$D= (0..31)
0 1.2 0 0 0 0 0 0 0 0 0 0.03 0 0 0 0 0 0 0 0 0 0 0 0 0 0 0 0 0 0 0 0 
##$DATE= 1567158254
##$DBL= (0..7)
120 120 120 120 120 120 120 120 
##$DBP= (0..7)
150 150 150 150 150 150 150 150 
##$DBP07= 0
##$DBPNAM0= <>
##$DBPNAM1= <>
##$DBPNAM2= <>
##$DBPNAM3= <>
##$DBPNAM4= <>
##$DBPNAM5= <>
##$DBPNAM6= <>
##$DBPNAM7= <>
##$DBPOAL= (0..7)
0.5 0.5 0.5 0.5 0.5 0.5 0.5 0.5 
##$DBPOFFS= (0..7)
0 0 0 0 0 0 0 0 
##$DE= 6
##$DECBNUC= <off>
##$DECIM= 24
##$DECNUC= <off>
##$DECSTAT= 4
##$DIGMOD= 1
##$DIGTYP= 9
##$DL= (0..7)
0 120 120 120 120 120 120 120 
##$DP= (0..7)
150 150 150 150 150 150 150 150 
##$DP07= 0
##$DPNAME0= <>
##$DPNAME1= <>
##$DPNAME2= <>
##$DPNAME3= <>
##$DPNAME4= <>
##$DPNAME5= <>
##$DPNAME6= <>
##$DPNAME7= <>
##$DPOAL= (0..7)
0.5 0.5 0.5 0.5 0.5 0.5 0.5 0.5 
##$DPOFFS= (0..7)
0 0 0 0 0 0 0 0 
##$DQDMODE= 0
##$DR= 18
##$DS= 0
##$DSLIST= <SSSSSSSSSSSSSSS>
##$DSPFIRM= 0
$$ [...]
##$SUBNAM2= <"">
##$SUBNAM3= <"">
##$SUBNAM4= <"">
##$SUBNAM5= <"">
##$SUBNAM6= <"">
##$SUBNAM7= <"">
##$SUBNAM8= <"">
##$SUBNAM9= <"">
##$SW= 24.9336996594482
##$SWIBOX= (0..15)
0 0 2 0 0 0 0 0 0 0 0 0 0 0 0 0 
##$SW_h= 4990.01996007984
##$TD= 16384
##$TD0= 1
##$TE= 0
##$TE2= 300
##$TE3= 300
##$TEG= 300
##$TL= (0..7)
0 120 120 120 120 120 120 120 
##$TP= (0..7)
150 150 150 150 150 150 150 150 
##$TP07= 0
##$TPNAME0= <>
##$TPNAME1= <>
##$TPNAME2= <>
##$TPNAME3= <>
##$TPNAME4= <>
##$TPNAME5= <>
##$TPNAME6= <>
##$TPNAME7= <>
##$TPOAL= (0..7)
0.5 0.5 0.5 0.5 0.5 0.5 0.5 0.5 
##$TPOFFS= (0..7)
0 0 0 0 0 0 0 0 
##$TUNHIN= 0
##$TUNHOUT= 0
##$TUNXOUT= 0
##$USERA1= <user>
##$USERA2= <user>
##$USERA3= <user>
##$USERA4= <user>
##$USERA5= <user>
##$V9= 5
##$VALIST= <valist>
##$VCLIST= <CCCCCCCCCCCCCCC>
##$VD= 0
##$VDLIST= <DDDDDDDDDDDDDDD>
##$VPLIST= <PPPPPPPPPPPPPPP>
##$VTLIST= <TTTTTTTTTTTTTTT>
##$WBST= 1024
##$WBSW= 4
##$XGAIN= (0..3)
0 0 0 0 
##$XL= 0
##$YL= 0
##$YMAX_a= 355963
##$YMIN_a= -528963
##$ZGOPTNS= <>
##$ZL1= 120
##$ZL2= 120
##$ZL3= 120
##$ZL4= 120
##$ABSF1= 10
##$ABSF2= 0
##$ABSG= 5
##$ABSL= 3
##$ALPHA= 0
##$AQORDER= 0
##$ASSFAC= 0
##$ASSFACI= 0
##$ASSFACX= 0
##$ASSWID= 0
##$AUNMP= <proc_1d>
##$AZFE= 0.1
##$AZFW= 0.1
##$BCFW= 1
##$BC_mod= 2
##$BYTORDP= 1
##$COROFFS= 0
##$CY= 11.3945322036743
##$DATMOD= 1
##$DC= 2
##$DFILT= <>
##$DTYPP= 0
##$F1P= 20.1720416913024
##$F2P= 0.152960286110954
##$FCOR= 0.5
##$FTSIZE= 0
##$FT_mod= 4
##$GAMMA= 1
##$GB= 0.15
##$INTBC= 1
##$INTSCL= 1
##$ISEN= 128
##$LB= 0.24
##$LEV0= 0
##$LPBIN= 0
##$MAXI= 10000
##$MC2= 0
##$MEAN= 0
##$ME_mod= 0
##$MI= 1.114404
##$NCOEF= 0
##$NC_proc= 0
##$NLEV= 6
##$NOISF1= 3.799351
##$NOISF2= 2.8
##$NSP= 1
##$NTH_PI= 0
##$NZP= 0
##$OFFSET= 15.70392
##$PC= 1
##$PHC0= -9213.091
##$PHC1= 15.40096
##$PH_mod= 1
##$PKNL= yes
##$PPARMOD= 0
##$PSCAL= 0
##$PSIGN= 0
##$REVERSE= no
##$SF= 200.130013532006
##$SI= 16384
##$SIGF1= 3
##$SIGF2= 2
##$SINO= 400
##$SIOLD= 16384
##$SREGLST= <1H.CDCl3>
##$SSB= 0
##$STSI= 0
##$STSR= 0
##$SW_p= 3612.71676300578
##$SYMM= 0
##$S_DEV= 0
##$TDeff= 0
##$TDoff= 0
##$TI= <>
##$TILT= no
##$TM1= 0
##$TM2= 0
##$TOPLEV= 0
##$USERP1= <user>
##$USERP2= <user>
##$USERP3= <user>
##$USERP4= <user>
##$USERP5= <user>
##$WDW= 1
##$XDIM= 8192
##$YMAX_p= 0
##$YMIN_p= 0
$$ End of Bruker specific parameters
$$ ---------------------------------
##NTUPLES= NMR FID
##VAR_NAME=  TIME,          FID/REAL,        FID/IMAG
##SYMBOL=    X,             R,               I
##VAR_TYPE=  INDEPENDENT,   DEPENDENT,       DEPENDENT
##VAR_FORM=  AFFN,          ASDF,            ASDF
##VAR_DIM=   8192,          8192,            8192
##UNITS=     SECONDS,       ARBITRARY UNITS, ARBITRARY UNITS
##FACTOR=    0.0002004,     1,               1
##FIRST=     0,             0,               0
##LAST=      1.6414764,     0,               0
##MIN=       0,             -528963,         0
##MAX=       1.6414764,     355963,          0
$$ Real data points
##PAGE= N=1
##DATA TABLE= (X++(R..R)), XYDATA
0 0 0 0 0 -8 8 -8 8 -16 16 -18 26 -33 40 -50 64 -80 91 -112 132 -154 181 -213 245 -283 326 -375 424 -485
28 -485 549 -619 697 -786 880 -983 1098 -1224 1363 -1513 1679 -1861 2063 -2282 2527 -2798
44 -2798 3099 -3440 3822 -4254 4755 -5333 6015 -6831 7833 -9093 10733 -12975 16225
57 16225 -21402 30969 -54651 237884 208210 -295194 -77837 262549 355963 81211 -110609
68 -110609 -67674 149500 142906 -78906 -220084 -57772 122204 66817 -179706 -262853 -85277
79 -85277 81833 -33912 -206198 -157714 21393 48686 -82795 -187381 -99795 85357 119368
90 119368 -46321 -128728 -3215 116650 59445 -53166 -37205 111935 175793 7523 -174348
101 -174348 -71375 179692 218456 8776 -175493 -137583 55646 147396 15892 -122535
111 -122535 -67310 31647 -2001 -79070 -78619 -12027 52819 23785 -92851 -110344 24137 80704
123 80704 -33297 -95232 13699 114858 49200 -88537 -100147 35160 123317 48865 -55053
134 -55053 -50808 17354 43923 -17921 -96454 -40172 112013 93709 -125647 -217659 -43050 136574
146 136574 98345 -77451 -170519 -70979 82819 76204 -43545 -65829 22278 71357 29168
157 29168 -32548 -14778 95788 143727 30189 -59966 35632 153995 111308 -4304 -25521
168 -25521 68499 157525 101254 -51434 -81428 56210 146346 67281 -58958 -80728 5215
179 5215 61107 -16036 -104898 -41831 72861 34628 -116469 -175773 -68229 80034 79557 -78405
191 -78405 -170977 -76598 40148 30299 -37793 -66080 -35052 23448 24542 -46826 -55257 35631
203 35631 69223 -5134 -48892 2576 63023 49741 -26036 -57418 20919 94542 44479 -44581
215 -44581 -54140 -2808 46790 52130 -8257 -59941 -24431 21281 -2748 -26949 866 17844
227 17844 -9149 -47311 -56821 -12174 42515 28436 -30126 -51456 -35841 -10598 23714 26638
239 26638 -13017 -26405 -7805 -12917 -11524 24678 26722 -19132 -29513 8331 35233 24276 -19238
252 -19238 -46787 -1965 60414 44083 -12272 -29125 -16430 6615 35807 31430 1344 2344
264 2344 12458 -7737 -11235 25447 47610 30660 -2716 -27050 -3947 49483 49585 2846 -7793
277 -7793 8777 5885 7452 23800 19922 7359 384 -18680 -21424 18005 36240 -1747 -39599
290 -39599 -37750 -4075 31474 13562 -47444 -52824 3887 25540 17 -17211 -29538 -34262 -3413
303 -3413 23727 12160 -521 -4244 -22377 -22905 9659 30913 24271 4401 -20045 -16417 19508
316 19508 24748 -2163 4068 22441 -1937 -25693 -6496 16443 18905 3140 -31464 -40585 7357
329 7357 40387 3688 -47040 -52575 -12829 38453 31596 -35804 -55722 2622 31398 -1968 -18610
342 -18610 811 15868 11756 -8681 -16077 23487 56794 17353 -36550 -22603 32388 65160
354 65160 39782 -27810 -47776 18678 63922 17063 -27664 -5148 23183 12668 -17263 -31157
366 -31157 1049 44093 16437 -52756 -51650 14430 48193 9807 -56160 -67435 10640 71236
378 71236 12710 -70506 -50305 19920 33887 -1396 -29638 -16307 23078 19334 -32985 -40306
390 -40306 20731 52730 13174 -41104 -47955 11635 69821 28502 -60132 -51546 33261 57466
402 57466 5074 -35570 -21684 21393 33261 -8906 -30229 16312 48181 6489 -41435 -29864
414 -29864 25944 64806 25195 -56362 -51478 40372 69278 -890 -53092 -27275 25513 40405
426 40405 -1606 -42365 -14015 30792 6774 -41298 -31604 16336 37244 1343 -61489 -59509
438 -59509 25275 65110 -5196 -68748 -36629 26726 39065 -3154 -42387 -18236 36970 30949
450 30949 -18999 -18787 25343 39085 10287 -24191 -16460 46395 79626 13239 -56078 -16932 61476
463 61476 66252 6465 -36894 -14027 42469 43505 -15775 -35313 7539 27296 -2728 -34699
475 -34699 -34544 2772 30981 -16558 -83192 -54323 29257 34371 -35606 -79425 -52034 7044 23611
488 23611 -26144 -60829 -23713 16553 924 -28776 -28647 -284 27543 10524 -33801 -20145
500 -20145 45070 50819 -9690 -36558 1678 50993 57644 9979 -32196 -3714 44626 34655 -1552
513 -1552 -2282 16628 22679 7436 -19309 -14066 32402 40152 -19174 -52185 -9768 40156 34159
526 34159 -17307 -54265 -21777 38929 33256 -21158 -32541 -1513 16521 11495 -7507 -20226
538 -20226 4984 33041 6556 -30903 -11754 26619 23936 -8909 -28376 -7582 32694 30832
550 30832 -14350 -30829 -3497 14302 14731 12357 -1111 -6698 6998 3080 -12810 11278 44371
563 44371 22649 -19867 -22529 9160 39413 35563 -4362 -22316 9475 33839 17373 -4900
575 -4900 -12650 -5089 17052 19655 -12761 -25603 -1286 4361 -16702 -22102 -13142 -8584 -10286 -26022
589 -26022 -41405 -24306 1012 -8621 -28662 -32009 -29647 -19610 -635 -2066 -17874 -17858 -14832 -18364
603 -18364 -3551 19749 16836 -485 -12687 -15293 6737 37193 27819 -1361 -183 13379 13336
616 13336 17322 19256 3615 2869 23334 25399 7400 -1991 -3488 4054 20252 21703 5886 -2138
630 -2138 -4853 -8095 3846 13876 701 -1960 12656 -865 -27798 -16392 13251 19160 7123
643 7123 -13465 -30958 -17094 14022 18774 -223 -14442 -17056 -4060 11990 3791 -7266 6763
656 6763 10516 -9491 -7732 15545 16814 4268 2139 2939 11367 24455 10114 -17478 -6847 27205
670 27205 34984 14206 -14567 -26882 -512 28779 13575 -15298 -10345 2488 -7130 -22704 -26331
683 -26331 -9731 17630 12009 -33117 -53814 -25068 4088 8399 -3887 -24803 -26981 -4048 1209
696 1209 -17928 -11870 11781 7858 -11223 -12237 993 11612 7481 -11228 -9198 19265 22644
709 22644 -9684 -27747 -15146 10252 29843 12347 -36232 -41700 5823 23330 -6856 -21117
721 -21117 -6085 2292 -5455 -19118 -18086 11524 33654 10656 -23458 -21527 6690 32060 32218
734 32218 5463 -4674 20602 27248 -1508 -4517 28932 41355 18598 -8263 -14077 10488 33664
747 33664 10021 -26792 -12111 26212 24047 -17559 -50434 -33115 24093 46893 -7504 -60624
759 -60624 -37006 14013 23619 -3065 -24130 -10491 22866 18084 -23876 -24872 25462 48795 18991
772 18991 -16435 -20791 11687 45295 27425 -15776 -12072 24448 22480 -13157 -24822 1275 29474
785 29474 13512 -35733 -47761 -2614 23229 -7377 -40503 -33284 1296 21562 -9872 -62733
797 -62733 -46653 30507 53112 -6321 -55678 -37992 15499 43825 16100 -21215 -8132 26315
809 26315 19622 -10951 -13639 12317 38824 31172 -13442 -35802 1217 33744 11051 -17599 -11777
822 -11777 3401 2888 -12743 -27327 -12662 15461 6688 -27088 -29025 -3862 7544 -1709 -17507
835 -17507 -16295 13241 28617 -5581 -35292 -7188 37219 40823 8155 -22153 -13399 27258 41185
848 41185 12908 -1303 14283 17351 3420 -2649 2789 19033 30359 7482 -26272 -16318 16484
861 16484 16149 -7062 -13443 -97 12549 246 -29494 -26845 15123 30814 -2335 -28941 -19224
874 -19224 5948 19753 2310 -27104 -12601 31954 30052 -19976 -42564 -10515 34359 40011
886 40011 -4814 -42693 -20325 21897 19068 -8848 -17082 -6145 6753 4266 -19488 -26067 6481
899 6481 24625 -4930 -31095 -17832 7385 15940 4 -19673 -8225 19448 12425 -16759 -15527
912 -15527 10933 24677 16911 -6369 -19853 2527 29674 14507 -13375 -5789 16836 18468 -2940
925 -2940 -24561 -16086 20967 32346 -2994 -31827 -23223 -2431 10131 7909 -12219 -20265 -3493
938 -3493 2416 -13562 -15147 -198 5933 1606 -6643 -13393 -3769 11160 5610 -3904 4491 10094
952 10094 3900 3246 3857 766 10151 19560 7025 -3518 4499 9311 5637 5503 4268 2387 5661
967 5661 344 -9899 -2904 9732 4578 -2941 -5314 -14301 -13099 5553 10335 -3374 -9336 -9415 -10408
982 -10408 -1765 6864 467 -5533 -3442 -4652 -2854 2928 -3790 -7986 4764 9527 -3328 -7390
996 -7390 -3524 -5821 -1288 7243 948 -6757 -2337 -2358 -6164 -2678 -1003 -1839 5332 4458 -8712 -9009
1012 -9009 2955 5319 6068 9360 -679 -8702 4559 15626 8876 2977 1964 2274 9641 12622
1026 12622 2807 628 9948 7322 -724 1629 2604 1135 6613 3019 -11685 -7413 8191 2647
1040 2647 -11951 -11989 -3836 4381 3533 -13404 -22952 -4333 10998 1839 -8993 -9993 -5192 5339
1054 5339 6091 -11194 -12661 13046 21434 -1355 -17333 -7732 12806 23487 7033 -18021 -10116
1067 -10116 17639 18181 -3087 -13110 -5654 10046 17475 -2851 -23784 -6907 17575 6103 -17066
1080 -17066 -15862 1778 13389 3525 -20829 -21557 7654 18676 -4877 -21173 -11157 7243 16468
1093 16468 1382 -22184 -13832 16945 17231 -10071 -16536 2042 15710 9625 -11602 -17941 7689
1106 7689 26495 5462 -19003 -11816 8611 17173 7405 -12934 -14218 12838 21651 -4297 -18386
1119 -18386 -903 15584 12000 -2786 -10927 2725 20626 7415 -14896 -5805 15857 17589 4171
1132 4171 -8768 -8812 11828 23445 1287 -15947 1783 20596 10688 -7038 -9904 4104 19315
1145 19315 8628 -15947 -10781 14572 15952 -4931 -16801 -10079 8445 17866 -2873 -26319 -10365
1158 -10365 15294 6846 -16119 -18514 -2969 11766 4457 -20429 -22677 4800 14396 -7727 -20674
1171 -20674 -8429 7897 12869 -3886 -24179 -11468 19732 17069 -11488 -17638 1336 15163
1183 15163 8789 -11167 -15953 8469 22960 -1116 -22750 -9437 11698 13740 -2994 -21143
1195 -21143 -13850 14425 15792 -15696 -27976 -5054 14576 8550 -13316 -22962 -2063 19919 4136
1208 4136 -21828 -11939 12972 16010 1960 -11148 -8340 15878 26572 1206 -17813 2415 25625
1221 25625 19495 -593 -10779 1630 22367 17071 -9052 -10041 12129 16139 -343 -11750 -8804
1234 -8804 6131 16625 786 -20439 -9394 12740 8540 -9502 -13585 -2055 13867 11731 -10158
1247 -10158 -15199 7737 18224 3947 -4456 1148 9420 14944 5695 -9561 -795 22126 17473
1260 17473 -5624 -10662 1237 11563 10565 -5888 -17278 -1331 11750 -3436 -18295 -11568 -1661
1273 -1661 -1230 -7395 -18649 -18060 -421 3532 -13895 -20392 -7863 814 -560 -7914 -13416 -2805
1287 -2805 10762 1688 -13667 -5135 8849 7894 2833 -640 -1951 6113 9804 -3165 -7853 7024
1301 7024 14231 4774 -6645 -11168 -3263 11770 8034 -10761 -10410 3487 2270 -6884 -6089 -4105
1315 -4105 35 7266 823 -11506 -5331 7160 4992 231 852 2285 6445 7864 74 -174 11581
1330 11581 12041 1827 2547 6702 4960 6815 7311 1482 2533 9215 2472 -5894 472 6453 5134
1345 5134 1964 -5874 -10566 796 9622 473 -5788 -1916 -2968 -3044 2409 475 -2317 4204 5860
1360 5860 -1085 -1705 584 -1147 5026 11731 4982 -2349 325 -41 735 8618 6961 -4025 -1767
1375 -1767 4407 -662 -6461 -4967 -2273 2026 3227 -8160 -16265 -7887 -1572 -2850 -3454 -7859 -13739
1390 -13739 -7911 -1564 -8098 -8661 626 -1916 -10372 -7114 -1287 -243 1306 -1101 -4674 1458 5919
1405 5919 -2153 -5204 4089 9327 7483 3162 -7031 -7182 10957 16605 359 -6817 1602 5839
1419 5839 3655 -1568 -6348 1544 15050 6592 -11135 -11048 937 7246 8027 1238 -7669 -1926 5741
1434 5741 -1531 -7304 4190 11764 4752 -3429 -6718 -1269 10664 9111 -5058 -3096 9825 7812
1448 7812 -3359 -5504 -844 9256 15142 677 -16953 -6455 13013 10614 -3845 -8548 -2462
1461 -2462 7956 5902 -10192 -12501 7101 15167 -283 -12177 -9804 788 12339 8525 -8459
1474 -8459 -8337 7816 6281 -8007 -6718 6139 13710 6932 -10143 -16400 2890 16406 2705
1487 2705 -10797 -5198 4862 5343 -3892 -16443 -9782 14253 15758 -11421 -24325 -8623 8101
1500 8101 8477 -4897 -15709 -4881 11120 1272 -17816 -11060 7675 12293 2465 -11524 -14249
1513 -14249 3664 16453 2102 -11078 -277 11004 4658 -5832 -8023 4065 19015 9296
1525 9296 -14586 -12495 10308 16077 2717 -8066 -6741 6076 13838 -1737 -18064 -3177 19381
1538 19381 13988 -7710 -17099 -6525 12903 15504 -4457 -12971 3978 12017 -1338 -10301 -3860
1551 -3860 7799 14997 3999 -15599 -11912 9502 12218 -3123 -7714 373 6905 3132 -10659
1564 -10659 -13851 6763 18278 57 -17309 -9813 4785 9932 2092 -11716 -9266 11274 12601
1577 12601 -9250 -16404 837 15570 12233 -4788 -16727 -2758 17299 9949 -8300 -6198 6289
1590 6289 8093 1204 -7272 -5898 9619 15380 -3389 -16583 -3657 9222 6579 -3395 -8999 -2026
1604 -2026 9625 1080 -17319 -10691 11571 13312 -3288 -15469 -12224 3998 14801 459 -16046
1617 -16046 -4914 13419 8437 -8408 -14186 -2440 16542 16813 -7602 -18227 518 14428 6424
1630 6424 -3740 -5197 1184 9798 4492 -10682 -8009 9857 12110 -1938 -9495 -5532 4191 9264
1644 9264 -877 -10455 -335 9062 -26 -8918 -3112 4008 6930 3156 -8581 -10121 5054 10942
1658 10942 -834 -6696 -1319 4060 4582 -2018 -9955 -1757 12042 6447 -8523 -8645 -1117 2766
1672 2766 3823 -246 -6669 -1788 3923 -3730 -8858 -1278 4241 2961 -376 -6588 -6490 3529 4982
1687 4982 -3999 -2530 5342 2640 -2008 -1426 -745 3525 8867 2882 -5396 104 6979 4112 882
1702 882 245 787 5492 6324 -3150 -5855 4876 7750 -321 -2840 -1760 -1319 2511 3139 -3429 -3578
1718 -3578 2501 -108 -5062 -2490 195 1764 3852 -2500 -8469 -932 6129 236 -2853 1061 822
1733 822 118 1801 -2159 -3561 4550 6633 -601 -2776 -1114 -169 3221 3597 -2820 -2227 4794 1807
1749 1807 -4651 -2346 -247 -612 2963 1205 -6407 -4878 2163 360 -2336 -1603 -3314 -2167 2288
1764 2288 -1778 -6192 -138 3554 -1652 -3352 -1049 -1482 1316 4669 -1902 -6286 740 4722 1571
1779 1571 -761 -2278 -1352 5310 4760 -5605 -5885 4033 5529 531 -1838 -4400 -2654 5554 4013
1794 4013 -6387 -4725 4329 4506 -850 -5570 -6253 2415 10050 1402 -8279 -1790 4864 3345 1753
1809 1753 -832 -2046 5681 9509 -43 -5163 3824 8916 4532 624 -915 2449 8274 4613 -5203
1824 -5203 -1737 7894 5662 -821 -2604 -2633 1369 5681 -1618 -9630 -2095 6291 406 -6608 -5700 -1876
1840 -1876 2698 1576 -8123 -8286 4089 6265 -3206 -6392 -3500 824 5729 2220 -6324 -2780 6752
1855 6752 3638 -3842 -2621 1956 4336 3559 -3509 -6607 2559 6692 -3347 -8037 -239 3490 680
1870 680 -3507 -8130 -5132 4548 3061 -8224 -7909 1504 3662 -1102 -6834 -7112 3350 10245 -1845
1885 -1845 -11495 -1594 8636 5806 -1346 -5540 -2585 8660 10785 -3084 -8926 2413 10140 3775
1899 3775 -3965 -5606 1798 10099 2294 -11089 -6336 7379 6045 -3470 -7066 -4555 3910 7732
1913 7732 -3742 -12350 -1089 10695 4364 -5851 -6120 756 8753 6009 -6296 -5640 9557 12605
1927 12605 -216 -6584 -863 8492 12124 3013 -8832 -1876 12150 8502 -4040 -6131 954 7895
1941 7895 6775 -5740 -11090 1673 9663 -755 -10131 -5036 2118 4272 -1547 -10250 -8263 4482
1955 4482 5840 -6591 -10094 -2497 4029 3846 -3783 -10278 -1823 8736 1917 -8339 -3344 4820
1969 4820 3751 -265 -5034 -4126 5342 9131 -1780 -8857 -1444 6201 4277 -1831 -5868 -1240 7461
1984 7461 2712 -8071 -5435 4162 4326 -856 -3362 -3979 1268 5696 -1684 -8363 -222 7662 2514
1999 2514 -4272 -5304 -1289 6011 5529 -4245 -5472 3992 5903 -1977 -3730 -132 3655 5905 153
2014 153 -7588 -1251 8575 4516 -4519 -4314 110 4347 4718 -3064 -6865 2361 7781 -951 -6674 -1520
2030 -1520 4056 4733 1110 -5114 -3100 6241 5782 -2972 -3335 2753 6173 5039 -1793 -7292 1033 11489
2046 11489 5635 -4457 -2269 3131 2901 2011 -1033 -2770 3391 5806 -2556 -7359 -2091 3222 2672
2061 2672 -1452 -6893 -5610 2269 1520 -7109 -5926 256 246 -2144 -3714 -5623 -2535 3319 94 -5753
2077 -5753 -2437 1667 296 -1168 -1573 -975 3907 5030 -2997 -5399 2411 5506 3019 841 -1845
2092 -1845 -1712 3359 4608 -1413 -841 3277 1448 -1322 -1296 -2223 114 5459 1989 -5211 -3241 1082
2108 1082 -171 -434 860 -1016 -821 1850 -768 -3684 -176 2000 692 2327 187 -3430 -641
2123 -641 1904 -898 636 4255 807 -3417 -1030 -433 -202 3161 2682 -2590 -2943 723 428 871 1402
2140 1402 -1166 -1115 2473 -273 -2909 1722 3616 456 662 416 -2205 753 5413 1835 -1280 1523
2156 1523 1679 13 908 405 -309 3172 3789 -2525 -3659 -36 -421 123 2007 -671 -3079 -1319 -2539
2173 -2539 -4821 -495 3288 -389 -3553 -4749 -4936 -216 3537 -1263 -4326 301 1168 -2375 -1991 -181
2189 -181 246 3581 3592 -3021 -3881 2903 4166 1223 450 -303 1266 4327 546 -4229 840 6700 2754
2206 2754 -1886 -1848 -1701 866 4423 977 -3588 357 2061 -2398 -2788 835 2811 3077 -780 -7371
2222 -7371 -3763 5475 4739 -2005 -2752 -47 603 1609 -874 -4305 1035 6879 1511 -5884 -3918 78
2238 78 2881 3080 -2074 -4716 1531 3221 -3972 -5333 950 3427 2948 -493 -6150 -4332 3679 4276
2254 4276 -1916 -2010 1708 1263 -274 -1633 -1557 4511 7794 -596 -6800 253 6164 4621 1455 -2287
2270 -2287 -2086 3815 4914 -2710 -4412 2470 4749 739 -3451 -5973 -1916 5099 2419 -5939 -4129
2285 -4129 1745 85 -3853 -3718 -1809 2642 4542 -2623 -8098 -1720 4486 3240 602 -615 -499
2300 -499 2731 1917 -3187 -594 7837 6377 -2330 -3782 -701 3273 6349 1796 -4910 -1187 5698
2315 5698 2207 -4523 -3335 511 4203 3165 -4300 -7230 773 5704 -603 -4010 -918 1038 1754
2330 1754 26 -4301 -1781 6518 4997 -3349 -4410 143 3319 4334 1028 -3921 -330 3825 -1062
2345 -1062 -5151 285 4051 1550 -2579 -6073 -5169 2505 4860 -3738 -7071 -2085 1293 -66 -3201
2360 -3201 -5695 -1819 6065 3195 -6445 -5142 2160 3762 1885 268 -1425 2058 5457 695 -3834
2375 -3834 1532 6815 4745 744 -3136 -2758 4023 6635 -755 -3893 1272 1900 -1572 -1632 -1419 -783
2391 -783 2136 -117 -6785 -3777 3138 1956 -1783 -2918 -2819 653 3357 -1072 -4927 722 4871 1013
2407 1013 -1717 -1053 -410 2809 4514 -77 -2036 2325 2619 -1512 -1434 934 2395 3437 308 -5885
2423 -5885 -3066 4192 2704 -1583 -1081 -1127 -890 770 -862 -2502 1400 3497 -1186 -2832 56 748
2439 748 1873 1892 -2266 -2647 3820 3915 -2463 -2456 1082 1741 1742 492 -3253 -2064 2681 1267 -2763 -1522
2457 -1522 -705 -845 -471 -1889 -3696 1225 3071 -3028 -5925 -1232 1150 859 672 -2518 -4320 901
2473 901 2568 -945 -1687 1342 702 521 156 -1992 24 5287 2581 -2545 -391 2660 1539 1041
2489 1041 -88 -1852 1980 5535 1294 -3248 -30 1847 1886 1897 -202 -2194 1697 2971 -1857 -1988
2505 -1988 2824 2392 -800 -1372 -2495 -818 3970 1640 -4350 -3182 838 1019 468 -1319 -4004 -676
2521 -676 3246 -755 -4394 1 2719 -23 -838 -1330 -1364 2447 3628 -1593 -3100 2329 3746 1207
2537 1207 -317 -2174 -402 5098 3800 -2893 -1995 2341 934 -498 609 -597 335 2111 -1044
2552 -1044 -4606 203 3466 625 -2040 -2535 -2023 1576 2732 -3127 -4402 1540 2296 -1351 -1320 -456
2568 -456 -623 1619 685 -3531 -1215 4127 1196 -2981 -1986 -43 1743 2550 -1750 -5177 353 4497
2584 4497 -33 -3489 -1728 -40 1011 1234 -2447 -2652 2680 2314 -3206 -2205 1672 2844 3038 -225
2600 -225 -4214 131 6780 3105 -2861 -768 3206 3241 2394 -755 -2595 2617 5518 -308 -2887 647
2616 647 2623 1369 -706 -4215 -2037 4628 3216 -5582 -5527 807 2025 276 -2496 -4684 -1752 3404
2632 3404 380 -5040 -2385 2525 1370 -927 -2670 -2127 3571 4639 -2713 -5421 1869 5239 2210
2647 2210 -1092 -2554 -1028 4529 3828 -3356 -3445 2561 3253 51 -1831 -2204 802 4342 -315 -5023
2663 -5023 -822 4679 1287 -3142 -3062 -1108 2896 4207 -1827 -5156 457 3341 35 -1284 -1441 -775
2679 -775 2412 764 -4524 -2304 3925 1951 -3503 -2741 -254 1395 2249 -1778 -5023 -59 4171 622
2695 622 -2904 -1701 -445 1513 2065 -2218 -3416 2963 3540 -2281 -2454 1958 2614 1768 -182 -2683
2711 -2683 -301 5652 3577 -2590 -1654 1274 1979 2582 435 -2278 1003 3748 -1156 -3138 1454 2866
2727 2866 494 -1138 -2515 -1787 2645 1991 -3688 -3367 1460 1921 -406 -2073 -3641 -1149 3244 847
2743 847 -4164 -1659 2383 -225 -1721 -1094 -799 1901 2938 -2599 -4637 1388 4185 1075 -886 -2044
2759 -2044 -1318 3026 3332 -2413 -2612 2675 2341 -1203 -859 150 1222 2804 -230 -3724 331 4305
2775 4305 1095 -1598 -1303 -144 2072 3368 -1837 -4642 1553 4399 -259 -1705 -1219 -813 1332 1133
2791 1133 -2129 -1520 2875 1129 -3428 -2715 -377 1124 2812 -674 -5496 -2263 3221 928 -2246
2806 -2246 -782 -486 -74 1663 -979 -2700 1049 2947 -699 -1292 884 760 1109 1230 -1376 -909 3849
2823 3849 2936 -2297 -1187 1232 1350 2255 1105 -2463 -1136 2606 317 -1175 960 1072 -585 -462
2839 -462 -1222 -2412 1992 3459 -2043 -4055 -482 522 691 879 -1456 -2442 930 787 -2192 -1347 899
2856 899 111 106 240 -2335 -1157 2094 -337 -2908 709 2367 -490 -826 -1216 -1697 1843 3421 -152
2873 -152 -2647 -11 651 290 1810 675 -791 1834 1237 -2344 13 3635 1983 -621 -314 -1039
2889 -1039 374 3448 1260 -2616 1 1858 -36 -323 -162 -1359 359 2176 -1402 -3351 797
2904 797 1056 -1387 -651 -252 -731 440 -279 -3619 -2104 2756 2044 -1042 -1466 -2213 -1353 2660 1862 -1840
2922 -1840 -363 2082 -1064 -1804 886 781 1663 2430 -1526 -3143 1203 3130 315 -566 161 -628 2023
2939 2023 1828 -2185 -1805 2936 2358 -867 -756 -328 -358 1878 1054 -1924 173 2321 -491 -2859 -273
2956 -273 509 1597 1591 -2462 -4583 64 2922 -434 -1839 -689 -1544 -963 560 -1754 -1562 2173 852
2973 852 -2784 -2092 157 218 1777 758 -2428 -442 3131 450 -2409 285 1893 1298 1815 -309
2989 -309 -2378 724 3252 402 -82 1486 351 -110 312 -842 -352 3873 2021 -3163 -2354 1284
3005 1284 1072 1383 467 -2317 -1369 1788 -44 -1759 882 1676 -511 -459 -771 -1632 1236 2447 -1475
3022 -1475 -2488 1292 1217 -1238 -690 -555 -769 2021 834 -3303 -2242 955 122 -294 416 -1007 -894
3039 -894 1239 -1334 -2684 1686 3488 -155 -1832 -1278 -508 2324 3666 -454 -1873 1716 1992 -361
3055 -361 859 986 589 2316 1184 -2793 -1302 3157 846 -1916 -388 142 -235 571 -1393 -3501
3071 -3501 175 2522 -767 -2762 -1644 -1093 114 1475 -1500 -3101 1126 1148 -2583 -1473 1490 1280
3087 1280 977 -691 -3301 -683 3997 2115 -1354 -882 -311 258 1966 702 -2542 707 3281 -617
3103 -617 -2302 377 969 512 1030 -720 -1676 1589 1950 -1753 -1761 1382 1324 1477 351 -2685 -1437 3153
3121 3153 2063 -1511 -400 1017 -129 32 33 -1329 930 2239 -1529 -3514 4 1537 210 0
3137 0 -2471 -3287 1200 2068 -2243 -2394 659 248 -635 34 -1631 -1207 2129 1054 -2168 -330 1674
3154 1674 179 1 818 -601 1403 3381 -152 -3214 704 2560 1233 500 6 -1069 516 1560
3170 1560 -918 -763 2147 906 -1624 -907 -730 -287 2374 393 -3538 -1218 2293 120 -1360 -790
3186 -790 -1196 137 1749 -717 -2866 8 1416 -979 -923 -98 -688 243 1043 -1949 -1911 2203 1698 -1937
3204 -1937 -1547 -180 83 1630 960 -2536 -1003 2084 695 -740 633 864 216 1440 -387 -1700
3220 -1700 2490 3516 -294 -1638 537 1195 1776 1428 -1387 -1556 2455 2161 -1725 -1285 624 286 1224
3237 1224 543 -2071 -554 2297 -221 -2995 -175 1053 16 62 -1410 -2726 927 2738 -776 -2139
3253 -2139 -327 -13 233 1041 -946 -1515 1837 1411 -2112 -982 2020 1136 -343 -387 -982 749 3096
3270 3096 646 -2374 218 1935 589 696 -496 -1436 1400 3209 -691 -1986 1293 1717 -480 -93
3286 -93 -145 -323 2137 979 -2829 -1585 2132 1447 -439 -893 -1976 -740 2197 239 -2899 -464 1439
3303 1439 -785 -1905 -339 -843 174 808 -1985 -2500 1618 1653 -1651 -1369 -512 -360 1890 990 -2210
3320 -2210 -1211 2314 1328 -1199 -449 496 661 2185 154 -1429 1075 3218 83 -1385 453 1326
3336 1326 1895 1625 -1355 -2332 2046 2862 -517 -1271 396 379 437 637 -1820 -879 2543 492 -2439 -893
3354 -893 569 345 531 -1187 -2534 172 2998 -612 -2890 -867 500 326 526 -1158 -2158 1026
3370 1026 1952 -1547 -1583 1194 1183 131 -385 -1954 -638 3217 1247 -2931 -897 1473 1491 788 -101
3387 -101 -1620 401 2833 314 -1491 450 1594 546 615 -704 -1154 1624 2279 -1731 -2158 1540
3403 1540 1216 -174 -525 -1473 -855 2133 950 -3153 -1487 644 -309 -803 -143 -1307 -544 1448 -1478
3420 -1478 -3268 143 2009 -799 -1100 -1188 -869 786 1845 -1778 -1728 1456 1491 -623 -196 186 -311 1648
3438 1648 1622 -1861 -107 3286 779 -970 241 867 1011 2067 -102 -1897 1249 2594 365 -838
3454 -838 -127 -539 1113 1816 -1004 -1711 1495 1039 -1493 -701 779 268 751 -304 -2581 -879 2259
3471 2259 183 -1481 -634 -324 -168 854 -479 -2765 329 2011 -795 -1739 -19 -229 -263 386 -1007
3488 -1007 -884 1874 1369 -2230 -910 1375 898 1135 632 -1387 -359 2929 1571 -1374 109 1475
3504 1475 700 528 175 -687 1430 2555 -1093 -1636 846 1360 590 404 -1044 -1245 1498 1647 -2105
3521 -2105 -1849 1105 669 -248 -576 -1658 -1024 1746 223 -2359 -259 1452 -225 -965 -978 -1197 1510
3538 1510 2566 -992 -3055 302 1630 202 57 -477 -728 1051 1047 -1754 -641 2494 1339 -482
3554 -482 -234 -970 287 2376 538 -2210 445 2679 372 -803 -193 4 994 2198 -635 -1930
3570 -1930 846 1647 -455 -604 132 -450 671 223 -2583 -1420 2007 1113 -2663 -1429 -519 -189 1297
3587 1297 -159 -2586 -566 1486 -991 -1672 61 383 271 431 -1500 -2037 1365 2289 -1300 -1483 961
3604 961 843 838 187 -1855 -405 2893 1684 -1594 -663 1090 862 1227 498 -1243 892 2293 -510
3621 -510 -2274 890 2062 816 384 -1213 -1413 1863 2452 -824 -1783 681 492 -22 -252 -1303 -814
3638 -814 1941 348 -2785 -1125 1434 633 -571 -853 -1567 214 1786 -1500 -2974 284 1729 173
3654 173 -1210 -1209 -1421 1310 2222 -1420 -1333 1374 1017 -935 -932 95 911 2557 768 -2524 -635 2347
3672 2347 1074 273 89 -419 362 1872 -567 -1936 617 2206 -214 -859 -570 -282 763 1214 -1616
3689 -1616 -1505 1220 337 -1403 -1011 -282 -454 986 -97 -2801 -1426 1986 421 -1285 -509 50 -278
3706 -278 644 -630 -1436 1528 2202 -1078 -1370 -52 505 1114 1302 -619 -1204 1428 1556 -1132 31
3723 31 1346 651 760 358 -1265 -28 2345 583 -774 733 1460 -335 493 203 -516 1292 2225
3740 2225 -657 -1211 667 692 9 244 -342 -1000 1003 229 -2226 -379 1891 -9 -891 -820 -1351 -343
3758 -343 1795 -101 -2696 -242 566 -633 -511 -490 -1102 715 1331 -933 -1518 1089 847 -428 224
3775 224 232 -940 899 1089 -1304 -171 2441 944 -747 -32 29 232 1703 471 -1209 276 995
3792 995 -615 -571 663 -285 486 1025 -1425 -2085 775 1044 -1053 -729 256 -570 321 419 -1836 -718
3810 -718 1114 101 -1218 -518 -181 -966 789 265 -1832 25 1133 -557 -1207 429 213 522 886
3827 886 -702 -1616 700 2000 -43 -136 591 -267 413 1394 -321 -433 2064 847 -1105 -112 844 374
3845 374 1398 698 -1190 -48 1974 -83 -718 733 574 -32 942 -422 -1890 670 1662 -400 -698
3862 -698 142 -682 -358 36 -911 -1121 926 321 -1886 -1014 207 -482 584 -38 -1675 -1247 930 -405
3880 -405 -1397 95 -153 -656 102 2 -956 687 1430 -687 -799 798 240 153 1093 -44 -896 1371
3898 1371 1107 -1135 -380 1490 491 -140 396 -755 -398 1520 63 -1245 515 907 -336 9 -656
3915 -656 -1294 320 1665 -1020 -2127 125 402 -848 -387 -475 -717 964 479 -1889 -895 1109 81
3932 81 -743 88 -783 -478 1361 288 -1868 36 1697 311 -440 168 -419 652 1778 -547 -1259
3949 -1259 1211 1186 -413 440 289 53 1181 963 -1397 -608 2442 1289 -767 -165 28 -80 1421
3966 1421 383 -1877 -143 1486 -114 -858 -57 -662 76 998 -1163 -1927 542 1003 -1397 -1157 97
3983 97 -541 77 -109 -2187 -1400 1265 161 -1359 -435 131 -580 600 40 -1557 33 2205 -450
4000 -450 -1137 222 780 552 638 -746 -891 1691 1772 -829 -548 904 426 212 783 -281 -451 1833
4018 1833 986 -1291 -330 1035 100 31 62 -1121 213 1414 -881 -1754 75 873 -656 -64 -386 -1495
4036 -1495 568 674 -1479 -1154 655 307 -917 -246 -615 -97 1036 -12 -1659 -213 1437 -153
4052 -153 -214 -22 -450 439 1608 -618 -1371 714 1168 -518 34 429 -331 902 1126 -1178 -472 1904
4070 1904 833 -1087 98 686 112 1134 290 -1411 -127 1980 699 -964 -18 -26 -13 625 -870
4087 -870 -1574 799 1154 -1182 -1183 -307 -383 250 539 -1484 -1412 1057 677 -1316 -1131 145 -176 575 -45
4106 -45 -1557 -136 1828 -125 -1210 340 429 255 813 -326 -891 1102 1923 -260 -664 897 657
4123 657 415 1338 -289 -993 1503 829 -1095 -262 978 74 -137 189 -1210 -147 1582 9 -1751
4140 -1751 -350 389 -242 -82 -486 -1577 -143 1186 -1077 -1798 209 -39 -223 133 -558 -1174 555
4157 555 662 -1445 -974 718 242 -147 -153 -1151 -595 1335 33 -1429 333 932 -454 2 513 -613
4175 -613 76 1574 -426 -704 1278 1044 -225 225 57 -141 1079 1277 -741 -345 1308 636 -310 554
4193 554 -385 -417 1364 546 -1636 54 1107 -252 -655 -68 -632 15 997 -901 -1751 224 594 -887
4211 -887 -272 -399 -847 208 378 -1292 -787 1211 389 -686 211 -33 -194 853 955 -803 300 1739
4229 1739 -229 -475 950 498 473 1333 -419 -1348 663 1466 -461 -644 514 46 334 174 -1228 -630
4247 -630 1227 418 -1375 -632 -11 -428 707 316 -1859 -518 1253 -278 -1630 20 101 -212 275
4264 275 -700 -1640 576 987 -1034 -1116 164 -334 -137 210 -1099 -956 1044 740 -1191 -207 741 68
4282 68 778 469 -785 155 1563 -340 -1152 936 1162 476 175 91 -378 849 1984 -604 -813 1362
4300 1362 948 124 564 -123 -44 1810 1102 -1103 -291 1364 362 -198 113 -426 -163 1183 -488 -1988
4318 -1988 236 1125 -489 -932 -471 -528 379 1080 -1186 -1514 790 436 -1098 -688 291 -240 894 365
4336 365 -1628 -260 2064 296 -654 -19 255 542 902 -576 -1488 1109 1906 -710 -745 220 -7 245
4354 245 803 -766 -1459 1279 592 -1653 -811 421 11 185 -348 -1903 -653 1172 77 -1604 -532
4371 -532 123 -749 -20 -1010 -1623 148 1231 -1061 -1701 452 318 52 -13 -877 -927 1322 598 -1722 -759
4390 -759 938 563 19 -329 -1144 -226 2024 465 -1240 357 1437 174 -24 -74 -383 1346 1979 -857
4408 -857 -903 1230 1281 7 420 138 -637 1127 1155 -819 -44 1370 591 -560 -159 -624 103 1340 -398
4427 -398 -1692 169 761 -485 -576 -227 -707 -247 979 -1243 -1720 793 899 -1263 -505 -259 -610 262
4445 262 332 -1196 -593 1376 149 -1037 -65 -154 63 1437 555 -1112 19 1299 -114 -462 966
4462 966 191 360 861 -511 -983 1040 1331 -611 -542 537 -542 -192 28 -1196 -660 1299 98 -1631
4480 -1631 -413 67 -589 205 -228 -1747 -144 853 -927 -1208 651 89 -479 207 -632 -1064 540 871
4498 871 -1048 -688 1118 -69 -217 713 -184 -133 1440 306 -936 377 1263 -282 234 721 -219 519
4516 519 1301 140 -651 1257 1112 369 297 307 -212 1035 1172 -687 -364 1268 127 -682 732 -97
4534 -97 -614 1175 157 -1414 -405 993 -333 -389 164 -1002 -601 573 -597 -1285 517 588 -727
4551 -727 -759 28 -921 -35 685 -1126 -878 975 88 -722 437 257 -475 896 145 -892 32 1145
4569 1145 -172 -474 898 434 -398 599 290 -619 516 1177 -611 -439 506 -335 241 771 -785 -842
4587 -842 729 408 -772 203 212 -906 69 212 -975 -994 690 -344 -789 290 -447 -844 226 -163
4605 -163 -1019 214 809 -916 -796 567 -55 -121 648 -240 -971 694 401 -980 122 711 162 384
4623 384 404 -672 86 1715 442 -539 445 791 66 403 868 -779 507 1325 -414 -339 858 321
4641 321 -245 680 -381 -685 706 578 -874 -338 751 -612 -568 97 -826 -597 660 -191 -1608 -452
4659 -452 246 -659 -785 -290 -1010 -342 969 -1078 -1423 457 756 -585 -211 -178 -928 695 1104 -930
4677 -930 -498 1091 705 -55 341 -297 -157 1511 642 -890 206 1209 61 137 346 -495 145 1338
4695 1338 -177 -1406 1019 993 -326 -70 -43 -776 323 770 -1045 -791 725 317 -968 42 -155
4712 -155 -565 672 75 -1492 -186 938 -177 -722 -111 -414 -123 906 -590 -1293 605 901 -731
4729 -731 -539 202 -810 317 900 -931 -371 1042 481 -692 2 416 192 823 507 -649 88 1442
4747 1442 116 -464 710 454 -105 847 247 -348 890 736 -756 -824 665 -410 -348 352 -441 -894
4765 -894 827 134 -1553 -391 399 -519 -428 -12 -1154 -542 955 -525 -1404 317 423 -420 1 100
4783 100 -853 414 1061 -600 -664 996 665 -282 924 -100 -213 1172 980 -819 166 1419 73
4800 73 207 241 -319 -7 903 184 -1052 832 990 -402 -44 171 -215 197 734 -550 -901 824 338
4819 338 -565 39 -112 -591 428 172 -1165 -375 1242 -324 -924 -315 -304 -447 566 -128 -1214 301
4837 301 738 -662 -376 198 -439 -111 480 -966 -913 956 374 -710 148 438 -321 221 560 -818 -416
4856 -416 1171 529 -274 336 478 -199 964 153 -443 535 1141 -467 -745 460 -44 19 497 -335 -946
4875 -946 731 412 -951 -485 279 -424 -157 -319 -794 -711 719 -147 -1364 331 531 -358 -211 277 -1004
4894 -1004 -200 1080 -300 -610 393 527 -302 743 10 -619 854 971 -808 -27 1041 11 137
4911 137 573 -147 -203 925 608 -1224 -62 768 -109 366 191 -821 307 968 -543 -738 304 278
4929 278 -605 -265 -359 -687 230 484 -1113 -553 874 69 -476 22 -314 -679 498 -58 -1063 -453 668
4948 668 -401 -311 157 -726 -425 568 -102 -1096 289 438 -370 -251 -201 -589 597 961 -329 -674 971
4967 971 476 -358 477 176 -203 764 684 -594 -201 1274 -7 -337 724 295 231 724 72 -747 586
4986 586 1115 -599 -50 462 -266 31 755 -632 -1385 226 -61 -901 -337 -237 -484 -199 309 -1033 -297
5005 -297 675 -97 -942 437 399 -427 629 195 -657 340 1400 -275 -384 558 482 104 1044 373 -125
5024 -125 891 887 -325 365 877 5 280 550 -767 -314 907 121 -692 87 250 -523 148 245 -784
5043 -784 299 698 -600 -1007 524 -78 -614 -185 -372 -1009 118 285 -1001 -671 510 -383 -495 67
5061 67 -845 -649 1107 -68 -1076 -101 386 -494 -111 351 -687 154 863 -246 -913 656 859 -146
5079 -146 336 448 -253 677 609 -624 19 1345 336 -326 521 325 -18 950 282 -818 326 1053 -578
5098 -578 -341 289 -274 69 359 -667 -1136 636 378 -527 -319 45 -494 -151 -5 -1139 -524 699 66
5117 66 -1029 -255 -166 -5 236 75 -830 -179 1101 -194 -660 468 350 85 750 153 -462 835 1093
5136 1093 -652 -121 599 -68 233 788 -208 -161 1212 526 -1159 -90 370 -173 252 197 -849 -210 974
5155 974 -370 -977 272 527 -211 125 -763 -772 420 515 -912 -789 344 -48 -421 -132 -439 -753 648
5174 648 126 -906 -370 527 21 51 362 -835 -131 903 -188 -593 363 680 67 182 -23 -274 586
5193 586 971 -253 -387 1014 199 81 351 130 47 951 313 -831 46 1106 -82 -399 415 -187 -168
5212 -168 538 -273 -870 208 631 -581 -477 -76 -453 86 327 -1005 -1193 535 214 -933 23 33 -295
5231 -295 85 274 -991 -178 916 110 -611 352 327 -45 851 8 -809 418 837 -60 -412 787 237
5250 237 69 557 -458 -533 796 524 -842 -120 801 154 159 190 -560 -266 985 -10 -813 72 238 -482
5270 -482 -66 -103 -649 137 768 -714 -1112 381 5 75 -174 -530 -548 383 451 -1011 -227 573 -336 -435 27
5291 27 -273 -425 973 -13 -895 172 624 -174 147 205 -483 180 1045 -370 -388 764 582 -142 349 487
5311 487 -325 586 424 -208 -95 1197 186 -494 477 -7 -71 589 -232 -1096 309 665 -428 -206 290
5330 290 -564 -473 281 -603 -1063 303 474 -925 -576 141 -308 -34 310 -1017 -277 926 30 -904 37
5349 37 190 -221 305 331 -645 315 1097 -123 -173 468 27 -203 573 -236 -545 680 566 -708 -197 591
5369 591 -28 45 656 -262 -395 481 123 -843 118 421 75 161 -21 -910 283 766 -504 -712 541 624
5389 624 -565 215 27 -384 647 238 -1016 -825 175 -82 -184 35 -657 -530 497 -137 -1032 -347
5407 -347 603 -54 -291 -50 -565 -297 932 -196 -393 366 466 -161 284 323 -248 767 624 -379 105
5426 105 992 415 323 632 248 -527 822 647 -984 -171 580 -248 -49 507 -483 -516 439 -196 -811 318
5446 318 376 -837 -295 53 -721 -221 515 -592 -864 552 -238 -667 69 -18 -434 96 539 -367 -119 844
5466 844 -5 -322 664 102 -377 785 -12 -277 735 692 28 323 694 -16 289 812 -262 -302 1066
5485 1066 476 -409 95 566 -322 130 551 -354 -1 673 -42 -701 111 -461 -122 203 202 -951 -355 232
5505 232 -562 -150 -26 -478 -589 -54 -369 -1032 155 105 -976 -142 358 -586 -532 41 -560 -122 827 -107
5525 -107 -823 465 873 -68 63 207 -281 460 771 -220 -196 599 339 246 493 82 -205 765 435 -672
5545 -672 -22 537 131 -481 85 -447 -644 336 -300 -972 -58 173 -820 -360 -72 -890 -725 155 -749 -1008
5565 -1008 -155 59 -765 44 257 -611 35 571 -400 16 712 34 -141 565 202 232 938 368 -148 711
5585 711 1158 149 385 647 389 221 956 -37 -279 818 776 -576 64 85 -523 348 671 -474 -642
5604 -642 505 276 -679 -87 58 -646 289 -49 -898 -533 312 -384 -873 176 -138 -868 450 -178 -747
5623 -747 80 667 -843 -470 297 -146 -29 99 -211 -392 884 531 -665 110 233 -322 609 348 -370
5642 -370 205 1024 -42 -344 467 534 -13 240 264 -229 669 532 -80 -355 536 86 15 415 -423 -702 571
5663 571 21 -597 -156 213 -334 -321 72 -642 -413 619 2 -938 282 287 -398 -11 -3 -653 215 732 -390
5684 -390 -676 566 395 -211 569 226 270 642 648 -311 20 973 273 86 280 -311 288 1071 -19 -357
5704 -357 266 822 -163 143 435 -189 41 690 -273 -477 649 102 -369 -123 49 -258 82 291 -625 -425
5724 -425 530 -259 -635 2 -302 -428 406 -68 -859 -121 696 -362 -272 289 -82 -149 463 -395 -732 453
5744 453 430 -483 -223 323 -496 -11 152 -716 -256 805 175 -657 472 -153 -253 388 502 -472 349 735
5764 735 -487 -162 333 191 -186 432 -333 -499 369 689 -571 -327 999 -206 -292 194 -450 -221 229
5783 229 -375 -868 102 50 -252 217 111 -186 203 673 -551 -505 556 21 -56 -37 15 -499 178 370 -520
5804 -520 -239 686 -81 -380 656 -148 -221 555 103 -496 200 443 -530 36 724 -194 -52 692 -218 -271
5824 -271 499 353 -751 209 174 -369 264 653 -521 -344 336 -142 -319 348 116 -589 221 195 -665 -99
5844 -99 549 -403 -263 256 -336 -380 371 -482 -880 135 357 -600 -349 169 -410 -243 289 -808 -366 307
5864 307 370 -522 291 149 -315 288 568 -607 -95 810 103 -82 691 -18 -241 756 173 -587 99 927
5884 927 -261 -80 719 -25 -14 671 -47 -673 409 444 -626 -433 279 -325 -23 189 -582 -222 895
5903 895 -209 -795 293 -134 -365 153 297 -863 468 608 -150 -468 305 -108 -167 250 -196 -398 331
5922 331 488 -557 -17 664 -192 166 360 16 -12 1035 366 -323 516 402 -46 349 597 -355 527 950
5942 950 -404 -430 443 373 -363 249 -103 -923 152 297 -773 -381 217 -228 -514 118 -691 -267 498 -128
5962 -128 -1291 -27 340 -137 -425 -113 -287 -194 638 -510 -872 576 435 -232 27 149 -158 572 783
5981 783 -717 -81 837 418 -322 217 287 38 913 485 -539 76 1126 -8 -3 270 316 -101 516 -167
6001 -167 -865 677 358 -772 -468 155 -275 -597 322 -803 -588 531 -277 -737 -241 -259 -573 249 -145
6020 -145 -1008 -206 735 -335 -398 160 256 -321 328 -52 -381 614 680 -261 -319 679 220 457 625 -71 -427
6041 -427 1110 364 -717 592 722 -336 149 413 -279 -149 366 -371 -613 287 240 -544 -117 -41 -638
6060 -638 308 307 -794 -654 410 -245 -321 121 -404 -292 538 192 -920 47 223 -473 -239 -179 -191 -87 403
6081 403 -133 -930 467 638 -214 47 533 4 139 338 -226 -396 660 329 -316 841 309 262 599
6100 599 534 -494 45 889 -195 -475 -18 -249 -310 241 -386 -644 282 233 -518 -521 238 -124 -139 -214 -596 -829
6122 -829 463 95 -800 -602 313 -236 436 241 -839 -20 937 -122 -555 514 245 54 405 300 -491
6141 -491 867 605 -419 -28 652 374 -303 344 -132 -57 709 345 -703 402 292 -119 -121 412 -583 39
6161 39 659 -130 -737 449 446 -294 -49 410 -649 78 499 -373 -424 321 113 -450 28 61 -703 229 165
6182 165 -405 -198 285 -305 -524 125 -4 -289 258 157 -756 373 292 -141 -276 597 -287 -360 451 -133
6202 -133 -90 919 -38 -597 197 352 -445 392 421 -404 -325 336 -204 -144 244 -208 -481 152 73 -719 378
6223 378 449 -283 -125 294 -263 -77 286 -54 -245 306 243 -484 72 17 -436 175 513 -227 -509 645 -303
6244 -303 -594 121 131 -338 -242 370 -592 116 209 -94 -198 252 -310 -589 774 75 -259 540 271 -219 238
6265 238 324 -391 -219 357 -118 -355 353 -75 -350 226 749 -314 187 331 -259 -264 600 -217 -485 402 -89
6286 -89 -420 347 435 -96 -36 543 -280 -203 536 -264 -365 448 -477 -646 344 -40 -738 134 285 -271 126
6307 126 352 -264 -206 413 -307 -697 88 166 -271 57 170 -752 -51 608 -369 -531 432 -60 -390 406 123
6328 123 -256 312 666 -381 201 510 -215 3 437 -369 -163 544 -55 -566 499 129 -354 -123 -14
6347 -14 -521 164 527 -440 -827 217 78 -787 -55 -47 -662 104 205 -304 -338 226 -289 -344 211 -219 -79
6368 -79 505 -74 -516 337 386 -154 -64 800 67 -118 733 -315 -311 895 660 -210 -30 550 -343 317 107
6389 107 -525 -142 499 -127 -499 325 302 -88 520 223 -512 -263 575 -542 -910 111 -180 -463 -22 -445
6409 -445 -576 122 206 -710 -382 -111 -470 -34 -126 -730 -795 888 -55 -598 97 514 -462 46 -26 -255 222
6430 222 581 -50 -200 570 549 111 356 -263 208 530 556 -341 223 797 -47 102 599 -100 2 853 320
6451 320 -543 103 206 -199 -254 13 -541 -145 584 -142 -921 178 263 -614 -310 -88 -532 60 240 -790
6471 -790 -371 443 -197 -482 19 -113 -359 436 5 -406 220 722 22 -158 458 7 140 364 -72 -162
6491 -162 724 549 -601 325 381 44 650 245 -376 -141 808 -21 -429 205 112 -303 92 260 -440 271
6511 271 550 -426 -896 386 -392 -457 56 -222 -637 80 -78 -727 -25 330 -14 -476 58 -275 -653 8
6531 8 -256 -498 156 280 -175 -150 325 95 48 739 -109 -138 745 249 -345 209 192 -41 268 -7 -298 111
6553 111 436 -67 -282 524 95 -220 157 318 -396 306 149 -829 -593 -47 -582 -282 355 -334 -215 5
6573 5 -376 -571 -237 277 -528 -168 144 -582 -346 96 47 -339 97 140 -174 151 431 -376 7 513 -266
6594 -266 -370 401 345 107 371 245 -432 455 392 -256 -35 304 -65 -117 -85 41 -401 571 96 -458 169
6615 169 372 -342 267 522 -42 -120 148 -297 -54 189 -46 -381 -224 63 -708 -27 -22 -686 -213 168 -296
6636 -296 -406 159 -45 -686 460 522 -419 85 216 -49 249 282 8 -137 295 202 -334 655 309 -274 435
6657 435 431 -337 319 612 -244 -41 123 161 -305 336 -101 -522 292 386 -119 -187 -114 -349 -63 359 -321 -519
6679 -519 459 -43 -477 -117 348 -586 84 308 -138 38 304 -52 -234 142 -48 -60 347 87 -342 30
6699 30 503 -298 -279 201 162 1 219 -91 -397 270 289 -636 15 239 -158 -301 100 -193 -267 499 228 -291
6721 -291 164 356 51 -30 279 -41 200 469 -89 -174 568 -24 21 315 -20 -121 478 169 -239 -139 301
6742 301 -82 -530 8 -171 -51 170 51 -612 264 490 -406 120 -161 -369 -92 431 -467 -414 364 104
6762 104 -321 162 37 -408 218 724 -424 -230 887 63 -249 138 120 -14 246 378 -501 209 728 -33
6782 -33 12 429 -96 316 242 -40 -489 599 454 -515 -300 50 -423 -162 145 -698 -55 249 155 -437 -76
6803 -76 222 -462 -73 -319 -568 -350 282 -451 -564 355 111 -16 142 -193 -670 85 228 -478 -16 389
6823 389 61 226 58 -134 -31 438 -182 -251 89 490 -157 -62 -153 100 549 515 -202 -449 414 485 -68 301
6845 301 -111 -109 203 455 -404 -243 717 -123 -206 154 -29 -449 256 -404 -520 -79 419 -389 -445 -100 -324
6866 -324 -343 61 -333 -638 485 194 -310 94 327 -2 13 141 -168 -361 607 100 -203 370 336 -96 413
6887 413 418 -372 636 795 282 52 574 -113 167 233 -36 197 395 569 -437 -80 544 3 -149 -228 -464
6908 -464 -281 360 -124 -912 -147 143 -496 -94 -21 -495 -156 353 -330 -422 287 -34 -151 -41 -209 -189 -260
6929 -260 32 -318 -71 403 123 -134 111 121 81 514 203 -242 353 424 -134 -269 300 -237 362 442 102
6950 102 -434 327 450 -273 297 285 -308 -53 309 -306 -142 257 -99 -723 -80 43 -37 222 55 -543 107
6971 107 359 -319 -259 375 -489 -281 93 -28 -388 97 185 -304 20 93 -105 273 336 -173 14 276 60
6992 60 -224 441 364 -128 479 549 -358 89 437 234 -132 364 137 104 448 284 -290 289 195 -41 226 9
7014 9 -171 -189 -12 -110 -572 57 51 -582 74 119 -766 -145 435 -390 -113 175 -245 -666 137 -78 -416 -114
7036 -114 57 -769 -139 16 -343 -225 15 -99 -207 131 34 -212 293 223 -204 280 412 -195 92 458 -268
7057 -268 -170 675 -177 -115 277 282 -431 293 205 -69 6 446 -33 -185 366 194 -85 304 287 -403 80 -91
7079 -91 -270 -133 200 -432 -386 -183 -382 -512 254 224 -558 90 76 -245 -188 93 -126 -70 380 -156 107 550
7101 550 395 -40 258 126 -288 248 686 -132 -126 618 -52 -35 274 -163 -248 573 226 -328 216 473 -373
7122 -373 -299 270 -310 -223 372 -133 -458 286 176 -623 -138 95 -70 67 138 -182 -254 336 66 -428 -3
7143 -3 -196 -3 -41 -118 -578 108 638 -139 -545 266 25 -157 498 -420 -356 173 499 -213 158 127 25 282
7165 282 188 156 -57 564 314 -389 313 320 -306 63 380 -449 228 701 5 -218 317 156 -238 279 208 -217
7187 -217 -14 266 -595 -226 449 -33 -89 40 -209 -241 19 208 -884 -176 -47 -275 -162 436 -492 -192
7207 -192 615 -400 -718 86 361 -287 120 45 -353 174 330 -502 -167 740 590 -339 217 248 -141 509
7227 509 11 -418 155 513 102 -117 290 155 40 428 12 -171 309 144 -155 -73 162 123 80 223 -168
7248 -168 -103 -40 28 -410 -164 112 -50 130 190 -654 -471 415 -337 -542 422 -99 -357 1 -112 -503 -33
7269 -33 369 -400 -137 394 -54 -30 99 -240 -270 342 251 -356 -27 -144 -30 -54 527 -139 153 306 117 -458
7291 -458 643 399 -292 241 258 -262 -83 403 -265 -4 484 -115 -227 337 -99 -285 286 21 -382 -129
7311 -129 405 -650 -361 -17 -189 -456 164 -77 -800 30 160 -309 67 322 -94 -60 223 -235 26 356
7331 356 -80 -231 427 393 -161 543 569 -73 110 376 -333 -50 516 211 -230 432 139 -137 270 300 -387
7352 -387 -140 280 -132 -174 99 -389 -306 -45 91 -477 -21 111 -327 -284 69 -256 -102 386 -177 -299 16
7373 16 -70 -317 127 382 -206 22 345 -121 77 528 -106 -167 141 260 -223 97 324 -310 67 468 -130
7394 -130 -189 345 -2 86 589 187 -671 389 288 -215 110 480 -268 39 8 -114 -72 190 -55 -136 70
7415 70 -46 -379 107 351 -152 102 152 -237 -124 153 -296 -286 269 157 -483 -85 185 -52 208 202 -334 -196
7437 -196 125 60 -526 464 -1 -284 50 100 -239 178 463 -252 -104 386 -18 183 363 134 -436 273 205
7458 205 -572 -340 464 12 193 378 -179 -403 224 125 -318 419 256 -234 -130 248 -458 -105 73 35 -439
7479 -439 53 -236 -95 -12 -90 -570 -267 136 -714 -230 551 -245 62 208 92 -423 486 -54 -402 74 311
7500 311 -243 139 231 -16 148 610 -194 -295 422 157 -168 214 189 -196 334 397 -348 -234 825 141 -288
7521 -288 227 95 136 545 50 -365 63 321 11 -45 -108 88 -361 217 -77 -400 128 126 -317 -128 -37 -667
7543 -667 44 264 -364 -172 302 130 -127 -7 33 -70 186 155 -441 308 639 -96 -287 548 -4 -301 58
7564 58 60 -651 337 233 -243 154 505 -7 -43 189 -58 -405 288 414 -430 -37 75 -221 102 41 -522 -214
7586 -214 330 -495 -409 188 144 -560 129 235 -252 297 55 -394 -348 342 -221 -514 405 -189 -322 92 75
7607 75 -241 -14 227 -416 -221 77 -136 144 438 -26 -145 372 338 -383 169 304 28 117 250 -525 31
7628 31 504 268 21 49 88 -47 293 185 -152 44 220 -279 -281 222 -21 -359 202 131 -505 257 -170 -429
7650 -429 -334 267 -498 -267 330 -593 -150 -179 201 -493 0 324 -367 13 186 -49 64 357 -43 -226 261
7671 261 343 -268 174 218 -359 350 316 -281 -76 632 222 -153 423 -83 -140 361 202 -361 -72 325 1
7692 1 -309 -52 161 -426 61 -152 -480 6 130 -701 -77 -47 -18 -67 -72 -144 -377 145 -167 -138 -18 -33 -567
7715 -567 -73 20 -163 -162 174 -145 -51 228 354 -48 149 -55 -141 457 502 -374 170 467 -38 189 105 -130
7737 -130 -72 640 -27 -307 508 481 -150 368 253 -204 61 321 -176 -378 -195 -242 -649 148 89 -308 -128
7758 -128 280 -335 -65 206 -305 -327 308 -48 -245 113 -40 -447 -95 223 -377 -168 282 -304 -259 203 103
7779 103 -222 156 -205 -500 255 295 -165 12 220 66 -124 44 -174 -117 350 281 -261 115 430 -494 -188
7800 -188 431 -84 92 247 -63 -315 243 70 -148 4 -97 -460 145 197 -361 -163 255 -359 -224 78
7820 78 -84 -98 147 96 -589 -30 38 -585 -303 251 -115 -276 68 -3 -170 345 235 -308 221 312 -170 -56
7842 -56 199 -107 123 660 -16 80 512 341 4 475 388 -427 82 106 -222 -138 228 -104 -28 -40 -258 -236 7
7865 7 84 -349 -86 -164 -156 -194 218 -277 -233 248 -108 -540 157 68 -748 -162 133 -242 -346 -31 -440 -384 474
7888 474 -45 -511 132 1 -367 202 188 -261 53 524 -65 -201 321 309 -27 269 107 -23 270 377 -221
7909 -221 63 417 -83 240 201 -287 -375 336 206 -292 -96 439 -388 140 203 -266 -353 450 -288 -414 165
7930 165 -89 -413 82 87 -570 253 105 -397 -97 198 -102 -73 -74 -124 63 434 -9 -412 -214 202 39 -121
7952 -121 56 -31 -355 321 24 -549 428 489 -46 88 36 -6 332 355 43 -289 302 216 -401 140 -146 -299
7974 -299 -85 93 -113 135 282 3 -376 340 -173 -169 197 -260 -436 8 272 -236 -281 99 -100 -139 262
7995 262 -33 -343 309 101 -149 147 80 -338 147 162 -143 -179 445 -261 -162 -132 -232 -59 425 119 -302 157
8017 157 538 51 -402 159 191 -311 431 -158 -90 344 137 -212 172 64 -82 64 255 -235 -160 417 -145
8038 -145 -329 9 124 -421 -260 -18 -315 -68 -13 -282 -79 536 -264 -443 274 68 -291 26 -37 -283 73
8059 73 241 -140 -52 232 116 -170 318 -28 24 147 180 -63 -214 393 -167 88 246 36 -95 584 295
8080 295 -322 334 355 -20 151 -21 -390 -18 56 -241 -64 -50 -165 -279 352 103 -586 -283 -58 -43 -71 -13
8102 -13 -209 -322 198 -114 -228 254 190 -544 124 126 -186 -115 7 -135 -333 334 124 29 421 387 -476 -27
8124 -27 323 39 54 376 -117 37 383 116 -205 52 139 -72 144 264 -445 145 392 -174 222 299 -168
8145 -168 -81 37 169 -375 -62 104 -354 -163 190 -245 -157 249 -353 -367 256 -99 -455 67 81 -503 -165
8166 -165 157 -108 -23 43 116 -80 454 66 -183 269 114 10 116 381 8 12 236 -164 12 390 -83 -250
8188 -250 183 243 -213
8191b13
$$ Imaginary data points
##PAGE= N=2
##DATA TABLE= (X++(I..I)), XYDATA
0 0 0 0 0 0 0 0 -8 8 -8 8 -13 15 -16 23 -24 29 -34 41 -48 56 -69 78 -89 104 -119 135 -154 176 -197 222
30 222 -252 282 -314 352 -395 437 -486 539 -598 661 -732 811 -898 993 -1104 1227 -1361
47 -1361 1522 -1705 1919 -2174 2485 -2872 3370 -4037 4977 -6403 8815 -13663 27205 -140720
61 -140720 -528963 -198910 206720 178116 -154242 -302802 -159794 59795 34497 -180179
71 -180179 -247801 -39510 124453 16431 -205094 -213952 8447 149686 5738 -163372 -79457
82 -79457 103092 91344 -63687 -126952 -8860 143941 119154 -65324 -128209 20152 127069
93 127069 38061 -75827 -38251 90019 107956 -55849 -176493 -26968 201343 163152 -85195
104 -85195 -206226 -75753 129494 166269 -2346 -131371 -43643 77010 35095 -51470 -32042
115 -32042 38978 65848 11824 -85375 -82857 45986 85215 -41286 -102036 8659 85596 -6872
127 -6872 -128158 -96959 50181 107895 742 -100393 -60623 30903 49149 -7064 -50196
138 -50196 15073 132259 90291 -100169 -129403 85456 231954 120307 -69862 -103754 39021
149 39021 173344 122936 -23031 -39807 59938 92000 23816 -33563 -6501 75729 84120 -38095
161 -38095 -113918 -9262 94360 19756 -102518 -92562 13007 66199 -14245 -140201 -124258
172 -124258 30739 95243 -18014 -133747 -105866 5062 51047 -26112 -97115 -26128 73995
183 73995 16835 -120556 -124941 15650 126124 67661 -97410 -150248 -17347 97788 49135
194 49135 -46184 -58931 -10601 35217 24355 -38308 -40697 45184 68552 -14572 -50871 16105
206 16105 70273 38951 -27478 -33515 48275 102354 34346 -53161 -33220 41291 72457 45638
218 45638 -17439 -53877 -7683 41623 11166 -27380 -6371 6788 -26656 -55218 -43647 510
230 510 34534 1657 -61428 -65279 -21816 9495 24972 16919 -22184 -30158 5307 17499 15450
243 15450 41736 44137 3226 424 47309 66267 40114 4514 -3676 42372 88481 51912 -17044
256 -17044 -23179 10111 30015 37344 17730 -21019 -26520 -9578 -21869 -28225 999 10561 -22038
269 -22038 -52438 -54685 -22819 21556 11959 -40010 -45204 -8984 9 -2509 12028 9936 -5141
282 -5141 -5237 -5747 -319 32317 42043 -1574 -32383 -11401 25178 40011 11106 -42650 -39769 20370
296 20370 33141 -12644 -37047 -32592 -25732 -376 17931 -5472 -28980 -26285 -27370 -21190 11392
309 11392 25846 4813 -16276 -24020 -8965 27332 32892 2000 1839 24901 8961 -11134 14097
322 14097 37752 26450 4513 -16381 -13794 27869 46691 -2338 -48934 -33409 13275 41859
334 41859 15728 -49200 -58349 6344 33613 -11479 -34102 -7374 8375 -812 -14348 -12763 19939
347 19939 41551 1380 -41117 -9409 50683 60871 17759 -35664 -33070 37704 73071 13575
359 13575 -36745 -5709 28052 8662 -21480 -24910 4144 29391 -5402 -66402 -52054 17481
371 17481 32430 -23679 -75494 -59766 16537 55736 -14733 -89062 -46344 37889 39575 -10498
383 -10498 -30140 -4799 31218 27309 -16167 -14227 47020 67191 13851 -29607 -11346 47851
395 47851 80826 25626 -53121 -29421 59108 65196 -9197 -46399 -17347 22520 21469 -23064
407 -23064 -43113 -463 23943 -24149 -64198 -33609 21241 35062 -14736 -76012 -50607 42350
419 42350 58015 -24329 -64779 -12971 44471 42236 -4601 -33598 2024 47083 21845 -24288
431 -24288 -6008 42146 44676 -1060 -45242 -25077 50852 68532 -15308 -71633 -20198 45102
443 45102 35069 -19351 -47283 -14742 34512 20749 -32477 -28596 19810 26710 -9659 -30336
455 -30336 -8860 42159 54621 -13658 -66053 -9632 68413 50357 -22761 -50021 -10367 40303
467 40303 28822 -33101 -47438 1606 19059 -20299 -48330 -34642 -1572 9579 -34972 -83511
479 -83511 -41916 37982 25033 -54423 -77630 -23639 34552 35041 -17216 -41439 6437 50117
491 50117 27804 -3790 8233 40416 56281 35645 837 17378 73005 67135 264 -18024
503 -18024 32313 68973 48256 -6985 -38007 -3299 41757 19475 -27643 -27930 -4650 -4530 -22488
516 -22488 -39317 -29088 7633 7942 -46757 -65193 -8991 35978 12680 -37598 -51641 -4437
528 -4437 50624 34269 -23577 -25629 19486 36993 20808 2975 -1266 20186 40103 11946 -23098
541 -23098 -989 35749 21851 -16935 -27598 -2215 26652 12706 -34961 -44692 -6569 12285
553 12285 -298 -11705 -20439 -23188 -6989 -2599 -14095 2909 27872 3176 -34858 -22196 18852
566 18852 37549 19960 -17687 -26612 9703 31797 5641 -21455 -18256 -4569 9213 4850 -26392
579 -26392 -37422 -10036 -1897 -26055 -32039 -17356 -13526 -18969 -27791 -32975 -13322 10570 -1439
592 -1439 -23796 -17540 -1619 9900 23284 20314 3010 5511 18931 21588 31932 47354 36199
605 36199 13506 8764 17417 36389 53264 34601 -922 241 20223 17317 10184 8106 -5326
618 -5326 -10000 6008 4203 -19193 -26909 -18828 -9792 -424 -3944 -22720 -28951 -20326 -15822 -5105
632 -5105 5015 -6628 -13064 1188 -2663 -21138 -4337 27329 25030 2475 -12166 -15040 5198
645 5198 33458 28384 -9 -11675 -4681 9427 19572 8385 -7888 1018 6925 -11471 -12630
658 -12630 9285 7561 -12502 -14402 -8310 -4209 1530 -10089 -30706 -16408 16541 14319 -16033
671 -16033 -35668 -30171 576 24624 4330 -27006 -18021 2876 -3951 -16104 -10118 7338 22011
684 22011 8643 -31180 -38722 2339 30671 18718 -3957 -19604 -16231 7640 13465 -6924 -6176
697 -6176 15441 9136 -12660 -9953 6299 12646 5643 -8431 -4725 19177 19438 -11590 -21529 4288
711 4288 28419 31918 8590 -27741 -21182 30488 44526 4938 -12085 8911 19069 8317 -781
724 -781 4481 26424 35696 5091 -26210 -12701 20841 33187 17948 -11241 -19902 4390 13082
737 13082 -13547 -17475 14049 19599 -11388 -32683 -23800 3682 19977 -4156 -34696 -14932 23472
750 23472 13686 -28356 -41231 -7702 40830 43375 -16478 -57469 -16402 40398 34998 -3999 -21787
763 -21787 -3621 23224 13698 -24275 -21385 25722 36920 -6854 -39237 -26441 9088 29366
775 29366 3422 -37815 -28633 12062 8935 -26538 -29670 2496 21726 -223 -39804 -36838 13748
788 13748 34811 -3134 -32951 -12769 21655 28639 -4711 -40329 -13276 55248 57448 -15466
800 -15466 -54133 -13554 41878 49420 7499 -29194 -11551 24290 14461 -18208 -14745 14005 27512
813 27512 8188 -30324 -38396 5134 35340 5616 -26620 -13030 8662 6203 -7786 -13526 3188
826 3188 25705 13464 -18718 -15017 16410 24338 8067 -5079 -92 22059 29040 -4783 -27261
839 -27261 6573 44740 30400 -11317 -30429 -9977 28226 32430 -3706 -20986 -1063 6935
851 6935 -7651 -10585 22 10141 11305 -10348 -34432 -16933 18558 13948 -14260 -18193 -879
864 -879 7498 -5270 -25972 -16922 21322 27626 -12591 -35982 -13750 13652 16832 -4472 -26683
877 -26683 -10076 27117 17057 -32529 -41420 3550 39311 25130 -22741 -46849 -11630 32383
889 32383 21617 -14058 -17594 1288 12206 7002 -10789 -12242 16988 29468 -3313 -26280 -3484
902 -3484 23449 21214 382 -14966 -2741 21375 11826 -17337 -12753 16214 21498 2738 -17384
915 -17384 -21290 2258 24379 5103 -23814 -12597 12372 8686 -13708 -24033 -7843 23712
927 23712 24349 -14713 -36818 -12835 15050 19352 7767 -10193 -14601 4526 13070 -2676 -5636
940 -5636 10877 14473 4220 -3322 -5315 4457 16825 9162 -3860 2844 9707 1092 -1197 2123
954 2123 716 5376 11179 -1131 -12658 -1984 6318 -273 -2595 -2032 -3908 -2035 -3559 -10507 -3815
969 -3815 8109 806 -10496 -9701 -10095 -6988 8368 10046 -7982 -13900 -7158 -3605 2373 8497 3
984 3 -8416 -3805 -1033 -555 3448 87 -4646 5718 10467 -3288 -7942 983 2875 4558 10780 4413
1000 4413 -4598 940 5631 1859 4221 7751 4863 7534 6889 -4343 -4022 9994 12006 5146 4770
1015 4770 -1749 -7963 4525 14375 3382 -6386 -4303 -1347 2660 3787 -5209 -8483 592 -175 -9599
1030 -9599 -6560 -2063 -4306 -1796 -3273 -13474 -8657 6621 1457 -13562 -9232 2586 6325 2125
1044 2125 -10574 -14632 4946 18689 4683 -9496 -4845 3312 8673 7705 -5530 -6511 15413 19718
1058 19718 -6478 -18776 -1666 17151 17482 -2194 -21217 -9262 17933 14326 -11000 -17145 -2297
1071 -2297 10673 10904 -7959 -23515 -4301 19885 5216 -18692 -11683 8987 13796 103 -18270
1084 -18270 -13245 14953 21339 -5956 -19864 -2127 16275 15908 -833 -18229 -6373 22619 18654
1097 18654 -11483 -14152 9058 18825 6292 -10969 -11233 13118 25997 1135 -21674 -6439 17086
1110 17086 17725 2526 -12846 -9128 15624 20268 -7224 -19290 3496 19147 8222 -8284 -11021
1123 -11021 3400 16536 2612 -17637 -6209 16308 11809 -6667 -14659 -7820 9509 15762 -6435
1136 -6435 -22088 -1753 16382 2139 -16426 -13459 2222 11972 -1191 -21846 -14027 11989 9547
1149 9547 -15319 -21768 -7256 8135 10288 -10252 -27873 -8724 17260 5349 -19547 -15962 4262
1162 4262 13189 2377 -17839 -15074 12852 20098 -5967 -16517 1463 16572 12495 -4287 -16838
1175 -16838 -1523 25678 17749 -13837 -15944 7925 18167 4922 -12335 -12016 10590 20165 -5960
1188 -5960 -24142 -4889 17083 11209 -8347 -18698 -6433 17922 15379 -15179 -21852 7072 24431
1201 24431 10080 -10920 -12356 9537 27083 8797 -16110 -2601 24179 20797 254 -8319
1213 -8319 296 19237 23071 -2988 -19434 3957 25502 11075 -12859 -15702 530 16484 6915
1226 6915 -18124 -17055 7950 9774 -10619 -17607 -7234 6400 10797 -4951 -21676 -6972 15781
1239 15781 8348 -11350 -10820 4828 15588 8465 -11015 -12570 11208 18580 -581 -10702 -1316
1252 -1316 6447 5836 -3724 -14780 -6288 12885 5116 -19782 -20724 -2834 4903 -1892 -16315 -21776
1266 -21776 -5047 7791 -7654 -22162 -9853 3074 482 -6662 -11364 -7027 8811 11496 -6193
1279 -6193 -10611 5525 14134 7832 672 -1537 7680 17491 7485 -7304 1789 16644 11712 1483
1293 1483 -463 346 5848 7636 -2853 -7210 6325 12208 -1376 -11335 -8513 1753 12537 6519
1307 6519 -11441 -9539 7610 7348 -4114 -1788 4245 6132 9237 3741 -6621 452 13856 9830
1321 9830 1039 2143 4681 6051 6139 -209 -1784 8082 7856 -4116 -4839 2469 1077 -1067 66 -4685
1337 -4685 -4625 1226 -2724 -10317 -3501 4053 -285 -5360 -8753 -9142 1954 9465 -1346 -9461 -3106
1352 -3106 -217 -1448 2460 2020 -2410 1779 4216 -3562 -4968 384 -219 2094 6175 -1660 -10143
1367 -10143 -5206 -1042 -2401 1931 192 -10284 -9067 -225 -4299 -10318 -5796 -1621 -143 -1644
1381 -1644 -10078 -14273 -3179 5556 933 -2527 -4087 -6699 -619 7003 1022 -1746 6860 5385 -3333
1396 -3333 373 8576 7309 5460 4328 1081 5329 9924 2144 -860 8238 11938 5136 -230 -5079
1411 -5079 -2269 12833 15419 -3481 -11147 1227 6938 830 -3237 -4504 2100 10720 1531 -14708
1425 -14708 -10605 6088 9735 4160 -3408 -8879 -2985 6592 230 -5902 4687 10420 456 -7784
1439 -7784 -6016 1676 10085 6845 -6776 -5682 7818 5407 -7295 -6497 1805 7668 8099 -5314
1453 -5314 -18141 -4922 14858 7834 -10222 -11584 -1525 6355 2662 -10793 -10998 7785 12986
1466 12986 -5820 -16295 -6268 5716 11178 4203 -11291 -9913 6724 6453 -8195 -6633 7548
1479 7548 9874 -830 -13379 -13217 5880 16514 -128 -15217 -5535 5960 2900 -6427 -12234
1492 -12234 -3826 14937 12066 -15410 -23360 -160 16325 9148 -6254 -12515 -573 13740 3772
1505 3772 -13707 -4334 15666 14870 -586 -10279 -6958 10897 19916 3073 -10762 1519 13804
1518 13804 4833 -5748 -3438 7677 15812 4004 -16192 -10565 13842 15883 -3240 -12075 -5543
1531 -5543 5926 9553 -4767 -17387 -1273 18503 7154 -16009 -18112 -863 14752 11083 -9606
1544 -9606 -15643 2876 11580 -3455 -11307 -436 9697 9788 -2265 -16773 -8707 13468 13521 -5706
1558 -5706 -9593 1465 6005 249 -9638 -8724 9744 16952 -4182 -19426 -6006 11084 9827 -1348
1572 -1348 -10902 -6069 11588 10836 -10663 -14751 6051 17144 6502 -10304 -14986 985 18430
1585 18430 7558 -12082 -7910 7704 6844 -2447 -7191 -2920 9137 10552 -7628 -18064 -1633
1598 -1633 12876 4589 -7401 -9125 -873 7177 -201 -15221 -6821 14094 11885 -9275 -16514 -5523
1612 -5523 9818 14338 -1088 -15547 -2361 15536 7368 -10163 -9952 5038 18452 12098 -10898
1625 -10898 -17007 5332 18703 4829 -7734 -5069 3176 7826 1900 -10841 -6513 10260 9748
1638 9748 -7304 -12539 -3560 5368 6561 -3366 -11576 -1757 8637 -1407 -10295 -2143 5790 4263
1652 4263 -1343 -8886 -7211 6787 11417 -2775 -8637 12 5933 3208 -2645 -6788 1005 12271
1666 12271 4393 -10821 -7806 3885 5952 3330 -1213 -5935 -1786 4443 -1308 -6605 1745 7099
1680 7099 1861 -2966 -5198 -3007 5812 7081 -2200 -2388 6348 4173 -2302 -238 3131 4938 6983
1695 6983 1452 -5849 103 7827 3441 -1922 -692 450 2274 2561 -5444 -7151 3325 5861 -4366
1710 -4366 -7622 -2840 -1594 580 635 -5511 -5663 681 -696 -5834 -2246 1710 1325 1224 -3188 -7016
1726 -7016 779 7907 1367 -3823 1454 2804 279 1662 145 -1506 4999 6472 -2066 -4721 -226
1741 -226 1553 2377 1811 -3635 -3964 2423 381 -7150 -3802 573 -765 -329 -1602 -7355 -5105 2963
1757 2963 1913 -3018 -1891 -1211 -442 2863 706 -3202 1866 6659 713 -2021 2277 3079 3288 5494
1773 5494 -178 -4341 2955 7329 1886 -1632 -828 292 3995 3153 -5592 -5444 4823 5266 -2654 -4883
1789 -4883 -3448 -1384 4532 3012 -6265 -4227 5627 4927 -2364 -4282 -1304 6344 10523 1541 -7365
1804 -7365 391 8977 5408 1285 518 551 5223 7733 -1428 -6352 3219 8068 94 -4721 -3645 -602
1820 -602 2974 -655 -9738 -6175 3603 387 -7819 -7748 -4414 -1558 1235 -4652 -10773 -2442 6213 -729
1836 -729 -7966 -3871 1362 3906 1918 -5516 -4229 7276 8895 -2407 -5487 985 5168 5915 1770
1851 1770 -5553 -2283 6478 3023 -6369 -3536 2441 2208 -698 -5752 -7304 1136 5111 -4931 -9163
1866 -9163 217 3986 -1090 -4395 -5141 -1456 6788 4851 -6008 -4656 6421 7801 646 -3047 -204
1881 -204 8037 11473 -16 -8708 2238 12733 5985 -3754 -4620 706 8008 7592 -6296 -10570 2435
1896 2435 8931 -475 -8421 -6368 2137 7140 -1019 -12138 -5175 8712 5683 -5696 -6634 -291
1910 -291 6507 7594 -2330 -8409 3529 14409 4857 -6311 -3273 5528 9630 4904 -5841 -4190
1924 -4190 9447 9754 -4894 -9862 -340 6811 5717 -4478 -12864 -4873 7973 2622 -11379 -10645
1938 -10645 -610 4442 -45 -9816 -12343 764 8734 -3470 -12258 -3733 5142 3673 -2619 -8145
1952 -8145 -4022 7648 8121 -5458 -7711 2782 7965 4279 -3090 -6493 1206 10406 2646 -8393
1966 -8393 -2329 7167 3814 -2643 -4582 -1832 5589 6617 -4187 -9503 383 7854 3056 -3286 -4783
1981 -4783 472 7159 2332 -7252 -3475 7684 6493 -1801 -3211 -867 3071 5733 -678 -6379 1899
1996 1899 9048 1959 -5760 -3658 1902 6163 3839 -5213 -5919 4422 5777 -3495 -4696 970 3842
2011 3842 3219 -1677 -6768 -785 8735 3004 -6471 -3992 2889 5254 3105 -2645 -5189 3418 8541
2026 8541 -811 -6875 755 6138 4027 -911 -4736 -2007 5895 4558 -4589 -4616 3027 4400 234
2041 234 -5123 -7202 814 8781 1057 -9740 -5464 2430 1120 -2049 -3176 -4099 567 2771 -5134
2056 -5134 -8894 -1258 4292 940 -2819 -6289 -3798 3627 3191 -5145 -3992 3740 3151 -1384 -1720 -1450
2072 -1450 782 5521 2326 -3821 -307 4975 2323 -125 402 1278 4219 4428 -2376 -4392 3907 6953
2088 6953 1307 -2129 -1749 -933 3464 4380 -1623 -2467 2655 1169 -2594 -1579 -495 790 4136 669
2104 669 -6333 -3737 2768 1499 -811 921 -730 -1689 1032 -746 -3333 412 2844 786 378 -539
2120 -539 -3383 -413 3508 858 -54 3436 243 -4057 -713 2549 1528 2670 2124 -2763 -2703 2073
2136 2073 2554 645 1136 -716 -1564 1807 465 -2827 1412 3553 -954 -2097 -375 -1854 -337 3886
2152 3886 169 -4276 -1089 387 -1555 -1177 -534 -1659 945 950 -4742 -5145 500 1365 -564 740 -1291
2169 -1291 -3971 -1436 125 -2164 1170 4060 -403 -4093 -2453 -885 2471 5293 551 -4000 1132
2184 1132 3349 -845 -668 2523 2296 3041 2543 -2612 -2576 4384 5167 145 -750 -298 742 2806 288
2201 288 -3754 712 6101 1151 -4695 -2393 -162 1265 2951 -26 -4754 -1200 1713 -2180 -2925
2216 -2925 1812 2645 280 -3002 -6133 -2201 6708 4863 -4274 -4212 348 1009 875 -449 -2805 1036
2232 1036 5779 221 -6966 -2681 3617 4107 1712 -2549 -3930 2136 4122 -2799 -4012 3274 5269
2247 5269 1410 -1992 -4543 -1866 5581 5319 -2492 -2755 2278 1813 -697 -936 -291 3682 4951 -2676
2263 -2676 -7601 272 6622 2476 -1986 -3780 -2375 2351 3392 -4375 -5600 1994 4036 -1736 -5056
2278 -5056 -4444 320 5527 1756 -6419 -3636 3835 1661 -3019 -1348 1846 3889 3841 -2334 -6191 1023
2294 1023 7822 3776 -665 -1009 221 2010 1780 -1975 -246 6560 3832 -5526 -5650 888 3803 3423
2310 3423 -896 -6514 -2072 4779 920 -5874 -3608 1849 3126 834 -4813 -6097 2084 6257 -742
2325 -742 -5003 -365 2175 851 -643 -2809 -721 5635 3594 -5287 -5004 1496 3783 2504 -1168
2340 -1168 -5001 -1545 3280 -983 -4919 219 4246 -185 -4739 -5294 -1990 4618 4921 -3347 -6537
2355 -6537 1084 4363 1235 -1591 -2110 1597 7089 3811 -5364 -3422 5774 6323 1628 -406 -701 1909
2371 1909 4431 27 -4047 1118 6341 2146 -3120 -4690 -2640 3110 4487 -3569 -6279 -178 1808
2386 1808 -2130 -2148 -313 -256 1334 -963 -5113 -1877 4695 2993 -2480 -2619 -194 2148 4057 -236
2402 -236 -3757 1719 5780 533 -2926 -608 1426 2888 3454 -1463 -3280 1450 2150 -2210 -1835 1778
2418 1778 1239 968 -1601 -5645 -2165 4878 2971 -3503 -2466 41 -678 934 3 -1664 899 3024
2434 3024 -1430 -2937 190 1888 1121 678 -2215 -2591 2847 2970 -3428 -3593 1512 1803 -168 -764 -3178
2451 -3178 -2060 2555 1050 -3022 -1902 381 -313 48 -483 -1783 1239 3492 -1866 -4524 1384 3992
2467 3992 1831 565 -1045 -2262 1950 4586 -259 -1214 2163 2095 564 325 -214 900 4495 2270
2483 2270 -3024 -903 3671 1596 -413 -343 -822 1419 4075 -453 -4565 -742 2474 1295 -161 -1696
2499 -1696 -2694 517 1691 -2654 -3206 1708 1277 -2311 -2913 -1913 -450 2952 766 -4724 -3091 2804
2515 2804 2158 -264 -1247 -2014 350 3953 509 -3763 812 4354 793 -1675 -59 648 2418 3410
2531 3410 -1399 -2726 2462 3567 -479 -2177 -1603 -6 3527 1523 -4717 -3472 1835 794 -2125
2546 -2125 -1091 -787 -1306 289 -1926 -4405 -1 3752 74 -3398 -2036 -351 2288 2667 -2312 -3671
2562 -3671 2497 3528 -1080 -1844 496 763 1571 861 -2398 -666 4050 1410 -3783 -1392 1795 1888
2578 1888 1169 -2047 -4121 1227 5544 -225 -4220 -697 2322 2015 1791 -860 -1288 3493 2950 -1951
2594 -1951 -1219 3611 3975 1436 -648 -2984 1197 6726 2346 -4504 -1768 3267 1941 -754 -2524
2609 -2524 -2678 967 3415 -2228 -5300 -354 1902 -493 -3102 -3771 -1699 3210 1679 -6372 -5212
2624 -5212 2969 3925 -273 -2424 -2886 449 4850 1562 -4121 -644 4526 2529 -1107 -1175 169 3592
2640 3592 4541 -2589 -4725 2921 6095 353 -3234 -2565 -138 3711 2574 -4115 -3934 2852 2870 -1814
2656 -1814 -2735 -1447 859 3344 -752 -5208 -536 4543 445 -4257 -2171 1083 3253 2586 -2992
2671 -2992 -5012 1159 4319 -59 -2615 -545 249 1563 656 -3068 -1820 4049 2313 -3927 -2558
2686 -2558 1538 2083 1179 -1460 -3688 1054 5138 625 -3312 -1151 1921 2689 2131 -1272 -2031 3409
2702 3409 4132 -2098 -2338 3006 2908 716 -697 -1620 389 4853 2033 -4228 -2763 1658 2055 517
2718 517 -1010 -2945 -621 2139 -1766 -4155 240 2309 -1368 -2669 -2359 -1393 1987 1468 -4066 -3001
2734 -3001 2230 2455 -1515 -2027 -1670 246 3772 1156 -3699 -691 3645 1130 -1580 -134 965 2411
2750 2411 2188 -2484 -3589 2762 4935 328 -2437 -1379 -110 3193 2607 -2617 -3007 2796 2732 -2048
2766 -2048 -1203 690 911 1449 -811 -3548 406 4230 578 -3045 -1406 669 1397 1454 -2357 -4502
2782 -4502 1351 3939 -1201 -3881 -1057 82 628 838 -2008 -1821 2306 849 -3867 -2206 1223 2130
2798 2130 2043 -930 -4329 -1261 4870 1922 -2163 -569 1264 677 1433 157 -1487 1764 3868 -260
2814 -260 -1861 1492 1291 502 561 -973 -1030 3066 1949 -3489 -2358 1608 1209 -326 -957 -2916 -1700
2831 -1700 1878 311 -2765 -269 687 -1784 -1616 -1072 -1350 1404 2511 -2541 -4336 384 2323 201
2847 201 297 -1114 -1966 1307 1652 -1853 -681 2223 774 -154 504 -1022 -684 2727 626 -1972 774
2864 774 2938 -511 -1595 41 106 1954 3452 -743 -3073 423 2064 642 959 678 -836 687
2880 687 1214 -1777 -220 3347 1404 -2522 -1439 -262 122 2266 228 -3460 -1486 1803 -531 -1723
2896 -1723 -695 -831 -106 1605 -1546 -3410 635 1925 -1123 -871 638 -576 -164 619 -1972 -779
2912 -779 3868 2492 -1853 -1494 -568 608 3354 2416 -1686 -654 2400 -58 -1586 1531 2007 812
2928 812 858 -1651 -2557 1719 3803 -385 -1772 112 24 994 891 -2078 -2165 2378 1930 -2121 -1944 267
2946 267 -428 1103 785 -2440 -876 1662 -937 -3042 -4 1177 340 48 -2456 -3977 1103 3963
2962 3963 -186 -2707 -331 -428 -367 974 -275 -548 2504 1502 -2467 -1046 2203 1868 1697 760 -1540
2979 -1540 -29 3467 1080 -2224 524 3066 794 275 -257 -2126 567 3324 -191 -1849 545
2994 545 54 -1515 -545 -473 -565 2527 785 -4060 -3063 1727 1503 154 -364 -2229 -1375 1874 514 -1871
3012 -1871 321 1673 -738 -1443 -295 -881 880 2267 -1593 -3156 1045 1755 -1429 -1116 236 -18
3028 -18 1261 694 -2867 -1443 2247 1630 -24 407 -134 -461 1294 355 -1361 2431 4200 -551 -2780
3045 -2780 154 1249 2485 2657 -1123 -2570 898 1862 -1008 -903 444 -469 73 -192 -3435 -1705
3061 -1705 1947 97 -3400 -1723 217 -643 -190 -956 -3033 564 2701 -997 -3244 -641 884 894
3077 894 1724 -831 -1809 1398 2298 -1355 -896 2502 2156 153 -446 -1708 337 4532 1732 -2652 -1500
3094 -1500 865 506 1340 257 -2006 479 2837 -948 -3138 610 2154 343 -19 -550 -1557 1399
3110 1399 1869 -1856 -1754 1765 1914 177 -591 -2574 -831 2988 1719 -2728 -1702 943 -361 -1078
3126 -1078 -231 -1000 -35 1130 -1684 -3719 314 2180 -323 -996 -1565 -1739 1592 2710 -1474 -2022 1561
3143 1561 1983 -633 94 152 65 2786 1650 -1752 -5 2760 925 -669 1089 235 885 2512 -808
3160 -808 -3607 429 3100 211 -1220 -737 -1421 -431 1142 -1015 -1630 1268 86 -2963 -1471 43
3176 43 -88 1268 54 -3638 -1222 2951 432 -2419 -746 -72 52 1507 -509 -3014 557 2431
3192 2431 -248 -1250 739 572 353 1242 -1103 -1035 2514 2014 -1984 -1171 1521 1604 1592 1144 -2076 -876
3210 -876 3012 1232 -983 849 1180 -71 580 -98 -947 1691 2981 -1343 -2679 712 1431 202
3226 202 408 -1637 -1850 1783 1296 -2785 -2000 359 -19 188 -254 -2268 -1493 1830 -35 -3206 -116
3243 -116 2032 122 -787 -856 -1255 1076 2949 -722 -2586 588 1953 487 749 -172 -875 1689 1831
3260 1831 -1752 -838 2760 1143 -935 -35 -421 750 2588 144 -2718 -291 2368 374 -608 -570
3276 -570 -1312 935 2343 -1465 -2857 1029 1576 -1275 -1185 -170 -550 799 276 -3238 -1915 2327 1162
3293 1162 -1889 -1549 -1703 -627 1839 536 -2852 -736 2009 -323 -1499 231 469 819 1079 -1009
3309 -1009 -1355 2157 2271 -1281 -803 713 1124 1763 1242 -1247 -758 3117 2090 -1401 -276 1423 643
3326 643 833 29 -1622 861 2537 -903 -2361 280 1273 467 382 -2014 -2819 1468 2478 -1619 -2476
3343 -2476 120 452 -240 -238 -1602 -1036 1964 503 -2841 -977 1309 234 -190 -399 -2028 316 2976
3360 2976 -952 -2885 -73 1790 743 266 -616 -1257 1301 2339 -1303 -1622 1639 1568 -400 -183 -814
3377 -814 382 2852 1257 -2819 -1402 2750 1640 -475 -355 -1179 -41 2558 24 -2295 325 1477
3393 1477 -216 -426 -409 -830 958 1723 -1978 -2155 1718 1323 -945 -1617 -1145 -607 1343 673 -2627 -1907
3411 -1907 1370 140 -866 -75 -757 -117 1504 -314 -1988 1252 2742 -229 -1428 436 623 1865
3427 1865 1946 -1071 -957 1942 1851 -424 -506 655 320 1728 1204 -1374 -16 2322 336 -1984 -161
3444 -161 859 196 909 -1071 -2323 595 2103 -854 -2096 -417 -519 99 1168 -1473 -2178 795
3460 795 1057 -2012 -879 1087 303 -485 -404 -2262 -953 2114 439 -2185 -654 938 218 707 -92
3477 -92 -1362 986 2541 -347 -2020 1062 1303 172 514 -63 -18 1995 1612 -1664 -932 1734 1331
3494 1331 522 82 -1172 -508 2584 1026 -2017 -431 1443 -151 -611 -183 -440 743 1657 -1272 -2815
3511 -2815 737 1419 -745 -811 -1268 -1380 1043 1161 -2246 -1985 1340 821 -1093 -960 -918 -330 1591 209
3529 209 -2173 315 1769 -85 -854 177 63 1078 2298 -1109 -2948 817 2792 303 -380 314
3545 314 -443 1037 1362 -1148 -843 2383 1330 -1535 -639 -268 508 1167 -58 -2514 -370 2538 -110
3562 -110 -2140 -536 107 290 893 -1416 -2593 326 1453 -1228 -1583 199 -162 -31 -54 -1862 -1284
3579 -1284 2235 1040 -2671 -1556 411 1021 710 250 -1900 -344 2056 300 -1577 990 1670 238
3595 238 585 -723 -1221 1914 2889 -1010 -1332 1396 1296 237 -106 -668 192 2864 992 -2209 -1249
3612 -1249 1382 879 -243 -170 -1376 -112 1871 -628 -2780 542 2112 -39 -1371 -1489 -1508 1045
3628 1045 1674 -1787 -2364 683 838 -1007 -488 -756 -605 1342 422 -2843 -1327 2184 369 -1299 -816
3645 -816 -362 424 1685 -607 -2065 1245 2509 -153 -1168 -388 -418 1655 2139 -930 -1536 1595 1642
3662 1642 -899 -542 623 971 1608 26 -2675 -630 2440 879 -1516 -584 -653 32 1181 -802 -2653
3679 -2653 384 1711 -1220 -2163 -614 304 -90 571 -1405 -1782 1373 1170 -2008 -1078 1184 730 847
3696 847 -1 -1844 -469 2656 992 -1373 -127 976 319 683 513 -609 1392 2145 -748 -1637 865
3713 865 1424 762 975 -490 -707 1383 1879 -844 -393 1750 505 -264 -170 -778 -45 1692 583 -1708
3731 -1708 -18 1054 -643 -612 144 -592 462 1280 -1386 -2430 279 553 -621 -395 -440 -1340 28
3748 28 -182 -2140 -656 1431 -148 -1474 -492 -530 -46 1585 -12 -2257 -74 1659 -356 -714 541
3765 541 54 538 882 -929 -1337 1566 1601 -289 72 562 -314 711 1316 -1181 -253 2019 689 -1449
3783 -1449 -455 239 60 1023 170 -1803 -269 906 -1083 -1230 497 24 -540 182 -1117 -1835 788
3800 788 1172 -1056 -1002 188 -123 102 350 -1415 -826 1753 704 -1193 -150 673 10 612 574 -1042
3818 -1042 -151 1789 -88 -875 862 1014 403 797 -291 -660 1398 1864 -341 -759 465 -160 -31
3835 -31 1197 -196 -983 876 371 -1284 -452 1053 -77 79 -212 -1601 -543 566 -681 -1718 -149
3852 -149 231 -634 -213 -682 -1651 31 1555 -956 -1866 213 -196 -908 -24 -301 -1193 814 452 -1755
3870 -1755 -636 1026 25 -5 528 -794 -412 1923 916 -1089 322 1284 -163 628 568 -190 843
3887 843 1722 -493 -910 961 1072 -226 674 -185 -587 899 731 -1660 -947 1312 333 -586 -98 -694
3905 -694 -905 936 255 -1956 -381 1260 -951 -973 -193 -389 558 1394 -954 -2019 530 1056 -278
3922 -278 -346 -153 -413 942 1088 -1417 -540 1749 773 -902 285 315 -39 1777 661 -1161 246 1992
3940 1992 29 -901 176 233 766 1381 -538 -1573 891 1566 -597 -475 221 -397 383 693 -1389 -850
3958 -850 1755 751 -1925 -1019 -60 -220 398 -65 -2292 -531 1142 -394 -1653 -157 -89 -124 175 -807
3976 -807 -1640 614 1357 -1269 -1132 700 492 175 486 -943 -35 2251 1350 -1128 -104 1239 376
3993 376 346 853 -1038 22 1872 504 -1329 703 1473 319 137 -549 -951 1147 1385 -904 -1068
4010 -1068 865 546 -655 226 -706 -928 997 353 -2034 -631 980 -96 -1298 -447 -890 -391 788
4027 788 -696 -1739 559 1058 -626 -708 -182 -676 484 1092 -1225 -1122 1291 984 -893 -185 585 192
4045 192 913 318 -1405 118 1817 75 -619 448 281 152 1226 -36 -1520 860 1762 -415 -912
4062 -912 400 53 504 745 -1028 -1101 1503 655 -1478 -650 274 -274 97 -97 -1549 -421 1976 -505
4080 -505 -1820 -458 331 -185 273 -893 -1698 942 1085 -1388 -1479 634 386 58 599 -812 -801 1591
4098 1591 1358 -1257 -419 1394 799 703 299 -604 -188 2168 456 -963 630 1153 87 395 184 -712
4116 -712 468 1380 -717 -1625 512 716 -584 -129 -356 -1211 384 1016 -1477 -517 722 -201 -1004 -355
4134 -355 -886 -548 1124 -326 -1848 -460 948 -440 -379 -75 -304 462 1472 -868 -1236 601 921
4151 921 -517 228 301 -734 605 846 -928 -874 1151 631 -374 35 -295 -32 1776 737 -1210 318
4169 318 1428 -86 -3 859 1 -65 1271 -66 -970 923 1269 -520 -97 411 -186 292 617 -1159
4187 -1159 -703 1000 323 -1051 -375 -276 -503 623 -204 -2061 -478 978 -364 -1150 83 -375 -255
4204 -255 532 -649 -1601 557 1597 -453 -459 403 -196 397 1132 -311 -667 1715 815 -962 -12 748
4222 748 180 763 747 -807 248 1808 -11 -960 459 502 -448 256 -43 -1397 335 1076 -822 -1095
4240 -1095 441 -391 -724 132 -1073 -1049 813 318 -1977 -728 530 -248 88 145 -1334 -487 1386 82
4258 82 -1689 175 615 -181 201 42 -783 754 1486 -504 -860 968 423 -360 664 -149 -152 1550 1189
4277 1189 -1324 -460 1398 813 -5 413 -297 173 1484 236 -1000 730 1552 -298 -37 271 -169
4294 -169 987 1516 -1132 -1752 1083 785 -694 -368 -139 -536 942 493 -2125 -785 1096 -181 -1023
4311 -1023 -151 -414 -839 386 -419 -1865 216 1205 -732 -1071 20 -395 64 789 -781 -1307 1052
4328 1052 951 -1124 -420 901 510 584 339 -1109 -114 2149 922 -1034 -42 313 264 128 -442 -1199
4346 -1199 623 1585 -1374 -1902 25 349 -105 303 -1012 -1310 587 752 -1907 -1100 694 364 -604
4363 -604 -628 -1382 -71 1645 52 -1939 -133 800 229 155 212 -468 857 1615 -500 -1330 969 1696
4381 1696 385 210 -389 -500 1518 1232 -1041 -279 1687 777 -297 57 -114 464 2010 480 -1299
4398 -1299 284 1541 427 -261 202 -91 747 1119 -971 -1619 1152 1192 -454 -554 -229 -494 235 723
4416 723 -1262 -1139 978 180 -1419 -985 -574 -527 530 -657 -1931 -238 783 -678 -1204 95 -210
4433 -210 -108 725 -781 -1675 692 1544 -747 -590 333 -110 403 698 -809 -41 1930 579 -1208 -69
4451 -69 766 498 830 508 -1188 87 1306 -69 -1160 250 480 -424 269 -874 -922 546 838 -1073
4469 -1073 -1371 769 -372 -703 170 -538 -705 989 224 -1677 -543 674 -328 -65 274 -983 -88
4486 -88 1358 -808 -623 1173 1089 -222 414 397 -574 811 1485 -547 -657 1241 620 85 527 380 85
4505 85 1391 344 -941 443 1581 -226 -135 744 -255 -129 1097 -352 -1369 724 998 -669 -496
4522 -496 136 -333 670 838 -1072 -891 558 -122 -1329 -153 -253 -777 412 -105 -1520 -594 894
4539 894 -297 -997 -355 -473 -737 548 -171 -1374 432 439 -659 -348 753 55 104 976 -315 -773 1040
4558 1040 746 -515 271 821 -173 666 790 -836 -90 1170 204 -416 386 199 -215 418 209 -849
4576 -849 178 920 -567 -608 271 9 -164 466 -752 -1137 533 852 -1290 -188 734 -545 -213 198
4594 198 -648 -573 996 412 -888 627 382 -416 645 750 -475 282 926 -623 -440 1028 465 -130
4612 -130 518 192 -686 1002 1125 -445 72 1217 -92 -215 385 -246 -230 1501 443 -1163 254 942
4630 942 -229 137 359 -1206 -458 1063 -554 -1173 597 504 -555 40 -222 -1303 186 678 -1256
4647 -1256 -984 676 -88 -810 -114 -265 -940 677 340 -1236 -268 1019 -367 -378 532 -199 163 1213
4665 1213 -372 -865 960 1144 -285 198 541 24 547 1485 -372 -687 1229 842 -549 134 304 -91
4683 -91 1062 309 -848 -86 1056 142 -426 480 -493 -252 987 -497 -1249 390 620 -627 -422 -53
4701 -53 -524 -149 670 -682 -939 769 95 -1261 75 312 -210 493 160 -829 -59 1307 22 -795
4719 -795 236 -90 -301 1033 -369 -963 598 1502 -579 -605 804 496 165 1125 -68 -475 828 960
4737 960 -975 -302 791 3 288 561 -699 -443 883 22 -1112 263 147 -592 224 290 -577 -236
4755 -236 576 -1192 -1464 154 -39 -619 -218 -427 -926 530 328 -1158 -103 1266 7 -450 485 -155
4773 -155 32 1565 265 -1133 426 1085 -87 -258 675 -111 657 1484 -254 -561 802 863 -6 434
4791 434 110 -410 403 434 -844 -26 1236 -144 -598 244 -6 -26 668 -257 -1404 -125 851 -1125 -924
4810 -924 387 -216 -71 507 -451 -932 523 560 -949 -413 -7 -410 -77 304 -1222 -551 1023 -491
4828 -491 -1181 164 123 -228 407 117 -947 -85 1343 -379 -451 722 241 -148 452 229 -593 1058 915
4847 915 -826 135 878 -372 -338 794 -693 -207 1193 256 -730 142 574 -512 322 518 -680 191
4865 191 885 -791 -1203 298 76 -847 150 -456 -990 248 656 -1018 -754 367 -19 -239 299 -311
4883 -311 -276 1054 463 -908 241 1135 398 114 878 -140 35 1453 -33 -475 967 871 -261 314
4901 314 188 -424 707 764 -586 -522 662 242 -423 614 -28 -587 690 -61 -1245 -367 827 -303
4919 -303 -853 -19 -767 -187 418 -605 -1275 252 514 -912 -173 215 -673 -174 601 -425 -1036 736
4937 736 388 -851 -101 15 -585 679 499 -1128 -522 749 -239 -526 399 162 3 667 286 -746
4955 -746 438 976 -178 -144 381 166 483 607 -305 -805 1113 750 -312 251 736 -145 495 779 -557
4974 -557 -333 1046 332 -896 163 -250 -633 151 152 -1096 60 790 -607 -900 183 -360 -439 4 -422
4993 -422 -1073 613 409 -816 -300 314 -26 -162 522 -339 10 1113 223 -611 408 737 -36 447 348
5012 348 -423 92 1346 26 -819 813 656 -220 350 -246 -899 347 521 -1023 -525 663 -498 -487
5030 -487 -84 -479 -515 596 -60 -1139 -359 95 -554 -694 135 -840 1 393 -911 -873 462 467 -689 -267
5050 -267 106 -836 369 784 -480 -276 938 210 -335 267 -57 -120 594 113 -805 406 1139 -53 -224
5069 -224 746 270 299 1021 -110 -437 837 847 -315 165 379 -100 194 716 -449 -324 704 -39 -765
5088 -765 -27 184 -290 292 -78 -1395 -373 678 -737 -1162 -208 -135 -660 130 -549 -1280 423 771 -1062
5107 -1062 -871 701 -88 -104 473 -749 -234 1019 501 -740 125 668 436 430 600 -667 292 1325 303
5126 303 -550 531 675 -284 301 339 -423 717 818 -828 -603 464 232 -695 -28 -724 -632 922 5
5145 5 -1581 -378 824 -160 -505 -225 -851 -316 518 -321 -958 10 380 -300 -386 27 -114 834 848 -604
5165 -604 -511 745 494 -173 462 -166 -100 688 664 -705 82 1264 212 -430 248 107 84 1161 333 -583
5185 -583 499 846 -239 88 246 190 545 876 -535 -916 653 528 -769 -48 140 -356 97 -7 -1090
5204 -1090 -720 696 27 -1262 -220 -282 -565 357 -160 -845 -59 752 -846 -461 262 -280 193 671 -441
5223 -441 -602 698 354 -529 -9 811 -175 99 475 -221 187 1203 361 -572 643 258 200 500 507 -586
5243 -586 519 873 -497 -788 646 314 -347 229 -578 -588 478 412 -1011 -305 331 -250 -362 328 -647
5262 -647 -449 1002 -115 -994 -264 502 -337 -312 134 -464 5 647 -610 -661 492 324 -168 99 -408
5281 -408 -737 719 10 -575 -565 967 -2 -338 165 297 -77 622 163 -989 481 768 -274 -229 657
5300 657 -266 209 661 -136 -627 435 826 -951 77 -5 -650 148 420 -545 -626 348 78 -974 -361
5319 -361 -253 -444 358 -97 -1033 -22 724 -682 -773 245 -337 -621 394 -22 -743 699 789 -490 -351
5338 -351 490 49 259 395 -155 -149 807 258 -742 392 707 -154 365 506 -393 120 1219 -312 -627
5357 -627 507 452 -234 274 96 -692 581 773 -592 -442 587 19 -291 156 -732 -439 777 38 -951
5376 -951 -77 622 -616 -318 -33 -647 -386 694 -209 -1148 282 276 -543 -268 -303 -679 532 391 -382 -690
5396 -690 474 -29 -437 174 -309 -257 551 232 -477 137 937 27 -316 447 260 51 1006 447 -581 493
5416 493 921 -255 126 269 -59 578 384 -459 -571 694 267 -416 -25 42 -473 180 35 -1119 -578
5435 -578 938 -144 -257 83 -639 -478 258 -43 -873 63 507 -706 -287 423 -77 -20 387 -103 -84 730
5455 730 812 -112 395 408 -126 411 629 88 332 768 111 -193 460 441 91 464 223 82 470 728 -226
5476 -226 -186 467 24 -219 153 -531 -546 375 86 -852 -459 248 -683 -285 353 -644 -619 350 -162 -884 -230
5497 -230 -10 -849 -268 134 -908 -151 527 -734 -587 582 146 -516 225 40 -485 322 657 -290 -214
5516 -214 866 122 80 710 341 -4 954 561 -380 579 621 81 298 241 331 34 583 -190 -362 607 405
5537 405 -442 -100 -105 -433 -56 180 -427 -816 570 -327 -675 69 -272 -837 197 2 -901 -132 206 -560
5557 -560 -128 625 -162 -130 593 47 -832 891 805 -63 -111 764 -137 523 924 -285 -1 883 517 -222
5577 -222 672 513 145 504 468 -616 50 771 -203 -313 105 129 -518 211 -257 -704 121 577 -750 -553
5597 -553 69 -371 -449 303 -638 -723 271 116 -1189 -230 161 -573 144 70 -834 -301 1010 -39 -704 132
5617 132 122 -830 257 30 -459 460 656 -136 -476 557 502 -92 146 64 -370 748 885 -753 32 524
5637 524 -47 175 673 -430 -173 1423 111 -642 434 185 -200 -99 72 -396 79 237 -705 -782 198
5656 198 -130 -284 114 -378 -591 -75 297 -987 -256 506 -266 -646 302 -561 -322 963 56 -838 480
5675 480 564 -88 110 353 14 284 826 -375 30 846 737 -306 179 301 -72 649 484 -580 -85
5694 -85 533 201 -440 146 -213 -95 475 140 -842 32 371 -583 -400 2 -305 -304 371 -439 -732 156 380
5715 380 -802 -479 381 -381 -211 382 -8 -504 829 189 -744 53 389 -180 282 130 -764 233 757
5734 757 -382 -773 561 -144 -5 475 -85 -544 542 323 -552 12 374 1 92 742 -281 -161 703
5753 703 345 -602 225 516 -349 -73 316 -413 -50 916 -318 -523 645 134 -161 -10 85 -648 33 363
5773 363 -634 -59 550 -33 -382 260 -331 -437 782 -125 -890 -92 740 -280 -139 216 -182 -173 702 67
5793 67 -634 182 502 -19 67 405 -109 122 663 -388 -275 767 64 -561 245 209 -290 293 286 -819 13
5814 13 599 -413 -388 596 -286 -458 520 -349 -683 733 544 -695 -75 291 -409 116 404 -627 -651 592
5834 592 -140 -443 113 91 -474 79 120 -926 -347 378 -484 -630 66 -208 -822 394 230 -391 419 121
5854 121 -83 -320 760 221 92 540 -14 -308 542 553 -542 460 265 -78 365 589 -316 -181 772
5873 772 284 -455 414 133 58 221 240 -529 -33 714 -230 -535 17 -247 -738 81 -51 -766 75 252 -502
5894 -502 -162 362 -715 -457 82 -406 -460 489 182 -789 90 316 -290 145 312 -301 258 450 -122 -449
5914 -449 275 281 -215 391 26 -287 413 767 -402 -240 635 98 -305 500 -213 -556 545 224 -774 245
5934 245 659 -315 -65 193 -817 -194 439 -474 -772 192 329 -501 -77 -296 -488 163 183 -846 -400 359
5954 359 -41 -618 -1 -53 -105 280 368 -420 207 1063 -159 -265 376 -79 409 1066 -116 -253 514 1018
5974 1018 -141 252 214 -103 351 992 -361 -48 1022 322 -596 -42 273 -212 32 35 -472 -329 459 -217
5994 -217 -353 196 -310 -490 113 -414 -1036 178 196 -820 -470 98 -446 -135 381 -518 -587 512 137 -944
6014 -944 95 622 -30 304 644 -554 159 902 138 -520 873 522 -200 430 207 -339 738 781 -506
6033 -506 -226 576 311 -403 260 -114 -386 192 62 -525 -406 466 -319 -300 21 -480 -90 460 -476 -966
6053 -966 281 238 -748 -402 280 -472 80 347 -734 -1011 577 118 -323 198 -113 -327 45 285 -703
6072 -703 -27 1378 -86 -110 456 -59 -103 815 -304 -732 557 857 -338 -106 524 190 212 363 -74
6091 -74 -572 629 94 -671 -168 300 -452 54 23 -839 -158 780 -390 -1158 -49 85 -477 -61 -69 -953
6111 -953 101 466 -253 -704 485 54 -441 97 -463 -481 740 256 -419 -145 700 389 255 422 -187
6130 -187 114 891 56 -668 629 662 111 173 20 -259 485 644 -619 -342 323 343 -530 96 -4 -182
6150 -182 479 84 -671 -152 667 -328 -546 321 -275 -482 379 17 -922 186 409 -364 58 -42 -241 -175
6170 -175 450 -625 -463 762 32 -473 355 -142 -401 259 115 -529 -253 970 -16 -427 426 310 -282
6189 -282 565 358 -656 179 632 -246 -129 358 -311 -216 575 -84 -256 479 412 -719 21 486 -374 -85
6209 -85 420 -429 -407 594 -139 -301 309 -161 -611 416 138 -870 -113 879 -173 -293 340 -227 -112
6228 -112 124 -78 -718 212 96 -662 -123 792 -285 -366 417 -280 -386 686 192 -226 361 419 43 178
6248 178 657 -133 -177 528 -228 -253 438 -99 -440 189 320 -604 -139 724 -407 140 494 -325 -46 468
6268 468 -45 -235 416 535 -194 271 207 -526 -94 353 -226 -357 379 -49 -448 -88 127 -532 99 -255
6288 -255 -356 -197 269 -153 -419 388 79 -298 209 -99 -540 248 336 -378 -55 584 -33 -50 323 -175 -485
6309 -485 439 159 -359 489 565 -326 253 414 -211 321 483 -30 -214 302 268 -189 303 35 -525 137 524
6330 524 -417 -144 537 -250 -275 271 -300 -665 251 120 -595 -126 437 -459 -396 366 -496 -402 406 -137 -588
6351 -588 321 185 -284 -104 434 -449 -174 550 -466 -355 387 215 -376 122 85 -177 785 167 -532 399
6371 399 551 -96 -78 606 382 38 690 -116 -240 793 407 -508 -282 467 -174 -71 285 -520 -422 331
6391 331 95 -848 -45 232 -381 -203 -363 -613 -131 592 -724 -629 -51 -30 -539 66 -181 -733 145 373
6411 373 -508 -392 530 -94 -121 337 -347 -400 876 445 -366 28 883 189 75 842 368 339 683 154 -513
6432 -513 504 477 -364 62 123 -376 224 224 -486 -221 433 44 -714 65 -308 -586 -225 -135 -607 -73 253
6453 253 -425 -452 -66 -333 -265 367 -380 -550 50 292 -374 -217 303 -372 400 392 -323 -367 516 134 -422 410
6475 410 600 142 440 380 -359 -207 656 -105 -449 265 104 -385 380 -89 -305 195 419 -401 -176 304
6495 304 -333 -91 377 -375 -452 210 -348 -689 -111 457 -459 -490 -129 -386 -55 318 -362 -810 -114 -1 -231
6516 -231 208 183 -467 213 594 -648 -112 635 -158 -428 334 379 -54 466 505 -412 329 745 -250 -371 177
6537 177 136 236 605 -189 -435 465 534 -260 80 93 -286 45 77 -560 -348 465 -124 -599 -22 -205 -418
6558 -418 -125 -19 -789 -177 111 -569 -931 147 -57 -498 132 12 -172 317 98 -423 43 724 -16 -472
6578 -472 618 -9 -403 326 140 -716 161 471 -345 263 114 -301 106 755 100 -466 321 241 -287 366
6598 366 384 -269 -51 405 -433 -256 323 -143 -393 386 -318 -594 518 136 -638 -12 114 -360 -390 528
6618 528 41 -344 -42 -31 -431 244 122 -514 -323 391 -230 30 616 -464 -277 196 -143 -356 378 208
6638 208 -534 525 458 88 -15 333 -145 -142 429 -90 -36 472 30 -227 367 371 -570 298 564 -491 -11
6659 -11 455 189 -383 182 -259 -254 -112 208 -533 -134 618 -152 -357 -26 -278 10 215 41 -633 220 155
6680 155 -380 -197 198 -154 77 29 -401 -351 693 -65 -532 145 -6 -223 63 287 -567 80 446 -164
6700 -164 -559 352 -177 14 274 -151 -274 265 534 -197 -107 649 33 -216 242 -61 -2 733 80 -386 194
6721 194 490 169 -160 403 -407 117 338 -580 -586 82 384 -428 -267 -223 -320 -3 393 -763 -131 362 -138
6742 -138 -648 240 -307 183 334 408 -584 -75 543 51 -393 -304 137 -106 228 -310 -394 573 534 -418 -144
6763 -144 211 216 196 394 -226 7 847 345 -326 178 108 -586 444 182 -652 11 368 -158 -450 336 78
6784 78 -62 -219 -173 -430 225 237 -599 -345 318 -249 -432 204 -452 -589 211 -183 -810 -323 395 -155 -265
6805 -265 53 -494 199 552 -190 -426 462 199 54 311 93 -464 398 180 -223 -190 541 313 -404 139
6825 139 100 129 383 -10 -664 255 448 -133 -146 444 -270 -198 235 -331 -572 562 449 -855 181 226 -512
6846 -512 -31 180 -648 -519 545 -216 -567 -191 97 -237 228 63 -423 -141 160 -372 -485 483 127 -245
6866 -245 292 71 -406 316 297 -331 13 335 350 230 510 -229 -213 628 120 -493 -44 434 -261 159 -59
6887 -59 -362 333 464 -293 -323 359 188 -160 -22 56 -697 -289 -350 -572 -428 304 -130 -505 -282 -392 -287
6908 -287 279 -206 -859 55 294 -304 -282 286 -114 -102 451 -133 -273 259 -46 -128 53 100 2 286 565 -554
6930 -554 -89 624 223 179 181 -48 -223 466 248 -244 -15 469 -159 -157 327 105 -236 98 3 -488 296 222
6952 222 -400 -153 202 -430 -597 -140 -626 -418 115 15 -475 86 -339 -469 -89 191 5 36 427 -70
6972 -70 -385 394 -277 -238 146 15 -294 160 443 -7 -52 460 201 241 459 26 -290 330 158 -149 56
6993 56 317 -55 384 596 -113 -304 353 9 -395 147 -176 -361 -76 348 -519 -63 -94 -307 -215 40 -41
7014 -41 -368 145 -35 -276 201 -174 -217 19 -51 -346 -65 345 -425 -194 237 -29 -421 118 308 -440 149
7035 149 290 -188 73 366 1 -283 355 38 -170 294 167 110 234 189 -71 -169 319 148 -146 121 211
7056 211 -228 378 143 -420 174 275 -432 -281 83 -496 -140 645 -183 -205 282 51 -398 306 52 -532
7076 -532 203 26 -271 -273 160 113 -477 265 133 -355 98 -24 -431 -109 513 -69 137 108 236 -63 245
7097 245 22 -586 93 501 -67 -316 460 -125 331 368 -194 -199 428 159 -235 246 -80 -306 -7 320 -542
7118 -542 178 467 -328 -481 -90 -320 -161 242 -273 -396 -43 231 -543 92 137 -9 -160 579 -174 -169 389
7139 389 16 -346 -318 477 -324 399 -91 -221 -132 489 120 -374 201 1 11 66 363 -201 162 444 -287
7160 -287 -34 381 -168 -253 105 71 -223 11 273 -309 -77 235 -333 -132 201 -405 -209 560 -50 -392 2
7181 2 293 -383 39 61 -538 -57 75 -555 -360 436 44 -186 -58 -193 -266 91 232 -501 -294 409 -77
7202 -77 -85 125 101 -302 436 -130 -436 -7 433 -332 124 294 -128 57 142 -196 -138 502 -74 -445 247 398
7224 398 -231 -33 422 -707 342 439 -285 -503 -132 -240 -370 296 -4 -417 -8 159 -438 -583 278 -365
7244 -365 -66 361 -306 -692 -5 166 -808 -23 333 69 24 226 -348 -212 430 -24 -86 205 273 6 63
7265 63 181 -162 33 362 -105 -166 368 129 -284 63 -247 -331 256 272 -229 244 436 -32 -219 204 -123
7286 -123 -239 408 2 -351 177 420 -676 -197 -46 -121 -157 234 -359 -13 303 -198 -762 -193 63 -675
7306 -675 -182 225 -620 60 155 -264 -188 222 15 -159 583 358 -147 318 363 -376 -295 361 147 131 341 -96
7328 -96 -226 409 314 -393 561 314 -32 -74 253 -236 117 462 -87 -296 81 -182 -407 -134 160 -245 -35
7349 -35 380 -315 -202 499 -333 -432 139 213 -281 164 274 -283 241 320 -107 -495 535 -153 -289 219 202
7370 202 -265 75 190 -195 279 498 -175 151 445 22 -364 369 211 -204 466 -4 -434 -11 386 4
7390 4 -44 453 -113 -129 215 -70 -123 42 -14 -228 -1 301 -265 -52 24 -244 -77 310 -273 -525 360 -77
7412 -77 -353 69 -105 -379 -284 458 -401 -314 -131 -97 -230 412 -8 -284 356 337 -133 -84 306 -228 242 784
7434 784 -139 -47 577 375 -257 119 502 149 122 85 -177 -14 602 -57 -400 409 -58 -194 204 159 -690
7455 -690 347 662 -692 -302 296 -12 -96 -14 87 -19 297 110 -783 -195 138 -268 -229 176 -400 -313 265
7476 265 5 -406 83 240 -192 27 -247 -301 174 227 -316 -303 276 313 -168 410 34 -156 191 663 -498
7497 -498 247 305 -107 -156 166 -97 -32 602 -82 -381 52 381 -209 268 329 73 -140 175 -484 -692 317
7518 317 287 -735 -94 -225 -261 105 477 -469 -189 422 5 -477 42 -165 55 25 -187 -274 156 183 -377
7539 -377 -314 388 -68 -179 259 171 -445 290 150 -353 -216 171 -112 10 414 127 256 463 -208 -289 208
7560 208 217 -203 110 527 -114 202 84 -466 -447 476 48 -347 71 -236 -416 496 -127 -462 -30 394 -515
7581 -515 -58 225 -309 -347 206 89 -942 80 368 -445 203 20 -255 249 396 -313 -381 387 58 -219
7601 -219 -250 43 -15 437 40 -122 142 588 -188 -265 794 355 -128 105 96 -375 356 502 -155 -360 98
7622 98 363 -144 338 49 -332 -33 25 -510 250 185 -263 -300 228 -654 -181 286 -524 -193 135 116 -562 372
7644 372 150 -505 51 307 -275 122 327 -170 -206 9 208 6 447 214 -379 516 446 179 72 37 -283
7665 -283 302 455 33 -196 192 485 -138 104 316 -21 93 142 -381 -101 639 10 -542 228 228 -68 75
7686 75 -209 -563 -163 184 -605 -203 12 -68 -339 244 -375 -653 -120 256 -427 -125 191 -49 -30 -27 -23 -7 422
7709 422 -64 -208 -59 167 -193 449 386 -30 79 297 -217 -195 630 -226 -132 311 357 -223 -142 561 -397 -147
7731 -147 388 -88 147 540 136 -537 287 27 -227 44 -12 -382 -227 628 -483 -53 269 -63 -457 -29
7751 -29 -108 60 -142 69 -639 -176 192 -537 -415 367 24 -244 371 -4 -226 72 200 -458 -26 245 -31
7772 -31 22 884 -178 -187 701 121 -112 27 -7 -95 381 605 10 261 275 22 -392 311 65 -444 106 131
7794 131 -470 -125 514 -158 -100 298 -339 -652 229 121 -484 379 -241 -335 -129 -47 -207 -306 293 -419 -492 228
7816 228 373 -290 251 -198 -362 292 298 -36 -304 321 -382 -41 268 -89 -101 258 220 -171 -10 587 -197
7837 -197 -61 245 -43 -331 202 -89 -385 370 77 -403 145 384 -205 -49 -15 -56 -174 178 -263 -322 30
7858 30 327 -581 -153 -76 -518 74 69 -361 -164 489 -181 -157 180 -215 -323 208 265 -223 177 191 -65 -216
7880 -216 119 122 -80 404 -184 -157 172 199 -183 380 314 -263 186 677 -70 -119 481 136 -260 535 -32 -126
7902 -126 8 260 -472 84 279 -264 -567 57 -217 -356 139 -145 -617 196 156 -527 -34 142 -99 -187 377
7923 377 21 -211 103 -3 -456 33 54 -366 -119 269 -138 -66 433 -251 -412 189 372 -343 -128 256 -137
7944 -137 286 29 -203 186 246 44 -199 349 -60 -32 378 12 -399 179 247 -177 -34 96 -266 184 486
7965 486 -370 -178 53 -33 -389 173 -84 -156 -73 4 -297 -374 337 144 -622 -135 142 -194 152 87 -403 147
7987 147 288 -186 -228 156 -117 -179 244 119 -82 260 196 -326 363 136 38 -58 413 -141 -69 486 -134 -565
8009 -565 431 273 -222 47 189 -195 8 536 -81 -55 296 -29 -105 103 -264 -292 186 171 -728 -315 208
8030 208 -226 -200 16 -425 93 326 -167 -367 182 175 -507 -260 202 -261 -22 44 -260 -370 -34 5 -528 395
8052 395 295 -66 206 199 -217 232 196 221 185 426 139 -222 160 221 34 248 101 -307 -69 224 -222 -71
8074 -71 289 -130 -205 350 32 -23 -367 99 -188 -264 176 -239 -207 474 -123 -314 146 -187 -375 -248 97 -220
8096 -220 -79 -95 30 -185 296 -150 -362 306 51 -262 279 246 -124 186 440 54 52 274 10 155 391
8117 391 136 -92 265 23 -66 226 560 -295 186 86 -256 119 329 65 -258 104 71 -482 80 436 -432
8138 -432 -10 172 -156 -113 -185 -230 -264 67 -351 -30 177 225 18 -274 32 -287 -434 -65 4 -233 348 382
8160 382 -659 266 187 -52 -41 290 38 -200 385 17 -91 456 -13 -120 223 406 -233 239 194 65 156
8181 156 211 53 199 334 5 -139 174 56 -570 -39
8191c9
##END NTUPLES=NMR FID
##END=
