##TITLE=1H_CA-8637-2
 CD3CN, 8 sc, 
 21.8.2019
##JCAMPDX= 6.0         $$ Bruker NMR JCAMP-DX V2.0
##DATA TYPE= NMR FID
##DATA CLASS= NTUPLES
##ORIGIN= UXNMR, Bruker Analytische Messtechnik GmbH
##OWNER= root
$$ XWIN-NMR		Version 3.5
$$ Wed Aug 21 14:49:29 2019 Russian Standard Time (UT+4h)  she@DPX200
##.OBSERVE FREQUENCY= 200.13155
##.OBSERVE NUCLEUS= ^1H
##.DELAY= (6, 6)
##.ACQUISITION MODE= SIMULTANEOUS
##.ACQUISITION SCHEME= undefined
##.AVERAGES= 8
##.DIGITISER RES= 18
##SPECTROMETER/DATA SYSTEM= spect
##.PULSE SEQUENCE= zg30
##.SOLVENT NAME= CD3CN
##.SHIFT REFERENCE= (INTERNAL, CD3CN, 0, 15.7039)
##AUDIT TRAIL= $$ (NUMBER, WHEN, WHO, WHERE, WHAT)
$$ ##TITLE= Audit trail, XWIN-NMR		Version 3.5
$$ ##JCAMPDX= 5.01
$$ ##ORIGIN= Bruker BioSpin GmbH
$$ ##OWNER= she
$$ F:/spectra/data/she/nmr/H-F/1/audita.txt
$$ ##AUDIT TRAIL=  $$ (NUMBER, WHEN, WHO, WHERE, WHAT)
(   1,<2019-08-21 14:48:28.65 +0400>,<she>,<DPX200>,
      <created by zg, POWCHK disabled, PULCHK disabled
       configuration hash MD5:
       00 E9 B6 7A A2 85 ED C7 34 08 36 98 17 FE 4E 26
       data hash MD5: 16K
       5C 97 63 5A 4D 1D 23 24 66 2D DE 29 56 25 5B 85>)
$$ ##END=
$$ 
$$ hash MD5
$$ 0C 1E B6 FE 6B E0 14 45 FD F2 EE 1C 00 70 66 83
##$RELAX= 
##$RELAX= 
##$RELAX= 
##$RELAX= 
##$RELAX= 
##$RELAX= 
$$ Bruker specific parameters
$$ --------------------------
##$DU= <F:/spectra>
##$EXPNO= 1
##$NAME= <H-F>
##$PROCNO= 1
##$TYPE= <nmr>
##$USER= <she>
##$AMP= (0..31)
100 100 100 100 100 100 100 100 100 100 100 100 100 100 100 100 100 100 
100 100 100 100 100 100 100 100 100 100 100 100 100 100 
##$AQSEQ= 0
##$AQ_mod= 1
##$AUNM= <au_zg>
##$AUTOPOS= <>
##$BF1= 200.13
##$BF2= 200.13
##$BF3= 200.13
##$BF4= 200.13
##$BF5= 200.13
##$BF6= 200.13
##$BF7= 200.13
##$BF8= 200.13
##$BYTORDA= 1
##$CFDGTYP= 0
##$CFRGTYP= 5
##$CHEMSTR= <none>
##$CNST= (0..31)
1 1 145 1 1 1 1 1 1 1 1 1 1 1 1 1 1 1 1 1 1 1 1 1 1 1 1 1 1 1 1 1 
##$CPDPRG= <>
##$CPDPRG1= <>
##$CPDPRG2= <>
##$CPDPRG3= <>
##$CPDPRG4= <mlev>
##$CPDPRG5= <mlev>
##$CPDPRG6= <mlev>
##$CPDPRG7= <mlev>
##$CPDPRG8= <mlev>
##$CPDPRGB= <>
##$CPDPRGT= <>
##$D= (0..31)
0 1.2 0 0 0 0 0 0 0 0 0 0.03 0 0 0 0 0 0 0 0 0 0 0 0 0 0 0 0 0 0 0 0 
##$DATE= 1566384508
##$DBL= (0..7)
120 120 120 120 120 120 120 120 
##$DBP= (0..7)
150 150 150 150 150 150 150 150 
##$DBP07= 0
##$DBPNAM0= <>
##$DBPNAM1= <>
##$DBPNAM2= <>
##$DBPNAM3= <>
##$DBPNAM4= <>
##$DBPNAM5= <>
##$DBPNAM6= <>
##$DBPNAM7= <>
##$DBPOAL= (0..7)
0.5 0.5 0.5 0.5 0.5 0.5 0.5 0.5 
##$DBPOFFS= (0..7)
0 0 0 0 0 0 0 0 
##$DE= 6
##$DECBNUC= <off>
##$DECIM= 24
##$DECNUC= <off>
##$DECSTAT= 4
##$DIGMOD= 1
##$DIGTYP= 9
##$DL= (0..7)
0 120 120 120 120 120 120 120 
##$DP= (0..7)
150 150 150 150 150 150 150 150 
##$DP07= 0
##$DPNAME0= <>
##$DPNAME1= <>
##$DPNAME2= <>
##$DPNAME3= <>
##$DPNAME4= <>
##$DPNAME5= <>
##$DPNAME6= <>
##$DPNAME7= <>
##$DPOAL= (0..7)
0.5 0.5 0.5 0.5 0.5 0.5 0.5 0.5 
##$DPOFFS= (0..7)
0 0 0 0 0 0 0 0 
##$DQDMODE= 0
##$DR= 18
##$DS= 0
##$DSLIST= <SSSSSSSSSSSSSSS>
##$DSPFIRM= 0
$$ [...]
##$SUBNAM2= <"">
##$SUBNAM3= <"">
##$SUBNAM4= <"">
##$SUBNAM5= <"">
##$SUBNAM6= <"">
##$SUBNAM7= <"">
##$SUBNAM8= <"">
##$SUBNAM9= <"">
##$SW= 24.9336996594482
##$SWIBOX= (0..15)
0 0 2 0 0 0 0 0 0 0 0 0 0 0 0 0 
##$SW_h= 4990.01996007984
##$TD= 16384
##$TD0= 1
##$TE= 0
##$TE2= 300
##$TE3= 300
##$TEG= 300
##$TL= (0..7)
0 120 120 120 120 120 120 120 
##$TP= (0..7)
150 150 150 150 150 150 150 150 
##$TP07= 0
##$TPNAME0= <>
##$TPNAME1= <>
##$TPNAME2= <>
##$TPNAME3= <>
##$TPNAME4= <>
##$TPNAME5= <>
##$TPNAME6= <>
##$TPNAME7= <>
##$TPOAL= (0..7)
0.5 0.5 0.5 0.5 0.5 0.5 0.5 0.5 
##$TPOFFS= (0..7)
0 0 0 0 0 0 0 0 
##$TUNHIN= 0
##$TUNHOUT= 0
##$TUNXOUT= 0
##$USERA1= <user>
##$USERA2= <user>
##$USERA3= <user>
##$USERA4= <user>
##$USERA5= <user>
##$V9= 5
##$VALIST= <valist>
##$VCLIST= <CCCCCCCCCCCCCCC>
##$VD= 0
##$VDLIST= <DDDDDDDDDDDDDDD>
##$VPLIST= <PPPPPPPPPPPPPPP>
##$VTLIST= <TTTTTTTTTTTTTTT>
##$WBST= 1024
##$WBSW= 4
##$XGAIN= (0..3)
0 0 0 0 
##$XL= 0
##$YL= 0
##$YMAX_a= 75496
##$YMIN_a= -132093
##$ZGOPTNS= <>
##$ZL1= 120
##$ZL2= 120
##$ZL3= 120
##$ZL4= 120
##$ABSF1= 10
##$ABSF2= 0
##$ABSG= 5
##$ABSL= 3
##$ALPHA= 0
##$AQORDER= 0
##$ASSFAC= 0
##$ASSFACI= 0
##$ASSFACX= 0
##$ASSWID= 0
##$AUNMP= <proc_1d>
##$AZFE= 0.1
##$AZFW= 0.1
##$BCFW= 1
##$BC_mod= 2
##$BYTORDP= 1
##$COROFFS= 0
##$CY= 11.3945322036743
##$DATMOD= 1
##$DC= 2
##$DFILT= <>
##$DTYPP= 0
##$F1P= 20.1720416913024
##$F2P= 0.152960286110954
##$FCOR= 0.5
##$FTSIZE= 0
##$FT_mod= 4
##$GAMMA= 1
##$GB= 0.15
##$INTBC= 1
##$INTSCL= 1
##$ISEN= 128
##$LB= 0.24
##$LEV0= 0
##$LPBIN= 0
##$MAXI= 10000
##$MC2= 0
##$MEAN= 0
##$ME_mod= 0
##$MI= 1.114404
##$NCOEF= 0
##$NC_proc= 0
##$NLEV= 6
##$NOISF1= 3.799351
##$NOISF2= 2.8
##$NSP= 1
##$NTH_PI= 0
##$NZP= 0
##$OFFSET= 15.70392
##$PC= 1
##$PHC0= -9216.728
##$PHC1= 19.20096
##$PH_mod= 1
##$PKNL= yes
##$PPARMOD= 0
##$PSCAL= 0
##$PSIGN= 0
##$REVERSE= no
##$SF= 200.130013532006
##$SI= 16384
##$SIGF1= 3
##$SIGF2= 2
##$SINO= 400
##$SIOLD= 16384
##$SREGLST= <1H.CDCl3>
##$SSB= 0
##$STSI= 0
##$STSR= 0
##$SW_p= 3612.71676300578
##$SYMM= 0
##$S_DEV= 0
##$TDeff= 0
##$TDoff= 0
##$TI= <>
##$TILT= no
##$TM1= 0
##$TM2= 0
##$TOPLEV= 0
##$USERP1= <user>
##$USERP2= <user>
##$USERP3= <user>
##$USERP4= <user>
##$USERP5= <user>
##$WDW= 1
##$XDIM= 8192
##$YMAX_p= 0
##$YMIN_p= 0
$$ End of Bruker specific parameters
$$ ---------------------------------
##NTUPLES= NMR FID
##VAR_NAME=  TIME,          FID/REAL,        FID/IMAG
##SYMBOL=    X,             R,               I
##VAR_TYPE=  INDEPENDENT,   DEPENDENT,       DEPENDENT
##VAR_FORM=  AFFN,          ASDF,            ASDF
##VAR_DIM=   8192,          8192,            8192
##UNITS=     SECONDS,       ARBITRARY UNITS, ARBITRARY UNITS
##FACTOR=    0.0002004,     1,               1
##FIRST=     0,             0,               0
##LAST=      1.6414764,     0,               0
##MIN=       0,             -132093,         0
##MAX=       1.6414764,     75496,           0
$$ Real data points
##PAGE= N=1
##DATA TABLE= (X++(R..R)), XYDATA
0 0 0 0 0 0 0 0 0 0 8 -8 8 -8 9 -16 16 -23 24 -32 33 -41 49 -57 65 -76 88 -101 115 -130 147 -166 188 -212
32 -212 236 -264 295 -329 367 -407 452 -500 554 -613 681 -753 834 -924 1026 -1142 1278 -1432
50 -1432 1614 -1835 2103 -2440 2881 -3480 4347 -5729 8280 -14594 66786 46429 -70374 5333
64 5333 75496 56681 -3624 25165 56942 24461 -31648 -6021 54729 68948 14018 -32754
76 -32754 -25235 22881 42931 17386 -11094 1934 14728 -11342 -32204 11719 56777 20960
88 20960 -47771 -36466 31234 42690 -7548 -19760 14279 13944 -24942 -19162 33287 45951 -973
101 -973 -29582 -4594 21113 15468 7982 16044 12532 -7471 -12786 7841 26655 22919 2805 -13339
115 -13339 -9312 9108 17871 8212 1341 6469 -995 -23203 -16353 23294 30817 -16061 -44437 -7833
129 -7833 25366 -1031 -29495 -4208 20385 -12916 -47124 -14582 33516 14975 -37267 -39291
141 -39291 3447 19053 -7556 -22894 -2871 12304 -5865 -28365 -14105 22131 24256 -14765
153 -14765 -35984 -3384 31257 12660 -23915 -11498 26440 17134 -25575 -21646 29975 39903 -10914
166 -10914 -37278 2379 35887 9958 -21798 -2353 27743 11136 -23135 -15219 22846 27779
178 27779 -6579 -25750 -5038 18848 11396 -9118 -7030 9105 6844 -15995 -18290 12223 28440
191 28440 292 -29850 -14460 18689 15154 -10808 -8153 13225 5703 -20184 -11492 23349 26293
204 26293 -8149 -23230 -1122 16448 6363 -2960 7391 12961 -2399 -14126 -812 20490
216 20490 18427 -2966 -13204 -658 13195 7604 -2268 4161 14048 2643 -16510 -7172 21702
229 21702 23944 -6986 -20110 2689 17822 1303 -10638 7690 20024 -3016 -25327 -5111
241 -5111 26800 20540 -11916 -19517 3325 14317 987 -6024 7451 14578 -3031 -20216 -5955
254 -5955 22704 23701 -5521 -21322 -1749 18003 7672 -8741 1409 17650 4508 -19545 -8648
267 -8648 24216 24682 -8803 -22272 2706 21227 5734 -9566 2312 15820 3537 -13812 -4298
280 -4298 18049 16654 -5359 -14141 2102 16616 8666 -5368 -1275 10560 6026 -7993 -4261
293 -4261 14935 18176 -1709 -13287 1997 16710 7283 -6026 1443 13032 5187 -8638 -1129
306 -1129 17218 15745 -4112 -9989 4179 13285 4953 -1926 4810 10198 2025 -6183 2241 14861
320 14861 10634 -5161 -8185 5724 13853 5503 -3197 2604 8590 1248 -6864 1910 15864 10165
334 10165 -8077 -9522 8096 16071 3167 -7117 1030 9389 1502 -7069 2665 16196 9135 -8856
348 -8856 -9335 8121 14702 1737 -7594 1179 10345 3428 -6210 793 13043 8783 -6942 -8597
362 -8597 6637 13586 2511 -5768 1346 10112 3469 -6872 -798 11884 9088 -5171 -7918 5934
376 5934 13690 4100 -5573 -455 7335 2748 -5332 -73 11679 9189 -4937 -8285 3679 11313
390 11313 3509 -5044 -1406 4943 1881 -3575 1394 8641 4101 -7285 -7623 3119 9190 1919 -5039
405 -5039 -2410 2923 1093 -3215 75 4841 1147 -6778 -5748 4315 8397 64 -7107 -3146 3024
420 3024 1608 -2413 310 4647 1036 -6316 -4376 5928 6965 -1357 -6338 -873 4156 806 -3189
435 -3189 815 4981 140 -7101 -4702 4203 6278 -2105 -6805 -2363 1501 -1136 -4416 -1119 3226
450 3226 -1448 -9128 -7635 1883 4672 -3340 -9914 -6173 -441 -1774 -4622 -2091 436 -4390 -11129
465 -11129 -8185 2263 4972 -3596 -10371 -7070 -800 -189 -2728 -1632 0 -3875 -8463 -4819 5204
480 5204 6843 -1645 -8483 -4849 1762 2845 1148 1160 1491 -1887 -4903 -1390 5514 6390 -112 -5668
496 -5668 -3587 2100 4031 1926 783 109 -2291 -4755 -1821 4803 6096 -416 -6173 -3558 1811
511 1811 2167 569 1028 1383 -2808 -5503 -556 5792 5918 -658 -4714 -2803 460 2994 4619 4760
527 4760 1202 -2891 -2470 2360 7372 7632 3238 -2363 -1667 3909 7824 6960 4558 2973 739 -1157
543 -1157 3532 11197 10816 1964 -3433 458 6267 6938 5980 5475 2974 -2126 -1514 5197 9044 5120
559 5120 -613 -2711 -706 2508 5301 5050 1351 -2007 -2759 -1609 1053 3940 5102 516 -4773 -4142
575 -4142 1842 4524 1362 -382 -190 -2197 -4246 40 6208 5045 -2444 -5756 -2757 620 1645
590 1645 3533 3372 -1245 -5340 -3192 1841 3929 2768 -539 -3709 -5480 -1677 4245 5315 -373
605 -373 -4774 -4884 -3251 -885 2897 3995 -1804 -7797 -6196 -294 1691 -14 -1240 -3025 -6523 -6589
621 -6589 -18 4337 881 -4887 -6216 -4388 -3382 -635 3019 1295 -4933 -7418 -3337 740 944
636 944 1106 -87 -3720 -6496 -2183 3631 3803 -195 -2329 -3521 -4174 -1375 4958 6324 -192 -5844
652 -5844 -4203 484 2193 3479 4445 143 -6653 -5962 3040 7682 3799 -817 -2930 -4452 -2810 4152
668 4152 8809 3930 -4367 -5970 -1255 2607 4629 6332 2244 -5949 -7002 1996 8502 5926 762
683 762 -1337 -3520 -4052 2366 9835 7029 -3000 -6471 -1708 2458 3841 6339 5061 -3416 -8374
698 -8374 -1682 6871 6526 1967 243 -2504 -6224 -2120 7161 8703 -276 -6234 -4080 -1083 648
713 648 4803 7035 -709 -9128 -6481 2617 5652 2759 1436 -1748 -6946 -5982 4434 9414 2754
728 2754 -5190 -5609 -3094 -1106 3412 7961 2705 -8178 -9310 320 5617 3893 1490 -553 -6298
743 -6298 -7418 850 8955 4597 -4292 -5983 -3375 -2082 868 6228 4136 -5722 -9780 -2191 3951
758 3951 2268 25 253 -3895 -7739 -2768 5877 4808 -2833 -5229 -2573 -2328 -2094 2825 4968 -1863
774 -1863 -7557 -3547 2078 1404 169 1759 173 -5771 -4671 2835 5170 214 -2546 -787 -1421 -3525
790 -3525 756 6066 2529 -4220 -3985 708 1726 111 2491 2780 -2973 -5633 -360 4462 2029 -1086
806 -1086 -822 -1198 -3171 -1453 3901 3598 -2353 -4542 -985 526 -209 1348 2783 -900 -5161 -2379
822 -2379 2784 2151 -1159 -602 427 -2497 -3084 1651 4193 296 -3471 -1565 659 -932 -421 2765
838 2765 2080 -2588 -3655 491 1879 414 453 1694 -1192 -3836 -876 3343 2545 -776 -1045 -662 -2235
855 -2235 -1405 3550 4078 -1409 -4882 -1733 1497 522 586 2009 -346 -4791 -3515 2581 4854 1080
871 1080 -2155 -2150 -2139 -1709 1853 4646 1142 -3421 -4186 -427 1838 2235 2232 -30 -3802 -3596 1409 4156
889 4156 1565 -793 -994 -2030 -2374 332 4888 3176 -2271 -3486 -128 1688 1109 1802 2101 -1160
905 -1160 -4105 -1797 3522 3564 504 -926 -1775 -1837 -247 3388 3522 40 -2413 -1906 -877 706 3093
922 3093 2988 -1545 -4723 -1910 2343 3204 733 317 -625 -3201 -2841 2117 4755 904 -3864 -2924 -214
939 -214 448 1155 1916 641 -2877 -3445 16 2419 1925 -452 -1944 -3307 -1874 1422 2438 -37 -1602
956 -1602 -1578 -1051 -770 263 1985 279 -3549 -3595 322 1715 -305 -1236 -277 -574 -2267 -1405 1610 1822
974 1822 -993 -2481 -1460 -224 3 355 323 -936 -1222 -705 278 854 948 186 -1853 -2439 -299 1965
992 1965 689 -1114 -751 281 -439 -815 1074 2486 30 -2680 -840 1773 2091 346 -199 300 -391
1009 -391 -163 1109 2508 1458 -202 -1012 288 1922 2063 951 -152 32 441 1482 936 1695 1794
1026 1794 647 -638 197 3057 3023 746 -754 250 1216 1269 998 1460 1710 66 -991 792 2440
1043 2440 2047 7 -247 665 1195 760 740 1126 914 75 -1008 174 1815 1640 624 -690 -191 681
1061 681 625 100 708 1209 -727 -2005 -446 1892 1519 -306 -1732 -811 286 138 -130 497 125 -1698
1079 -1698 -2519 -579 1675 1134 -1356 -2880 -1799 -362 -140 -14 -118 -1006 -2669 -2693 -511 1381 632
1096 632 -2055 -3225 -2048 -14 -62 -790 -1154 -1618 -2444 -2121 -656 1194 353 -2293 -2969 -1437 -190
1113 -190 -195 -1123 -623 -1244 -2070 -2034 -44 1445 223 -2413 -2657 -1291 -76 -45 -425 -388 -820 -2161 -2016
1132 -2016 2 1906 1014 -1377 -2473 -1077 861 942 294 227 -950 -2227 -1471 1148 2509 1600 -1185
1149 -1185 -2456 -519 1379 1659 1261 203 -657 -1596 -695 1556 3098 1618 -1328 -1903 -9 2060
1165 2060 2184 1381 733 -515 -1318 -652 1948 3286 1318 -1207 -1716 199 2393 2321 1436 836 -433
1182 -433 -919 76 2091 3010 1510 -937 -1185 -146 1721 2362 1755 857 -351 -949 -178 1835 2864
1199 2864 1566 -980 -1783 -325 1650 2319 968 -5 -950 -1698 -879 1804 3055 664 -2301 -2424 -577
1216 -577 1204 1891 1281 -410 -2332 -2492 -626 2002 2164 227 -2405 -2946 -1072 1562 2179 687 -1371
1233 -1371 -2018 -1800 -421 1040 2148 727 -2612 -2805 -373 1364 1587 442 -590 -1492 -2299 -470
1249 -470 2168 2386 181 -1974 -1624 -331 901 1751 1203 -251 -2001 -2186 414 1477 1758 746 -1123
1266 -1123 -2632 -1655 1366 2009 1062 -591 -1452 -1809 -750 1465 3127 1242 -2381 -2641 -537 1400
1282 1400 1936 1338 337 -2027 -2914 -51 3021 2506 584 -1663 -1753 -1036 894 3306 2520 -501 -2555
1299 -2555 -1139 826 1607 2365 1681 -988 -3140 -1032 2285 2913 1067 -485 -959 -1702 -772 2015 3367
1316 3367 507 -2123 -2337 -230 805 1472 1934 6 -3026 -2800 132 2306 1826 154 -1366 -2484
1332 -2484 -2545 465 3154 1645 -1954 -3066 -1873 -579 1000 2603 1568 -2364 -4301 -1283 2098
1347 2098 2296 462 -693 -2296 -3363 -892 3163 3225 -378 -3280 -2024 -1005 845 2603 2332 -1389
1363 -1389 -4426 -2511 1435 2317 1239 167 -1367 -2938 -1914 2547 3833 580 -2466 -2247 -1119
1378 -1119 -204 1796 3022 472 -3324 -3015 725 2411 1647 981 309 -2442 -3026 917 3838 2060
1394 2060 -1331 -1659 -1264 -811 511 3232 2104 -2484 -3353 -351 1845 1654 1404 1253 -1360 -3501 -738
1411 -738 3548 2942 -281 -1239 -1118 -1389 -148 3140 3146 -723 -3348 -1272 1086 1733 1356 1914 -514 -3085
1429 -3085 -1744 2387 3114 278 -944 -680 -967 -1072 1679 3097 249 -2803 -1588 772 598 335
1445 335 1456 730 -2343 -2452 953 2292 244 -782 62 -631 -1852 -400 2069 1316 -1727 -1884 12
1462 12 192 -704 882 1660 -785 -2934 -838 1212 358 -280 342 78 -2443 -1637 1346 2285 -583 -1608
1480 -1608 -170 -421 -1063 600 2312 335 -2643 -1809 587 462 -144 595 1045 -1512 -2190 402 2481
1497 2481 1128 -1069 -518 -449 -1296 85 1933 1806 -1354 -1971 277 968 409 914 1497 -453 -2201
1514 -2201 -582 2134 1660 -129 -37 442 -1227 -904 1932 3184 148 -1981 -860 904 656 368 1658
1531 1658 888 -1662 -2023 841 2343 725 316 23 -1074 -1384 914 2808 1416 -1392 -1345 -300 -43
1548 -43 423 2213 1152 -1909 -2567 651 2096 609 -157 346 -527 -2187 -467 2704 2097 -1272 -2714
1565 -2714 -567 789 11 884 1226 -490 -2534 -1435 1086 1459 217 -313 -976 -1676 -457 1306 1314
1582 1314 -725 -1506 -770 -878 -1075 747 1798 -274 -2976 -1814 1053 1185 -742 -486 449 -1020 -2615
1599 -2615 -248 2412 624 -2095 -1638 -527 -28 -26 589 173 -1212 -1688 -526 547 421 525 -317 -1902
1617 -1902 -1713 563 1990 115 -1256 -447 442 -1139 -610 1886 1737 -1121 -2692 210 1945 1026
1633 1026 -738 101 912 -326 -1069 1182 1552 332 -753 -561 379 739 869 18 -443 -65 515 -57
1651 -57 -258 728 1291 -596 -1590 -222 2058 908 -1320 -725 1511 743 -991 -421 1997 1209 -1172
1668 -1172 -1258 1102 1737 124 -753 120 858 271 -734 241 1282 1241 -625 -1237 462 1422 904 -689
1686 -689 -585 544 1244 -542 -747 1295 1375 -1188 -1575 730 2378 114 -2011 -885 1259 624 -1353
1703 -1353 -527 1431 522 -1604 -1338 587 1835 -278 -1815 -709 670 396 -824 -832 410 522 -1178
1720 -1178 -1809 299 1744 -222 -2075 -1240 1182 638 -1185 -1195 1389 1419 -1507 -1932 929 2345 -336
1737 -336 -2208 -671 1557 586 -1389 -760 1139 571 -1442 -1796 1290 2123 -194 -1941 -866 1067
1753 1067 807 -1103 -565 1291 787 -1640 -1912 1240 2673 30 -2527 -1149 1690 1339 -1403 -681
1769 -681 1433 877 -2011 -2054 1524 2726 -297 -2698 -937 1915 1218 -1575 -676 1601 1062 -1391 -1325
1786 -1325 1465 2475 -56 -2397 -622 2322 1266 -1218 -716 1606 1244 -1642 -1721 1586 2897 -474
1802 -474 -2723 -585 2184 1255 -1365 -792 1708 968 -2121 -1983 1942 2928 -816 -3269 -810 1899
1818 1899 782 -1563 -1088 1819 819 -2455 -2126 1592 2713 -935 -3772 -1234 1916 551 -1822
1833 -1822 -1096 1546 593 -2824 -1748 2025 3143 -1170 -3598 -1180 2557 1019 -2269 -1221 1448
1848 1448 708 -2534 -2120 1943 2954 -1129 -3546 -706 2284 798 -1916 -1270 1495 657 -2755 -1982
1864 -1982 2458 2865 -1130 -3750 -689 2713 1332 -2102 -1262 1972 714 -2568 -2052 2562 3513 -1049
1880 -1049 -4037 -699 3017 1532 -1864 -702 1880 807 -2291 -1623 2961 3634 -991 -4030 -345
1895 -345 3426 1749 -1574 -603 2328 1219 -2616 -1253 3373 4151 -1246 -4090 76 3621 1817 -1841
1911 -1841 -502 2398 564 -2482 -989 3393 3674 -1467 -4085 65 3358 1600 -1536 -686 2049
1926 2049 841 -2628 -1867 3310 3788 -1144 -4319 -219 4118 1593 -2205 -932 2458 701 -3069
1941 -3069 -1779 3631 3889 -1650 -4335 -80 3543 1463 -1866 -411 2026 306 -3446 -1486 3185
1956 3185 3649 -1667 -4335 -562 3123 1357 -1605 -774 1916 315 -3374 -1919 3519 3546 -2157 -4814
1972 -4814 -541 3535 1027 -2788 -683 2490 83 -4036 -1552 3542 3472 -2725 -4829 19 3298
1987 3298 996 -2362 -1027 1677 -184 -3338 -1326 3145 3217 -2393 -4620 -537 3544 1201 -2169
2002 -2169 -1291 2199 446 -3525 -1706 3727 3594 -2643 -5285 -259 3910 868 -2567 -409 2470
2017 2470 -205 -3986 -1413 4082 3187 -2434 -4321 221 3082 1223 -1556 -471 1692 280 -2999
2032 -2999 -1025 3711 3489 -1899 -4728 -188 3970 1012 -2627 -662 2357 396 -3510 -1083 4482
2047 4482 3434 -3264 -4642 1074 4069 381 -2392 -79 2414 -368 -2923 -185 4025 2476 -2489
2062 -2489 -3624 134 3151 1134 -2101 -1015 1409 44 -2879 -1510 3235 3656 -2203 -4789 324
2077 324 4324 364 -3246 -586 3024 -267 -4144 -762 4247 2668 -3498 -3704 1120 2904 -245
2092 -245 -2080 106 1494 -817 -2945 -927 3027 2753 -2037 -3782 -263 3327 1109 -2588 -790
2107 -790 2549 859 -3665 -1668 3994 3188 -2770 -4384 910 4234 -519 -3281 728 2800 -959
2122 -959 -3424 -186 3983 2014 -2949 -2634 832 2612 52 -1836 101 2109 356 -2560 -1272
2137 -1272 2889 2798 -2017 -3893 324 3360 453 -2697 -25 3280 77 -3971 -1305 4439 3015
2152 3015 -2909 -3589 1291 2906 -475 -1814 1365 2416 -891 -3023 -231 3840 2356 -1779 -2649
2167 -2649 616 2120 625 -1234 306 2112 -28 -2704 -1302 3303 3100 -2178 -3654 857 3087
2182 3087 517 -2551 452 2729 -683 -3771 -425 4061 2247 -2993 -2709 1492 2649 -484 -1267
2197 -1267 837 1402 -976 -2598 -15 2804 1944 -2021 -2952 -200 2368 226 -2315 -309 2017 -162
2213 -162 -3072 -848 3288 2773 -2727 -3423 1003 3042 -391 -2461 536 2379 -957 -3054 117 3622
2229 3622 1479 -2950 -2431 1269 1718 -119 -1012 321 1138 -803 -1661 -55 2947 1641 -1885 -2864
2245 -2864 410 2625 454 -2053 -316 2083 -123 -2681 -450 3515 1855 -3180 -2609 1805 2529
2260 2529 -951 -1967 1163 1870 -838 -2081 610 2417 840 -1883 -1406 932 1583 230 -1048 126
2276 126 1116 -50 -1295 -284 2288 1917 -1991 -2465 1280 2579 -424 -2243 433 2319 -372 -2800
2292 -2800 289 2635 414 -2525 -1534 1325 1367 -720 -1252 781 1071 -438 -1531 -119 1380 760
2308 760 -1528 -1645 570 1870 -286 -1529 -226 1665 -18 -2120 -637 1646 1034 -2198 -1850 1360
2324 1360 2101 -1419 -2052 90 1627 -1051 -2109 378 1841 172 -2278 -1101 657 1149 -1107 -1113
2340 -1113 251 809 -291 -1468 -378 1259 635 -1705 -1672 499 1905 -541 -1705 181 1436 -159
2356 -159 -1970 -111 1671 519 -1944 -692 1559 1558 -1048 -1628 516 1252 -290 -1473 373 1109 193
2373 193 -1283 -296 836 1165 -585 -882 216 1460 138 -908 -209 1607 781 -1312 -850 1205 1816
2390 1816 -555 -969 581 1552 125 -1128 416 1778 310 -1283 -504 1499 1161 -582 -896 622
2406 622 1189 44 -445 91 1381 327 -722 -275 1522 1578 -283 -801 482 1323 529 -424 420 1242
2424 1242 124 -1016 -519 1446 1147 -633 -1103 239 1130 10 -652 584 995 -119 -1198 -284 1109
2441 1109 909 -239 -742 116 840 43 -708 -16 513 -161 -815 -368 980 890 -583 -1452 -298 902
2459 902 195 -493 8 704 -46 -1252 -531 1096 480 -1230 -1179 -71 580 -378 -417 19 34 -545 -897 -342
2479 -342 719 320 -647 -907 -555 272 -287 -417 -386 213 -582 -1009 -568 577 428 -937 -1361 -280 451
2498 451 4 -826 -22 147 -338 -756 -246 1081 458 -686 -1030 48 530 349 -235 -185 -128 -223 -788 104
2518 104 1035 603 -572 -750 -27 422 203 -79 225 250 -312 -378 354 1187 472 -589 -807 143 712 697
2538 697 293 182 -9 -371 -478 359 1112 552 -695 -648 -187 756 454 329 -44 -177 -273 21 792 1021
2558 1021 488 -507 -855 -119 632 599 241 -30 -337 -366 -262 722 940 546 -765 -693 -369 486 609 53
2578 53 -280 -78 -692 -346 319 760 642 -388 -800 -148 430 750 122 -109 -718 -360 -361 480 587 308 -723
2599 -723 -1066 -235 37 787 237 3 -461 -580 -471 370 827 274 -915 -1225 -177 441 482 519 128 -471
2619 -471 -495 -79 526 511 553 -532 -746 -71 274 596 400 5 -352 -664 -470 536 1017 562 -578 -492
2639 -492 -149 599 535 393 -75 -407 -847 -115 652 927 313 -601 -594 -353 366 510 650 -333 -416 -348 62 743
2661 743 849 584 -506 -1191 -296 724 1123 366 -146 -813 -578 -505 640 1172 396 -455 -667 -320 625
2680 625 559 611 -38 -390 -571 299 674 649 188 -361 -522 -732 646 961 400 -379 -420 -547 -161 636 392
2701 392 272 -732 -1177 -173 538 656 460 -59 -421 -673 -185 950 704 -99 -716 -529 -158 275 673
2720 673 687 -251 -1014 -462 189 711 705 -14 -111 -736 -586 899 750 -192 -553 -665 -377 147 877 650 22
2741 22 -641 -753 -57 419 190 322 263 -448 -971 198 1123 475 -317 -661 -535 -125 341 1020 708 -232
2761 -232 -894 -251 425 384 647 717 -328 -786 -331 727 816 50 -104 -325 -684 -174 726 988 240 -898
2781 -898 -748 -102 -176 330 625 43 -957 -500 384 725 309 -177 -453 -668 -308 520 1096 346 -435 -683
2801 -683 -430 -97 282 613 232 -961 -805 -14 631 142 -152 -15 -557 -957 -90 714 488 -196 -755 -140
2821 -140 -461 8 620 538 -468 -1113 -794 -150 431 245 48 -126 -970 -633 731 669 -6 -602 -420 -157
2841 -157 -172 174 731 475 -969 -900 -31 179 425 355 277 -238 -764 143 859 607 -424 -540 -387 -307 263
2862 263 680 669 -427 -691 -82 257 339 727 414 -281 -468 81 952 668 198 -434 -29 -183 29 802
2882 802 953 75 -859 -190 558 579 170 610 313 -468 -560 729 1027 257 99 -408 -183 -37 621 1126
2902 1126 563 -140 -229 311 266 394 643 522 -176 -648 360 739 370 -283 204 4 -631 -105 755 874
2922 874 -291 -526 229 294 58 499 304 -56 -534 -345 610 494 102 146 26 -494 -382 546 468 -415 -638
2943 -638 -366 32 -170 99 791 -166 -774 -661 324 309 -477 -298 35 -135 -624 -270 405 26 -665 -326
2963 -326 -75 -178 -414 110 36 -713 -724 82 367 -18 -96 401 -556 -747 -319 696 -328 -831 -67 265
2983 265 -54 -272 254 624 -125 -901 -323 505 116 -82 64 42 -362 -626 -42 319 -226 -187 8 219 149
3004 149 161 263 -67 -423 23 92 -212 -134 470 301 -318 -38 442 239 -272 -424 421 398 -358 -385 471 66
3026 66 -272 -445 370 211 -104 -9 378 -111 138 305 241 350 -9 209 -103 67 -73 775 65 -242 46
3047 46 273 18 -106 212 371 -131 -625 -86 626 490 -531 -329 71 308 -88 142 488 119 -36 -70
3067 -70 330 218 168 -210 -181 -633 66 23 268 -143 28 -134 -94 213 494 390 -371 -331 35 93 -176 -58
3089 -58 43 148 -408 -539 391 399 -206 -228 -72 -151 -89 199 17 -70 -403 -213 -400 -41 452 402 -258 -371 227
3112 227 32 330 -76 93 237 -35 -313 112 687 223 -347 -514 -4 102 206 -17 150 -242 -313 -238 513
3133 513 653 -153 -664 -180 25 124 161 -43 -287 -205 -249 -71 360 496 -196 -284 -483 -146 266 171 222 -136
3155 -136 -313 -244 -136 387 644 173 -384 -230 -195 -73 176 -145 29 -209 -599 52 393 546 330 -552 -474
3176 -474 -22 138 529 -16 -61 -224 -325 -374 142 36 -137 -348 -459 -143 134 158 143 -398 -241 -34 -130 366
3198 366 320 74 -195 -345 314 303 183 108 -285 -181 -346 177 314 326 68 -460 -563 -267 408 412 -80 -184
3220 -184 -405 -271 -105 262 412 -79 -542 -456 -118 489 201 -1 -115 -225 -646 395 394 501 -254 -407 -430
3241 -430 465 366 344 402 -50 -216 -585 41 428 339 119 -385 -540 5 394 349 -51 -150 -432 -242 -28 560
3263 560 466 -264 -620 -644 59 112 716 192 -231 -230 -396 425 752 550 -242 -368 -436 19 377 731 -319 -327
3285 -327 -451 -87 3 248 543 -44 -382 -591 -64 246 168 214 -166 -689 -32 198 461 423 -125 -485 -106
3306 -106 -39 305 479 675 -229 -263 -513 58 301 363 67 -450 -306 -37 452 301 126 -548 -785 -344 385
3327 385 339 396 152 -682 -630 103 266 276 168 -567 -713 -204 156 658 184 43 -585 -418 49 324 654
3348 654 -216 -291 -582 -159 286 610 224 -101 -330 -478 -87 656 560 -131 -168 -256 -223 170 439 428 -74 -505
3370 -505 -475 71 791 446 148 -447 -374 151 525 691 427 14 -291 -306 206 534 460 408 -401 -584 -118 301
3392 301 300 454 97 -550 -170 162 557 281 162 -227 -291 10 -52 711 296 -277 -662 -212 100 296 357 -20
3414 -20 -259 -468 104 246 344 11 -237 -245 -407 -199 643 476 -136 -377 -354 -114 216 412 169 -27 -216 -473
3436 -473 255 266 213 126 -380 -764 -575 541 363 79 -301 -570 -469 -74 145 274 398 -731 -757 58 235
3457 235 66 -83 -217 -346 -575 -58 499 177 -284 -558 -376 -364 -6 716 233 14 -867 -10 218 126 -201
3478 -201 110 70 -426 -135 378 391 149 -135 -184 -178 15 219 572 229 -213 -356 -246 331 412 371 57 -747
3500 -747 -604 263 253 412 -206 -428 -69 -250 280 546 285 -292 -453 -43 273 269 59 290 -274 -236 -586
3521 -586 494 216 275 -179 -1 -203 209 332 313 321 -371 -115 -10 159 295 492 246 -466 -85 532 681
3542 681 39 9 182 11 -83 -64 743 74 -304 -124 91 82 205 285 79 -270 -334 265 318 219 23 115 -45
3565 -45 -425 333 653 197 -659 -497 -179 96 -310 453 187 -107 -466 -327 495 187 23 -288 -115 -447
3585 -447 -143 134 576 -163 -451 -426 36 207 -22 295 -155 -167 -206 294 205 -93 -73 -170 -547 -169 350 393
3607 393 166 -400 211 5 -77 -31 406 106 -509 -533 286 137 58 -198 171 100 -257 -45 176 477 -362 -373
3629 -373 32 -10 293 251 121 -520 -274 -8 -13 -65 -62 118 -223 -422 105 618 299 -439 -155 34 -224 -578
3651 -578 -70 472 334 -830 -129 201 107 -150 33 -58 -133 -243 -153 133 129 -213 -80 -244 -215 678 231 -466
3673 -466 -245 411 157 -87 -152 324 178 -315 -380 283 400 -198 -136 46 362 -172 -30 210 709 -33 -446
3694 -446 -132 231 -163 98 -193 -441 -254 -99 -195 -82 524 218 -325 -400 326 313 216 -318 -343 183 228 -344
3716 -344 459 440 -92 -320 -371 423 460 -220 -306 98 202 85 -37 -141 205 -94 -456 5 370 188 -257
3737 -257 -544 16 102 235 -323 -143 344 114 -500 -313 454 1109 136 -286 0 216 57 -427 -244 153
3757 153 -224 -547 -307 555 255 -334 -434 -313 531 -107 -456 -197 33 -47 -458 -387 409 525 110 -512 -435
3778 -435 390 239 -200 -284 240 -108 -630 -137 768 391 -351 -664 -206 552 113 -68 246 501 -134 -842
3798 -842 100 479 425 -644 -425 -149 475 245 -387 -179 272 -199 -342 -179 463 644 -312 -489 -185 642
3818 642 255 -480 -85 482 145 -924 -211 825 440 -662 -887 -144 301 250 -368 -177 365 -42 -549
3837 -549 -128 701 666 -508 -719 68 872 286 -480 -93 105 146 -376 -161 905 685 -112 -901 61 614
3857 614 -68 -398 -156 627 109 -691 -11 1032 661 -382 -530 100 721 24 -162 -262 257 10 -587
3876 -587 -139 784 562 -695 -607 76 1049 263 -718 154 523 -191 -686 -160 821 450 -388 -765 341 884
3896 884 -134 -346 -34 275 -85 -472 -69 677 727 -705 -643 213 959 92 -412 -38 177 43 -557 -57
3916 -57 856 593 -616 -615 -4 680 314 -677 -187 317 249 -630 -413 499 404 -959 -1120 -70 598 -73 -465
3937 -465 -203 180 -361 -467 -116 820 420 -698 -915 396 603 9 -175 222 332 -48 -876 -63 593
3956 593 436 -668 -936 338 944 193 -582 -111 400 -10 -1016 -98 792 478 -349 -810 346 693 171
3975 171 -621 75 419 -136 -600 328 880 423 -786 -553 162 924 43 -507 186 402 4 -435 -71 805
3995 805 717 -745 -839 300 1045 -412 -438 198 633 2 -661 258 900 478 -907 -552 306 670 84 -438
4015 -438 131 731 -302 -475 238 884 485 -790 -869 420 884 -95 -443 205 636 -472 -545 226 1276
4034 1276 345 -668 -757 20 809 -124 -382 204 603 -24 -535 251 1260 400 -678 -541 448 655 -108
4053 -108 -704 -52 567 -238 -813 162 532 273 -720 -808 476 896 -23 -740 127 252 -444 -755 110 1150
4073 1150 80 -1078 -881 581 1036 -78 -337 -134 482 -169 -380 -142 750 459 -928 -486 647 608
4091 608 -41 -447 137 333 -255 -771 289 821 19 -938 -676 570 774 -59 -576 -7 380 -547 -364
4110 -364 206 717 63 -862 -563 330 577 7 -259 358 406 -332 -530 350 947 218 -675 -715 613 849
4130 849 -32 -414 174 385 -178 -771 290 702 456 -917 -534 581 676 -231 -582 66 369 -160 -400
4149 -400 315 364 45 -567 -659 382 810 -239 -462 -2 212 -457 -302 106 640 113 -810 -572 609 672
4169 672 -290 -564 231 580 -517 -462 145 848 -105 -845 -556 356 633 -243 -514 230 447 -467 -720 105
4189 105 732 58 -951 -246 307 682 -56 -493 -180 678 -128 -363 67 615 29 -676 -216 705 507 -390
4209 -390 -744 217 490 -157 -355 27 699 -104 -666 -281 497 580 112 -496 64 108 -73 -192 476 654 -27
4230 -27 -462 -487 664 539 -348 -777 140 190 60 -645 326 534 -174 -721 -216 609 722 -198 -535 180 464
4251 464 -434 -26 -133 721 -253 -273 -151 366 567 -345 -329 21 256 -459 -205 -180 283 95 -378 -233 534
4272 534 426 -321 -833 17 329 -172 -485 320 348 -16 -677 -386 789 343 -67 -359 250 137 -187 -112
4292 -112 321 311 41 -686 -253 33 376 -508 -376 -153 202 -99 -387 -41 784 187 -678 -89 586 416
4312 416 -442 -677 229 437 -106 -244 562 234 -354 -506 -45 486 58 -238 -394 -19 415 -162 57 7
4332 7 205 -5 -280 -379 137 405 -221 -557 -11 359 -305 -31 274 569 72 -490 89 392 321 -336 -422 505
4354 505 71 -45 -43 217 5 -97 -403 27 216 477 -76 -447 -118 461 -67 -116 -225 472 -8 -547 196
4375 196 442 380 -396 -440 -7 289 -227 -446 -129 479 -174 -465 -35 220 120 -661 -46 81 86 -161 -356
4396 -356 -89 251 -247 91 -130 22 171 33 -201 -7 263 92 -169 47 360 -331 -434 147 508 -260
4416 -260 -264 113 254 216 -188 -71 140 387 -103 -148 303 -187 -92 -15 -241 322 144 -46 -125 -13 130 156 -238
4439 -238 -238 253 239 -68 -355 83 435 -61 -181 109 118 -276 -171 -142 331 247 -260 -367 332 45 -190 82
4461 82 -111 18 68 -308 191 137 152 153 -5 311 416 266 -36 30 -154 112 -271 118 299 171 -168 -366
4483 -366 148 213 168 54 22 473 -275 -274 -121 550 89 -163 -281 294 163 277 231 -146 151 -69 31 156
4505 156 -269 141 -202 -131 -98 129 139 -22 143 -317 -296 -281 237 506 43 -391 -517 155 308 16 298 -181
4527 -181 80 19 100 336 251 44 16 -107 -154 242 -16 -259 -182 -81 -16 41 275 413 211 -199 35 181 74
4550 74 278 31 175 -397 -67 31 326 222 -190 6 -103 -5 176 12 91 -284 -53 -281 -234 196 441 68
4572 68 40 -24 -92 368 -110 -254 -172 -121 -104 -119 143 332 93 -297 -164 203 52 -186 -146 -372 -159 -107 -243
4595 -243 317 385 -307 -108 -60 143 150 -97 177 -217 -214 -194 106 213 465 -23 2 -112 -70 329 126 -139 -150
4618 -150 -5 41 -2 168 270 -239 -154 101 44 -87 -289 -245 -78 -133 -42 204 178 186 -197 -331 62 69 78 110 -240
4643 -240 -106 216 -209 -94 133 376 -102 -330 65 207 70 187 74 -254 29 35 279 17 -25 53 -118
4664 -118 -1 -134 264 206 177 30 -375 -255 -132 230 108 -129 -104 215 114 428 157 -163 -196 -243 86 39
4686 39 338 -130 16 164 -190 -86 499 325 191 -287 -114 -5 -33 39 239 -50 46 -424 66 80 -121 252
4708 252 -222 -80 25 -66 226 -101 -143 -251 -37 -36 227 292 -15 -67 18 13 -180 389 284 -330 -152 283 28
4731 28 157 46 -148 -312 -220 56 264 -107 -120 -354 -180 -199 -245 -234 -143 91 197 227 -27 131 399 -6 -222
4754 -222 -109 -154 124 -90 197 204 106 -213 -173 -4 337 143 -68 -83 -5 208 177 -109 13 -57 -5 -137 146
4777 146 -12 59 83 -84 99 83 276 156 -27 -404 -198 69 272 284 -39 -75 -314 60 -63 52 195 -90
4799 -90 -91 150 231 255 129 32 -332 -160 -207 124 110 -51 77 -310 -220 84 283 -217 -114 -70 -4 -160 -133 338
4823 338 122 199 165 60 -28 219 71 442 -521 8 -284 123 109 -352 -340 37 -66 -131 244 114 80 127 -418
4846 -418 -30 476 175 122 -76 -91 192 -158 95 -84 53 178 -576 -210 186 167 85 -350 88 -109 -16 71
4868 71 15 -179 249 -52 212 187 89 16 -147 101 244 -34 -109 70 -124 -93 -84 262 -146 -11 54 54 -77 172
4892 172 33 279 26 181 27 39 -95 -87 85 364 72 -133 -116 -189 284 -29 150 -132 -142 34 113 73 22
4915 22 54 -191 266 229 42 162 -95 -72 -134 -19 312 -75 -147 -120 -162 377 265 -239 69 15 25 -51 69 237
4939 237 169 -31 -139 -48 -103 13 8 105 -74 -161 41 53 93 -64 -80 405 -237 121 383 -51 11 73 -185 122
4963 122 91 -147 186 70 171 -34 132 -94 291 -228 -37 59 -20 224 98 -26 -308 -199 91 -18 -35
4984 -35 -79 22 -353 -467 -387 158 80 191 129 7 203 250 -32 29 41 -47 31 150 99 78 92 -51 -30 -334 -190
5009 -190 70 -114 201 -117 -206 87 92 -49 -109 257 -240 -95 295 -209 87 -71 -165 135 -76 40 -26 -121
5031 -121 -225 -1 379 47 -9 -256 -118 276 -247 48 257 140 -21 -186 -259 34 -37 -167 178 50 127
5052 127 157 -36 29 -215 30 303 11 -30 -78 9 -98 173 88 93 67 -171 55 -57 46 -310 -34 125 100
5075 100 -30 -20 -193 156 -5 1 75 -7 212 120 99 21 1 -336 424 -122 53 81 32 217 201 -222 348 76
5099 76 -154 372 118 -138 -92 1 -237 372 136 135 -30 -99 222 -178 314 -12 -22 -21 -184 71 119 271 -23
5122 -23 -332 -38 -32 167 142 243 -124 -70 22 96 -43 -244 34 79 162 218 147 148 41 -161 299 101 144 36 42
5147 42 157 -77 7 53 -65 125 133 -155 -187 39 -128 -2 135 -211 -185 -160 -124 31 -47 -42 -255 31 41 127 94
5172 94 166 166 48 -68 35 -70 -92 406 64 -101 164 202 350 190 -65 -236 -251 -143 338 -112 -153 -98 -204
5195 -204 10 340 57 240 -68 172 -73 -99 106 -154 -71 -342 -143 285 51 305 352 128 -265 -7 149
5216 149 176 191 -56 -68 -81 -88 -191 237 14 -98 67 13 155 80 -167 82 -48 245 49 -29 -106 183 -400
5239 -400 -58 74 1 -258 4 156 -52 29 134 -40 151 51 180 330 235 204 -65 3 15 129 -202 -61
5261 -61 206 170 95 -60 15 -87 -105 197 -79 28 -35 -87 73 396 -52 290 177 -33 140 -48 -255 79
5283 79 58 95 45 -34 68 89 164 216 93 -321 125 108 -279 161 -414 -343 232 234 373 -154 -82 -178 190 254 246 229
5309 229 144 -289 -185 -46 197 55 -188 -131 -378 79 -183 65 -17 116 -81 -233 -35 210 189 -41 -38 -331
5331 -331 -108 285 -218 18 -103 -5 -82 95 230 75 79 31 -292 267 97 80 378 -49 4 -152 119 48 -51
5354 -51 -359 -3 47 57 178 133 -301 84 -342 51 109 60 81 6 -103 -283 -177 13 207 42 -148 47 1
5377 1 190 -105 103 -448 -279 30 -55 156 -14 208 16 -219 357 316 286 86 -38 -22 -202 302 2 -22
5399 -22 206 68 -80 -94 70 25 315 -217 -6 197 93 -107 -18 155 -43 332 -57 -97 357 -115 49 99
5421 99 -33 -455 -13 14 -67 -44 120 -63 -141 64 -64 -45 23 -44 151 193 10 46 8 -116 18 259 54 126
5445 126 51 -78 -173 -84 193 93 182 -5 -104 -187 -121 -8 84 150 -243 -234 304 -172 -82 -144 164 -14 17 17 -277
5470 -277 159 86 -208 -66 8 -31 154 -142 139 -119 239 210 50 -7 -197 -160 -123 138 124 20 -95 109 62
5493 62 -272 427 59 -180 -116 234 -178 28 206 247 -48 31 -184 107 77 3 -258 297 -162 -433 -30 44
5515 44 267 -119 -258 -462 29 -82 -47 10 -12 74 -96 -90 106 104 -38 15 -26 263 -86 -107 41 254 -112 -17
5539 -17 297 92 201 -91 223 -132 -8 51 262 44 45 126 -197 29 70 -136 -66 56 221 136 -220 -72 -58
5562 -58 -34 193 -60 -21 95 -35 -238 203 120 110 110 196 167 -15 -271 -37 62 -71 243 0 -81 -29 69 22 -113
5587 -113 14 -115 42 34 -107 243 -220 -232 -346 102 87 -189 41 200 -136 -22 -112 -32 87 -178 -106 -357
5609 -357 68 135 81 476 59 -48 -61 -220 169 -257 16 69 6 -178 -30 -95 -34 -200 -197 -164 -92 -54 137 132 5
5634 5 -4 -306 93 -11 319 -30 212 261 -58 78 -7 54 44 187 -131 109 229 192 -166 -25 13 35 70 -114
5658 -114 -385 -248 -142 42 -2 -22 30 49 -69 -379 -16 -107 -178 -96 73 115 100 116 195 33 26 -80 202 -80
5682 -80 -280 197 171 164 -67 145 73 49 -61 16 -294 -150 -41 71 -12 -207 241 87 108 0 35 -40 -209 -25
5706 -25 -256 287 250 140 -252 -13 176 -267 -24 -39 -27 31 181 17 -92 166 -16 260 276 -206 16 -377
5728 -377 -145 -99 -46 23 -347 -76 180 91 38 -1 190 116 145 308 -45 127 105 -53 1 137 -230 -109 -88 -38
5752 -38 -20 -236 95 -192 223 -248 -421 22 360 -249 -111 -144 -370 321 431 62 -61 -149 103 290 -45
5773 -45 -73 58 -73 -143 -201 186 188 -216 108 -56 -6 -180 -19 -148 101 -170 -42 -92 -242 275 -33 -227 60
5796 60 73 -176 -287 47 190 -273 58 -19 127 112 20 96 -36 -100 30 -231 30 214 115 -80 -52 52 -267
5819 -267 -385 -18 369 328 27 -288 10 -51 -283 -195 -223 194 -234 -45 -79 100 -93 -171 -96 -138 78 110 -126
5842 -126 -27 285 62 -77 -58 53 31 -178 -327 405 29 -120 -138 -110 -103 -67 -174 -68 281 228 201 -85 141
5865 141 27 -268 18 95 295 -3 -223 -93 -135 225 -117 158 24 -91 -110 -233 46 -16 -75 126 -168 84
5887 84 285 68 -3 149 -193 -163 -192 165 277 106 -306 -70 282 -28 -62 -261 113 25 -66 18 66 253 281
5910 281 -75 -203 144 -4 -148 -207 -61 148 0 269 252 338 -68 -43 197 176 120 -219 -12 6 5 -340 -133
5933 -133 391 61 2 -103 -49 -226 -75 -19 86 249 -78 -32 -216 256 443 -110 230 -13 217 44 -155
5954 -155 55 -201 186 -65 119 -137 423 190 -46 -109 -184 132 277 35 15 -308 233 -119 80 109 87 -262
5976 -262 338 262 48 -46 164 119 255 -181 -246 50 83 111 -113 103 -104 196 -394 84 105 -10 -18 -191 116
5999 116 142 -37 -180 -48 183 223 -85 210 196 110 -352 30 -69 -91 45 -465 -114 148 139 -313 38 266 73
6022 73 4 -186 49 -17 -187 222 151 52 -90 -184 302 -74 289 -77 -581 152 226 145 -23 -316 228 135 -234
6045 -234 -236 126 -60 100 -333 275 272 16 -197 -47 118 50 -140 -71 135 69 102 241 108 89 -120 203 114
6068 114 53 200 -159 128 184 135 -49 54 -140 -75 -175 45 335 124 173 130 -79 116 133 -144 3 111
6090 111 116 301 31 -5 91 -56 101 -133 213 -164 -93 -90 385 186 -158 -8 -35 162 257 -120 -260 136 175
6113 175 28 -111 -43 15 -4 -165 68 149 -18 2 -34 301 51 -257 -88 217 111 -142 -101 -82 43 179 -40
6136 -40 124 326 136 191 195 42 301 -356 -4 225 143 -66 13 228 19 -40 -462 -84 193 162 240 -389 165
6159 165 83 -32 206 -77 401 47 -129 139 105 286 -317 48 125 414 66 -287 -311 100 202 137 -123 -122
6181 -122 239 28 -448 78 148 143 10 -104 309 197 62 -279 108 15 -122 -11 -36 -23 -266 -223 -132 158 -136
6204 -136 -178 152 -7 131 156 287 53 -16 39 357 -43 207 -140 -75 -251 -137 324 -49 121 -84 66 -145
6226 -145 -180 -210 -45 157 -200 -56 122 222 43 -103 -223 -92 83 193 186 238 130 -157 129 -2 446 -150
6248 -150 -172 177 -20 47 -72 -16 133 -168 117 -276 -219 193 -219 1 348 192 -487 103 -18 -32 -31 -126 -58
6271 -58 67 231 -85 -32 7 290 112 -186 -86 51 123 -124 -308 242 -68 -19 -185 66 -31 -85 -192 -175 -147
6294 -147 -184 66 -63 398 117 -171 -246 120 363 -4 -49 153 161 -61 -82 139 29 104 8 114 -137 88 -19
6317 -19 -165 94 -82 -66 84 172 220 -136 -265 -164 46 -44 -119 -280 -160 116 -171 48 -67 149 77 -32
6339 -32 195 -80 -82 101 176 -10 54 293 -191 -206 71 136 276 -50 192 220 244 24 117 -90 -52 -87 15 211
6363 211 489 11 -110 -57 24 25 -130 -401 68 5 23 -14 28 128 -61 -8 234 206 -218 69 27 29 257 -146
6387 -146 -68 -135 -118 79 -214 13 136 -258 -169 -51 -81 151 -216 -147 314 -109 -108 138 109 205 -165 -125 -123 413
6411 413 -115 1 -44 155 136 -349 -157 21 194 37 -4 -93 -25 164 -33 -118 225 -109 56 -142 -207 154
6433 154 -215 -297 38 -103 13 -138 -43 321 66 -5 -152 163 144 113 -194 -18 229 52 44 -98 27 -82
6455 -82 -27 -287 155 274 -110 -160 22 -105 -132 384 203 305 8 47 -207 113 173 -125 -16 158 147 40
6477 40 127 100 -41 49 -41 38 87 7 180 -142 73 203 -34 -6 -192 -108 -69 -113 -48 -129 237 380 138 -135 -212
6502 -212 -59 -69 46 154 -31 127 153 -344 -27 -9 -142 239 -25 -83 237 -51 -42 -26 -154 86 -309 79
6524 79 35 -90 -349 194 -94 141 75 -173 93 -197 190 -130 82 -124 -280 -288 177 245 141 -26 -66 118
6546 118 -80 84 -288 126 135 4 338 197 -25 84 200 -49 49 10 -44 -13 -192 13 -29 -203 134 46 -154
6569 -154 43 -253 73 29 -85 59 -134 -36 -13 110 -134 -112 71 208 14 200 10 38 172 -118 -289 -131
6591 -131 -75 8 -166 -71 -158 -49 -124 15 -39 174 -29 22 -20 -165 -9 -33 324 -27 188 -13 -94 -77 39 214
6615 214 15 -152 187 34 -422 182 214 220 194 -232 42 -60 40 -97 -191 4 -42 70 118 -85 -13 166 -179
6638 -179 -14 -188 177 -129 -58 -52 156 206 190 215 59 34 -6 -163 142 -11 -225 -106 -111 -285 -127 -15 -16 219
6662 219 -76 125 216 46 136 117 -243 221 147 -332 193 -178 -50 -48 239 -105 -52 -79 -100 170 -115 -207 6
6685 6 -354 -155 16 5 -238 15 -156 -55 269 170 -165 82 -168 430 169 99 84 4 174 507 69 -200
6707 -200 -96 7 -184 -155 -226 187 -21 -286 -53 432 -219 130 33 108 120 -25 44 99 355 203 -143 -10
6729 -10 106 95 341 257 -11 -195 63 -129 227 -178 -70 66 26 264 83 -30 84 -319 -210 -6 -26 13
6751 13 167 8 86 177 -163 -77 96 -68 -176 165 -10 102 -197 161 32 -97 230 -95 -119 113 -209 99
6773 99 -119 32 325 -262 -23 127 121 -185 43 -157 62 201 -199 259 202 -118 10 259 8 -38 -144 232
6795 232 -129 107 247 -50 194 68 385 -70 79 -46 -65 175 208 75 169 30 44 -314 217 69 -66
6816 -66 34 -12 250 40 -73 170 190 -17 186 178 -89 -101 207 -24 -22 165 44 131 -106 173 -216 178 119
6839 119 -105 -85 -228 -79 -194 162 40 -22 4 -128 -106 -18 7 62 -46 -29 -18 -337 -107 82 -93 -156 113
6862 113 85 111 125 172 128 -125 109 -188 -385 -157 46 -158 -21 -230 70 303 -22 109 -34 -2 69 333
6884 333 -57 -197 -112 248 -102 42 37 -30 53 115 -106 238 -125 92 44 -189 -82 -16 -75 101 -23 86 283
6907 283 -236 -63 -303 66 -165 350 -41 0 95 52 101 225 124 -41 293 -51 94 -25 62 302 -14 -79
6929 -79 129 43 -162 194 -57 -268 -161 270 -251 -219 97 180 128 77 -234 -1 236 283 117 -29 -104 -119 349
6952 349 -140 -233 179 -136 48 104 184 -8 -36 -119 226 211 162 9 106 -163 69 45 49 5 113 52 -49 103
6976 103 55 83 -31 44 36 -26 -95 196 -210 493 269 -78 -365 -197 7 122 333 141 -92 204 183 -281 -59
6999 -59 -57 -117 -67 62 225 -131 -114 -87 44 311 145 -291 -8 1 -97 -50 -133 -7 61 100 -62 -137 206 -5 -360
7024 -360 43 238 141 -276 39 16 -139 -132 -235 -35 -176 43 141 174 26 -47 -42 327 17 -108 -32 -265 93
7047 93 -125 106 -208 213 -264 -5 172 155 93 -215 -295 88 100 -109 -25 -142 45 100 -164 -128 -41 28 -98
7070 -98 -69 50 144 -51 -207 143 138 -249 116 -40 -256 -64 166 -41 -13 -375 -90 -136 352 -69 -129 115 -217
7093 -217 42 -176 -216 140 126 3 -66 -15 72 249 -74 60 187 42 -336 76 125 -123 -75 -1 -189 33 14
7116 14 -80 173 -185 312 -3 28 -218 -48 -186 -314 133 -196 -143 190 -73 23 -73 -112 -145 -125 -116 62 -9 -3 157
7141 157 -142 26 -92 -59 -112 121 10 -23 171 103 -64 125 -101 167 458 -48 44 -22 -31 84 -20 -44 -120
7164 -120 28 224 -124 -208 -258 -156 107 115 -4 117 -4 163 -174 112 12 3 27 274 102 103 76 -163 221
7187 221 -26 158 -158 -8 60 259 -306 -355 -99 -294 -215 121 34 -7 -43 304 7 145 162 -25 -135 -75 -94
7210 -94 233 309 -91 -135 -130 24 -53 -173 121 66 94 -94 -61 -222 41 -95 30 143 -116 -97 71 -47 -1 13
7234 13 201 148 -48 203 -129 123 -119 91 -3 1 -35 25 128 202 -193 -28 -45 366 148 -127 279 -181 -40
7257 -40 94 125 63 193 -35 -72 79 382 -76 -91 133 -14 30 109 113 -162 -31 -122 -69 -121 77 278 -79 -137
7281 -137 -27 180 -75 32 -282 63 -289 -24 59 16 -305 -28 -113 -29 219 -152 157 212 168 101 69 90 -33
7304 -33 -271 35 -4 -152 -204 95 128 99 175 141 -317 40 65 -119 -1 -304 13 -187 -44 -188 8 6 -107
7327 -107 -59 48 -87 137 -130 251 87 142 -176 -95 -256 -147 -394 -242 239 9 28 55 129 -90 -5 -27 -40
7350 -40 -50 62 -169 259 75 -170 -13 239 63 -180 434 -87 108 242 -22 -144 203 -220 0 -42 306
7371 306 -24 34 -28 281 -416 -190 -42 55 -305 -118 131 281 4 -93 48 -393 -194 -11 -54 106 399 59
7393 59 215 -12 -342 -4 72 77 367 163 15 58 -34 119 276 -19 38 -281 46 93 138 -25 -106 -71 66 32
7417 32 50 337 132 150 -40 7 -46 -136 -82 -143 54 89 222 -15 -70 -35 -47 -100 -196 41 -14 -56 202 -86 61
7442 61 119 -419 85 242 -24 -66 -150 138 8 -268 474 232 -88 -145 46 -16 97 -57 118 -96 -240 -208
7464 -208 -76 35 -41 70 -214 158 -147 -126 120 184 -239 57 -275 -164 24 -50 -174 60 20 137 196 -157
7486 -157 102 138 147 -47 149 -107 -135 -65 -160 1 29 -23 247 -17 334 166 52 106 -137 -67 77 54 -392 -196
7510 -196 -353 -57 47 51 -66 -135 25 132 62 90 244 232 -153 -130 37 117 -32 -148 -150 80 -137 -299 -305 -94
7534 -94 49 25 -128 220 236 -54 0 110 154 -107 -131 -69 -1 -180 208 209 -100 79 -87 -187 11 250 -163
7557 -163 -50 -30 -245 -103 -48 -27 -137 13 116 -3 -192 -270 -55 189 -288 123 -28 -82 156 -74 67 -216
7579 -216 26 -510 -91 -270 -194 -61 6 122 146 -169 116 10 336 392 -96 -65 95 0 102 533 213 99
7601 99 -160 -355 215 198 55 -123 170 -6 -272 124 39 -52 -103 -25 114 -48 -50 74 -277 28 -109 144 11
7624 11 -80 108 -178 -163 30 -241 66 -226 -43 105 110 82 23 -45 60 112 -66 -118 -253 -36 -76 -97 212 -38
7648 -38 -34 335 79 -175 -13 154 32 -65 98 15 34 -58 -163 141 141 172 479 -1 16 -42 1 -154 119 -15
7672 -15 -4 52 -19 -120 -108 54 -302 82 110 238 285 129 26 198 183 143 -233 53 -52 76 124 48 -131 42
7696 42 -96 -75 -79 -337 74 -142 110 -100 45 210 6 -342 -136 33 15 -308 -46 -48 326 5 44 98 -84
7719 -84 -66 144 29 340 102 -1 234 65 -140 311 7 -59 -129 -384 70 -145 -56 157 55 -178 328 -80
7741 -80 -124 31 43 -69 89 -359 -139 -9 3 -303 -164 -121 -110 -83 -164 325 94 35 -83 281 295 -114 84
7764 84 -50 80 431 218 -99 147 44 -44 83 33 70 222 44 -348 -78 147 10 -170 -71 -2 -59 -80 129
7787 129 106 203 -259 -95 221 -96 105 -12 1 94 -54 -44 168 18 -282 119 -143 138 -11 69 -52 -17
7809 -17 -33 -52 -69 217 -30 -46 77 111 -11 162 -115 72 -197 340 92 113 -75 248 94 -196 543 38
7831 38 10 21 14 -191 186 -146 -23 37 -81 3 30 66 183 -135 186 -413 -85 48 -192 -124 23 -172 -322
7854 -322 161 -19 123 -42 -55 -98 -5 64 182 -176 203 -265 -123 -120 112 71 140 -177 132 186 149 -96 112
7877 112 73 -234 -227 -265 -67 -8 146 -88 -81 -121 88 48 -201 26 61 -412 -131 98 181 45 177 24 -80 -195
7901 -195 -9 115 124 -42 -45 52 151 164 289 -208 -61 98 -179 330 128 -40 275 -183 -28 120 49 -54 -25
7924 -25 -258 119 -177 -93 -42 246 124 166 -330 -201 141 49 69 -218 -105 -22 13 57 47 -102 30 -111 -273
7947 -273 78 -119 -34 83 100 399 -203 -150 260 -61 -97 -84 -10 121 -173 -272 -8 -53 136 -116 233 -131 323
7970 323 98 156 -63 -46 99 39 48 100 -29 -111 -228 155 -71 157 -174 -150 -31 56 -114 -153 9 83 241 -174
7994 -174 -27 100 82 45 -40 382 -219 -29 -31 -237 135 -363 -213 118 -90 -185 -201 7 328 87 119 -99 -20
8017 -20 -103 237 53 -76 95 168 17 -73 207 -134 -95 305 160 -189 -148 260 302 117 -85 -249 68 165 -76
8040 -76 -171 -68 -26 161 87 -345 124 175 -124 -194 205 -180 -233 178 73 -89 317 -43 -137 -61 190 -33 -238
8063 -238 -25 313 313 -284 -133 -129 70 43 170 -35 112 234 -127 84 79 415 159 193 2 61 -4 -59 177 98
8087 98 54 -378 206 223 41 -219 -70 14 -202 -7 -16 8 246 -231 -374 54 29 -151 108 -23 -8 214 -410
8110 -410 130 186 192 -188 -79 -42 87 -75 6 0 322 146 -9 -122 -47 59 -95 -249 -35 -44 205 40 -308
8133 -308 -25 -294 -398 153 -288 -15 183 -125 -11 -111 -88 -95 186 238 -38 -361 27 86 -10 -48 -288 -84
8155 -84 101 -124 -257 60 9 10 -192 -134 136 365 -167 -85 -76 80 -49 -305 145 -2 -158 -96 -155 106 -41
8178 -41 -210 -165 -175 82 -138 42 63 58 135 163 -19 72 229
8191B29
$$ Imaginary data points
##PAGE= N=2
##DATA TABLE= (X++(I..I)), XYDATA
0 0 0 0 0 0 0 0 0 0 0 0 0 8 -8 8 -8 8 -8 16 -16 16 -22 24 -29 32 -38 41 -48 54 -62 70 -78 87 -98 111 -122
35 -122 135 -151 167 -187 206 -227 252 -279 310 -343 381 -424 474 -530 595 -674 769 -888 1041
54 1041 -1243 1530 -1957 2675 -4098 7995 -39795 -132093 -34804 50772 14447 -56401 -32710
67 -32710 6496 -23056 -66758 -32657 26380 20044 -43357 -74962 -42906 10625 20228 -16397 -44423
80 -44423 -26675 -5954 -21322 -33968 3886 36300 -5788 -64023 -38476 33334 35206 -24548
92 -24548 -38212 2532 9445 -23861 -17853 28979 31239 -21475 -44098 -7320 22501 8947 -8383
105 -8383 -4126 -5412 -19604 -19132 3523 15797 2055 -20638 -28272 -15153 4100 7789 -7606
118 -7606 -18087 -13054 -13565 -24988 -15549 16390 15628 -29422 -47843 -4560 28580 -1011 -32308
131 -32308 -7504 18482 -10480 -37364 -1971 40108 13412 -37495 -28969 21292 32495 -1528
143 -1528 -17670 4782 19875 1441 -16140 2049 31395 24807 -14081 -26481 10762 39797
155 39797 14445 -22356 -7392 29075 17971 -21843 -14271 33101 34498 -18506 -37548 8696
167 8696 39790 7125 -26298 -4986 25075 6543 -25471 -12203 24372 21671 -15618 -28041
179 -28041 685 23334 9670 -12683 -9464 8216 6339 -12155 -10620 16939 25423 -5163 -28826
192 -28826 -6278 27003 18874 -11109 -8699 13384 8496 -13465 -3835 26866 22537 -13698 -23247
205 -23247 5977 24107 8523 -5235 3776 9562 -3484 -11134 4672 21207 12417 -10185 -15388
218 -15388 2162 15005 6812 -5081 -1030 8343 -998 -14697 -2980 21654 17030 -14467 -22500
231 -22500 4908 20480 1539 -12425 4437 15752 -5820 -22097 927 29029 14912 -18680
243 -18680 -19954 8305 19266 2410 -6690 5282 11217 -4681 -16048 2160 25981 18092 -12721
256 -12721 -21571 3330 22214 8436 -9847 -541 14942 2845 -16736 -3086 25158 19200 -14996
269 -14996 -22384 7459 24445 5029 -12862 119 13759 1912 -12683 -1230 18805 12951
281 12951 -9750 -13974 5813 18338 6304 -8102 -3097 9124 5280 -6877 -2050 14456 13942
294 13942 -6910 -14441 3689 17586 5179 -8864 -1475 10563 3561 -8993 -773 15277 9926
307 9926 -9871 -12527 5183 13942 2051 -6304 619 6739 -879 -7753 1198 11475 4700 -10010
321 -10010 -9377 6020 12158 954 -8117 -1826 5503 -753 -7209 960 12107 4232 -12313 -10224
335 -10224 8512 13874 -1848 -11832 -1997 8036 195 -7243 1828 12176 2965 -13273 -9594 8479
349 8479 12685 -2662 -11051 -367 8835 1222 -7540 -579 9943 3477 -10533 -8748 7340 11751
363 11751 -1407 -9897 -760 7758 688 -8513 -1885 9132 4922 -9243 -8976 5619 10654 -1052
377 -1052 -10510 -3723 5203 796 -6635 -1530 8078 3574 -9856 -10294 3602 9500 -462 -9309 -4299
392 -4299 3729 533 -4664 -1105 4565 -459 -9866 -7445 4540 7972 -1391 -8579 -3821 2511 791
407 791 -3765 -1673 3295 -182 -6844 -3934 5593 7061 -2302 -8611 -2451 4857 2666 -2556 -688
422 -688 3358 -247 -5806 -2740 5824 5765 -3792 -7774 -530 4984 353 -3979 -751 2621 -1476 -6943
438 -6943 -3280 5139 4775 -3928 -7841 -2414 2958 165 -3384 -743 2316 -1850 -7394 -3404 5537
453 5537 5745 -3310 -7805 -2107 4819 2890 -564 906 3009 -734 -4576 201 9401 9314 -262 -5519
469 -5519 414 8009 7101 2974 3252 4263 1752 -417 4042 11624 9711 -105 -4570 1838 9230 8907
485 8907 4004 2864 3554 1413 -97 4156 9007 7098 117 -3588 815 6881 7250 3146 784 933
501 933 578 -42 3214 7800 7093 45 -3898 606 6688 6689 3054 2604 3147 895 277 4919 10262 7237
519 7237 94 -2301 2440 7014 7884 6784 4722 1435 -817 2187 7268 9549 6839 1087 -2190
534 -2190 697 6670 8507 5122 754 -153 -644 -5 4069 8723 5268 -4207 -7354 -490 5428 3992
550 3992 117 -1340 -2664 -5219 -2808 3292 4543 -1051 -6777 -6058 -1566 1674 2304 276 -3390 -5712
566 -5712 -4251 -910 1488 2532 1038 -3345 -7001 -3553 2799 4167 -643 -3187 -2203 -2037 -2431 1186
582 1186 5470 2117 -5147 -7105 -1115 2886 2174 1258 350 -3564 -5954 -2234 3146 3550 -282 -3425
598 -3425 -4733 -3902 324 4806 2695 -3595 -7226 -4288 -419 1732 3219 2328 -3469 -7807 -3742 3276
614 3276 4407 169 -1980 -2128 -3244 -1579 4023 6457 1221 -4854 -3426 410 2625 4258 4980 2176
630 2176 -3102 -3278 2361 5970 4626 1676 584 -1284 -1313 3255 7577 5642 -61 -1832 -348 499
646 499 3168 7602 6676 -1031 -5275 -449 5127 5890 4221 2587 -753 -4791 -1516 7550 9323 2209
662 2209 -3206 -2757 -890 1868 6778 8318 970 -6639 -4848 3043 6490 4674 3380 -904 -6116
677 -6116 -4301 5453 10102 3677 -3356 -3879 -2189 -707 4526 8733 2806 -7035 -7820 814 4973 3722
693 3722 2708 68 -5830 -7830 868 8208 5003 -2613 -4667 -3823 -3786 398 7412 5679 -4719 -9310
709 -9310 -2900 2839 3037 3419 2602 -4138 -9315 -3754 6393 7004 225 -3203 -3614 -5092 -2153 6023
725 6023 8429 -958 -8860 -5456 744 2658 4276 4784 -1437 -9841 -6980 4177 8330 2436 -2849
740 -2849 -3932 -5409 -4055 3937 8989 2231 -7737 -6834 -559 2468 2768 4558 918 -7257 -8222 1282
756 1282 7270 2806 -1927 -1821 -2958 -4519 873 7811 4732 -4458 -5413 -4 2104 1364 4080 4158
772 4158 -2159 -6643 -771 5736 3780 30 865 216 -3723 -1712 5048 6335 -296 -3603 -693 749
788 749 -570 2535 5595 1370 -5303 -3467 3018 3495 544 721 1130 -3322 -4633 1770 5744 1720
804 1720 -2931 -1901 -502 -1495 345 4204 2846 -3450 -4078 695 2743 736 593 1611 -1239 -3931
820 -3931 -502 4515 3157 -1655 -1301 799 -969 -1154 2804 4515 -383 -3935 -739 2243 917 192
836 192 2217 1489 -2910 -2718 1635 3879 560 -709 270 -1020 -2762 757 4239 2064 -2027 -2171
852 -2171 -39 -272 268 3456 2813 -2728 -4893 -324 3183 1764 42 759 -785 -3873 -1207 4160
868 4160 4803 -482 -3448 -1479 -211 462 2561 3294 -125 -4167 -2729 1912 3671 2231 887 -1042
884 -1042 -3431 -1534 3065 4655 681 -2225 -1540 -678 -152 2052 4524 1460 -3708 -3703 1155 2997 1323
901 1323 165 244 -2106 -3648 183 4409 2952 -1402 -2944 -1364 -561 1060 3266 1968 -2045 -3853
917 -3853 -1539 888 1722 2074 831 -2830 -4534 -631 4167 3046 -992 -1984 -1700 -2559 -1250 3086
933 3086 3644 -1426 -5290 -2433 1488 2176 1064 666 -1065 -3469 -2565 1351 2904 659 -1834 -2478
949 -2478 -2199 64 2753 2743 -474 -2303 -1182 245 301 1108 1874 -316 -2935 -2138 2258 3120 59
966 59 -1588 119 -21 -827 54 2394 2017 -1207 -2327 94 1669 1479 574 545 -130 -392 218 1324
984 1324 1757 821 -26 -1140 -1047 1295 2968 1430 -1040 -512 1216 969 658 1682 2444 95 -2296
1001 -2296 -288 2943 2430 41 -569 783 529 586 1333 2542 946 -1036 -1021 549 2098 1852 183
1018 183 -1107 -768 1132 1376 806 480 282 -394 -1174 -177 1910 1650 -1285 -2135 -591 994 -105 -308
1036 -308 48 115 -1156 -1728 192 1280 200 -2305 -2160 -478 82 -909 -685 -698 -607 -1627 -1875 -1079 406
1055 406 -230 -1978 -2405 -1550 -531 -649 -990 -891 -895 -2138 -2366 -958 925 91 -2344 -3297 -1337 277
1073 277 -489 -1043 -681 -1412 -2350 -2348 -221 1295 264 -2709 -2655 -1245 740 435 -582 -954 -1477 -1900 -1383
1092 -1383 819 1520 224 -2524 -2806 -348 1510 823 -112 -843 -760 -1042 -615 1088 1980 65 -2012
1109 -2012 -1737 366 1734 1199 -104 -88 231 -655 302 1800 2083 533 -1067 -1262 1271 2255 1309 500
1127 500 335 25 218 633 2479 2807 1503 -862 -578 978 2617 2061 1178 305 -33 -159 586 2900
1145 2900 3349 1284 -1400 -1172 1383 2968 2453 706 75 -400 -491 729 2601 2909 685 -1572 -1230
1162 -1230 1399 3081 2286 290 -852 -849 -534 783 2453 2473 53 -1880 -1447 1421 2627 1525 -311
1179 -311 -594 -1094 -539 401 1927 1736 -199 -2077 -1804 567 1950 1388 -10 -1236 -1693 -1055 182
1196 182 1367 1291 -494 -2561 -2366 97 1785 1273 -1020 -2136 -1890 -1592 -344 1339 1576 -1325 -3593
1213 -3593 -2165 498 1771 863 -701 -1758 -2815 -1596 559 2142 1077 -1325 -2654 -2232 36
1228 36 2232 2149 -682 -2174 -1860 -423 1397 2217 1489 -585 -2871 -1850 1231 2974 1440 -802 -1082
1245 -1082 -1151 -828 805 2403 1699 -890 -2362 -938 1049 1839 1471 754 -1350 -1856 -710 1339 2012
1262 2012 1235 -511 -1845 -2014 170 2263 2482 155 -1690 -1751 -642 714 2183 2355 -107 -2936
1278 -2936 -1992 884 3142 1787 313 -948 -1865 -1292 1247 3594 1931 -1283 -2391 -1065 685 2126
1294 2126 2709 966 -2256 -2390 -298 1859 1870 1153 -381 -2463 -2674 -167 2729 1972 -904 -1993 -1860
1311 -1860 -1304 218 2202 2329 -1078 -3608 -2378 919 1990 1207 26 -1288 -3083 -2010 1763 3001
1327 3001 606 -1559 -2220 -1680 -832 2034 3366 437 -2796 -3363 -397 1491 1970 1752 24 -3080
1343 -3080 -2907 733 3385 2183 -645 -1785 -1548 -1254 1069 4044 2270 -2046 -3463 -1145 1361 2078
1359 2078 2303 940 -2468 -3675 -847 3439 3339 300 -1597 -1869 -1974 90 3627 3567 -967 -3195
1375 -3195 -1493 889 1568 2240 2027 -789 -3462 -2133 2618 3335 1144 -605 -451 -1838 -1270 2514
1391 2514 4261 801 -2356 -1742 369 787 1650 2673 850 -3064 -2849 1349 3087 1908 116 -75
1407 -75 -1699 -1981 735 4165 2257 -1823 -2255 -665 -182 578 2661 1933 -2127 -4037 -885 2641 2042
1424 2042 86 -130 -1509 -3050 -622 3200 2601 -1294 -2286 -648 -226 -387 1652 2501 -573 -3356
1440 -3356 -1141 1472 1053 -218 453 68 -2058 -1740 1602 2636 -206 -1754 -429 112 -724 243 2425
1457 2425 796 -2475 -2084 433 625 -78 881 851 -1280 -2457 72 2055 1036 -400 180 -288 -1576
1474 -1576 -340 2253 1935 -941 -1807 -263 475 -226 995 2238 196 -2171 -805 1589 1347 -246
1490 -246 167 553 -1034 -1726 1358 2848 774 -1263 -726 122 2 551 2020 1007 -1373 -1942 619
1507 619 1396 658 535 504 -550 -1927 102 2550 1303 -746 -805 11 -363 -273 1920 2217 -894 -2730
1525 -2730 -515 1460 828 46 689 -170 -1619 -1477 1288 2268 -130 -1209 -845 -560 -862 1058 2261
1542 2261 115 -2006 -1617 155 891 924 1218 50 -2624 -2346 1131 2342 215 -1479 -713 -853 -1410
1559 -1410 -281 2371 1388 -2797 -3092 169 1487 380 177 272 -1148 -2249 -523 1692 1083 -555
1575 -555 -1217 -947 -968 -17 1286 781 -1555 -1939 -400 327 -191 644 1290 -728 -2716 -903 2141 1455
1593 1455 -614 -788 197 -532 -1346 683 2332 620 -2132 -1413 1070 1383 699 468 485 -894 -763 1085
1611 1085 1567 1235 335 -306 -645 -420 1903 2202 147 -1105 258 1233 -25 -299 1953 1665 -1057
1628 -1057 -1775 920 2797 505 -1159 222 1420 88 -457 918 1053 37 -1265 -367 818 1162
1644 1162 469 -117 -481 -104 880 366 -128 553 1220 -449 -1460 134 2111 1230 -1496 -740 1156 741
1662 741 -857 -340 1707 1106 -1487 -1390 1123 1883 -609 -1317 -114 691 -223 -878 -27 998 262 -719
1680 -719 -869 456 1331 187 -1119 -917 684 545 -946 -1013 493 610 -1557 -2055 405 1819 -604
1697 -604 -2647 -1251 1267 343 -1496 -1083 718 164 -1808 -1427 981 1594 -608 -2113 -517 1250
1713 1250 359 -875 -702 464 753 -549 -862 1029 1529 -271 -1862 -426 1996 936 -1348 -1329 1349
1730 1349 1188 -1704 -1047 1479 2319 -555 -2123 -597 2188 764 -1457 -423 1359 864 -1375 -1119
1746 -1119 1686 2238 -602 -2070 -497 1792 875 -1107 -659 1273 847 -1357 -1223 1454 2400 -185
1762 -185 -2758 -584 2249 1506 -1134 -1067 1364 723 -1966 -1210 1983 2711 -790 -2866 -122 2351 948
1779 948 -1149 -853 1480 742 -1616 -1244 1672 2427 -721 -3056 -389 2443 1208 -1825 -1128 1737
1795 1737 933 -1677 -1871 1517 2245 -1484 -3222 -605 2584 933 -2041 -1206 1477 647 -2127 -1627
1811 -1627 1889 2266 -1364 -3784 -322 2755 938 -1906 -1081 1494 426 -2354 -1216 2183 2628 -1438
1827 -1438 -3262 -190 2757 1057 -2102 -1016 1738 681 -2034 -925 2285 2913 -1182 -3483 6
1842 6 3321 1186 -1971 -1562 1903 959 -1911 -1034 2760 2707 -1304 -3466 208 3570 1206 -1928 -1481
1859 -1481 1788 1071 -1658 -697 2798 3126 -1696 -3584 267 4057 1645 -2112 -927 1913 1000 -1950
1875 -1950 -700 3321 2983 -1657 -3390 660 4051 1591 -1825 -669 2145 956 -1996 -748 3063
1890 3063 2869 -1955 -3615 758 3919 1544 -2172 -1149 1842 758 -2180 -997 3163 2816 -2481
1905 -2481 -4074 319 3890 1159 -2682 -1458 1545 543 -2573 -761 3240 2463 -2562 -3981 431
1920 431 3680 802 -2828 -1636 1464 418 -2469 -1290 2992 2247 -2656 -4602 373 3882 533
1935 533 -2688 -1470 1743 354 -2986 -1438 3140 2736 -3175 -4928 385 3742 462 -2993 -1045
1950 -1045 1476 -103 -3069 -682 3441 2242 -3032 -4364 -119 3651 1144 -2624 -1370 1474 260
1965 260 -2727 -897 3437 2506 -3151 -4682 529 4372 931 -3008 -1250 1997 -35 -3229 -972
1980 -972 3817 2433 -3378 -4534 1028 4097 877 -2771 -1089 1969 269 -2490 -592 3459 2358
1995 2358 -3082 -3960 948 4158 1175 -2952 -1163 2326 554 -2668 -802 3793 2573 -3342 -4323
2010 -4323 964 4906 799 -3143 -503 2470 -85 -3028 -323 4202 2648 -3463 -3920 1242 3870
2025 3870 547 -2342 -621 1876 82 -2100 -287 3689 2452 -3356 -4150 952 4572 656 -3199
2040 -3199 -1323 2448 783 -3166 -762 3928 2238 -4066 -4604 1840 4253 -206 -3459 109 2056
2055 2056 -213 -2792 293 3771 1662 -3370 -3350 1360 3450 606 -2523 -1087 1387 409 -2242 -705
2071 -705 3237 2519 -3134 -4228 1361 4389 32 -3732 -968 2853 84 -3371 -104 4338 1737
2086 1737 -3979 -3186 2042 3491 -219 -2584 17 1637 -533 -2385 -56 3398 1613 -2479 -3206
2101 -3206 1104 3687 810 -2842 -839 2532 432 -3082 -936 4241 3013 -3619 -4232 2602 4378
2116 4378 -742 -3506 568 2874 -318 -3276 371 4208 1444 -3367 -2295 1836 2848 -274 -1856
2131 -1856 -57 1606 326 -2373 -449 3018 2107 -2397 -3183 1015 3880 510 -2557 -141 2755
2146 2755 -320 -3528 -574 4396 2035 -3878 -3129 2115 3284 -901 -2264 1156 2293 -1311 -3023
2161 -3023 464 3406 1064 -2479 -2592 1142 2454 33 -1926 -499 1638 70 -2367 -647 3172
2176 3172 2466 -3180 -3818 1285 3748 -411 -2966 -17 2390 -720 -3341 230 4362 993 -4231
2191 -4231 -3058 1798 2722 -725 -1918 684 1009 -1048 -2007 518 2943 936 -2566 -2965 692 2517
2207 2517 96 -2021 -367 1503 -412 -2638 -560 3462 1515 -3330 -3295 2036 3120 -616 -2465
2222 -2465 650 2174 -1183 -2668 923 3688 825 -3598 -1933 2251 2461 -811 -1560 215 806 -630
2238 -630 -1190 645 2421 862 -2575 -2795 903 2990 230 -2520 -271 1971 -415 -2624 -44 3269
2254 3269 927 -3398 -2640 2548 2740 -1180 -2327 870 1468 -843 -1953 1180 2329 -147 -2607 -1423
2270 -1423 1590 1486 -521 -1635 -94 935 -95 -1468 3 2109 859 -2541 -2458 1423 2616 -888
2286 -888 -2703 -95 2029 -756 -2553 285 2546 258 -3059 -1488 2336 1648 -1357 -1443 624 919
2302 919 -737 -1199 459 1603 66 -1582 -1240 1227 1445 -550 -1866 -372 1897 242 -1403 -320
2318 -320 1932 881 -2141 -1462 1959 1743 -1534 -2018 669 2049 -724 -1661 797 1994 -56 -1994
2334 -1994 -678 1365 899 -1173 -1034 669 1254 -280 -1323 -50 1652 807 -1214 -713 1468 1704
2350 1704 -266 -1640 307 1735 290 -1489 375 2110 731 -1518 -513 1922 1252 -1261 -996
2365 -996 561 1510 -61 -578 518 1590 -188 -1249 -223 1635 1241 -499 -1222 319 1421 161
2381 161 -649 182 1387 565 -1208 -981 1736 1397 -820 -1088 550 1506 -43 -1275 -8 1361 173
2398 173 -1255 -489 1668 1022 -1018 -845 280 781 -413 -985 132 814 220 -911 -402 959 1007 -1134
2416 -1134 -1110 53 959 -51 -749 -429 791 -79 -1332 -559 937 465 -1207 -1554 362 870 -283
2433 -283 -1001 -220 458 -644 -1131 -242 1042 428 -1130 -1414 -114 243 -256 -688 -164 97 -302 -1144 -159
2452 -159 751 302 -1402 -1324 110 707 6 -600 -268 290 -147 -1022 -354 1315 266 -1323 -1281 529 711
2471 711 200 -628 -130 319 -249 -535 360 925 357 -889 -995 339 755 1 -364 -140 11 30 -428 168
2491 168 775 610 -591 -1061 306 848 203 -267 -183 524 45 -21 369 1151 324 -695 -461 504 826 293
2511 293 -456 -140 288 -219 285 666 858 358 -516 -541 643 1120 829 -128 -102 360 -272 -253 519 888 54
2532 54 -875 -455 386 1186 367 -345 -95 -130 17 -81 604 864 79 -363 -524 415 595 382 -299 -404 -189
2553 -189 -215 -92 387 702 -271 -852 -720 318 981 612 -317 -312 -193 -136 -71 380 526 114 -1052 -434 178
2574 178 490 505 -440 -576 -318 -130 13 721 613 -112 -765 -677 22 743 403 -42 -278 -502 -85 199 536
2595 536 539 -132 -1000 -925 313 804 491 -3 -255 -367 -199 -4 783 509 -61 -762 -905 315 890 473
2615 473 181 -517 -342 -223 155 489 430 -189 -420 -523 320 819 805 88 -445 -476 -616 212 744 743 104 -1040
2637 -1040 -700 246 480 405 23 -180 -466 -395 243 776 376 -472 -811 -691 275 438 770 527 -604 -809
2657 -809 -623 419 717 266 -173 -651 -801 -65 809 571 96 -532 -723 -150 275 394 605 -329 -536 -846
2677 -846 446 840 607 -67 -331 -840 -581 496 1201 522 -184 -748 -699 -156 560 1178 302 -689 -798 -130
2697 -130 339 742 419 -101 -701 -774 -251 874 542 -152 -355 -522 -321 495 772 636 -229 -1062 -684 382
2717 382 632 483 485 -567 -947 -163 692 1077 258 -374 -162 -469 -64 496 1078 -399 -871 -764 -67 536
2737 536 648 311 -34 -932 -821 345 929 189 -140 -67 -951 -206 433 874 641 -377 -762 -31 147 186
2757 186 818 18 -423 -1107 120 916 434 -32 -31 -496 -488 275 956 635 -425 -554 -514 -174 150 524 630
2778 630 -422 -1157 -454 389 279 324 154 -424 -934 -613 420 747 -71 -481 -326 -351 -335 574 997 313
2798 313 -843 -489 -70 380 201 336 36 -895 -894 -61 816 173 -277 -295 -616 -651 224 931 345 -565 -901
2819 -901 -523 238 31 687 465 -499 -620 -368 931 891 389 -242 -568 -875 -263 838 662 -98 -986 -192
2839 -192 49 581 719 854 -183 -643 -645 535 721 334 184 -194 -273 -481 686 1254 112 -488 -655 21
2859 21 193 767 548 550 -296 -603 108 529 912 124 29 -417 -392 -158 1179 495 -420 -319 166 114 62 447
2881 447 778 -192 -973 -481 491 348 57 138 106 -536 -425 324 889 231 -521 -385 -240 -107 252 470 -105
2902 -105 -1159 -529 303 119 250 329 159 -1006 -670 418 716 -132 -682 -318 -141 -207 -130 810 82 -819
2922 -819 -778 -43 320 135 -343 -129 -368 -827 -525 709 60 -434 -683 -487 -612 -363 530 249 -386 -735
2942 -735 6 -191 -133 -113 113 -312 -915 -456 551 543 -276 -647 348 -445 -565 -143 550 59 -804 -434 153
2963 153 154 -131 23 -48 -225 -312 149 135 168 -271 81 -151 -795 64 694 179 -637 172 492 153 148 431 971
2986 971 -236 -676 194 814 88 -271 363 582 -400 -110 506 295 253 -683 211 52 180 168 120 -38 -200
3007 -200 225 291 126 106 273 154 -259 -178 478 582 -135 -597 356 384 -87 216 592 76 -244 -449 335
3028 335 412 70 122 -87 -91 -64 78 295 347 10 -103 -20 -63 95 268 20 -421 -102 280 62 -7 -170 -108
3051 -108 -191 -622 -100 710 -99 -505 -74 233 137 -330 -84 1 -32 -167 -51 338 215 -110 -140 -111 -115 72 309
3074 309 25 -32 -261 3 -271 -112 440 410 -479 -433 243 -210 84 -293 67 379 -393 -794 409 752 67
3095 67 -557 -378 -95 93 -153 46 148 -374 -470 124 -6 229 -79 -465 -326 -167 279 220 -278 -213 -26
3116 -26 -200 -31 39 454 12 -158 -428 193 534 14 -235 159 22 -192 -112 379 649 -336 -620 -211 399
3137 399 343 282 127 -45 -71 -333 34 -47 93 -200 -303 -274 281 425 326 -117 -345 -155 24 19 213 391 -344
3160 -344 -384 -492 34 509 58 -230 -333 0 -532 9 157 41 -478 -521 -370 146 546 -289 -6 -336 -456
3181 -456 -115 123 563 183 74 -721 -411 219 371 68 -91 -271 -95 -97 -161 163 -92 -46 -433 -225 297
3202 297 405 88 -148 -370 -94 34 99 217 94 -319 -482 -111 336 694 291 108 -175 75 -61 150
3222 150 445 560 -50 -365 -146 388 618 172 -613 -597 -349 -20 289 398 210 -171 -555 -531 225 381 195
3243 195 -207 -275 -68 -88 166 295 264 -279 -448 -122 269 593 483 71 -553 -30 35 116 509 372 -270 -525
3265 -525 -645 277 340 177 -31 -312 -136 119 517 536 73 -345 -494 -77 223 401 420 26 -272 -268 39 761
3287 761 353 12 -328 -497 -412 -31 244 244 -263 -286 -168 279 105 229 121 -320 -505 -23 174 394 145
3308 145 -248 -494 -523 421 429 493 77 -35 -296 -57 528 744 340 -209 -560 -63 207 220 474 334 -190 -710
3330 -710 -215 328 620 386 86 -447 -397 79 493 615 73 -352 -298 -366 510 595 182 -95 -265 -328 271 579
3352 579 275 -112 -266 -381 -156 258 889 557 -305 -330 -236 355 420 250 324 -156 -257 -418 163 545 505 -35
3374 -35 -411 -196 169 385 305 -100 -198 -643 -127 124 279 144 -125 -629 -493 255 356 181 -44 -76 -496
3395 -496 -394 176 336 254 -609 -655 -42 -101 212 187 251 -648 -522 -214 483 218 100 -469 -341 -553 186 602
3417 602 103 -270 -643 -474 -364 165 547 475 -467 -601 -267 108 206 77 124 -591 -368 -383 462 505 -90 -418
3439 -418 -203 -397 -23 302 472 -361 -437 -642 2 185 399 269 -261 -860 -587 129 161 142 -367 -416 -258
3460 -258 -246 288 719 -28 -543 -419 -90 257 482 182 133 -513 -574 -105 451 206 258 -108 -126 -194 264 546
3482 546 532 -31 -419 -75 -96 325 250 441 -26 -817 -238 301 561 303 43 -454 -450 -27 523 466 101 -294
3504 -294 -257 144 34 -48 530 150 -367 -401 -65 433 475 78 -32 -477 166 145 765 326 -464 -382 -456 282
3526 282 400 356 487 -311 -484 114 332 -24 237 -10 -475 -472 -71 676 413 -173 -370 -34 29 -302 36
3547 36 299 131 -283 -614 350 170 3 -143 -11 -492 -100 -4 441 34 -151 -518 63 23 391 417 53
3568 53 -532 -333 27 -68 165 202 155 -298 -502 188 563 238 -215 -200 -92 -443 -241 216 366 -170 -518 -330
3590 -330 86 231 26 -106 -200 -261 -395 212 -34 -213 -59 -252 -681 -206 186 139 -116 -114 -210 279 -193 99
3612 99 448 -156 -432 -475 263 467 289 -294 196 -83 -255 -8 508 247 -360 -343 -126 -38 497 209 -135
3633 -135 -504 -286 241 78 114 75 196 -121 -270 441 700 -19 -586 -111 225 203 -339 -41 561 -143 -480
3654 -480 -129 371 314 -362 -254 -223 25 219 -15 195 190 -311 -158 -430 263 220 0 -194 44 156 104 32
3676 32 48 32 72 -346 -482 495 484 -468 -321 -104 320 9 192 -4 344 -30 -414 76 100 206 -403 -92
3698 -92 354 -80 -40 316 183 241 107 -246 -401 332 355 -133 -412 -210 654 256 -299 -404 591 80 -542
3719 -542 -344 328 561 -101 -175 51 349 21 -103 -236 345 -223 -312 104 212 401 -50 -422 -151 353 304
3740 304 -128 -334 332 -81 -124 -460 645 671 -264 -550 -62 483 157 -222 -116 378 -262 -375 -313 719
3760 719 41 -297 -619 164 427 62 -257 135 171 -87 -232 -280 595 388 -442 -534 -155 778 526 -199 101
3781 101 68 178 -362 -134 228 307 -301 -379 180 590 -33 -523 -40 385 -35 -439 24 564 415 41 -437
3802 -437 106 304 184 -494 114 -192 -51 -323 -95 409 628 -311 -469 409 789 329 -534 -226 129 -195
3822 -195 -542 -292 729 413 -740 -748 186 873 207 -384 -191 225 -283 -168 -207 419 518 -491 -521 376 1035
3843 1035 -80 -195 26 303 -27 -133 -167 651 434 -675 -742 224 840 -113 -646 -86 398 102 -271 188
3863 188 686 633 -875 -836 338 590 -107 -405 -33 619 142 -454 62 756 514 -650 -554 56 792 114
3883 114 -605 -119 206 -147 -221 -200 377 -38 -734 -805 117 632 -113 -603 -211 355 -133 -677 136 764 306
3904 306 -1008 -633 459 904 -71 -648 -18 449 -80 -403 -33 733 363 -711 -825 324 746 -70 -603
3923 -603 -366 442 -291 -770 74 489 179 -921 -686 7 709 -103 -552 23 267 -62 -110 -17 825 82
3943 82 -1047 -845 233 1012 23 -618 122 447 -230 -489 -157 1194 340 -732 -688 347 773 219 -689
3962 -689 -134 416 174 -471 27 770 607 -667 -666 377 966 -14 -573 311 450 -325 -556 0 753 497
3982 497 -761 -617 687 836 -272 -651 183 445 208 -383 96 851 268 -920 -488 477 761 -226 -511
4001 -511 -130 354 -338 -524 -117 806 114 -994 -410 820 962 -332 -621 -55 462 -111 -139 22 879
4020 879 167 -900 -797 415 1058 -201 -555 -24 309 -434 -738 1 682 13 -966 -928 386 689 -375
4039 -375 -724 -87 384 77 -665 98 855 -228 -1127 -461 466 795 -283 -890 -154 187 -384 -551 -73
4058 -73 499 95 -768 -543 605 962 -481 -704 -50 415 -11 -667 -193 725 96 -912 -475 610 661
4077 661 -347 -582 21 266 -284 -686 126 632 42 -964 -607 498 685 -232 -759 -31 409 -169 -590
4096 -590 117 1025 -40 -1150 -477 864 837 -273 -622 183 242 -306 -581 240 1100 -37 -841 -550 362
4115 362 523 -180 -411 141 678 -74 -265 690 645 124 -1025 -307 506 739 -187 -640 33 608 -241 -632
4135 -632 693 795 8 -734 -666 324 871 -737 -379 128 460 -461 -472 245 424 201 -682 -190 460 562
4155 562 -384 -462 -26 487 -328 -197 208 699 28 -874 -429 1038 533 -454 -673 166 508 -195 -517 179
4175 179 579 50 -739 -187 801 600 -246 -306 39 313 -102 -169 362 549 -58 -808 -462 517 472 -307 -482
4196 -482 71 265 -34 -449 30 690 31 -1139 -352 344 516 -309 -178 -46 308 -137 -566 444 433 -409
4216 -409 -624 116 769 330 -590 -154 -28 318 1 -180 5 383 60 -238 -222 517 567 -460 -704 205
4236 205 544 -21 -367 108 416 -175 -819 -371 967 379 -561 -359 249 327 -556 -403 443 534 -348 -370 -219
4257 -219 445 452 -244 -419 12 471 -226 -470 224 670 98 -528 -552 621 506 -379 -773 99 366 -616 -349
4278 -349 122 224 -238 -526 -78 545 287 -512 -300 346 236 -207 -215 -88 396 -45 -249 -53 606 199 -382
4299 -382 -272 197 452 -328 -193 168 331 -257 -355 -299 153 288 -335 -452 377 355 -204 -304 195 235 -157
4320 -157 -338 177 187 367 -108 3 245 97 132 -159 61 363 21 -667 -299 416 432 -198 -185 772 241
4341 241 -211 -472 567 157 -78 -469 -26 668 254 -401 -448 522 129 -380 -264 112 161 49 -198 -207 309
4362 309 -66 -275 -329 59 352 21 10 222 97 -89 -426 80 393 265 -75 -458 320 410 -386 -243 -92
4383 -92 522 -394 -291 309 349 15 -418 -298 213 282 -352 38 289 252 -445 -398 165 294 333 -390 -146 521
4405 521 380 61 -244 -1 407 60 -515 115 124 91 -412 -108 118 157 -167 -97 173 -21 -396 -189 -69 256
4427 256 62 -162 -296 261 6 -61 -145 234 267 -190 -147 48 313 -60 -216 -329 462 382 -154 -35 21 185
4449 185 -210 -319 54 188 78 -59 -36 275 135 87 -357 59 278 -30 150 -39 172 230 19 -199 171
4470 171 236 202 -371 120 3 -27 271 266 60 -130 -149 33 220 102 -222 -11 105 144 -44 76 39 267 -370
4493 -370 -304 -58 273 8 21 68 -188 208 -188 176 -46 72 60 -299 -243 153 398 65 -309 -113 -66 -141
4515 -141 -70 8 45 262 -209 110 128 12 181 -170 -141 -180 -46 -18 207 -7 70 -175 50 323 374 217 249
4538 249 -272 -101 -29 46 155 24 153 -135 -388 19 426 -54 -14 96 -149 -230 143 136 -39 47 -166 84
4560 84 18 73 -164 -136 -32 -4 -185 176 20 76 -74 -346 35 98 459 -88 -121 -341 -133 -91 -94 145 20 11
4584 11 -142 -247 158 68 -25 -229 -28 -182 -185 307 76 211 -179 -23 -119 186 185 -61 -413 -351 -152 82 289
4607 289 78 219 118 -99 -271 285 114 107 -324 41 -164 -168 199 336 -80 -60 -35 -265 206 42 -170 -105
4629 -105 -44 -70 -52 -107 -104 115 -187 2 179 97 23 15 -185 -272 -43 40 202 -54 134 -17 -102 -212 10 175
4653 175 85 -114 -234 -444 -165 -160 4 -183 -422 -95 -204 -128 93 155 -151 134 257 83 74 90 -165 -166 -138 -73
4677 -73 367 353 45 -38 -180 -202 164 278 275 -15 40 -52 300 394 80 -199 -168 83 -122 26 62 -49 82 -39
4701 -39 65 -5 132 389 77 -42 -83 -159 62 196 463 -144 -441 -330 134 157 -170 53 -168 -503 121 13
4723 13 -159 298 1 -275 -224 128 238 185 68 24 -92 16 -67 241 111 179 -329 169 -45 165 125 30 -237
4746 -237 -345 -284 -47 41 -143 95 -219 -322 249 227 -55 -214 -25 30 -148 68 221 -58 -45 -602 -126 -9
4768 -9 -137 187 -16 -156 -393 65 40 187 10 67 -347 121 -6 14 73 -112 -85 -222 163 20 232 -102
4790 -102 223 46 -260 -29 68 -182 -123 -32 85 -317 150 40 201 -325 76 21 21 370 87 184 180 -285 -134
4813 -134 -27 54 120 -60 -256 172 -54 -49 384 -67 33 -90 -118 187 59 -161 -64 268 182 73 28 78 -92
4836 -92 -5 -290 -229 508 27 125 -20 -247 73 287 115 -210 -117 144 -168 -186 -59 28 -148 -157 194 -39 21
4859 21 -4 -7 -180 -471 -119 81 -114 159 71 26 -88 -118 23 110 74 165 0 -77 -222 196 96 -113 -35 -297
4883 -297 -233 -2 76 -45 55 -90 -6 -299 176 53 156 -47 -136 147 -138 23 194 149 243 20 -70 65
4905 65 170 492 50 -398 -270 -185 148 -174 -274 5 40 257 -72 342 52 -161 -226 166 -41 249 -133
4926 -133 84 -141 -363 -4 143 265 88 113 -258 -201 257 277 7 -226 -166 229 177 -46 -133 199 196 -169 104
4949 104 -8 -270 329 71 34 -202 75 131 145 -15 117 -86 -41 90 -25 226 69 -279 -95 77 12 25
4971 25 17 127 -43 24 233 227 -162 -326 -52 -191 -122 -73 225 90 247 301 93 163 64 -101 -179 -298 180 149
4995 149 -166 4 80 -6 -307 -41 191 74 11 -171 123 -63 346 -68 -106 -26 -44 57 -26 275 -82 272
5017 272 249 48 -139 -167 -88 -199 42 9 -26 183 -10 51 -163 -213 -57 128 -282 82 -73 -10 13 -303 122
5040 122 -43 139 -111 92 193 -45 93 -171 224 -167 -124 -26 94 -16 -264 19 -192 99 -40 -52 -62
5061 -62 -12 -32 10 225 -111 -333 170 -236 -240 -90 -52 -37 -389 98 54 4 -34 -124 -42 288 151 -322 123 -104
5085 -104 160 222 12 -88 -225 18 123 -117 -51 -263 -5 110 87 -136 306 -158 28 147 262 211 286 238
5107 238 0 -58 -139 299 140 -89 275 110 -90 145 -12 175 -111 -30 53 -220 237 56 22 131 69 -94
5129 -94 -94 299 261 -102 -125 -29 135 193 -146 53 -149 -174 79 -203 -71 313 138 110 -138 -306 -16 6 -233
5152 -233 -200 169 -105 -201 -33 122 -341 -27 154 62 296 -55 -31 -147 -51 -280 56 -16 213 -83 127 115
5174 115 -492 -218 252 113 -252 -128 87 -112 -51 146 -87 -286 -58 -194 42 296 86 -309 -145 31
5194 31 -301 159 -61 -264 -198 -119 178 164 90 49 -14 -239 214 240 -122 -123 312 16 -108 -185 -63 387 300 -200
5218 -200 23 -287 8 187 173 -172 -25 -2 227 127 0 -142 16 67 56 -68 207 204 -92 -144 49 210
5240 210 75 351 -94 -233 279 84 -15 -100 160 -27 -90 -93 -158 14 -14 -257 -37 -47 260 74 40 -289 34
5263 34 117 63 -21 255 155 337 158 -53 107 -413 278 84 69 91 -138 -245 -255 285 8 -130 32 -58 -350
5286 -350 336 244 178 2 -15 60 149 305 115 8 56 -84 112 26 228 -38 -109 -203 193 22 -150 256 -164
5309 -164 170 143 49 -159 -36 -64 -10 191 528 -48 156 -49 -316 -149 140 224 -49 -48 -159 -176 -191 70 -35
5332 -35 66 -21 -217 -1 57 243 72 -184 164 71 207 432 382 91 -58 -36 -115 66 84 55 -78 87 -200
5355 -200 -226 56 -50 95 77 19 -41 -148 -206 38 291 -142 -212 81 -56 348 79 140 -59 -25 -138 45 125
5378 125 203 -195 -220 -52 -23 -130 -21 192 168 88 -142 -10 271 -54 -55 21 -144 73 270 -24 -6 201 -66
5401 -66 -61 2 -41 82 161 -73 140 -80 65 48 0 22 -380 47 97 -15 -182 -181 -34 -345 -25 -153 171 -269
5425 -269 115 34 72 -27 147 115 -185 -39 299 -107 354 -398 -226 37 -227 -194 -33 6 199 130 -291 5
5447 5 3 157 21 196 28 -25 195 61 90 -74 221 111 19 34 20 32 -239 -337 -120 -201 247 120 -181 -291
5471 -291 -135 -235 -57 13 -5 2 -53 -303 58 10 -186 224 -19 63 159 125 116 4 -98 -51 -139 -77 0 159 -56
5496 -56 -151 29 34 333 124 -3 -75 -18 -161 -15 75 173 -64 -249 -174 -12 -138 -42 258 -244 98 -329 -194
5519 -194 202 321 5 131 141 158 133 173 98 -173 -147 -18 170 213 -90 198 -152 141 -60 304 465 -51
5541 -51 -99 -4 169 -37 -137 147 -327 -204 71 -68 24 -5 -64 -65 -174 251 -87 -282 -198 -84 -17 26 -248 -72
5565 -72 -8 -50 3 91 86 60 183 -113 114 310 -103 143 160 -76 -2 -71 -121 -44 99 -104 -20 -101 -74 24 -19 -292
5591 -292 167 -102 4 31 -59 -295 194 131 100 -81 -39 -137 -63 -143 -7 -14 125 108 18 163 -65 -96 -254 52
5615 52 -12 169 66 110 18 -40 252 7 13 -133 9 0 -258 5 5 74 -111 95 27 113 25 -167 -102 45 136 -177
5641 -177 201 135 88 41 -157 188 -130 -95 110 -155 144 -170 84 15 60 227 310 -76 133 -143 168 148 97
5664 97 179 -253 46 62 242 133 -97 174 61 143 -43 44 -267 -231 -99 -209 -227 123 -68 -187 -159 -83 -14
5687 -14 -159 -230 156 34 83 -93 -56 199 19 198 -96 286 166 -182 144 148 189 82 131 -248 173 -150 -215
5710 -215 138 26 185 -308 -6 128 -162 -340 -20 -97 180 -54 221 -129 -151 129 127 -340 218 44 -48 158
5732 158 68 -48 150 -86 -513 4 93 94 -119 3 256 168 5 117 8 265 66 -210 140 15 60 -205
5754 -205 5 -151 -33 -26 165 32 29 -62 310 187 332 185 -182 -238 20 -1 73 116 244 -105 1 21 121
5777 121 -25 -92 43 318 127 32 1 -179 324 -63 2 56 -12 120 -170 -171 59 313 -195 -151 27 -215 104
5800 104 -151 -7 302 127 113 -149 174 -312 -142 -347 154 -116 420 -195 -475 146 -22 -95 -139 94 73
5821 73 -87 -202 -91 94 -151 -173 -143 6 241 104 -208 -172 -50 17 47 65 122 226 -373 8 18 114 -106
5844 -106 -140 38 74 18 -58 120 20 109 53 -204 18 347 185 221 313 -151 298 52 -190 -13 105 53 -34
5867 -34 -1 61 99 -145 106 285 170 102 48 166 184 -100 49 -28 265 127 -286 59 -200 -94 -110 -68 134
5890 134 17 -323 227 -90 189 -163 -26 -188 -56 52 -126 43 3 16 -176 69 23 98 -9 -257 -59
5911 -59 5 -370 -50 -52 412 54 64 134 247 153 -61 -117 -220 87 310 -145 -236 -111 43 79 -220 78 75 -85
5935 -85 -63 -174 44 282 -293 -175 173 86 -257 94 -2 249 -204 -403 350 134 -273 -96 -117 -205 341 -155
5957 -155 96 -106 316 96 -133 68 73 -37 212 88 -394 67 60 -382 -190 50 409 -95 -38 144 108 120
5979 120 122 118 -11 -297 42 469 417 -217 81 181 210 17 227 -48 -139 -236 -165 91 -197 182 35 -200 -14
6002 -14 32 -176 -275 141 135 -112 361 80 125 -122 -181 -205 -292 12 -224 139 -4 -149 -12 -289 73 137 15
6025 15 202 -296 146 -34 66 -46 25 95 227 76 -240 382 -53 -23 337 -105 114 25 53 344 213 131
6047 131 -22 -308 -100 302 135 3 72 255 -123 129 -75 37 278 52 -9 157 -137 -169 -55 -80 172
6068 172 -245 -188 98 600 114 -159 -297 -181 -97 14 -107 -53 26 249 -225 -280 -43 187 -159 -54 127 184
6090 184 43 -486 58 -7 -87 177 22 143 -88 -123 -50 69 45 -10 -62 130 51 22 -50 2 436 -32 33 -248
6114 -248 -51 -86 281 -175 36 -7 -50 -142 -314 201 -77 -337 114 -48 153 170 -229 -115 155 80 -44 112
6136 112 69 280 -87 -154 272 61 -50 72 -108 -130 -147 -328 -12 -32 138 -144 82 21 148 -42 -97 33
6158 33 -25 -248 -285 -24 171 221 -158 41 -55 280 -369 -274 -114 -14 -148 -321 7 157 144 83 -129 -137 -195 -12
6182 -12 -57 183 132 33 -314 -91 -121 130 152 147 89 206 -40 -149 -253 204 -212 -54 208 74 -206 -133 80
6205 80 412 100 -330 -80 -62 -164 81 -257 244 98 37 0 -135 78 -329 91 -9 -155 137 72 45 -76
6227 -76 143 1 -257 -105 36 180 -44 -123 121 111 70 1 -76 285 33 19 -13 258 132 -159 -119 296 194
6250 194 168 -24 51 -15 199 -461 7 -64 25 -241 -113 150 -86 -352 -210 33 -90 6 77 -151 -181 -99 57
6273 57 11 68 -63 228 35 -177 -247 10 -289 205 136 -62 58 12 52 -31 -47 -119 -50 367 265 -148 52 80
6297 80 59 -8 -126 -159 137 212 110 -210 103 131 97 128 123 18 -18 78 284 -58 -62 -148 63 115 -34 -161 -146 -163
6323 -163 120 -133 -304 -200 221 -161 -161 76 32 342 441 -71 35 54 250 -161 36 -28 -17 120 153 531 259
6346 259 119 -86 109 62 66 -116 -291 -147 -85 19 -17 11 61 205 116 -72 301 -204 -100 41 -119 345 -112
6369 -112 -4 -28 101 23 -101 -34 -48 -361 94 -114 138 -226 -37 -337 24 141 -21 -61 97 -16 -39 -65
6391 -65 9 290 22 -221 199 196 184 -64 -209 375 15 -28 80 -105 195 -30 53 14 -140 48 193 126 125 180
6415 180 -338 194 30 178 191 -110 191 433 -232 214 -165 -150 -182 82 -185 -69 44 235 44 66 300
6436 300 42 -42 77 -106 106 -86 -80 -226 297 286 -74 -338 258 -335 80 183 81 -36 -222 110 18 -104
6458 -104 36 18 224 -304 -300 -78 -177 41 -58 100 -65 115 169 107 -213 74 -98 127 136 50 -155 27 154
6481 154 146 -16 22 15 -76 -169 -2 -97 -4 -56 4 -93 195 116 -143 -24 53 28 67 337 213 -232 -81 210 25
6506 25 -176 -38 155 248 153 23 20 -29 23 -210 -260 -140 205 -227 182 -187 82 -73 58 199 -103 309 209
6529 209 112 104 64 47 -103 -120 283 12 -64 -155 119 -39 128 -98 -98 133 88 -9 -237 93 106 326 -354 -222
6553 -222 168 213 79 75 -153 -231 -139 -59 -43 60 -185 -49 -344 79 -124 -124 37 161 -178 -178 -70 -50 -24 -209
6577 -209 17 -89 97 -157 -13 -147 -81 -128 -125 168 -85 73 303 -229 203 245 -102 23 316 121 86 -50
6599 -50 24 225 -78 -144 -40 -137 -2 -12 34 34 129 -60 182 72 327 262 -152 -92 -67 -43 -45 -27 77 -287 122
6624 122 -263 -175 -44 -110 -1 -78 110 74 385 -172 -104 -2 -39 -309 70 -277 190 106 -122 -31 -252 101 -43
6647 -43 31 -122 150 -102 146 -223 91 207 88 190 -173 299 -206 203 -337 -2 455 298 132 -134 54
6668 54 17 -24 41 257 -91 315 -132 167 -262 -140 270 243 -162 304 -47 -252 -272 311 105 -231 8 -17
6690 -17 72 86 209 164 89 42 -83 65 345 -71 106 119 150 -18 -118 78 219 109 -210 57 185 -40 66
6713 66 -46 50 202 -213 113 306 51 225 -182 46 -239 -113 121 -20 73 29 182 -83 -82 -99 -1 69 -71
6736 -71 -100 168 -135 -115 -75 -102 225 -169 19 -119 -507 140 177 4 166 208 13 -29 -244 -89 339 -252 -214
6759 -214 -86 182 330 6 -2 170 -11 73 117 -110 162 -147 -60 375 -244 -19 -330 -32 -118 -242 72 77 -36
6782 -36 252 228 -272 -69 138 -126 18 -214 77 211 -86 -87 -151 85 138 -116 93 -380 445 1 -254 213
6804 213 104 -375 48 -121 -153 85 -124 -24 78 -87 51 -93 38 2 -67 -133 -200 112 210 223 254 238 -36
6827 -36 -160 65 -211 -67 21 -146 -97 56 -31 280 -187 -19 234 170 147 -187 76 -56 -190 241 -161 -209
6849 -209 178 284 307 159 205 160 129 19 108 40 -211 -127 13 39 -101 58 3 86 144 -39 -264 -184 -146 24
6873 24 -24 157 109 -243 22 29 -18 182 115 238 -244 -98 -12 -55 -27 -164 -64 205 42 -26 69 135 14 50 -159
6898 -159 29 -174 -53 -343 -56 42 21 109 81 58 150 -280 -93 15 -337 160 -243 55 -193 192 -46 -46 -422
6921 -422 119 -79 -8 -190 36 -39 -180 -138 253 146 -28 -185 -351 -156 149 -104 33 62 -30 334 -139 193
6943 193 -97 -8 -228 240 9 -7 75 294 139 -67 334 75 -204 -29 -19 82 180 135 -142 -59 -96 111 101
6966 101 255 167 -16 481 -173 299 139 313 270 -34 201 94 -65 -46 -98 -305 144 76 10 247 -107 -210
6988 -210 264 154 68 -2 -144 32 -149 -26 124 150 44 13 166 139 108 -47 -86 56 -208 -59 205 325
7010 325 -303 68 125 166 -32 108 165 2 -143 -131 48 -312 -33 -67 -42 -188 -46 82 -152 68 80 116 -74
7033 -74 -75 -72 62 -25 121 232 5 -115 228 441 139 195 -296 89 48 -29 -83 86 -209 139 23 -127 16
7056 16 -282 12 81 -34 176 -105 -157 359 -310 95 -418 -163 188 90 39 84 -84 19 162 -79 20 57 158
7079 158 252 32 12 117 268 -85 317 266 -169 238 -7 -133 -15 52 -20 -285 -353 125 368 103 -209 -87
7101 -87 4 -7 12 90 33 76 -234 308 107 -38 -70 120 -142 186 227 143 -42 -91 -37 -167 -45 -499 17 -264
7125 -264 -3 127 -26 199 158 86 30 -121 -17 -189 183 40 -98 -182 -21 -71 243 -124 80 61 88 75 220
7148 220 18 -41 277 21 98 -14 91 -126 -278 -72 -145 181 -235 -38 -317 -176 62 213 -278 104 -6
7169 -6 -38 180 -14 154 -212 -178 67 193 17 -252 -189 112 129 136 227 -101 154 -183 166 58 -86 295 -12
7192 -12 -359 240 -73 -141 72 -94 215 13 -105 64 83 75 -73 6 161 25 236 112 -82 25 90 -120
7214 -120 386 -5 114 43 78 270 -77 177 57 72 35 39 -210 -172 71 29 19 -87 -92 127 -3 -42 113 23
7238 23 -211 -8 302 -70 75 -30 136 95 -273 -217 -125 100 -70 -44 -85 -36 29 -72 -48 195 -11 61 231
7261 231 -112 -60 -4 -288 -109 42 -206 65 -176 108 -154 -5 -37 -137 5 459 50 -27 -135 112 42 25
7283 25 174 -18 -228 -14 -79 135 -64 -164 -66 -72 -87 0 80 81 15 -19 218 82 221 69 126 -100 -12 409 -82
7308 -82 -183 128 -36 -123 11 298 278 36 -288 277 -109 21 -5 -151 -280 105 57 141 -265 98 -131 -62
7330 -62 -391 -248 72 419 -53 -229 -111 42 -89 164 297 -46 -107 9 92 108 -138 -83 -251 28 -24 5
7352 5 -254 -61 -516 -269 -32 311 37 -64 18 -308 18 124 -30 -311 -42 292 -28 -100 -248 -172 31 6
7374 6 10 -38 266 -94 125 -67 298 -20 168 46 263 -36 -210 28 258 3 103 16 47 -209 133 129 -101
7397 -101 378 -101 29 47 -143 39 -21 -146 259 -102 -410 82 315 66 28 49 105 229 124 190 -29 -159
7419 -159 227 86 50 -73 111 -8 -114 -187 349 167 71 234 -1 -152 203 -24 -36 136 -142 297 -130
7440 -130 -267 70 9 -37 -246 -64 -66 -94 47 -147 86 10 -74 -167 61 -130 -158 -61 -102 -73 -266 -80 -14 42 -214
7465 -214 -96 198 338 213 120 -21 -164 188 -46 -10 -113 227 44 -241 -97 -29 45 171 -102 -96 58 85
7487 85 174 25 357 173 -364 -15 -110 256 192 25 -32 69 -209 -242 -48 10 -9 -45 21 35 -67 95 90 150 -17
7512 -17 -62 74 74 -65 -46 107 120 -79 147 8 121 -330 69 -255 -132 195 -125 160 -4 -85 -4 159 -15
7535 -15 -366 -351 -253 141 148 37 52 -21 -212 -11 104 258 -133 40 41 55 -218 -129 210 -70 -123 -14 -297 -134
7559 -134 151 266 110 -268 -19 -428 129 -107 -231 -225 -10 -190 296 115 -33 -203 232 82 54 255 102
7580 102 159 196 176 -59 96 -153 -84 -159 -227 -255 -33 28 -18 -98 132 79 42 9 44 -258 128 -148 50 -167 264
7605 264 -40 -162 235 -71 60 147 94 -39 170 -69 -174 -118 -70 -281 -51 -229 254 -148 -263 -167 64 -140
7627 -140 244 -105 -17 -62 166 -42 -25 30 57 -13 87 276 -29 -44 -152 105 -317 -21 -133 -294 31 72 -109
7650 -109 -305 -87 412 12 -97 -154 154 -11 179 79 -46 -171 -5 -150 162 110 30 -128 -181 -331 108
7671 108 76 -290 13 105 -109 207 -14 470 -61 -258 24 169 -197 -411 -86 -200 -90 -91 20 -54 -9 15
7693 15 9 80 46 -47 -168 -441 -49 156 177 104 -3 19 -92 -172 285 -177 -363 -161 215 -197 -134 92 -104 -253
7717 -253 29 -51 20 171 38 225 67 -6 -101 23 -138 -215 270 102 48 -106 126 139 118 -139 -337 172 40
7740 40 -40 -126 -148 35 95 2 -131 10 -148 73 -102 -132 103 210 -140 -269 29 253 167 28 -55 -188 113
7763 113 -193 -111 -19 23 204 126 -58 -294 -117 202 139 -11 -104 45 23 -209 -101 -44 9 135 106 12 26 41
7787 41 113 -243 81 284 163 200 -11 -133 51 -15 -36 165 -110 90 93 30 0 -217 36 -7 -268 -61 -215
7810 -215 -228 -64 90 -64 -138 -168 124 158 -152 -169 -15 35 236 314 44 48 -137 197 176 448 -155 -372 -287 -301
7834 -301 13 77 -39 -185 33 6 -264 -180 21 82 -251 -92 -139 -35 -23 204 214 221 -94 -104 -42 -230 -9 311
7858 311 -53 -37 66 30 131 168 304 -103 -61 95 243 140 -250 -64 -59 -158 -186 14 -51 119 25 37 235 280
7882 280 164 220 -120 -125 47 -182 -148 21 95 -55 29 28 316 81 -154 -223 -255 43 -89 -251 219 272 72 -56
7906 -56 -126 18 -35 -82 121 -182 384 -25 24 73 -53 245 230 174 39 59 54 -70 195 -83 277 -157 -17 110
7930 110 -96 -85 -137 95 10 -288 -169 -57 35 -121 -169 -49 120 73 -220 -132 -114 -84 -80 -150 92 -15 -22 -42 183
7955 183 87 112 48 -214 66 81 331 -185 55 -101 150 184 -113 -41 -438 -303 -20 35 244 34 -44 221 9
7978 9 85 126 207 -174 -60 -105 -125 162 -116 -35 -4 -321 204 -47 -172 75 117 -122 -60 243 242 31 -12 -236 -42
8003 -42 -107 -24 46 133 54 -28 -529 262 -60 -144 -175 -97 -9 100 -86 -233 198 -73 307 -287 -254 116 92 -127
8027 -127 150 26 342 -244 22 37 -167 -204 -45 -123 1 -338 -351 291 31 299 -73 50 88 227 -18 -48
8049 -48 244 270 41 60 43 -34 42 18 83 41 -119 -117 -335 21 82 43 440 -124 -139 48 -120 1 50 -94 39
8074 39 -181 -149 348 215 -337 -133 432 196 227 -293 34 -62 -240 -137 -68 142 302 -209 -33 39 9 71 -45
8097 -45 -11 -145 -31 -45 186 -9 -122 -175 -24 150 10 217 -162 -17 128 -273 -296 128 121 -110 -394 -85
8119 -85 239 103 -232 -45 17 231 95 -218 188 58 -122 -364 -294 352 235 -117 -216 233 -20 -168 -58
8140 -58 171 340 -333 82 -244 -18 -14 -503 -42 45 -134 -59 -45 -220 85 299 -267 -174 54 93 -196 76 100
8163 100 114 -144 61 12 -68 47 -39 14 190 41 269 -277 -11 92 -127 -185 146 47 -86 24 95 -54 -46
8186 -46 -259 111 68 14 -254
8191b54
##END NTUPLES=NMR FID
##END=
