##TITLE=1H_CA-8637-1
 CD3CN, 8 sc, 
 21.8.2019
##JCAMPDX= 6.0         $$ Bruker NMR JCAMP-DX V2.0
##DATA TYPE= NMR FID
##DATA CLASS= NTUPLES
##ORIGIN= UXNMR, Bruker Analytische Messtechnik GmbH
##OWNER= root
$$ XWIN-NMR		Version 3.5
$$ Wed Aug 21 14:56:26 2019 Russian Standard Time (UT+4h)  she@DPX200
##.OBSERVE FREQUENCY= 200.13155
##.OBSERVE NUCLEUS= ^1H
##.DELAY= (6, 6)
##.ACQUISITION MODE= SIMULTANEOUS
##.ACQUISITION SCHEME= undefined
##.AVERAGES= 8
##.DIGITISER RES= 18
##SPECTROMETER/DATA SYSTEM= spect
##.PULSE SEQUENCE= zg30
##.SOLVENT NAME= CD3CN
##.SHIFT REFERENCE= (INTERNAL, CD3CN, 0, 15.7039)
##AUDIT TRAIL= $$ (NUMBER, WHEN, WHO, WHERE, WHAT)
$$ ##TITLE= Audit trail, XWIN-NMR		Version 3.5
$$ ##JCAMPDX= 5.01
$$ ##ORIGIN= Bruker BioSpin GmbH
$$ ##OWNER= she
$$ F:/spectra/data/she/nmr/H-F/1/audita.txt
$$ ##AUDIT TRAIL=  $$ (NUMBER, WHEN, WHO, WHERE, WHAT)
(   1,<2019-08-21 14:55:33.04 +0400>,<she>,<DPX200>,
      <created by zg, POWCHK disabled, PULCHK disabled
       configuration hash MD5:
       00 E9 B6 7A A2 85 ED C7 34 08 36 98 17 FE 4E 26
       data hash MD5: 16K
       24 C9 92 3A D0 A2 C6 32 24 5A 39 71 9B 4C 84 5E>)
$$ ##END=
$$ 
$$ hash MD5
$$ 55 BA 1D E9 EC 37 C9 FF 8C E7 A4 D9 A4 B7 68 BD
##$RELAX= 
##$RELAX= 
##$RELAX= 
##$RELAX= 
##$RELAX= 
##$RELAX= 
$$ Bruker specific parameters
$$ --------------------------
##$DU= <F:/spectra>
##$EXPNO= 1
##$NAME= <H-F>
##$PROCNO= 1
##$TYPE= <nmr>
##$USER= <she>
##$AMP= (0..31)
100 100 100 100 100 100 100 100 100 100 100 100 100 100 100 100 100 100 
100 100 100 100 100 100 100 100 100 100 100 100 100 100 
##$AQSEQ= 0
##$AQ_mod= 1
##$AUNM= <au_zg>
##$AUTOPOS= <>
##$BF1= 200.13
##$BF2= 200.13
##$BF3= 200.13
##$BF4= 200.13
##$BF5= 200.13
##$BF6= 200.13
##$BF7= 200.13
##$BF8= 200.13
##$BYTORDA= 1
##$CFDGTYP= 0
##$CFRGTYP= 5
##$CHEMSTR= <none>
##$CNST= (0..31)
1 1 145 1 1 1 1 1 1 1 1 1 1 1 1 1 1 1 1 1 1 1 1 1 1 1 1 1 1 1 1 1 
##$CPDPRG= <>
##$CPDPRG1= <>
##$CPDPRG2= <>
##$CPDPRG3= <>
##$CPDPRG4= <mlev>
##$CPDPRG5= <mlev>
##$CPDPRG6= <mlev>
##$CPDPRG7= <mlev>
##$CPDPRG8= <mlev>
##$CPDPRGB= <>
##$CPDPRGT= <>
##$D= (0..31)
0 1.2 0 0 0 0 0 0 0 0 0 0.03 0 0 0 0 0 0 0 0 0 0 0 0 0 0 0 0 0 0 0 0 
##$DATE= 1566384932
##$DBL= (0..7)
120 120 120 120 120 120 120 120 
##$DBP= (0..7)
150 150 150 150 150 150 150 150 
##$DBP07= 0
##$DBPNAM0= <>
##$DBPNAM1= <>
##$DBPNAM2= <>
##$DBPNAM3= <>
##$DBPNAM4= <>
##$DBPNAM5= <>
##$DBPNAM6= <>
##$DBPNAM7= <>
##$DBPOAL= (0..7)
0.5 0.5 0.5 0.5 0.5 0.5 0.5 0.5 
##$DBPOFFS= (0..7)
0 0 0 0 0 0 0 0 
##$DE= 6
##$DECBNUC= <off>
##$DECIM= 24
##$DECNUC= <off>
##$DECSTAT= 4
##$DIGMOD= 1
##$DIGTYP= 9
##$DL= (0..7)
0 120 120 120 120 120 120 120 
##$DP= (0..7)
150 150 150 150 150 150 150 150 
##$DP07= 0
##$DPNAME0= <>
##$DPNAME1= <>
##$DPNAME2= <>
##$DPNAME3= <>
##$DPNAME4= <>
##$DPNAME5= <>
##$DPNAME6= <>
##$DPNAME7= <>
##$DPOAL= (0..7)
0.5 0.5 0.5 0.5 0.5 0.5 0.5 0.5 
##$DPOFFS= (0..7)
0 0 0 0 0 0 0 0 
##$DQDMODE= 0
##$DR= 18
##$DS= 0
##$DSLIST= <SSSSSSSSSSSSSSS>
##$DSPFIRM= 0
$$ [...]
##$SUBNAM2= <"">
##$SUBNAM3= <"">
##$SUBNAM4= <"">
##$SUBNAM5= <"">
##$SUBNAM6= <"">
##$SUBNAM7= <"">
##$SUBNAM8= <"">
##$SUBNAM9= <"">
##$SW= 24.9336996594482
##$SWIBOX= (0..15)
0 0 2 0 0 0 0 0 0 0 0 0 0 0 0 0 
##$SW_h= 4990.01996007984
##$TD= 16384
##$TD0= 1
##$TE= 0
##$TE2= 300
##$TE3= 300
##$TEG= 300
##$TL= (0..7)
0 120 120 120 120 120 120 120 
##$TP= (0..7)
150 150 150 150 150 150 150 150 
##$TP07= 0
##$TPNAME0= <>
##$TPNAME1= <>
##$TPNAME2= <>
##$TPNAME3= <>
##$TPNAME4= <>
##$TPNAME5= <>
##$TPNAME6= <>
##$TPNAME7= <>
##$TPOAL= (0..7)
0.5 0.5 0.5 0.5 0.5 0.5 0.5 0.5 
##$TPOFFS= (0..7)
0 0 0 0 0 0 0 0 
##$TUNHIN= 0
##$TUNHOUT= 0
##$TUNXOUT= 0
##$USERA1= <user>
##$USERA2= <user>
##$USERA3= <user>
##$USERA4= <user>
##$USERA5= <user>
##$V9= 5
##$VALIST= <valist>
##$VCLIST= <CCCCCCCCCCCCCCC>
##$VD= 0
##$VDLIST= <DDDDDDDDDDDDDDD>
##$VPLIST= <PPPPPPPPPPPPPPP>
##$VTLIST= <TTTTTTTTTTTTTTT>
##$WBST= 1024
##$WBSW= 4
##$XGAIN= (0..3)
0 0 0 0 
##$XL= 0
##$YL= 0
##$YMAX_a= 95342
##$YMIN_a= -139144
##$ZGOPTNS= <>
##$ZL1= 120
##$ZL2= 120
##$ZL3= 120
##$ZL4= 120
##$ABSF1= 10
##$ABSF2= 0
##$ABSG= 5
##$ABSL= 3
##$ALPHA= 0
##$AQORDER= 0
##$ASSFAC= 0
##$ASSFACI= 0
##$ASSFACX= 0
##$ASSWID= 0
##$AUNMP= <proc_1d>
##$AZFE= 0.1
##$AZFW= 0.1
##$BCFW= 1
##$BC_mod= 2
##$BYTORDP= 1
##$COROFFS= 0
##$CY= 11.3945322036743
##$DATMOD= 1
##$DC= 2
##$DFILT= <>
##$DTYPP= 0
##$F1P= 20.1720416913024
##$F2P= 0.152960286110954
##$FCOR= 0.5
##$FTSIZE= 0
##$FT_mod= 4
##$GAMMA= 1
##$GB= 0.15
##$INTBC= 1
##$INTSCL= 1
##$ISEN= 128
##$LB= 0.24
##$LEV0= 0
##$LPBIN= 0
##$MAXI= 10000
##$MC2= 0
##$MEAN= 0
##$ME_mod= 0
##$MI= 1.114404
##$NCOEF= 0
##$NC_proc= 0
##$NLEV= 6
##$NOISF1= 3.799351
##$NOISF2= 2.8
##$NSP= 1
##$NTH_PI= 0
##$NZP= 0
##$OFFSET= 15.70392
##$PC= 1
##$PHC0= -9214.744
##$PHC1= 12.20096
##$PH_mod= 1
##$PKNL= yes
##$PPARMOD= 0
##$PSCAL= 0
##$PSIGN= 0
##$REVERSE= no
##$SF= 200.130013532006
##$SI= 16384
##$SIGF1= 3
##$SIGF2= 2
##$SINO= 400
##$SIOLD= 16384
##$SREGLST= <1H.CDCl3>
##$SSB= 0
##$STSI= 0
##$STSR= 0
##$SW_p= 3612.71676300578
##$SYMM= 0
##$S_DEV= 0
##$TDeff= 0
##$TDoff= 0
##$TI= <>
##$TILT= no
##$TM1= 0
##$TM2= 0
##$TOPLEV= 0
##$USERP1= <user>
##$USERP2= <user>
##$USERP3= <user>
##$USERP4= <user>
##$USERP5= <user>
##$WDW= 1
##$XDIM= 8192
##$YMAX_p= 0
##$YMIN_p= 0
$$ End of Bruker specific parameters
$$ ---------------------------------
##NTUPLES= NMR FID
##VAR_NAME=  TIME,          FID/REAL,        FID/IMAG
##SYMBOL=    X,             R,               I
##VAR_TYPE=  INDEPENDENT,   DEPENDENT,       DEPENDENT
##VAR_FORM=  AFFN,          ASDF,            ASDF
##VAR_DIM=   8192,          8192,            8192
##UNITS=     SECONDS,       ARBITRARY UNITS, ARBITRARY UNITS
##FACTOR=    0.0002004,     1,               1
##FIRST=     0,             0,               0
##LAST=      1.6414764,     0,               0
##MIN=       0,             -139144,         0
##MAX=       1.6414764,     95342,           0
$$ Real data points
##PAGE= N=1
##DATA TABLE= (X++(R..R)), XYDATA
0 0 0 0 0 0 0 0 0 -1 8 -8 8 -8 16 -16 17 -24 25 -33 40 -46 52 -63 73 -82 95 -107 124 -140 161 -181 204 -228
32 -228 258 -287 321 -358 398 -442 491 -543 601 -668 739 -818 906 -1006 1118 -1243 1389
49 1389 -1558 1757 -1996 2287 -2656 3134 -3788 4736 -6249 9049 -16036 73910 70668 -42872
63 -42872 31597 95342 75616 13586 39204 72142 45964 -13350 -210 57497 80701 27583
75 27583 -26839 -23680 26888 42732 11761 -10654 8918 12117 -24127 -40301 8166 47809 14577
88 14577 -43028 -37870 9204 21171 -6702 -13082 6741 2497 -31362 -32402 14883 41713 6346
101 6346 -33401 -20933 7924 5453 -5232 10517 19502 -11378 -38974 -17395 21349 21009 -9229
114 -9229 -26110 -20839 -12604 -9317 -6469 -2876 -4184 -21441 -45709 -41706 -1943 17678 -18890 -57013
128 -57013 -38059 -4868 -16791 -40027 -18563 7727 -21890 -62981 -40801 12744 14766 -28349
140 -28349 -43757 -16290 856 -13725 -21061 474 15969 -5305 -35374 -23687 18073 31058
152 31058 -89 -22908 -5508 15352 4381 -9016 8309 27057 7323 -25989 -19474 20528
164 20528 35069 3409 -25233 -12259 10611 2491 -14485 152 21103 -454 -39005 -30899
176 -30899 14243 24406 -12356 -33980 -15080 452 -10705 -16937 -119 9056 -11155 -33915
188 -33915 -24416 7489 20321 -1389 -24485 -17002 2631 1651 -9574 770 18609 4938 -24898
201 -24898 -19207 19020 30486 2026 -16788 -1520 10501 -787 -6187 12447 24842 3852
213 3852 -23347 -16475 14510 24869 2607 -14719 -6232 3501 -5568 -11655 5693 18756 -1918
226 -1918 -31173 -24133 7306 18398 -2151 -18893 -12299 -3581 -9138 -12577 2209 13908 -1247
239 -1247 -27882 -24553 6784 20625 605 -16702 -7119 3400 -4990 -9028 9175 21100 2149
252 2149 -21263 -13299 12729 21035 6565 -3745 180 3715 -1353 -2225 10704 21605 9547 -12749
266 -12749 -13291 9058 21893 9042 -3943 560 4917 -3120 -5681 11297 22938 7190 -15369
279 -15369 -12667 8748 17489 7165 -803 2806 3818 -4641 -3689 12762 22669 7227 -12890 -8667
293 -8667 11873 19041 8589 2672 7221 6397 -1804 -276 14934 23277 10426 -6901 -4568 12481
307 12481 19802 10643 3020 7263 9882 702 -2436 12995 25510 12192 -8534 -5523 12216 16566
321 16566 5555 3313 10533 7350 -4921 -4037 13359 20953 7351 -8894 -7305 6644 11953 6485
335 6485 2619 5339 3741 -5055 -6690 6932 17530 7299 -10958 -11232 4642 12127 3956 -1676
349 -1676 1829 2524 -6884 -8952 4940 15872 5826 -11524 -10933 3192 8833 1054 -2415 2068
363 2068 1629 -7057 -7364 5375 13238 4126 -8986 -9500 412 5728 3515 1133 2438 987 -4942
378 -4942 -6516 2632 11724 6555 -7339 -10820 -193 7211 3861 147 2284 314 -7981 -9064 3328
393 3328 12391 4222 -8463 -9757 -2063 1684 745 1111 990 -4308 -10049 -7631 2555 7846 1657
408 1657 -8472 -10690 -5139 419 1311 239 232 -3347 -8920 -8203 802 7638 2823 -6937 -8880 -3098
424 -3098 850 608 1090 2847 -1568 -9058 -8340 1840 8359 2863 -5870 -7422 -4089 -2660 -1272 2014
440 2014 2014 -4261 -11685 -10085 -965 4345 85 -7508 -10734 -8633 -5889 -3548 -1445 -1538 -6838 -14486
456 -14486 -14229 -4448 3362 -1136 -10637 -12730 -8767 -6323 -5406 -2364 142 -5052 -13081 -12116 -1850
471 -1850 4471 582 -6720 -8017 -5421 -3512 -1432 1789 3625 -780 -7825 -8142 -254 6310 4775
486 4775 -1903 -4873 -3243 -877 295 2843 4610 1700 -5917 -8237 -1203 6987 6427 -1424 -5602
501 -5602 -4539 -2006 -235 2772 4911 829 -6220 -7666 -76 6687 6159 664 -3873 -4001 -280 3568
517 3568 7036 6504 2954 -1478 -2564 2607 9535 10669 5932 1447 885 4570 7563 10083 10483 7272
533 7272 2312 1170 6079 11490 12035 7744 3599 2067 3481 6635 10175 10680 6252 438 -971 2733
549 2733 7732 8646 5694 1219 -1982 -1247 2722 7230 6881 1479 -3024 -3792 -430 4780 6825 3891
565 3891 -1531 -4414 -2723 1492 5719 6138 2171 -3436 -4601 439 5337 5454 2808 -389 -2660 -2526
581 -2526 1299 6180 6492 981 -4047 -4055 -443 2792 3978 2797 -928 -4531 -4741 -1277 2206 2642 -514
598 -514 -5495 -6906 -4422 -103 1378 -376 -4045 -6718 -7713 -4981 -452 1723 -1282 -6899 -9361 -5408
614 -5408 -564 1062 -1054 -3299 -5559 -6769 -4014 1544 4572 714 -4783 -6721 -2917 1723 4174
629 4174 3254 -576 -3582 -2899 545 3203 4512 3365 -721 -4089 -2133 3866 6424 3509 -286 -1618
645 -1618 -1780 -309 2593 5374 3189 -1337 -3697 -2077 1516 3839 3972 1043 -3039 -3575 -840 2943
661 2943 4046 2911 -678 -3503 -3636 713 5105 5188 1343 -2619 -2882 -207 3580 5004 4401 1158
677 1158 -2558 -3079 1649 6329 5814 1951 -1694 -1944 19 3511 6145 4398 -68 -2991 -1675 1405
693 1405 4065 5051 2307 -2676 -4530 -973 2988 3351 1249 -1045 -3178 -4502 -2298 1986 2935 -696
709 -696 -4418 -5317 -3240 -783 1602 1166 -2292 -5620 -5483 -3037 -82 1594 103 -4194 -7066 -5154
725 -5154 -345 2190 568 -3024 -4872 -5373 -3300 271 2468 405 -3555 -6913 -5160 -431 2488
740 2488 1589 -2651 -5431 -5194 -2815 1007 2061 -87 -3383 -5403 -4540 -1313 1704 1722 -1615 -5342
756 -5342 -5564 -2450 320 911 -56 -2063 -4838 -4573 -1048 2232 1835 -1096 -3146 -3726 -2279 797 2946
773 2946 1990 -754 -2913 -2436 -539 3197 4540 2448 -1977 -2910 -40 3139 4225 3658 1312 -1295
789 -1295 -1998 790 4821 5278 3022 -408 -1875 175 3435 4962 4010 1152 -1083 -1309 1044 4110
805 4110 4732 2467 -272 -1902 -549 2265 4336 3601 898 -1639 -1171 344 2391 3863 3010 -32
821 -32 -2535 -1081 1876 3474 2972 992 -836 -2133 -261 2185 3653 1977 185 -2096 -2192 401
837 401 3761 4387 731 -2140 -2021 -220 1800 3327 2478 -430 -2899 -2810 444 2916 2948 936 -2082
854 -2082 -3398 -1535 2251 3172 1368 -924 -2520 -2297 -575 2055 2739 554 -2103 -3344 -1404 1494
870 1494 2703 1352 -906 -2375 -1871 -595 1618 2804 1005 -2022 -2978 -1199 1393 2381 1477 343
886 343 -1871 -2257 -895 1792 3483 1628 -1340 -3077 -2059 1145 3270 2325 -91 -1390 -1631 -730
902 -730 1215 3174 2014 -1658 -3583 -1777 1440 3109 1879 -83 -1766 -2178 -429 1372 2559 1861
918 1861 -958 -2941 -2310 1080 2769 1829 -690 -1958 -1968 -726 1031 2196 1908 -786 -2729 -2701 110
935 110 2071 2041 -229 -1728 -2072 -1297 -52 1508 2007 -538 -2618 -2997 -658 1156 1275 -135 -1751
952 -1751 -2914 -2178 207 2136 1041 -1019 -2505 -2922 -1211 1478 1592 -101 -2187 -2825 -1917 -144
968 -144 1521 1799 -738 -3069 -2816 -665 1035 1129 229 -1174 -2738 -2367 -415 1659 1229 -685 -2240
985 -2240 -2385 -1097 984 1772 477 -754 -2119 -2011 -219 1988 1896 192 -1653 -1748 -337 1101 2215
1002 2215 2123 186 -1625 -1728 477 2861 3143 1176 -1032 -1235 359 2238 2514 2277 1205 -997 -1682
1019 -1682 503 3281 3413 1277 -1347 -948 750 1916 2441 2573 1353 -383 -1484 397 2886 3239
1035 3239 1275 -1091 -1176 363 1918 1881 1958 1316 -156 -1491 -625 2216 3207 1194 -1475 -1734 -371
1052 -371 1271 1448 1441 393 -1159 -2168 -1240 1171 2817 780 -1932 -2681 -1509 298 981 943 204 -1813
1070 -1813 -3036 -2485 734 1579 707 -1912 -3240 -2223 -113 668 578 -498 -1937 -3056 -2371 113 1534
1087 1534 38 -2474 -3209 -2227 -914 -194 531 -651 -2299 -3238 -2597 -260 653 387 -1871 -3030 -2639
1104 -2639 -959 427 760 -238 -1980 -2679 -2429 -169 1274 874 -1369 -2413 -2044 -995 982 1544 471
1121 471 -1209 -2240 -1548 751 2012 1624 31 -1286 -1351 -167 1626 2520 2010 -544 -1842 -633 2130
1138 2130 2837 2142 688 -239 -846 163 1912 2896 2403 206 -970 -230 1488 3215 2649 859 -90
1155 -90 -445 279 1286 2908 2515 788 -1351 -652 1547 3033 2318 1198 218 -304 -217 1332 2556 2297
1173 2297 463 -1621 -1313 931 2937 2401 693 -305 -671 -205 1140 2325 1928 267 -1554 -1767 488
1190 488 2293 2218 412 -1071 -1408 -912 225 1270 1299 -116 -2222 -2568 -714 1434 1216 -372 -1752
1207 -1752 -2006 -1475 -566 725 704 -1021 -2780 -2591 -1371 311 832 -401 -2027 -2516 -2122 -790 214
1224 214 686 -791 -2261 -3171 -1728 299 1138 -66 -1884 -2702 -2083 -664 1087 794 -620 -2281 -2675
1241 -2675 -1053 359 1296 653 -1141 -2382 -1943 -380 1259 1335 -114 -1697 -2008 -536 938 1201 1156
1258 1156 -575 -1987 -1355 348 1558 1506 110 -793 -1330 -491 813 2203 1451 -203 -1028 -695 445
1275 445 2285 2489 1195 -604 -784 142 1258 2172 2301 937 -351 -771 818 2784 2826 1731 92
1292 92 -497 2 1587 2755 2449 1127 -216 -672 636 2550 2801 1662 -704 -1114 157 1481 2271
1309 2271 1525 418 -764 -1186 -230 1526 2124 1161 -957 -1623 -742 699 1079 1182 213 -1315 -1462 -601
1327 -601 1082 1539 413 -817 -1968 -1312 53 1098 1098 -442 -1809 -1663 -1159 144 1253 1096 -1206
1344 -1206 -2519 -1841 50 1200 647 -230 -1845 -2265 -1811 270 811 150 -1369 -2440 -2078 -595 639
1361 639 649 -457 -2135 -2318 -1206 -206 666 266 -1208 -2522 -2097 -761 773 677 -698 -1782 -2153
1378 -2153 -954 -65 1092 656 -945 -1868 -1236 -435 927 747 149 -863 -1528 -991 499 1393 863 77
1396 77 -1182 -1410 -298 1253 1957 695 -1252 -1340 -635 640 1595 1255 89 -1164 -1569 -371 1382
1413 1382 1544 763 -715 -1164 -843 455 1737 1053 -392 -924 -1145 39 1135 1756 653 -1030 -1229
1430 -1229 -484 673 1369 1332 378 -1001 -1063 -301 937 1703 1237 -141 -1224 -787 479 1327 1337 284
1448 284 -954 -1122 -437 947 1345 1025 -354 -1359 -961 230 1404 1282 276 -1255 -1077 -635 533
1465 533 1207 1113 -190 -1395 -1518 -325 1116 1042 321 -936 -1511 -742 990 1028 596 -228 -1038 -1281 -36
1484 -36 1215 1432 -84 -929 -973 -239 529 1093 1181 214 -684 -1199 -275 1169 1452 584 -361 -1033 -402 1001
1504 1001 1343 1362 289 -702 -823 -192 1333 1814 1101 -473 -933 -501 795 1444 1636 341 -420 -1228
1522 -1228 66 1267 1628 1098 -726 -890 -607 239 1429 1556 290 -849 -1019 -72 697 1154 544 -497
1540 -497 -925 -701 404 1535 1361 -90 -1148 -1256 -260 676 1136 437 -718 -1134 -784 -208 775 1228
1558 1228 190 -1381 -1597 -447 431 642 437 -654 -1360 -1326 -824 620 1014 -61 -1349 -1826 -833 186
1576 186 776 328 -750 -1137 -1074 -948 237 1128 95 -1434 -1705 -1166 35 217 3 -748 -1127 -1591 -878
1595 -878 433 1034 361 -1166 -1910 -912 483 575 18 -281 -669 -1231 -777 424 1428 905 -653 -1568
1613 -1568 -749 501 984 744 -44 -180 -414 -202 674 1220 1411 -339 -1224 -512 819 1344 786 465 194
1632 194 -637 -502 470 1766 1342 182 -1300 -452 775 1517 1089 375 188 -448 -223 494 1772 1827 -263
1651 -263 -975 -92 735 912 991 682 408 -307 -566 473 1640 1438 -158 -780 -714 786 1320 582 247
1670 247 213 -661 -620 89 1412 1265 -330 -1107 -704 185 268 276 416 -317 -1117 -1279 -485 1166 571 -882
1690 -882 -1858 -1329 -34 -117 -266 188 -288 -1353 -2048 -313 991 381 -1558 -2140 -1322 -486 -328 -188 53
1709 53 -227 -1756 -2060 -855 1089 768 -1031 -1726 -807 -335 -393 -157 367 213 -1324 -1685 -27 1229
1727 1229 1209 -553 -1444 -679 9 21 254 576 454 -853 -1909 -602 1422 1334 -644 -1311 -734 467
1745 467 239 156 1004 991 -575 -1284 42 2051 1711 -194 -572 -60 932 557 592 1354 1543 -37 -1345
1764 -1345 87 2165 2224 206 -368 511 1028 558 581 1583 1525 157 -929 432 1992 2018 542 -282
1782 -282 84 675 772 396 1133 1204 71 -1385 -218 1911 1933 439 -721 -175 563 -213 148 1296 964
1801 964 -449 -1480 -664 1466 1509 -118 -1057 -239 129 -295 -239 771 1160 -613 -1868 -651 1265 1288
1819 1288 -403 -797 -388 43 -776 4 914 1366 -785 -2030 -844 1140 908 -654 -1048 -404 -530 -1351
1837 -1351 -994 802 1019 -1174 -2489 -1222 487 741 -757 -1453 -519 -512 -1455 -1086 738 1196 -741 -2400
1855 -2400 -1192 706 1044 -854 -1273 -210 -360 -1238 -798 1223 1461 -913 -2222 -1046 1125 1033 -271
1872 -271 -647 285 210 -916 -467 1207 1511 -519 -2018 -591 1291 1256 -432 -569 469 1 -868 -770
1890 -770 1211 2034 -357 -1964 -606 1593 1421 -63 -545 687 418 -1031 -768 1362 2109 -48 -1735
1907 -1735 -596 1529 1211 -246 -192 852 436 -759 -325 1176 2177 142 -1590 -788 1523 1565 201
1924 201 -228 658 358 -886 -640 1445 2037 -7 -1741 -768 1200 1139 -198 -511 739 -109 -1071 -656
1942 -656 1270 2003 -354 -2095 -939 970 621 -210 -641 510 117 -1632 -1183 1218 1824 -409 -1724
1959 -1724 -691 822 522 -646 -95 937 -171 -1905 -938 1250 1970 -252 -2113 -956 782 647
1975 647 -619 -294 581 -128 -1682 -807 1317 2152 -581 -1922 -946 1039 752 -307 -201 524 -121 -1477
1993 -1477 -944 1259 1887 -191 -1911 -668 910 549 -410 56 1044 178 -1749 -1260 1306 2083 -150
2010 -150 -1605 -708 1236 714 -819 212 1243 211 -1586 -955 1242 2077 -145 -1710 -618 1119
2026 1119 670 -498 136 1191 258 -1679 -999 1320 2038 55 -1474 -619 1168 774 -615 131 900
2043 900 167 -1809 -1281 1278 2189 44 -1641 -388 686 68 -556 133 1019 130 -1943 -931 1207
2060 1207 1805 152 -1662 -598 676 26 -356 -238 1030 227 -1714 -1287 754 1575 -35 -1719 -614
2077 -614 732 149 -829 49 1391 11 -1793 -1559 797 1552 -137 -1046 -459 832 44 -1006 148
2094 148 985 155 -1478 -1385 1025 1973 92 -1182 -605 748 39 -569 412 1378 328 -1339 -1235 822
2112 822 1762 201 -1459 -405 725 -184 -700 567 1347 81 -1674 -1015 1425 1705 18 -1014 -142
2129 -142 799 -210 -619 619 1464 414 -1376 -1136 1186 1481 160 -926 -236 899 3 -997 370
2146 370 1703 478 -1157 -1150 932 1546 -80 -1150 3 693 -166 -735 195 1572 463 -1236 -1039
2163 -1039 725 1503 53 -642 -22 308 -308 -754 445 1462 301 -1659 -1239 409 1507 -152 -877
2180 -877 -149 227 -478 -1291 103 1198 -66 -1757 -1294 554 1118 -45 -869 -414 216 -848 -857 165
2198 165 913 -262 -1828 -1628 195 889 -156 -774 -262 -9 -393 -1048 -340 1274 227 -1315 -1151 219
2216 219 948 -27 -769 -293 399 -547 -855 278 1177 511 -1400 -720 515 728 41 -368 -65 409 -400
2235 -400 -477 515 1215 498 -935 -851 386 1231 405 -233 223 531 -63 -630 351 1622 667 -688 -580
2254 -580 747 1257 423 -59 569 561 -261 -554 536 1562 665 -895 -541 685 667 636 139 397 316 -308
2274 -308 -622 465 1648 827 -1138 -797 675 825 343 -174 381 472 -464 -855 456 1367 54 -849
2292 -849 -706 515 626 -96 -74 583 218 -742 -526 173 1193 335 -1221 -855 -55 506 -507 -481 412
2311 412 178 -830 -830 -94 803 327 -1054 -806 -52 74 -565 -292 179 -2 -762 -1109 -4 901 43 -1087
2331 -1087 -1079 -120 42 -423 -544 -66 -166 -806 -907 105 924 -85 -639 -922 -258 276 -247 -348 95 361
2351 361 -690 -962 5 953 171 -833 -809 -245 203 2 5 168 73 -610 -676 51 629 183 -587 -418 83
2372 83 304 270 184 577 495 -828 -706 650 791 886 -397 -580 274 387 370 346 737 531 -137 -551 209
2393 209 1125 883 -386 -571 60 209 -191 562 453 280 -314 -528 234 1200 367 -120 -112 -26 110 78 242
2414 242 664 101 -335 -525 -128 985 575 -98 -295 211 153 -33 450 722 196 -365 -799 -155 682 505
2434 505 -157 -306 -17 -230 -313 -19 505 75 -409 -850 75 377 246 -467 -552 -150 27 -416 44 285 -55
2455 -55 -495 -885 -155 351 228 -128 -499 -555 -227 -257 -110 244 393 -330 -929 -310 136 589 -234 -459 -185
2476 -185 -364 -139 -59 416 -48 -517 -747 -280 93 523 -139 -439 -308 -683 -222 405 468 246 -444 -728 54
2497 54 522 458 170 -26 -320 -219 -198 278 598 562 -383 -293 -197 415 592 -184 -35 -241 -70 -301 232 552
2519 552 -50 -224 -651 -5 528 557 -101 353 59 -369 48 459 574 230 -665 -407 304 149 290 162
2539 162 -179 -244 -303 -43 538 377 610 -181 -575 -66 320 486 139 63 -149 -370 38 118 327 362 -322 -573
2561 -573 10 281 418 266 -6 -115 -458 -341 28 571 117 -481 -527 17 480 198 438 -280 -435 -432 -136
2582 -136 37 149 358 -78 -583 -437 -70 61 127 -242 -313 -249 -337 394 285 318 26 -455 -61 123 116 371
2604 371 363 -109 -190 -159 196 449 489 241 -372 -354 -39 387 575 135 -281 -674 -326 163 264 221 48 -361
2626 -361 -431 292 222 754 -46 -287 69 -117 379 363 466 232 -306 -56 1 104 602 -193 -35 -352 -306 28
2648 28 294 254 22 -179 -426 -203 165 81 405 -132 -129 -356 -82 270 353 61 -282 -644 -379 93 435 351
2670 351 -75 -604 -429 157 457 393 61 -385 -878 -216 275 183 91 -42 -607 -336 46 593 34 107 -151
2691 -151 -627 -125 -44 298 377 -88 -371 -244 -542 237 271 286 -289 -510 -605 -52 333 80 35 -261 -287 122
2713 122 440 356 99 -93 -31 -99 136 289 305 4 -161 -362 92 280 619 137 30 -315 -276 232 389 269
2735 269 253 -205 -146 48 320 348 343 228 -59 -69 266 493 505 124 -293 -138 -19 379 149 166 -46 42 62
2758 62 293 461 331 429 -141 -103 -87 -12 102 358 -129 -303 243 284 266 241 277 -498 -459 -166 326 316 320 -340
2782 -340 -274 -252 -184 182 244 -3 -18 -266 -70 174 262 -38 -211 -314 -195 -249 33 278 -319 -69 -500 -484 282
2805 282 257 147 53 -286 -651 -162 -226 -4 -60 -413 -562 -290 -289 283 217 -483 -553 -390 -134 192 201 -60 -405
2828 -405 -471 -503 308 -3 -273 -126 -400 -412 67 97 285 54 -203 -464 -174 -81 285 145 -74 -250 -396 52
2850 52 -19 307 365 -106 -487 -35 85 155 168 -191 -386 -481 149 348 290 327 -130 -159 23 127 390 394 174 -171
2874 -171 -32 279 272 165 188 -31 -335 -211 -8 418 564 239 90 -128 26 625 734 519 80 91 -46
2895 -46 79 217 610 289 302 -172 -148 228 402 452 192 -202 -211 -26 353 165 403 -224 90 -33 346 378
2917 378 502 -36 -373 -177 249 259 236 7 -587 -473 -429 47 128 200 -271 219 -330 -106 38 30 234 -229
2939 -229 -422 -340 -202 56 232 -342 -488 -330 -49 216 298 -67 -110 -269 -429 -207 99 -199 195 -34 -512
2960 -512 -399 -3 -121 -201 -171 -245 -345 128 122 46 267 -355 -430 -206 160 240 6 52 71 -308 -152 297 418
2983 418 188 -380 -271 -215 77 244 56 -165 -352 -363 -186 14 349 346 -10 -193 -226 -143 78 581 374 14
3005 14 -110 -46 93 242 363 -136 -525 -153 238 45 169 115 -314 -108 -77 220 456 -141 -103 -67 108 239
3027 239 292 291 307 183 -204 -40 182 167 338 -182 -5 51 -172 212 -97 84 -304 -247 14 184 447 347
3049 347 -191 -189 -122 -22 -45 284 87 -409 -2 74 258 95 260 42 -322 -425 -288 -25 286 -175 -256 -404
3071 -404 -241 -272 174 267 -78 67 -168 -87 20 40 165 -269 -286 -536 -13 -10 88 78 -166 -151 -226 127 374 199
3095 199 -61 -449 -136 -67 75 -86 6 -267 -110 -128 -19 249 86 76 -329 -444 157 344 122 90 -226 53
3117 53 164 165 164 93 318 -232 -217 -44 241 340 111 122 -90 -93 41 68 359 216 -192 87 -50 164 17 140
3141 140 -155 -156 -53 181 281 317 4 -391 -258 232 -98 80 133 -194 37 -19 109 41 428 -272 -220 -273 -147
3164 -147 174 5 185 -296 -191 -443 -92 226 22 73 -411 -386 -64 -46 -117 -227 178 -98 -435 -325 -54
3185 -54 117 329 -270 -236 -19 33 288 -249 -115 -405 -305 -1 436 341 -70 22 -209 -476 -88 7 389 58
3207 58 -113 -34 -188 -17 388 208 -135 -241 -24 129 88 341 68 -114 -256 -275 273 347 -2 0 -118 203
3229 203 451 266 449 186 105 -104 -173 -122 466 142 -261 -309 -109 -131 265 236 106 -115 -344 -299 0 275
3251 275 155 69 -257 -270 -67 436 209 -78 30 -144 -94 -121 94 159 -202 -139 -146 -82 127 307 -59 -231 -189
3274 -189 -52 82 163 203 -256 -54 -210 -85 345 155 261 -120 -310 -226 -67 101 201 -33 -341 -245 -429
3295 -429 -78 184 -174 -194 -491 -599 161 247 122 -76 -329 -461 -273 -3 31 2 6 -288 19 -328 74 74 -10
3318 -10 -332 -306 6 -40 185 207 -185 -372 -102 -53 220 -124 -157 -38 -319 93 37 129 396 171 -91 -392 9
3341 9 146 221 80 -89 -356 -98 98 296 472 -47 -80 -10 -35 -149 275 167 -177 80 -159 29 257 237
3363 237 -113 -91 -186 176 119 346 -47 65 -342 -23 345 307 287 353 -177 285 190 -19 255 -28 -11 -123 -91
3386 -91 -117 283 117 127 126 -85 -61 -80 121 170 -82 50 168 429 134 304 180 17 -246 -29 234 186 -64
3409 -64 -45 -181 -247 22 -154 136 -54 76 -77 -175 313 230 -163 -128 -261 -157 155 80 -322 179 -134 -126 -78
3432 -78 -81 304 98 -50 -256 -96 -76 252 103 -125 -44 -284 -13 -127 175 96 -157 -90 -201 -5 -101 89 -48
3455 -48 -288 -119 -106 54 188 -165 -182 -34 -446 -286 174 113 125 -183 -426 -238 -314 249 144 49 -225 -130 88
3478 88 -32 141 89 -64 -369 -397 -497 136 -55 68 -361 -358 128 15 458 279 119 -123 -103 136 95 271
3500 271 291 293 -175 -21 124 327 32 -109 -97 -333 149 276 400 -26 -226 -141 -43 24 -75 155 8 92 -22
3523 -22 -16 144 169 207 -336 -255 -68 95 185 215 85 -21 -268 -7 132 264 -129 -259 -102 7 227 188 116
3546 116 39 -133 28 255 -181 21 183 -109 270 -127 -134 415 48 69 -422 -328 -73 -5 65 -6 -168 -256 -148
3569 -148 -150 185 175 -437 -73 -10 -71 124 -29 -288 -136 -21 -312 -35 143 117 -176 21 -321 170 -59 292
3591 292 -6 -236 -204 -178 -184 254 -60 -257 -277 -260 179 53 101 -151 -43 89 -156 65 -15 38 -5 -481 -63
3614 -63 -88 -70 99 73 44 68 -46 84 61 158 63 -144 -356 -74 -10 132 27 113 -185 35 -145 47 233 189
3638 189 -191 -78 -63 -96 -42 -179 -153 -47 -147 -169 77 138 189 -203 -219 132 18 -42 125 133 -3 -131 -139 296
3662 296 116 -300 -414 -130 186 109 184 267 257 184 -28 -299 -153 119 23 -467 6 114 45 -21 -45 271 -215
3685 -215 -127 -64 78 426 240 -250 53 -271 -38 62 -167 -106 -59 -299 -354 120 429 172 164 -211 -295 -130 171
3708 171 -222 -58 -300 -93 -25 101 58 -83 -208 131 157 -109 68 150 382 -154 -84 -31 273 128 150 30
3730 30 176 -261 31 -254 133 179 289 -296 -61 -149 121 313 47 -135 -75 161 -36 299 497 79 -330
3751 -330 114 206 266 -34 95 92 -27 -403 -104 -98 213 220 -363 144 -186 -6 -66 -228 -76 -157 -79 -452 -40 327
3775 327 -68 -212 0 10 175 14 -50 -154 2 -311 -156 22 233 174 -50 109 2 352 -35 -102 33
3796 33 38 41 -12 72 119 13 -85 -19 -201 -1 -163 -58 -123 30 -81 -297 127 198 161 -431 -192 -98 8 105 -217
3821 -217 -216 167 -199 -242 24 238 -206 -231 -327 88 24 -49 457 -145 260 17 -197 100 330 219 -108 89
3843 89 6 224 115 194 -61 183 -89 -370 226 248 107 -156 -167 285 349 24 65 -53 199 -131 121 -134
3865 -134 181 5 -286 -310 -41 193 -2 -122 14 181 -434 278 233 296 41 -55 -245 -22 411 21 -171
3886 -171 -104 -208 -44 -336 176 55 30 -240 -54 209 -238 65 92 20 304 -239 -249 25 113 229 -259 -104
3908 -104 458 -124 -155 85 202 -119 -362 -40 178 238 -135 -205 -166 95 223 154 -122 146 -165 -354 -302 247
3930 247 176 138 -130 -247 -76 181 193 -220 -31 -21 -317 -356 201 136 -197 -203 -64 34 63 5 143 128 -21 -79
3954 -79 -469 118 438 80 -256 -329 -1 -77 -154 -93 138 230 -286 -106 1 224 199 -150 25 133 65 52 -326
3977 -326 39 153 -88 -14 65 188 119 -285 -202 406 -87 -197 -119 130 67 51 -317 -104 208 -80 -216 -230 54
4000 54 17 27 -231 65 138 -322 -345 57 508 -38 75 -22 199 121 -112 -149 77 200 -240 -174 41 37 129 -489
4024 -489 -104 227 27 135 94 336 84 -22 -278 385 574 262 -429 -15 52 -103 -368 -201 323 333 -48
4045 -48 -44 -101 138 41 -244 58 -53 200 -467 -255 172 128 -281 -310 68 103 121 -214 -425 169 232 -192 -6
4068 -6 192 306 -242 -380 -333 279 314 -255 -382 34 -208 -70 -180 -179 221 -451 -56 25 458 94 -109 -91 35
4091 35 -322 -318 -5 96 322 -92 -306 -99 57 -22 -295 -258 28 -239 -288 260 79 182 -276 -232 128 42 -153
4114 -153 -76 101 202 295 -97 292 325 -98 76 -312 271 200 -92 -39 -119 38 127 -274 206 282 79 -179 -232
4137 -232 -50 202 -281 -139 200 208 234 -157 75 243 312 -314 -15 -276 177 -450 -215 5 240 -110 -284
4158 -284 -273 109 194 -342 -80 -57 314 216 -79 75 193 -204 -291 -62 370 120 -355 -158 -206 34 -17 -95 -47
4181 -47 198 38 -395 3 254 106 -163 -176 -5 308 15 21 -63 188 26 -43 -142 180 0 -217 -205 -127 247
4204 247 -7 -308 49 161 116 -321 -23 397 358 -191 -254 32 253 123 40 188 42 -82 -88 -122 501 274
4226 274 6 -343 148 147 -212 -82 -44 158 -348 -1 -181 205 425 91 -185 -133 208 -398 -102 -202 229
4247 229 -70 -204 -159 292 -88 -19 -51 -109 35 -163 -112 36 -11 -102 -351 -173 381 201 -277 -54 34 6 178
4270 178 -310 200 82 -144 -395 267 328 -20 39 151 -188 -57 -21 211 -215 140 40 -133 -68 206 68
4291 68 -282 -180 11 275 -36 -99 48 -50 117 -108 -25 -97 413 -186 6 224 19 80 -331 -113 -131 47
4313 47 -127 -167 -92 236 -102 -169 123 -160 -8 6 23 13 55 34 193 -167 59 142 -161 170 63 -359 64
4336 64 81 58 -131 -257 -48 43 145 -223 -53 -228 -127 -78 11 30 154 -123 -63 -34 218 227 -182 258 94 163
4360 163 -74 -94 339 166 -134 -256 29 122 32 -189 -44 -63 -12 109 56 338 207 78 6 -170 49 185
4382 185 -335 -57 -115 -105 24 140 140 20 -273 -87 26 -26 -158 -95 -282 308 0 -19 21 -37 453 65 -217
4405 -217 -273 157 -37 -267 85 -212 229 -177 -235 103 103 1 -107 -291 111 260 54 -233 20 -65 -258 -259
4427 -259 -36 -78 -147 -392 -262 124 -205 47 23 -129 44 54 63 94 -1 156 94 -160 107 -202 134 328 -91
4450 -91 56 -286 254 452 243 -13 -3 126 2 85 293 -108 86 41 153 11 206 314 -150 -124 148 82
4472 82 -296 406 -110 -109 -20 -218 -108 88 -102 145 -133 81 101 -82 59 19 12 -12 -192 -155 3 93 -169 43
4496 43 -197 -54 -270 325 2 -24 -54 -178 3 77 -92 -182 105 -125 -169 16 -104 285 23 251 -143 26
4518 26 270 5 157 -236 -13 -291 39 -84 14 -3 -115 61 -79 130 156 -44 149 -83 252 -220 349
4539 349 100 250 65 -188 -83 1 1 -58 -2 -105 49 -10 -212 -161 -87 -12 -327 -185 -192 45 57 -358 101 -20
4563 -20 -147 -207 26 45 -161 -72 344 54 -114 -39 -102 -431 -179 1 300 -39 -299 -29 -33 -31 -47 257 -21 -91
4587 -91 70 98 -226 -144 -24 -9 -80 -1 -104 142 179 119 -23 -88 -63 245 -18 2 36 119 -81 -76 261 40 -3
4612 -3 133 15 42 252 284 160 -73 212 165 191 -109 110 -280 156 37 -235 77 -2 258 20 31 -319 -148
4635 -148 -194 103 -147 -97 134 -157 128 157 -276 -160 -17 -98 232 247 437 207 -115 2 -98 26 61 81
4657 81 213 -223 -344 201 101 -278 52 131 168 -235 -30 219 -138 -148 -153 43 129 289 -89 219 -269 82
4679 82 20 24 193 155 35 47 15 77 -89 -198 344 139 134 -297 60 16 137 -223 55 -85 -106 275 188 -203
4703 -203 -36 -439 -357 57 14 -88 -58 77 -180 -197 -21 107 208 19 196 238 -205 -19 -20 148 -11 -26 -16
4726 -16 -148 127 127 -27 -300 -188 -56 78 214 129 235 -159 -204 -20 49 640 117 165 -134 252 18 -37 -103
4749 -103 -16 -67 -139 42 152 486 80 -13 -94 -229 -135 -131 -221 165 -221 -80 -151 166 97 -222 14 30 273 25
4773 25 126 -253 108 3 -281 -57 66 37 -250 -119 -128 148 169 -100 258 -89 72 -165 107 -58 -91 -109
4795 -109 -144 -13 -170 -51 15 -269 22 207 -345 -15 -169 186 -119 43 -548 -94 288 133 80 -133 -43
4816 -43 -178 -9 -83 -61 208 124 -77 87 -11 -129 -130 89 -61 65 -114 -318 47 34 9 -165 -153 -264 -2
4839 -2 131 275 479 -97 -13 84 70 208 -17 291 -5 -45 238 107 -56 270 -11 -29 156 197 -100 100 130
4862 130 409 -23 136 8 93 -255 -306 -24 -6 71 -60 195 -141 24 -300 58 143 -40 -203 -92 53 23
4884 23 -191 -251 -20 140 -77 24 61 143 147 -14 -7 -134 133 -5 76 151 -98 -113 46 -308 145 26 17 12 25
4909 25 -40 -96 57 -236 165 10 -138 151 297 101 182 -48 95 -42 -147 145 187 65 -83 50 167 156
4931 156 37 -43 11 101 123 -32 -25 141 334 -147 -100 122 134 -4 -41 -115 30 -63 175 260 158 212 -33 -91 -1
4956 -1 -56 52 145 -185 -193 122 -124 -343 -193 -150 -87 -34 159 -198 113 201 -267 -40 189 148 -54 -28 -42 -55 256
4981 256 -212 31 133 -5 -277 -10 -47 25 195 27 -22 -200 186 -194 6 216 138 -123 -244 -99 -27 99
5003 99 17 -127 -355 271 166 195 82 25 5 -19 -119 -378 65 42 -7 170 -165 -155 29 -55 -151 -82 -49 -31 -64
5028 -64 306 -237 -19 -285 -11 120 -140 -174 132 227 -275 48 18 -21 -74 -176 -150 54 50 86 233 199 64 169
5052 169 -74 169 -168 162 -117 95 -20 -5 103 277 135 -69 -84 -32 -199 -15 -91 -18 19 -10 -108 148 -18
5075 -18 -69 165 -16 146 -89 173 -240 -296 -167 -33 -75 -26 276 264 83 -134 5 -169 -120 326 228 59 283
5098 283 -30 61 -114 147 229 -88 178 -100 -3 -134 226 -51 -205 45 -43 14 19 237 20 25 -272 204 144
5121 144 52 -71 26 93 0 259 113 84 86 -99 -186 22 55 -131 -174 -57 17 91 -44 -4 7 45 51 -5 -204 12
5147 12 127 -152 -74 49 171 10 49 102 -140 -98 67 43 18 45 -140 -124 174 -160 84 -38 -272 246 43
5170 43 99 467 -337 156 -300 140 -76 -432 -94 -35 18 67 -46 -245 -102 -64 324 13 -5 50 -4 -96 -27 126
5194 126 -216 190 52 33 215 -38 224 -172 -91 290 201 158 -249 -99 -108 -41 -113 170 25 43 -19 155 17
5217 17 118 135 114 10 -133 -80 43 -85 -212 -67 3 148 -14 25 209 426 -18 175 30 1 -258 -39
5239 -39 -78 -304 53 -38 -345 110 168 -171 -148 194 459 -315 60 375 -31 45 -142 139 38 -47 6 47 -169
5262 -169 64 272 83 111 -145 -122 -178 92 -206 -240 -215 103 -58 224 112 -191 -294 -70 -126 82 -257 -43
5284 -43 86 117 -309 -206 -108 -29 -1 -320 -73 84 79 20 -90 -381 232 -461 -81 -47 -32 69 -115 -309 -23
5307 -23 37 103 128 -24 -347 137 -93 68 27 122 127 47 44 25 206 102 -145 83 -135 -200 -41 60 -220 -232 212
5332 212 -45 174 -141 -176 -82 -291 -322 110 -162 21 74 -155 -168 -248 11 21 -281 243 20 -47 171 -71 -165
5355 -165 72 251 -67 10 -219 -20 -94 26 -277 -12 -308 162 55 -18 -28 69 -51 57 -51 49 63 138
5377 138 104 -204 107 -32 -11 125 16 21 -65 -32 96 -45 -105 -54 -268 198 -97 -289 -193 -246 182 158 190 -332
5401 -332 304 -45 -32 -75 -177 -266 109 19 39 82 -5 -74 -69 -3 169 -392 -91 -144 259 294 -162 -144 -178 82 -34
5426 -34 34 -159 74 -102 83 127 -243 -67 -189 142 128 169 -253 -55 -47 -207 -152 -155 -233 144 -161 48 136 -327
5450 -327 -168 -155 187 33 116 -51 -14 55 -185 439 -131 -113 -46 -288 -106 -218 237 -28 -108 -257 -36 7 -328
5473 -328 68 97 -71 -104 -327 -36 117 -85 172 -223 -58 -215 -123 -91 -133 -106 -20 30 11 59 328 -88 177
5496 177 128 -19 63 198 -93 165 44 80 -65 -108 131 -92 -219 6 -265 35 52 121 58 110 -209 50 -29
5519 -29 8 -5 -55 65 -92 99 -20 101 -49 41 -108 145 -50 -85 270 88 17 -113 49 -170 -66 -39 159
5542 159 -42 70 184 39 -79 -186 68 201 -193 53 -43 -206 -17 16 -107 -175 -60 81 -311 -68 118
5563 118 -272 -22 104 15 36 415 -46 85 -154 -9 344 -119 6 -89 155 -69 83 -271 117 311 -174
5584 -174 -74 43 120 101 169 -256 193 51 -178 -120 -358 -288 95 -124 -21 -182 -251 -248 214 16 141 381 -167
5607 -167 -47 -197 -27 93 -57 -57 -58 174 -174 -75 72 -189 -104 8 -51 -153 -22 226 304 -100 36 -206 -116
5630 -116 132 -180 112 248 -200 23 107 -39 -61 201 72 137 -16 84 -56 170 -69 -156 275 315 -108 74
5652 74 0 50 -353 2 190 -48 -312 -141 -204 -10 29 -122 -173 -36 -101 58 -263 -77 -180 -97 -75 -154 105
5675 105 21 -377 43 -29 -378 70 -266 -49 -114 -78 -101 -53 -91 -102 -104 18 -130 46 -189 -3 68 -292 22 -10
5699 -10 -11 -212 -78 227 348 -70 -32 110 79 182 -92 -15 -364 -17 -167 -238 -388 -42 -91 -8 -197 -170 -108 -43
5723 -43 304 -68 146 -25 236 -85 -177 -146 61 333 -18 146 104 169 -19 71 106 35 -196 87 -129 -31 18
5746 18 -167 76 -163 9 34 4 -5 226 271 129 108 -82 317 26 287 83 246 49 120 117 -173 -94 -132 68
5770 68 116 -17 -232 -87 128 228 57 269 42 -274 107 20 213 -124 75 -194 110 353 -40 49 374
5791 374 100 111 -52 -377 119 278 34 -211 84 92 70 25 212 -340 273 184 248 272 92 -19 -205 -57 171
5814 171 -3 -56 38 -16 -233 -241 58 -98 163 -1 -71 132 -45 266 -237 -272 -99 -76 -10 94 -222 12 47
5837 47 -116 127 -41 -51 132 73 53 130 -3 -69 -107 76 151 -133 112 15 15 -327 -121 34 -444 -260 -70 -11
5861 -11 -117 0 -5 72 282 5 -59 -248 -37 -208 -39 144 -84 77 48 -16 115 118 325 -130 67 87 -50
5884 -50 -170 -75 -57 -342 -95 -170 378 122 -26 78 100 7 -132 -13 15 -146 121 -86 -587 281 80 -34
5906 -34 107 350 125 -48 324 -28 -42 59 -45 112 -68 -232 73 -210 -36 -42 6 -117 -53 76 90 -137
5928 -137 -129 -113 247 -270 -47 -13 -55 10 -161 -140 55 49 94 222 -124 -74 -80 -101 284 -76 161 211 97 -85 -104
5953 -104 -153 88 13 184 -43 18 -183 83 -181 -122 -170 -97 -126 22 -72 139 -128 -48 81 76 85 -25 79 -342
5977 -342 230 -209 -246 91 143 121 213 236 143 94 177 97 321 2 125 49 -463 -83 168 -214 -131 -18 128 109
6001 109 137 282 -77 -28 29 73 -67 -334 68 31 -236 17 -100 -286 -234 99 163 -328 142 -118 -160 -2 271
6024 271 52 101 167 -85 -119 -237 4 108 -79 189 -252 98 152 -161 145 53 -121 -19 -17 159 -49 -251
6046 -251 60 56 -64 341 -77 172 30 94 122 18 -108 -251 -128 75 35 -30 -26 -73 3 -306 -184 91 -80
6069 -80 352 -259 -169 -9 -298 -153 -34 88 -268 381 -69 -278 31 -183 65 133 -69 -83 1 -103 80 -91
6091 -91 -52 -156 58 -46 12 44 82 15 -169 142 203 -42 360 15 74 110 -219 -38 151 -129 119 87 -119
6114 -119 9 212 -6 11 223 -285 -220 180 35 215 -285 142 93 -136 -42 -200 -162 243 50 9 -290 -11
6136 -11 -28 -188 -94 -189 -59 -185 -1 -251 354 -248 111 -42 -526 -67 117 84 -17 -219 33 -28 -183 14
6158 14 -354 -140 -14 37 -72 46 110 227 115 214 -382 -40 -49 -51 -1 -28 -21 -284 41 -292 -76 -90 -46 131 -94
6183 -94 -143 -93 -41 145 8 -147 -54 176 -190 36 -117 0 -57 178 140 -140 128 -180 -238 81 -190 335 92
6206 92 -40 121 -129 -109 87 14 92 84 325 -85 77 135 -16 215 -189 -174 0 -42 207 -55 29 -78 172
6229 172 163 84 201 158 111 -45 -79 13 -59 93 19 -8 192 -160 251 -184 204 -117 -171 -75 -218 139 -112 82
6253 82 -139 167 -48 154 228 -4 189 -273 -92 220 -94 -250 174 -9 40 98 122 165 220 -68 -9 -50 -104
6276 -104 168 121 -38 -31 125 -170 109 189 -166 63 317 59 -13 -159 -134 186 37 138 -36 -113 -20 11 -94
6299 -94 -16 -353 256 34 -4 -137 -162 -346 181 106 -145 -5 74 -193 -55 -110 -197 -111 6 -111 -238 -123 4
6322 4 -124 33 -191 13 99 217 82 -56 -221 66 -28 -211 65 -115 -67 24 246 -69 -92 379 30 123 4
6345 4 46 239 -77 -50 -47 142 143 -128 159 -210 -233 496 -164 15 105 -96 145 182 98 -350 69 200 47 41 -231
6370 -231 98 -64 -74 -123 -61 -89 -32 -217 -82 -23 164 45 155 -27 -212 205 19 133 44 193 -133 26
6392 26 5 -145 -7 -72 160 208 29 1 60 223 -417 59 76 93 98 -82 95 10 -43 -146 -193 243 -170 113
6416 113 -39 -45 -266 156 319 -67 81 -225 -36 29 44 176 144 282 -91 -82 -82 3 -38 -7 -49 -345 -287 -21 -41
6441 -41 33 9 -26 84 70 -294 -114 -155 -126 -263 -243 -31 25 -87 16 -35 -66 -144 -85 149 212 -227 130 -79 -172
6466 -172 -62 -198 20 -60 135 28 -1 -118 186 -33 -160 -33 255 -57 -120 49 203 -119 -196 -171 -117 -170
6488 -170 -171 342 93 178 266 184 -135 95 36 -197 299 -180 -468 -260 33 46 86 -97 170 41 39 -99 -307
6511 -307 89 -4 70 202 259 180 -69 189 -236 -82 -79 75 -256 -103 -52 159 -65 208 79 24 -167 311 148
6534 148 -72 277 202 142 -46 95 67 -167 19 27 37 27 -202 31 59 201 187 -109 -271 231 36 31 -110 19
6558 19 50 197 29 46 225 164 -100 -56 -26 118 -167 135 -157 107 -55 232 -68 -24 97 41 120 -1 -33
6581 -33 -70 12 -55 -6 147 -13 -26 -10 205 189 -2 287 -4 307 -202 28 5 -18 -80 -207 -97 -201 -274 53
6605 53 -103 22 145 20 137 68 -30 47 -85 144 -173 -74 245 -82 -39 -26 221 -42 164 21 28 25 -91 -118
6629 -118 -159 -102 -214 12 190 -198 -58 145 110 42 129 -259 -148 103 -52 59 71 28 -39 307 -51 -172 -41
6652 -41 76 -146 -257 118 211 73 -94 12 208 58 370 18 28 147 152 10 63 7 -168 -47 -122 56 64
6675 64 230 198 319 4 79 229 241 -27 -4 287 12 168 54 -182 -103 134 83 1 -44 104 -201 -8 71
6698 71 -180 -23 -8 46 -260 -41 71 -22 82 47 265 -117 60 126 -492 222 2 209 -86 266 -18 -315
6720 -315 -74 -90 -392 -184 -70 -145 213 -16 -80 -236 233 -374 247 -322 84 -31 41 9 310 -39 -3 120
6742 120 -129 -241 -192 -115 85 -105 421 48 192 92 215 27 -182 179 -52 244 190 59 -141 19 -73
6763 -73 -296 -172 -100 96 224 46 -183 -242 322 289 -89 53 -249 -6 8 -216 20 64 -238 55 -67 34
6785 34 177 -13 -72 -52 295 -30 130 13 109 -211 -95 -155 -211 -122 131 0 115 319 166 19 75 -58 -85
6808 -85 7 202 -88 51 152 -95 -184 58 30 193 11 -99 264 -98 68 88 60 -244 67 142 94 -163 -78
6831 -78 -292 44 -33 170 -184 -26 130 -138 57 -21 -218 73 128 56 27 129 -190 -75 183 15 -17 -196
6853 -196 64 -78 -102 143 -159 55 217 -177 -94 -154 -70 246 0 -58 -22 93 -101 86 301 284 204 257 377
6876 377 81 -252 -7 -99 -135 200 -229 -120 -124 -150 20 -101 177 119 -20 -60 145 -14 -147 391 -168 -147 87
6899 87 146 -53 228 -62 181 86 -156 194 361 -303 -174 200 60 67 98 -42 115 -228 17 338 36 108
6921 108 34 -97 -15 -132 -200 -119 93 89 334 26 66 43 48 -61 -35 -116 -152 -27 192 -64 -206 -135 -57 187 -338
6946 -338 -171 -110 -53 -116 9 60 -19 145 -76 186 -152 94 -297 -83 39 -65 115 193 -9 78 162 -93 215
6969 215 -48 198 -114 -300 150 -207 168 -8 291 29 -42 -15 -161 102 23 64 75 507 57 -128 17 -271
6991 -271 305 -105 10 50 0 182 -177 -47 -42 -122 161 53 -226 34 183 93 -144 86 54 -92 252 -290
7013 -290 204 -106 -16 -48 40 146 -45 270 -53 -28 177 116 176 -58 -42 299 -44 -248 -183 -30 51 3 -22 -88
7037 -88 250 -50 -37 269 184 -237 26 103 -69 41 195 85 -176 226 -248 152 178 342 -193 -155 -129 184
7059 184 -49 -45 29 -387 319 116 -52 16 211 64 51 70 -78 61 26 -50 252 -27 197 -85 42 -158 135
7082 135 114 148 8 190 5 -142 207 -370 -187 83 91 -150 27 -146 37 -185 -147 207 66 -160 360 59
7104 59 49 145 144 -229 113 103 178 -89 -211 -80 -76 79 5 -45 31 170 -224 195 78 19 230 335 -223 -129 -41
7129 -41 7 81 -21 -53 73 -126 -298 10 38 -196 159 -289 -138 -29 -66 47 -54 -86 -193 193 -57 -243
7151 -243 -21 47 -81 238 84 32 -63 171 61 -48 -220 -89 54 -210 59 463 342 -198 11 192 7
7172 7 454 338 -118 136 86 316 42 -371 89 -176 79 244 91 -27 42 118 10 -137 39 -150 43 11
7194 11 -307 135 -18 209 75 134 216 -71 127 72 32 138 -40 -124 89 -84 67 540 264 -276 131 38
7216 38 -51 -74 -44 -134 -111 64 230 182 4 -51 104 -55 135 28 83 261 -172 230 -229 28 116 86 3 21
7240 21 115 81 84 -184 50 -120 123 -231 150 -272 -44 -133 -87 153 93 -230 -132 219 -346 -417 111 67 -517 -51
7264 -51 21 -66 9 113 -55 -17 -4 -265 278 -14 -55 -24 109 -123 104 -70 -111 -223 149 132 -22 84 -171
7287 -171 191 -132 -39 94 83 -40 106 118 -451 -78 -134 125 142 -652 45 14 35 5 79 -259 -104 -186 206
7310 206 181 151 -132 -117 36 -217 -331 -77 -355 183 -159 126 -89 18 -15 -63 123 -35 -102 -42 -11 -115 83
7333 83 -263 22 -18 -240 120 80 281 230 -17 -58 -55 197 90 48 -15 100 76 -229 -271 36 -61 -97 -90 -201 -15
7358 -15 -13 175 -110 80 -180 64 -65 -44 -10 52 -172 -1 -107 -140 59 -133 113 -276 -107 26 88 -28 33
7381 33 -117 3 51 113 -47 351 276 246 326 66 -294 19 -107 -178 -193 -99 103 285 -102 -139 -55 50 262 -283
7405 -283 79 275 -53 -124 13 -61 219 145 -374 34 -55 205 175 52 -77 -34 16 -142 141 -230 90 -254
7427 -254 11 -180 99 150 181 34 -189 206 -11 37 -35 59 234 22 -173 -49 -157 167 132 -92 157 39
7449 39 103 -39 76 -147 -364 -51 25 180 -82 12 -18 -17 166 102 8 55 154 35 39 -151 -104 138 -283 -48 -56
7474 -56 77 -181 319 164 17 134 -228 -132 -21 180 7 183 -21 -267 -69 -249 384 260 32 30 156
7495 156 -111 -13 11 -166 206 136 108 -82 290 118 -56 -250 117 -4 -46 66 123 -44 -252 -351 117 -111
7517 -111 79 14 -166 -397 187 86 20 124 -186 -208 20 -77 241 -74 186 165 49 55 90 89 1 121 146 -288
7541 -288 -198 140 -45 -28 238 -95 -113 -126 -359 21 241 81 -64 84 125 -89 -129 384 14 98 -276 27
7563 27 143 161 126 139 6 92 -209 -5 36 -225 -23 -90 12 -67 -168 -102 -135 16 361 217 249 -223 -104 197
7587 197 -242 -58 78 -192 -87 122 -27 -125 57 112 348 -86 47 23 -123 -103 297 -177 -346 107 16 178
7609 178 65 -118 178 -17 -399 -107 -263 -76 218 -193 -20 1 -88 -104 -37 39 -155 296 170 363 -72 -46
7631 -46 -121 -66 -180 127 -81 61 35 -124 -320 -67 29 -4 85 -50 36 157 133 -107 2 -310 -4 -128 -32
7654 -32 -44 -46 -200 -189 103 -79 67 -152 -239 480 -200 122 -108 -160 437 19 42 -65 -116 -15 42 46 43 -56 -111
7679 -111 244 21 97 -116 86 234 60 -122 -41 170 226 44 -356 -168 -77 -116 112 156 -158 169 129 10
7701 10 -141 -231 223 155 -133 -12 48 -32 170 1 -13 243 -133 110 110 221 -32 83 16 -99 -27 291 -69
7724 -69 -225 -280 -54 99 84 -96 172 111 73 -9 161 -37 -140 106 38 188 245 -85 49 -100 15 29 60
7747 60 115 172 -193 60 52 -128 59 83 176 -52 -5 -136 -21 -129 -1 -36 -80 103 116 150 276 -42 -157 28
7771 28 -168 81 -66 108 -239 -155 144 227 -12 44 83 -64 -88 -52 -63 -191 -83 -284 -96 226 -40 -29 -151
7794 -151 -129 6 -147 208 -35 100 -240 -381 64 249 9 95 -139 -32 -292 136 81 -218 101 39 11 -24
7816 -24 84 -198 -264 30 233 10 27 -23 284 51 121 -75 53 94 91 -224 -260 -237 127 0 220 174 13 -327
7840 -327 -53 121 -38 63 -18 305 92 -193 -5 -84 222 38 178 -130 27 335 173 117 121 32 23 186 260
7863 260 150 183 -57 11 137 288 190 -236 -197 148 136 -68 -18 181 -152 74 -294 -107 245 170 -108 -26 -159
7886 -159 -16 -112 -118 247 102 -186 12 189 168 -19 67 191 -249 -231 46 12 59 -116 -491 -14 -461 -266 -48
7909 -48 -198 189 -15 -75 147 14 169 114 189 125 -64 -9 129 -350 232 191 -52 -250 148 300 61 182
7931 182 65 -181 135 184 -39 133 146 -51 254 16 264 -39 -23 195 -193 -33 47 -42 41 9 10 -3 65 99
7955 99 -113 -312 -95 -25 18 -68 184 -178 -57 84 266 379 102 123 -133 -97 87 -26 -133 83 114 46 -188
7978 -188 -301 171 -114 -39 -243 162 -129 -184 124 -100 144 16 1 -287 146 40 -155 -52 147 133 -31
7999 -31 6 33 153 156 -405 -336 28 199 -33 -192 196 57 -199 -227 11 123 -20 -164 -10 -59 -284 -233 -108
8022 -108 92 3 65 46 -6 136 107 -182 -180 39 -47 -71 171 -250 274 153 195 -112 436 74 -17 24 198 126
8046 126 -8 75 285 349 256 -80 -129 42 178 37 -91 84 -215 -305 -223 276 -106 -298 -203 247 68 311
8068 311 -6 -214 -96 -78 -145 2 59 -100 -121 97 -28 155 -69 -70 89 146 285 -18 -23 230 75 -130 -171
8091 -171 -18 -48 87 -375 -100 64 5 55 200 19 138 141 -117 228 90 -6 -167 86 320 166 124 165 151
8114 151 -44 109 -241 235 200 -326 -327 -250 203 -274 -65 -28 -125 52 -112 -147 14 -9 -128 -301 -5 25 -98
8137 -98 -223 -5 4 -76 -153 -131 -79 249 -15 -345 -233 227 57 -83 31 -212 248 -308 -218 -24 -52 -34 -33 -146
8161 -146 367 -23 45 88 -16 60 314 -181 -49 28 -33 -112 43 107 52 106 101 34 192 124 -223 426 321 -90
8185 -90 -187 -214 154 99 -123 87
8191H7
$$ Imaginary data points
##PAGE= N=2
##DATA TABLE= (X++(I..I)), XYDATA
0 0 0 0 0 0 0 0 0 0 0 0 0 8 -8 8 -8 8 -12 16 -16 20 -24 26 -32 36 -40 47 -54 60 -68 77 -86 98 -109 123
34 123 -136 152 -168 187 -207 229 -255 283 -313 346 -384 425 -472 528 -591 665 -750 858 -989
53 -989 1158 -1380 1695 -2163 2946 -4493 8697 -42654 -139144 -44503 34631 -1523 -70342 -46993
67 -46993 -5880 -30501 -76634 -51413 8250 13529 -46398 -86776 -57457 1449 11594 -27412
79 -27412 -48907 -24348 -11239 -35040 -39578 7566 36124 -6104 -56701 -36018 20062 26767 -9619
92 -9619 -20721 645 1534 -23491 -18477 24109 37549 -7627 -44293 -21828 14517 9336 -11066
105 -11066 -4926 712 -25278 -43775 -15686 18761 5969 -31885 -43314 -25876 -11155 -9674 -12003
118 -12003 -13982 -19105 -30779 -40771 -26637 8438 16598 -22913 -53224 -24172 15279 3681 -22561
131 -22561 -5851 17921 -7846 -39114 -9497 41375 31865 -17685 -27188 9296 27915 9402
143 9402 -1425 15953 25784 3248 -19112 -911 37013 37686 -1463 -22064 1523 23753 11246
156 11246 -5771 6633 19624 -1064 -27551 -13190 25090 28202 -10668 -34134 -12534 14453
168 14453 5921 -13422 -2717 13659 -5414 -35284 -18084 26400 28207 -14343 -31330 -3256
180 -3256 17550 5172 -4248 9748 15754 -3528 -18500 -796 29212 30534 2470 -16675 -2219
193 -2219 20511 18242 3413 8377 20984 7449 -16473 -5919 29478 32097 -3401 -20907 -880
206 -880 15583 3784 -4678 9187 15663 -6127 -26407 -11820 19182 21136 -7272 -23271 -9728
219 -9728 5338 -1405 -8235 4528 12535 -7818 -28982 -13143 19911 23048 -4166 -19475 -6326
232 -6326 7739 4275 -67 10655 17455 648 -18234 -6616 24945 31026 4350 -13087 1452
245 1452 16100 9215 3301 16682 23127 2650 -15148 -420 25966 26802 5571 -6014 1717
258 1717 8616 6031 4730 13862 18129 3656 -14055 -7219 16663 24134 5526 -8903 -1854 6906
272 6906 2234 481 13371 19191 1043 -17070 -7136 17038 21437 5270 -4618 963 5393 837
286 837 2278 15071 18868 957 -14505 -4240 17886 20041 3997 -4171 2007 4326 -895 1103
300 1103 13076 15680 119 -13861 -6312 11865 15204 1348 -7725 -2240 2156 -3688 -5512 7125
314 7125 13787 -2331 -20218 -11981 8329 9795 -4476 -9281 -1633 -2152 -11395 -8275 6685 9337
328 9337 -7376 -20416 -12210 3817 6643 -2971 -8230 -5844 -5222 -10226 -9054 3281 8739 -4386
342 -4386 -19746 -14535 3582 8871 -2951 -11034 -6223 -3292 -8640 -8476 3651 9718 -3546 -18499
356 -18499 -12893 3960 7519 -3259 -8693 -3234 -1980 -7858 -6387 4801 7883 -3399 -14894 -10438
370 -10438 1998 6190 375 -4065 -3233 -4002 -6908 -6013 2076 7472 -616 -13035 -12751 701 7068
385 7068 299 -5881 -4511 -4623 -9303 -7181 3680 8353 -2694 -15034 -11615 -244 3571 -459
399 -459 -3038 -3511 -7022 -9216 -3757 4891 5936 -2950 -11780 -9878 -383 4354 2253 -988 -2610 -4637
415 -4637 -6822 -3775 4560 7743 -238 -9229 -8060 250 4388 1615 -654 -896 -4190 -8347 -5367
430 -5367 4052 7165 -1435 -10322 -8714 -2347 -24 -411 -19 -1258 -7295 -11239 -5900 3539 5252 -2013
446 -2013 -9366 -8926 -3511 970 1878 1224 -682 -5097 -8286 -4114 6159 10158 2734 -6524 -5613 1817
462 1817 5385 4669 5247 5774 958 -4205 91 10592 13598 5581 -1939 -785 4606 7308 7749 8006
478 8006 7124 2415 -2154 546 8735 12770 7102 -567 -1755 2274 5504 6141 6572 5652 1678 -3220
494 -3220 -1867 6391 11504 7380 -1230 -3691 833 5524 6633 7099 6723 2200 -2280 -64 7581 12910
510 12910 8629 1443 -847 2182 7276 10202 9908 7067 2789 180 2478 8266 12459 9976 3165
525 3165 -1163 1100 5976 8031 7477 4681 848 -2450 -1371 4028 7904 4943 -1328 -4980 -3641
540 -3641 -493 2417 3058 1141 -3895 -7896 -6267 -774 2787 1491 -3562 -6917 -7121 -3954 522 2566
556 2566 -3 -5848 -8219 -5312 -347 3273 2292 -2456 -6897 -6762 -2658 1914 3423 1420 -3430 -6879
572 -6879 -4889 770 4205 1705 -3288 -5202 -5018 -3252 961 3230 736 -5374 -8234 -5609 -930
587 -930 1240 75 -2752 -6158 -7430 -4724 -829 1138 -778 -4678 -7309 -6160 -2038 1561 1516 -2189
603 -2189 -5170 -5729 -3455 293 3548 3285 -847 -5049 -4383 1205 5649 4606 674 -1288 -1437 -357
619 -357 2698 6915 6473 1149 -3368 -2362 3491 6478 6267 2780 -948 -2669 -215 4203 5326 3907
635 3907 777 -2406 -3263 393 5241 5491 415 -3671 -3169 -1111 817 2677 3181 171 -4305 -4581
651 -4581 -916 2774 3145 1156 -2284 -4410 -3278 672 3243 3026 -317 -2873 -3973 -1915 2543 5247
667 5247 2732 -2477 -4866 -2458 1406 3619 3259 427 -2815 -4407 -2532 2533 4744 1623 -3566
682 -3566 -5739 -3720 -362 2369 2265 -1139 -5835 -6530 -2907 55 1344 80 -3287 -6740 -6453 -1716
698 -1716 1818 247 -3104 -5049 -5578 -4583 -1682 1510 867 -3758 -6339 -4918 -1490 1243 1567 -367
714 -367 -3682 -5309 -3020 910 2792 2204 -380 -3973 -4715 -1168 3862 4522 688 -2867 -3598 -1428
730 -1428 1669 3676 3683 490 -3058 -3738 -310 4559 4870 1652 -1939 -3251 -1197 2283 4337 4006 442
747 442 -2448 -2059 570 3642 5129 3289 -525 -2945 -536 3697 5142 3901 2231 77 -1048 520
763 520 4634 6769 4244 871 -524 638 3041 5813 5997 3224 338 -420 1714 3945 6177 5024
779 5024 1809 -994 -609 3051 5916 4913 2706 -138 -1405 -379 3049 5532 4279 387 -2622
794 -2622 -1799 967 3853 3780 1015 -1847 -2683 -987 1327 3463 2490 -1064 -3502 -3193 -295 2395 2735
811 2735 497 -2532 -3265 -1783 639 1828 1573 -308 -2896 -3696 -1208 2055 2129 357 -2037 -3117
827 -3117 -2533 92 2555 2090 -937 -3284 -3003 -2059 926 2743 1556 -2194 -4447 -2762 263 1783
843 1783 1492 -366 -2834 -4050 -2445 1059 2654 675 -1946 -3958 -3426 -105 2396 2252 -859 -3377
859 -3377 -2985 -1448 730 2368 1608 -1236 -3636 -2648 373 2637 2228 -250 -2524 -2766 -1157 1064
875 1064 2377 1880 -313 -2891 -2531 868 2669 2271 330 -1240 -2187 -1188 500 2444 2098 -444 -2499
892 -2499 -2748 -374 2578 3360 581 -2279 -2674 -837 -64 1745 2674 423 -3139 -3751 -487 2724 2631
909 2631 58 -2112 -2576 -1626 327 1880 2056 -102 -2631 -3265 -1041 1758 2777 148 -2308 -2480
925 -2480 -1330 487 1128 1545 -97 -2430 -3335 -1643 1235 2321 994 -1417 -2763 -1587 232 1292
941 1292 1484 509 -1849 -3339 -1778 1215 2162 744 -1163 -2177 -1855 -348 1938 2711 1065 -1689
957 -1689 -2584 -1309 846 2545 1668 -572 -2257 -1565 -48 1920 2632 1219 -1320 -2303 -1074 1602
973 1602 2662 1455 -203 -1215 -1184 70 1977 2974 1652 -913 -1847 -395 1944 2814 2172 675 -855
990 -855 -916 -82 2153 3068 2239 -77 -1591 -274 1661 2753 2567 1158 -562 -1201 -412 1893 3389
1007 3389 1921 -243 -1738 -799 1323 2468 1917 489 -825 -1776 -965 1046 3228 1996 -1146 -2599
1023 -2599 -1162 973 1639 1428 212 -1068 -2151 -1528 164 2311 1171 -1215 -3097 -2049 98 1182
1039 1182 297 -426 -1387 -2382 -2301 -670 1674 1387 -1387 -3274 -2438 -679 757 640 -555 -1342 -2351
1056 -2351 -2954 -1537 1064 1453 -1310 -3720 -3323 -947 715 563 -219 -1421 -2735 -2914 -1243 1239
1072 1239 1498 -1244 -2827 -3004 -993 972 1026 78 -1337 -2086 -1785 -591 1470 2066 55 -2362 -2213
1089 -2213 -44 1202 1486 389 -563 -1627 -1647 106 1820 2204 654 -960 -1298 -383 1513 2465 1638
1106 1638 208 -882 -897 621 2179 3063 1663 -815 -962 324 2001 3019 2615 944 -510 -467 1185
1123 1185 2872 3379 1555 -139 -595 475 2100 2918 2997 1192 -602 -1148 769 2934 3290 1002 -336
1140 -336 -606 3 1148 2532 2520 1054 -1247 -1432 102 2211 2383 1120 -896 -1431 -695 330 1248
1157 1248 1352 599 -1389 -2308 -786 1507 1870 555 -1319 -1803 -1428 -289 519 1417 400 -1786 -2950
1174 -2950 -1558 882 1778 461 -1472 -2401 -1565 -611 558 915 5 -2313 -3067 -1886 410 1487 177
1191 177 -2170 -2758 -2273 -616 143 274 -446 -2082 -3228 -2223 -40 1398 38 -1961 -2607 -2272 -625
1208 -625 145 855 -304 -1785 -2835 -1896 506 1366 725 -716 -1937 -1958 -379 934 1685 1018 -616
1225 -616 -1443 -967 504 2090 1720 103 -1541 -1198 224 1758 2266 1519 -444 -1427 -1027 1111 2517
1242 2517 2276 463 -1232 -1113 162 2010 2967 1606 -405 -1277 -332 1463 2410 2240 570 -862 -579
1259 -579 292 2145 2453 1631 -160 -576 -296 1039 2343 2292 1025 -463 -491 386 1651 2496 2034 125
1277 125 -1262 -602 882 2013 2003 977 -519 -1268 -1172 1294 2308 1427 -1075 -1785 -1184 150 1187
1294 1187 1335 189 -1491 -1890 -1288 284 1356 454 -1191 -2561 -1991 -329 982 586 -651 -1880
1310 -1880 -2571 -2279 -325 549 193 -1241 -3075 -2634 -1052 405 344 -713 -1741 -2560 -1827 -544 628
1327 628 527 -1065 -2271 -2506 -1244 429 713 73 -1539 -2561 -1429 -333 625 1061 -149 -2151 -2486
1344 -2486 -914 1160 965 -31 -1279 -1880 -1703 -150 1388 1110 -474 -1575 -1760 -854 1335 1748 795
1361 795 -975 -1667 -900 680 1237 1354 482 -811 -1533 -671 1528 2078 1445 -240 -988 -361 894 1653
1379 1653 1564 717 -618 -1031 -46 1756 2165 1597 -36 -1045 -555 615 1942 1810 716 -331 -783
1396 -783 -125 710 1957 1965 -246 -1280 -697 920 1734 1613 710 -353 -1344 -452 1065 1805 993 -129
1414 -129 -1076 -1232 112 1526 1829 465 -861 -1220 -397 846 1577 1288 287 -1123 -1430 300 1162
1431 1162 1206 523 -539 -978 -709 387 1379 1355 -35 -1089 -1199 15 1222 1342 684 -704 -1253 -1102
1449 -1102 101 1175 1142 -20 -1254 -1458 -774 945 1608 767 -959 -1688 -705 470 1007 1171 498 -903
1467 -903 -1464 -397 1045 1716 852 -218 -1210 -1091 454 1395 1295 260 -710 -815 -682 477 1501 1123
1485 1123 -211 -1231 -623 509 1152 1045 267 -650 -841 -818 891 1113 1234 55 -1317 -958 -82 1413
1503 1413 1432 448 -348 -1209 -712 -4 1222 1170 -212 -1088 -1286 -250 1055 1362 18 -829 -1544 -888 150
1522 150 758 812 -530 -1496 -1697 -561 677 1025 292 -1300 -1841 -1276 274 1041 546 -661 -1305 -1809
1540 -1809 -679 480 934 417 -1134 -1624 -1262 -328 817 435 -463 -1627 -1441 -605 120 724 436 -514
1558 -514 -1826 -1458 -18 695 370 -242 -806 -1154 -726 113 1079 280 -762 -1435 -1433 20 770 521 -321
1577 -321 -1177 -921 -592 -118 799 1119 -186 -1643 -1246 610 1436 902 13 -519 -454 -259 268 1096 1707
1596 1707 339 -635 -992 545 1799 1484 434 -306 -259 185 430 1433 1457 521 -752 -739 350 1617
1614 1617 1778 398 11 -241 -50 302 1098 1346 1039 -711 -1002 192 1850 1329 410 -328 -211 -256 -286
1633 -286 987 1541 263 -1156 -1458 -385 1121 989 434 -546 -308 -537 -281 777 1183 765 -1062 -1878
1651 -1878 -79 1177 767 -2 -226 -907 -900 -517 492 1060 532 -1112 -2067 -576 772 546 -265 -813
1669 -813 -1046 -1082 -848 24 575 -3 -1534 -2012 -693 75 -13 -719 -303 -755 -1628 -1265 16 879 -50 -1618
1689 -1618 -1747 -773 539 532 -239 -122 -530 -1205 -1166 304 1723 574 -1196 -1345 -22 565 689 144 208
1708 208 -133 -889 -691 780 1861 1188 -854 -1217 326 1452 574 600 571 712 -578 -623 884 2041
1726 2041 1284 -560 -803 303 1109 581 819 951 695 -366 -924 558 2201 1592 -647 -1100 417
1743 417 1442 853 1100 1142 852 -258 -896 972 2355 1304 -324 -855 764 1411 883 622 978 919
1761 919 -589 -990 633 2239 1158 -720 -1197 386 1120 520 122 646 719 -667 -1514 -1 1358
1778 1358 856 -639 -1912 -522 359 208 -337 320 -26 -1294 -2100 -550 1227 753 -1192 -1977 -578
1795 -578 -169 -178 -118 268 -149 -1412 -1793 -647 1242 737 -1278 -1801 -758 314 -268 -584 625 101 -1858
1814 -1858 -1913 -257 1348 660 -1305 -1813 -461 -265 -625 -603 550 173 -1331 -1995 -688 1545 827 -1200
1832 -1200 -1382 -498 74 -298 -267 782 466 -1202 -1926 -171 1769 1017 -775 -942 -142 192 -253 212
1850 212 1333 1296 -1005 -1808 -84 2017 1290 -449 -846 131 750 -370 -1 1526 1577 -861 -1728 323
1868 323 2370 1732 -462 -520 61 743 -19 209 1687 1452 -397 -1602 202 2075 1560 -647 -686 463
1886 463 816 -195 -438 1534 1463 -581 -1509 69 1920 1571 -504 -276 370 204 -353 -518 1304 1611
1904 1611 -876 -1897 -86 1742 1300 -715 -554 248 429 -778 -417 1618 1398 -1280 -2047 -671 1298
1921 1298 1109 -1056 -754 222 157 -770 -549 1096 1044 -861 -2391 -689 1389 771 -768 -1145 246 -183
1939 -183 -1372 -702 1275 1135 -1009 -2065 -636 1457 897 -612 -719 83 -73 -1507 -878 1413 1104
1956 1104 -1078 -2148 -426 1157 668 -753 -650 168 -189 -1245 -415 1513 1538 -726 -1965 -243 1449
1973 1449 801 -663 -334 388 -12 -1165 -523 1589 1857 -785 -2120 -81 1663 845 -157 -38 596
1990 596 -122 -1266 -481 1638 1863 -714 -1840 -68 1871 577 -771 -57 684 311 -1097 -338 1666
2007 1666 2154 -807 -1974 -311 1464 822 -619 -160 1014 24 -1451 -379 1573 1879 -789 -2158
2023 -2158 -388 1387 404 -554 -62 733 -350 -1248 -424 1635 1495 -1025 -2042 -267 1418 833 -933
2040 -933 -208 571 -102 -1741 -584 1415 1975 -753 -1887 -594 1005 541 -851 -264 751 -92 -1496
2057 -1496 -657 1693 1544 -757 -1642 -389 1122 636 -747 -234 717 68 -1527 -856 1555 1875 -206
2074 -206 -1597 -187 993 282 -625 58 676 -33 -1659 -421 1519 1950 -359 -1668 -202 1124 527
2091 527 -604 -214 1068 73 -1501 -727 1649 1680 -512 -1513 -481 1343 218 -260 385 1076 321
2108 321 -1482 -712 1201 1784 -338 -1404 277 1006 238 -174 327 1238 -52 -1740 -1064 1451 1583
2125 1583 -400 -1220 -35 931 19 -583 253 936 1 -1475 -830 1526 1737 -493 -1568 -180 584
2142 584 43 -661 322 1180 -86 -1981 -1198 1133 1228 -551 -1334 -430 591 -296 -714 2 756 -125 -1497
2161 -1497 -1104 948 1342 -668 -1359 -425 213 -280 -763 311 1009 -148 -2005 -957 855 900 -424
2178 -424 -1091 -594 503 -174 -800 338 1010 121 -1512 -1080 1102 1425 -241 -1076 -236 527 -397 -367 617
2197 617 1263 -160 -1268 -777 838 1368 52 -790 -24 645 -5 -654 533 1217 308 -1299 -794 1142
2215 1142 1478 118 -575 57 694 119 -450 683 1131 -127 -985 -466 1291 1350 535 -256 203 907 260
2234 260 -320 840 1350 356 -1147 -397 887 1144 217 -514 51 763 11 -262 733 1397 64 -1406
2252 -1406 -588 900 696 -163 -686 131 545 -559 -358 312 943 -154 -1111 -826 647 711 -152 -631 -159
2271 -159 194 -339 -804 673 943 -70 -1553 -1232 586 896 -333 -738 -36 174 -749 -925 669 859
2289 859 89 -1509 -1162 544 479 -134 -728 -127 56 -764 -745 254 880 -144 -1151 -1115 106 105 -154 -692
2309 -692 86 -155 -987 -330 369 868 -217 -1314 -1059 477 736 -147 -458 253 2 -608 -610 416 1024
2328 1024 201 -986 -750 434 831 188 -393 415 191 -492 -465 693 1264 356 -614 -685 414 1411 426
2347 426 23 283 6 -279 211 942 1155 375 -514 -256 538 408 201 213 312 117 -673 -148 445 1076 441
2368 441 -810 -169 434 686 234 361 520 421 -176 -105 579 614 364 -525 -304 356 571 401 195 203 177 -298
2390 -298 -334 623 727 166 -822 -475 372 4 163 270 311 -168 -616 -601 166 616 156 -447 -558 74 -42
2411 -42 65 -141 50 -93 -891 -841 114 572 454 -610 -412 -78 8 4 -350 335 -405 -700 -818 249 751
2432 751 53 -440 -702 -337 -83 115 -145 -152 -29 -800 -932 -10 365 68 -835 -940 -367 43 -76 46 157
2453 157 -261 -856 -781 177 539 286 -440 -626 -199 165 -25 168 345 -246 -398 -628 380 579 440 -245
2473 -245 -413 -246 -57 266 362 462 290 -631 -526 289 827 557 -146 -304 253 57 180 505 670 10
2493 10 -457 -143 179 501 344 -107 -119 169 199 53 348 568 -187 -264 -499 168 778 347 78 -169 -111 -141
2515 -141 215 193 470 127 -617 -179 155 420 483 129 -158 -189 -204 132 467 420 -99 -543 -594 371 452 136
2537 136 1 -308 -373 -130 107 -113 551 -68 -424 -235 118 611 416 -178 -434 -395 -46 -380 424 488 -236
2558 -236 -527 -792 -52 259 145 -138 -162 -271 -195 -6 612 156 -126 -493 -490 -147 59 237 441 -243 -395
2579 -395 27 22 21 513 127 -397 -482 -212 560 383 198 -426 -271 -268 -306 298 652 132 42 -482 -468 64 263
2602 263 395 -168 -217 -244 86 284 393 72 -291 -663 -124 276 492 204 -71 -215 -179 204 324 343 -23
2623 -23 -446 -274 -352 70 111 217 28 -118 -55 -271 96 232 11 -419 -244 -284 130 475 123 59 -465 -346
2645 -346 -404 259 320 39 -277 -325 -352 197 357 -51 55 -216 -379 -132 155 279 371 -244 -379 -350 80 148
2667 148 124 40 -276 -426 -230 293 75 383 -470 -196 -37 144 236 425 244 -59 -417 -172 283 361 185
2688 185 122 -216 -92 242 291 181 -1 -187 -99 -77 202 370 -2 -98 191 -277 -128 387 345 295 -153 -193 71
2711 71 141 546 313 38 -113 -352 -33 276 26 99 -269 -427 34 231 609 765 -270 -281 -351 -8 525
2732 525 399 266 -1 -284 -50 238 325 221 109 -115 -233 18 170 377 145 59 -455 -539 6 241 63
2753 63 103 -267 -378 -350 102 448 122 -191 -377 -305 -144 131 274 103 -285 -315 -177 -81 160 -8 -147 -442
2775 -442 -450 -94 300 123 -160 -561 -601 -313 205 85 163 -329 -504 -205 -87 -55 107 -101 -506 -251 -140 88
2797 88 359 177 -282 -219 -103 -35 464 333 -199 -193 -621 13 173 45 68 -5 -447 -118 -169 183 372 202 -213
2820 -213 -73 -48 157 534 514 206 -344 -97 8 337 595 0 -68 -470 149 348 548 -5 130 -168 -256
2841 -256 296 706 344 207 37 -57 -130 283 317 226 216 -114 21 -41 298 413 228 -202 145 271 374 377 473
2864 473 365 -106 -352 -252 414 550 43 -8 -227 -160 193 470 221 292 -147 -182 -230 105 397 56 -425 -124
2886 -124 -113 -98 72 447 43 -273 -272 -155 164 181 136 -39 -213 -211 -103 145 207 49 -263 -886 -293 86 -123
2909 -123 -39 96 -363 -169 -260 -50 -1 315 -204 -547 -511 -78 -8 43 187 -220 -193 -238 -216 223 67 -315 -266
2932 -266 -398 -38 93 -107 121 -177 -496 -334 107 288 163 -207 -321 -322 144 379 -15 46 -249 -23 -69
2953 -69 15 396 -29 -120 -276 237 169 123 552 179 -244 -296 -155 201 131 287 -131 -107 -223 -63 260 629 344
2976 344 85 -150 235 51 160 300 150 -214 0 2 224 26 148 -46 -226 -143 484 363 567 226 -124
2997 -124 19 -11 385 379 206 181 -32 -124 89 176 267 -36 -360 35 281 151 600 -149 -125 -32 45 -51 377 457
3021 457 107 -53 -374 150 236 259 -33 147 -541 -238 58 67 146 202 -355 -443 83 -124 245 106 -309 -291 -396
3044 -396 -480 349 -268 -6 -77 -202 -260 199 181 15 -26 -35 -426 368 420 274 -25 -118 -582 -210 29 -121 -115 -109
3068 -109 -151 -248 -371 272 319 -87 48 -245 -135 -123 205 190 -185 100 -554 -466 153 182 4 -323 -78 -291
3090 -291 237 -84 113 22 -153 -241 -278 246 506 97 -3 -17 -123 -145 71 353 250 -221 -468 -82 -104 223
3112 223 205 -323 -327 -117 157 7 366 144 -102 -56 -425 85 386 251 -178 -168 -185 -156 -11 322 322 -255 -252 116
3136 116 65 208 169 201 -206 -103 -251 179 368 208 -30 -153 -378 209 272 93 492 -110 -20 157 64 138
3158 138 233 20 -303 -54 240 215 8 36 -212 -365 58 -360 311 232 -105 -46 -232 32 595 -225 -169 25
3180 25 -284 -217 -44 149 151 186 -109 -27 28 311 255 111 -142 -64 -236 311 237 366 23 -334 -342 -60 188 368
3204 368 -128 -189 -120 -73 72 152 303 -148 -76 92 131 54 577 334 -293 -128 -148 12 -132 351 -68 -214 -159
3227 -159 210 346 338 -124 -382 -565 -208 56 140 90 -214 -63 -281 -101 151 214 188 43 -178 -249 170 344
3249 344 299 -18 -94 -405 -73 271 119 -395 27 -74 -226 -172 269 457 -23 -313 -280 -104 -205 183 246 -502
3271 -502 -248 -254 -235 -128 391 191 -357 -310 -264 -129 419 167 -168 -10 -10 144 197 272 159 -337 -408 -116 139
3294 139 328 81 -98 -163 -394 -234 352 199 20 -102 -194 -30 356 231 272 -133 -74 -310 52 158 -70
3315 -70 256 -216 -226 -222 29 213 254 -97 9 51 47 67 200 153 -20 16 -140 620 427 134 -139 -217 117 12
3339 12 130 74 -88 -75 -46 183 124 192 26 235 -128 -26 -112 76 295 105 -53 28 101 43 151 295 166
3362 166 15 40 74 54 243 314 -106 -310 -163 123 -81 52 78 13 -402 -289 144 45 424 73 -272 -302 -110
3385 -110 95 434 -9 19 70 -249 194 2 -70 -139 174 -386 -223 241 -190 79 -461 -222 -285 -258 -124 145
3407 145 -111 -85 -441 -90 371 3 220 -457 -305 21 -125 194 49 -50 -231 -258 -265 -32 273 -243 -101 16
3429 16 -314 188 364 374 -138 -310 -120 -101 -54 145 -229 -9 -124 -109 220 267 304 162 18 -366 -40 148
3451 148 -12 160 250 127 -96 77 -47 387 -21 -90 -240 118 82 311 183 56 79 -309 57 246 372
3472 372 185 94 -227 78 -136 283 249 -104 -216 -307 44 115 151 208 127 -208 392 -56 222 113 26 -262 -33
3495 -33 150 69 367 -17 76 -122 -90 146 367 102 328 39 -117 173 -158 200 402 164 -151 -178 35 116
3517 116 168 -247 1 -201 -289 148 231 -199 -319 -289 54 192 116 317 -5 7 -71 -252 233 94 -14 -212
3539 -212 -138 -351 73 -233 85 -163 -158 -153 -66 -123 14 133 216 -102 -66 165 -123 202 -336 -49 -212 385 -19
3562 -19 -36 93 -86 -191 -247 -35 -64 70 76 -160 -182 -27 -30 -27 100 -61 -147 -109 -18 -12 20 194 -224 -235 -254 214
3588 214 221 -51 -327 159 -107 -121 -45 64 151 -18 90 -99 92 276 193 72 -31 365 4 218 342 399
3610 399 -111 -328 61 -103 391 -117 -99 170 35 57 176 72 46 4 -397 100 18 527 44 43 -94 -76 -45
3633 -45 -70 142 330 70 -373 -57 63 -38 90 104 -270 -23 60 -103 147 106 19 -525 -35 -161 195 61
3655 61 -89 -82 -31 -452 -12 389 60 51 -58 -510 172 239 13 -99 -29 -227 -317 61 200 251 -105 -555 116
3678 116 251 -131 -40 26 29 -126 -358 -83 102 298 20 -126 -23 82 113 153 -77 0 -16 14 -163 201 430
3701 430 82 -351 -218 215 186 51 -75 260 87 -231 -269 105 99 -65 64 -28 177 -185 -114 278 -184 -108
3723 -108 -240 -151 259 165 -207 -137 177 153 -37 -371 215 315 401 94 -200 371 -168 -6 -359 29 61 20
3745 20 -82 -126 171 -79 -355 -94 272 6 -30 -303 47 148 293 -392 65 183 16 49 162 300 244 81
3767 81 223 91 72 -59 47 4 55 -105 -234 -200 112 260 95 -138 -171 -102 -138 -283 303 175 135 -331 -310
3790 -310 139 179 320 106 67 -246 -212 -308 171 288 76 -473 -76 246 371 48 -236 -328 74 -58 38 231
3812 231 268 -446 -321 -122 -12 9 182 58 -114 -254 -143 13 215 247 -123 -260 -34 370 18 60 -107
3833 -107 101 -75 -171 20 107 170 78 -287 8 215 134 118 -213 1 214 -99 -155 378 85 87 -362 -79 -5
3856 -5 -130 -26 -69 241 4 183 -64 -129 169 -56 -364 193 55 261 -22 6 -38 233 -179 -59 232 115
3878 115 -53 -331 -231 247 -1 10 -145 -118 -232 -257 -272 -125 0 114 -360 -156 239 -118 95 -331 149
3899 149 -150 -71 -114 97 114 131 -434 -144 -51 420 280 -116 7 -121 -328 -167 -161 -7 82 -308 8 231 -115
3922 -115 -121 -76 318 11 29 -28 148 228 -439 -27 -110 12 75 -56 -197 -119 118 -73 -51 377 233 -264 -285 95
3946 95 172 51 -98 20 43 -222 -103 59 293 340 253 -76 -130 64 -56 -104 -124 160 -27 -146 -8 142 430
3969 430 119 -128 86 -107 388 -75 22 103 -347 -21 -347 171 624 38 -231 67 480 358 189 83 339
3990 339 292 -141 -228 -147 586 -86 -402 126 276 86 224 -117 222 -313 -158 -39 177 333 -133 -207 -76
4011 -76 36 211 -92 -31 99 88 7 -200 326 424 244 110 102 301 -68 -191 -175 101 154 -381 59 255 410
4034 410 -189 -178 93 190 -135 -178 -15 60 59 -104 -385 -34 437 -130 -108 -201 64 40 -65 111 179 23 -565
4057 -565 -204 -21 187 -15 -297 -16 -5 182 65 -155 80 122 -268 -260 110 347 39 -154 -163 607 423 129
4079 129 -168 357 153 -225 -342 133 704 -5 -271 -327 274 217 -73 83 445 184 -158 -307 424 410 -14
4100 -14 29 45 376 172 4 -116 461 265 -161 -25 191 401 -191 -412 33 141 -81 -220 -53 175 144
4121 144 -111 114 308 347 109 -396 -144 254 259 -262 -10 456 200 -247 -126 115 435 -152 -156 175 151 -35
4143 -35 -99 -182 -31 17 -11 -289 -50 26 -41 -175 -402 -136 159 -152 -93 63 68 -192 -141 38 233 -85 -85 -3 163
4168 163 39 42 -155 42 -160 -24 -336 -40 361 -281 66 -143 137 -181 -30 114 495 241 -212 119 -1
4189 -1 35 80 -316 136 -154 -80 -193 -278 380 318 -304 170 274 164 -255 15 -21 -85 -112 -91 132 327 179 -434
4213 -434 -198 27 6 -154 -452 -108 -105 -32 -59 -189 158 -232 -383 -242 -16 8 -55 -251 -279 105 -251 41 -47
4236 -47 51 275 -187 -172 141 198 -168 34 -207 -24 -50 -168 21 226 -40 -134 -169 -245 72 -83 -158 25 -30
4259 -30 156 -136 -189 108 220 -413 -431 200 181 6 -86 289 5 6 -153 -31 4 84 -104 -322 182 119 47 191
4283 191 76 89 -92 -224 10 197 10 -122 75 -144 -126 -209 -158 16 450 8 -223 -18 147 343 97
4304 97 -13 109 348 -169 -249 130 392 68 -130 -15 105 370 -108 -118 -90 112 -94 -205 100 112 -214 -174
4326 -174 225 330 159 85 75 106 17 -173 17 230 69 -196 -350 130 73 188 107 -253 -108 217 -41 19
4348 19 158 322 -140 -419 383 -184 164 -45 9 154 392 -226 20 85 393 -241 142 198 110 251 4 -216
4370 -216 86 -33 -148 174 162 183 109 -274 85 414 16 -79 -72 -186 -285 10 37 283 -76 -22 -227 90 -19
4393 -19 78 -49 -13 210 -30 -63 -189 -136 212 -215 -350 -345 163 135 -75 -168 212 105 134 -186 215 342 61
4416 61 -175 362 135 316 34 -318 3 103 202 84 224 -86 -102 -451 -241 257 372 -160 1 117 46
4437 46 -43 -276 149 199 -9 -66 53 -133 -12 54 -193 37 -204 29 55 -116 142 32 118 -256 26 167
4459 167 211 98 -299 -275 -145 -29 178 122 -150 104 99 164 155 85 -116 188 33 -8 -58 -19 -108 -20 50 117 107 209
4485 209 134 -173 -19 -235 -39 276 204 171 59 -331 0 12 230 -209 -132 104 -176 -249 128 -125 309 27
4507 27 -171 153 154 39 324 -334 -54 60 -298 -91 158 182 50 -111 -187 59 30 -35 15 162 -65 149 189
4530 189 -8 1 -122 59 -232 -50 104 230 65 -322 -75 -178 97 -119 171 56 104 -208 177 16 -19
4551 -19 194 401 92 22 13 -35 429 -118 -26 342 -13 163 487 232 -224 226 -7 -298 71 -169 8 60
4573 60 -341 139 40 124 -31 -24 227 -260 71 89 127 -74 -138 -37 -48 145 -102 -306 -75 -1 40 -234 81 261
4597 261 8 -116 -129 -240 -186 -210 11 217 116 -175 -356 81 -125 -49 151 137 -72 173 -203 -83 4 -199
4619 -199 32 283 349 153 -74 171 -102 -150 -188 -65 125 -145 -9 -146 115 176 147 -18 -29 160 170 25
4641 25 24 -258 210 119 36 -177 152 -147 -65 -24 -57 296 344 112 -37 335 118 -164 81 6 -61 -48 -255 88
4665 88 73 154 -98 -134 28 -102 -314 167 -210 244 39 -129 161 -40 -108 301 104 -52 -398 105 31 306
4687 306 133 256 -407 -56 -24 205 168 27 209 -23 45 -56 31 249 3 8 -98 113 24 88 -80 -126 -220
4710 -220 -23 -84 -91 18 -251 -90 -150 -225 -104 110 -120 204 -167 19 107 64 163 154 141 75 -53 71 26 -113
4734 -113 -112 -131 -94 85 311 92 149 5 274 -311 -206 -102 -24 -57 143 -20 -234 -66 58 198 -100 -14 -41
4757 -41 -90 -57 210 -243 83 18 133 -229 81 54 95 -115 64 -356 62 -144 -57 248 -311 99 -32 -206
4779 -206 392 102 -2 -150 -103 13 154 232 210 -239 -300 187 23 -16 21 -87 -52 -74 182 120 119 -188 92 86
4803 86 15 25 -147 -82 -194 -77 -3 67 -121 -246 -23 -176 2 366 119 291 -19 -100 -130 99 43 -165 193
4826 193 -75 276 -431 173 -34 -129 -90 -140 159 -49 50 88 228 5 26 -53 -351 67 210 80 -145 110
4848 110 101 288 41 -48 135 -119 187 29 108 197 -214 -119 28 -118 263 57 -11 -188 0 -52 81 128 139
4871 139 -102 305 79 -41 -244 54 -31 -101 -4 87 45 -71 237 199 98 -196 303 127 -205 70 -55 26
4893 26 -89 96 171 111 261 67 157 -226 -4 20 -278 -94 -168 -186 -156 184 51 160 22 -70 206 -70 -47
4916 -47 6 181 94 33 -167 -4 256 133 291 -23 -126 192 -146 -132 -81 -35 -161 36 -83 136 104 -111 -82
4939 -82 93 -158 -182 275 111 -11 -147 108 164 -133 -127 -325 -282 170 -103 43 142 -120 346 -110 242 373
4961 373 96 -112 436 -77 -69 -11 111 381 -101 230 -175 186 202 191 -250 122 -47 -243 -188 -196 37 321 -106
4984 -106 34 -100 -101 431 -38 189 -101 98 -107 207 191 -72 -287 -98 -324 -4 94 -1 50 54 51 -51 -161
5007 -161 133 -100 163 40 -7 -9 117 244 172 132 -470 -26 47 -1 33 118 64 1 -184 136 -254 51 263 -155
5031 -155 81 -76 310 236 -61 -99 -170 -19 237 -56 22 380 -88 -266 286 234 74 123 212 -95 -50 232 -132
5054 -132 -412 -38 141 166 -13 -2 143 -127 -153 159 94 -83 -177 -168 9 278 343 -103 160 -152 361 95 150
5077 150 -84 26 20 21 150 -20 329 72 -248 -67 -93 -99 124 144 -36 -245 47 21 -108 146 -138 -74 102
5100 102 -69 -58 -240 -130 -12 -130 29 102 -147 -70 84 -214 15 -27 -147 362 45 -218 122 93 102 120 -130
5123 -130 -142 218 344 -44 -31 -4 15 199 111 151 115 -133 -141 69 -194 238 15 84 -306 365 -233 -65 -78 -68
5147 -68 65 -88 -29 160 15 99 291 -22 117 -16 65 -78 -95 -143 5 78 330 288 35 -5 -58 -150 170 -50
5171 -50 -190 -79 18 -84 -188 39 116 153 197 98 -102 37 17 283 -154 -394 -16 7 101 111 38 -200 -112 93
5195 93 133 20 -306 -150 30 -33 359 -17 -75 -141 -1 104 -32 28 -223 -149 -69 176 67 -99 -57 208 3
5218 3 185 51 -52 59 112 -7 168 -91 57 -119 -95 -55 -41 -126 -218 -157 178 -108 5 168 -148 193 -53
5241 -53 -45 170 149 176 -308 3 -23 -46 150 70 -216 -140 94 -168 -212 -262 -33 -66 -251 -162 10 -92 -24 -169 113
5266 113 -5 132 -62 6 38 121 -22 -60 -122 190 -3 -291 -58 -74 105 274 -26 -132 -42 52 381 -157 98
5289 98 -137 22 -1 -89 21 -118 103 63 95 -167 -175 -346 -15 -21 -66 168 168 -78 81 197 53 -77 355 219
5313 219 -58 127 110 137 6 10 6 126 -188 -365 266 -192 -45 -252 126 180 250 -76 -178 -15 117 126 156 155
5337 155 179 38 -239 -108 -159 -284 -141 90 243 152 -153 -147 8 82 -118 -61 227 -119 49 -40 -139 14 -100
5360 -100 -87 8 -53 -33 189 119 111 112 -2 -64 -207 -5 242 301 41 -338 -8 15 -410 -47 160 59 16 43 77
5385 77 -68 56 48 306 -89 -200 -177 -87 21 43 -58 329 93 -261 -2 -68 -207 -482 -26 -113 -44 -1 -173
5408 -173 -75 -301 72 51 -49 -92 -8 -52 -42 -93 34 -45 21 -256 100 57 56 47 275 -145 77 -161 -295 -218 -78
5433 -78 -69 -142 -121 36 61 -2 116 -226 28 -124 -22 146 -72 -185 -135 171 -139 -268 41 66 -223 -11 -168
5456 -168 -236 -43 -53 -70 -246 25 90 243 322 295 162 108 358 156 -133 128 -136 -13 -338 104 -224 132
5478 132 14 -175 -118 -125 -12 51 102 -169 -167 -380 -209 -65 -80 -98 151 -292 -14 250 -69 118 139 -16 -193
5501 -193 45 112 129 289 23 229 -126 -41 -80 -81 -67 -259 39 -43 32 -93 235 -55 257 -88 66 -146 -50
5524 -50 -138 -54 -283 -28 -109 -169 -86 -5 -128 187 153 233 18 -173 -212 5 244 110 136 115 -86 -67 58 -136
5548 -136 276 -45 -55 41 -112 68 -151 -107 186 26 202 70 -149 -55 -150 -108 -67 -190 137 185 -51 86 51
5571 51 -175 76 -8 -13 134 213 427 72 85 61 23 -238 -69 -64 61 -71 254 205 54 -270 -238 -134 80 -188
5595 -188 11 -113 -351 -34 -38 -169 218 90 -244 354 8 104 95 -172 -123 325 -185 -196 -88 -103 371 -107 45
5618 45 -96 -11 212 69 -227 -57 -38 78 -30 63 48 -119 129 -260 -149 137 120 437 125 60 -1 275 -47
5641 -47 268 -175 -32 135 -39 -148 -47 -178 -109 29 -96 -83 -69 135 60 288 -235 -56 141 338 -62 185
5663 185 101 14 -59 -457 -53 157 17 -226 -195 34 30 -244 -125 -218 58 -125 -21 89 105 -209 22 231 173
5686 173 246 176 2 146 122 -48 43 -222 119 29 -79 -109 74 224 -68 -2 -84 -101 116 13 -84 235 -173
5709 -173 -38 -185 -3 -186 244 -161 -120 48 -136 203 -106 -183 -34 -148 -202 -97 143 200 -1 47 136 -133
5731 -133 48 -192 3 -265 88 -281 -86 184 -239 172 -36 129 54 -34 155 131 -114 23 56 -116 110
5752 110 -129 -56 -5 165 -388 21 -64 -374 107 -6 84 -79 -121 -49 -234 174 -68 -149 15 -200 24 -159
5774 -159 -95 -29 -9 -433 -65 280 -96 159 300 401 -1 72 55 168 143 -27 -2 -250 84 0 0 -20 -142 295
5798 295 157 -33 -9 327 110 -3 -23 102 209 -63 18 -364 -407 20 -1 -42 37 37 324 -343 -22 58 -184
5821 -184 120 148 137 126 46 146 -22 -243 75 -90 -158 -118 -8 -304 93 160 86 -80 205 -169 75 147 -55
5844 -55 27 95 47 61 -359 202 176 9 -156 -1 103 -58 -205 -383 -158 -10 -350 -10 -178 37 -5 56 -114
5867 -114 26 71 -94 -11 52 45 -125 -3 22 0 168 133 -211 -109 170 -45 -387 64 -39 -108 -264 334 -356
5890 -356 27 -87 194 90 -119 33 112 -233 -61 6 -49 -246 -115 28 -85 237 142 -62 -17 289 25 8
5912 8 -144 109 -301 -51 -111 -85 -51 -115 -66 269 279 -27 -5 -130 -85 -133 254 -487 -182 148 -25 -237 -9 -264
5936 -264 -112 181 -159 411 -152 63 117 68 297 16 47 -88 -165 114 -293 102 -207 4 196 155 240 -5
5958 -5 62 123 -59 232 -143 56 79 194 -119 1 330 217 -31 127 -122 122 -198 258 125 117 113 -87 -216
5981 -216 -146 198 -70 302 -20 0 47 -162 -134 50 -120 233 -159 89 61 -89 -202 -51 148 -170 274 157
6003 157 -177 7 -288 24 -256 -193 -141 219 123 -158 -25 125 182 95 -124 -212 154 188 112 22 132 -11 -54
6026 -54 352 305 282 203 -26 -224 91 74 93 62 346 119 -193 -208 237 129 -161 -264 -356 268 362 -125 -69 11
6050 11 131 241 140 -108 301 -358 -368 -65 -151 127 -117 -12 288 -12 -285 -304 22 -44 -8 -141 49 282
6072 282 -165 180 -202 -145 186 199 -9 -91 -83 129 30 7 456 -42 -192 -215 -331 -87 -39 -191 46 210 -240
6095 -240 -243 43 167 12 250 -119 295 -56 -188 -23 -23 -222 -267 -27 19 -43 -39 103 71 -99 -47 -123 -106 21
6119 21 -262 7 -153 24 199 8 41 -5 -183 36 31 -92 -2 -53 -88 -52 49 -7 -51 93 -196 -59 279 417
6143 417 62 -133 17 -123 -135 49 -234 248 206 -83 39 -68 58 92 -208 -25 -214 -234 -83 96 113 -98
6165 -98 -46 -185 14 36 54 109 116 199 38 -128 78 299 119 -103 -293 265 -25 -6 63 65 -61 72 276 319
6189 319 -40 -7 78 36 168 -131 9 83 42 143 -267 -35 368 -76 273 102 126 -172 15 -140 -197 48
6211 48 9 -40 -139 121 439 -159 184 252 152 12 -152 114 -77 257 -346 67 -9 -1 80 -209 -192 -61 -58 -89
6235 -89 0 -157 -392 -72 130 -62 217 -87 -1 125 -25 170 -22 -236 -128 -445 299 -33 -40 96 207 -270
6257 -270 38 -84 -163 -3 174 -82 113 26 -118 -171 61 85 -103 -142 60 -43 -149 -10 145 -262 -33 -156
6279 -156 55 -135 -355 -13 -191 -116 -99 66 -246 141 -138 264 -169 220 181 -85 113 -296 -286 -192 -110 -203
6301 -203 235 -309 -165 -86 162 167 345 240 96 59 -74 -176 201 74 334 7 154 -2 235 -164 132
6322 132 -117 -111 326 -357 -18 230 88 -76 117 -122 39 -57 352 84 -6 -173 201 -55 157 32 -13 324
6344 324 154 -70 40 182 -75 21 -45 -52 211 49 -6 -184 73 58 -28 -250 161 110 -303 63 205 300 -45
6367 -45 -56 -200 276 -59 88 79 124 89 127 114 -256 -269 65 111 134 136 -2 153 -94 -166 136 195 -81 228 55
6392 55 -44 18 -240 -272 -77 -119 160 93 -55 64 43 -172 43 -45 70 -82 -241 -242 10 107 -299 178 -216 -209
6416 -209 96 8 -199 216 205 48 -150 -283 126 66 343 -202 387 159 7 -190 188 -133 237 161 -114
6437 -114 107 -25 51 146 -44 210 106 -116 80 182 -46 103 210 186 -303 -3 -90 -293 -177 19 -152
6458 -152 -86 216 -135 64 -244 430 -143 -395 250 171 170 -202 72 -33 1 2 -235 196 147 -65 27 98 -148
6481 -148 43 138 270 32 -59 4 56 2 360 -19 104 38 -25 -210 53 40 132 15 219 65 201 151 72 52
6505 52 87 242 -219 -105 -66 -64 -3 -225 192 -123 -23 21 -9 -35 -64 224 130 25 -306 -143 155 30 60 333
6529 333 0 -2 31 -37 -230 157 81 10 80 68 -115 117 -123 205 126 -155 -39 153 185 8 122 187 -25 38
6553 38 226 -135 180 -148 -3 -81 78 457 -121 -5 352 -143 75 -138 10 -86 142 335 -19 -84 -56 78
6575 78 66 -88 -87 -479 177 140 -283 -119 -196 11 27 36 -44 14 121 0 -195 8 -280 348 215 -122 -246 -82
6599 -82 109 251 22 8 84 -187 181 249 76 -37 156 -50 84 94 206 406 180 539 159 -45 224 58
6621 58 91 -44 94 -9 -83 8 154 40 101 -127 -215 22 102 -33 37 -66 -187 83 357 75 79 70 34 112 -118
6646 -118 207 -84 146 25 -20 37 -73 -70 -434 98 -122 -229 -63 -358 -28 -56 117 -89 423 -167 152 149
6668 149 72 -124 -68 148 -21 -80 -143 -77 232 -1 -67 -99 166 169 25 -379 -221 44 -37 -35 70 -145 161 -109
6692 -109 81 163 173 -23 -255 91 -43 20 -91 -273 -158 -32 -124 124 -238 40 287 -66 245 49 -90
6713 -90 -102 -81 130 -143 58 518 -110 137 -5 63 -206 326 -246 169 52 -59 -36 53 -141 128 -31 -127
6735 -127 -121 102 23 267 39 -240 171 -74 -149 -391 -148 -127 12 26 25 25 126 -80 245 131 315 67 43 165
6759 165 -164 -168 -22 -69 -70 -409 130 104 108 -280 -80 164 -98 -298 -19 -65 3 -46 -168 52 -327 -124 29 180
6783 180 -29 -112 -43 63 282 -27 75 245 5 112 -58 77 -110 -7 37 -23 58 -237 7 101 63 -74
6805 -74 -24 -95 137 114 7 -16 -357 -215 35 -4 -393 -269 -29 -53 -178 91 -59 -46 170 -175 -228 -5 -425
6828 -425 29 66 101 8 -36 -193 78 -77 -80 -247 195 114 -372 -433 178 -99 -86 14 -82 -172 -370 241 -301 72
6852 72 -232 204 -179 53 184 129 -285 169 167 71 125 194 -221 10 257 -122 -15 -157 -122 -164 -85 50 376
6875 376 85 -191 56 385 -178 61 14 217 83 -339 -214 52 28 -323 -64 -156 150 -71 161 136 -129
6896 -129 78 40 -2 -167 -196 13 14 -22 -134 196 141 -114 9 110 161 -20 -194 -127 89 -177 -65 35 222
6919 222 -52 -14 -2 195 -346 -274 282 -31 -43 52 -206 137 91 -64 12 86 251 43 -59 -304 -141 -59 216
6942 216 145 -137 -343 5 -125 134 47 174 -373 62 160 -209 -204 -26 -198 -129 97 -29 -161 -37 -87 173
6964 173 -11 208 18 -290 -103 -130 -44 33 28 -226 151 71 -117 -170 -70 -58 125 242 40 269 331 -44 97
6987 97 32 44 118 130 -327 -227 126 -131 95 226 -91 -228 -59 87 88 -33 6 -121 138 -99 162 -331 -58
7010 -58 -132 -47 -27 -63 61 -294 -160 105 128 189 184 31 -49 -192 50 536 177 166 63 -45 189 21 -200 134
7034 134 -83 -171 -141 -263 92 174 -96 -103 -264 181 287 48 -87 -256 84 313 183 142 204 4 6 41 26 67
7058 67 75 -123 -34 87 -82 -177 112 -216 -236 -190 45 133 -21 34 69 -103 -2 -73 97 178 17 22 -332 -160 215
7083 215 458 -13 15 8 136 -20 -103 277 24 -220 97 -43 239 -106 35 350 48 -179 126 130 260 33
7105 33 -318 324 -235 108 99 65 -66 49 -34 -139 49 67 318 -127 -481 235 -113 -213 -110 -133 -325 71
7127 71 124 -212 96 -137 -386 -52 -48 -363 391 -118 45 -4 21 341 159 123 47 181 154 -238 191 227 69
7150 69 166 -70 -80 133 -85 65 15 -143 152 -161 -161 -23 113 -28 25 44 -70 -30 -81 88 -41 100 -120
7173 -120 -122 46 -264 -186 -254 43 178 -204 -167 79 93 171 -139 44 -101 7 52 -197 -91 20 163 -2 108
7196 108 -41 71 -8 103 35 34 70 -94 -33 -136 89 -132 -66 84 -229 -18 85 216 178 -131 -71 11 243
7219 243 -124 114 -61 183 -19 -141 207 -299 -223 209 -265 -109 59 165 -231 63 -325 51 -186 -18
7239 -18 -155 -126 140 -123 -54 -222 -126 -302 389 50 47 -133 -261 6 -148 246 -119 116 -38 -50 121 22 263
7262 263 213 -43 272 -103 110 -52 -109 357 -143 59 -172 185 -32 146 -62 288 185 67 107 92 -263
7283 -263 22 -196 -81 31 232 -323 -47 52 -307 -119 192 -195 -78 140 -231 -61 -12 -188 -269 222 122
7304 122 -51 136 99 171 113 -31 211 49 14 -114 -113 -87 119 78 -76 184 -27 30 205 -107 -330 -353 58
7327 58 44 -140 177 -143 -267 -70 192 -39 -26 78 96 -109 168 47 26 -114 16 -292 -167 -56 -129 58
7349 58 -181 124 -37 15 -26 -31 -241 -65 108 -222 155 -5 137 146 -132 201 55 180 -147 -48 -168 147 275
7372 275 -272 65 -151 -128 -146 -1 109 -227 15 -100 107 86 166 142 -9 166 49 76 195 206 -54 -132 -22
7395 -22 -7 -215 -46 3 -50 -106 -52 109 143 189 -51 121 -10 248 -27 -375 81 -232 -55 -72 76 170 -67
7418 -67 8 215 -212 -13 -227 106 70 -76 -212 -170 -20 -46 25 -16 -135 226 82 196 60 214 -17 -33 -14
7441 -14 149 133 34 -31 -266 -40 -169 -117 -145 -15 -102 -323 -39 -47 -104 -210 132 -223 -9 -98 -200 66 175 65
7465 65 -141 55 23 142 125 -55 340 -65 15 56 -157 32 -336 -269 163 314 -12 -29 -25 21 -21 -29 198 27
7489 27 -42 1 -102 -274 79 229 175 -83 58 208 94 318 -43 -100 28 -20 -239 -93 5 175 19 124
7511 124 156 89 -44 178 -87 169 169 -114 6 100 -157 84 -58 131 85 31 36 -158 301 98 -178 -32 161
7534 161 -184 -29 216 -138 -132 152 -109 -62 -187 -340 -211 59 43 52 97 -37 226 31 47 229 43 280 -56
7557 -56 -67 82 -197 -151 34 -29 -70 72 190 -127 -117 -350 108 429 -186 201 -4 -172 -49 -29 62 -72 -24
7580 -24 -55 353 183 -154 -89 -38 -51 -178 -94 -69 344 -14 20 192 9 137 -17 5 -66 -222 -176 -3 -4 -230
7604 -230 120 328 -19 -162 -130 -31 47 253 -118 -249 35 -47 -231 -27 81 68 140 -182 136 75 118 -6 -254
7627 -254 44 -173 93 -176 -108 234 21 7 -4 80 214 118 -5 -200 218 124 100 -140 30 408 6 268
7649 268 2 86 -51 382 31 -109 127 59 -194 183 224 16 113 67 -57 -77 -58 -163 253 -263 -10 -237
7671 -237 -161 233 121 -114 141 -160 -174 -140 420 39 1 -136 56 -102 -107 75 -164 212 -166 11 -19 -45 131
7694 131 115 -139 49 118 0 -55 -73 5 -102 -76 -98 -44 -479 -183 -44 -158 338 74 198 -59 145 -81 132
7717 132 107 -177 54 -103 51 97 123 -141 142 -194 -56 357 143 -137 -285 335 -138 31 90 -104 -213
7738 -213 -320 -142 -33 -53 -137 -31 48 9 187 -98 114 84 -108 -188 -126 244 -178 -34 70 128 94 149 2
7761 2 -23 129 -297 189 -171 -21 149 71 18 92 -13 -156 48 -28 266 -173 239 281 129 17 -1 -237 91
7784 91 259 -77 -178 -86 -14 95 -79 179 8 -26 -90 366 -64 -66 -88 -7 -53 127 -175 -54 -43 214 -183 7
7808 7 363 81 21 123 -53 -102 -57 -231 -56 -75 -103 -63 -5 -1 169 -319 -86 -97 39 373 130 3 -40 -294
7832 -294 278 86 10 416 164 -119 94 25 62 -326 -265 54 -100 -214 -14 -414 -92 -198 -173 148 -211 -2
7854 -2 -230 -306 192 100 179 92 -225 -151 -46 -176 -69 -148 48 -62 180 -128 87 -104 165 14 230 46 9
7877 9 -287 69 323 169 54 69 -34 -168 -129 -8 109 285 -317 -64 -65 110 407 -98 -98 -258 170 76 230
7900 230 -17 176 -175 33 200 382 205 -170 -314 13 -65 -122 -47 -145 -105 -1 -128 217 289 243 108 -231
7922 -231 -339 253 41 95 181 410 -270 -151 43 -157 -25 22 4 -75 64 120 -26 227 214 49 110 321 206
7945 206 -272 -153 70 74 72 -35 -292 166 186 -307 -413 13 261 63 -234 -120 -217 -228 45 167 -116 -130 -24
7968 -24 -96 -176 48 129 104 -48 118 -66 133 -217 -65 48 112 -137 261 -41 149 138 -108 -191 -365 -158 49
7991 49 -185 234 213 -87 222 188 8 -180 235 -5 78 90 88 -79 328 110 -24 -258 -116 -145 28 225 208
8014 208 87 44 463 51 -88 136 60 158 -35 -89 126 -87 -15 -152 197 -17 -7 56 -209 -216 62 -119 81
8037 81 -277 -58 104 -37 -48 -239 93 -69 -58 -210 179 17 -70 2 123 49 -33 -103 -18 75 -89 152 22
8060 22 -221 -272 -96 11 25 233 0 -108 -272 110 53 -50 74 -98 -39 -70 -109 -44 -148 33 -293 288 -9
8083 -9 206 -44 -269 239 82 -4 66 55 -167 -202 -215 77 287 -50 -460 -191 122 62 11 191 -216 136 -67
8106 -67 -228 -132 -140 71 -47 138 195 -132 132 207 -359 -117 181 118 104 -58 -357 90 -70 187 -25 -221 -143
8129 -143 -86 466 189 221 -98 120 -2 -218 205 -255 -155 -205 -295 -103 -87 -191 55 -200 -131 27 -97 -150
8151 -150 -17 -37 19 -76 -178 97 -65 -118 -312 -260 129 345 -76 63 269 438 -45 -234 -76 191 -7 35
8173 35 10 83 -207 118 -192 -241 -10 49 114 -27 -169 -65 -87 -85 202 -134 -104 91
8191I1
##END NTUPLES=NMR FID
##END=
