##TITLE=1H_CA-8633-1
 CDCl3, 8 sc, 
 2.8.2019
##JCAMPDX= 6.0         $$ Bruker NMR JCAMP-DX V2.0
##DATA TYPE= NMR FID
##DATA CLASS= NTUPLES
##ORIGIN= UXNMR, Bruker Analytische Messtechnik GmbH
##OWNER= root
$$ XWIN-NMR		Version 3.5
$$ Fri Aug  2 14:59:50 2019 Russian Standard Time (UT+4h)  she@DPX200
##.OBSERVE FREQUENCY= 200.13155
##.OBSERVE NUCLEUS= ^1H
##.DELAY= (6, 6)
##.ACQUISITION MODE= SIMULTANEOUS
##.ACQUISITION SCHEME= undefined
##.AVERAGES= 8
##.DIGITISER RES= 18
##SPECTROMETER/DATA SYSTEM= spect
##.PULSE SEQUENCE= zg30
##.SOLVENT NAME= DMSO
##.SHIFT REFERENCE= (INTERNAL, DMSO, 0, 15.7039)
##AUDIT TRAIL= $$ (NUMBER, WHEN, WHO, WHERE, WHAT)
$$ ##TITLE= Audit trail, XWIN-NMR		Version 3.5
$$ ##JCAMPDX= 5.01
$$ ##ORIGIN= Bruker BioSpin GmbH
$$ ##OWNER= she
$$ F:/spectra/data/she/nmr/H-F/1/audita.txt
$$ ##AUDIT TRAIL=  $$ (NUMBER, WHEN, WHO, WHERE, WHAT)
(   1,<2019-08-02 14:58:45.00 +0400>,<she>,<DPX200>,
      <created by zg, POWCHK disabled, PULCHK disabled
       configuration hash MD5:
       00 E9 B6 7A A2 85 ED C7 34 08 36 98 17 FE 4E 26
       data hash MD5: 16K
       6F CB 9B BB 9B F4 EA DB 30 4F 7C 01 20 51 D1 41>)
$$ ##END=
$$ 
$$ hash MD5
$$ C4 D0 FD C9 AC C5 E2 B0 46 20 F7 F9 D6 FE 4C 8F
##$RELAX= 
##$RELAX= 
##$RELAX= 
##$RELAX= 
##$RELAX= 
##$RELAX= 
$$ Bruker specific parameters
$$ --------------------------
##$DU= <F:/spectra>
##$EXPNO= 1
##$NAME= <H-F>
##$PROCNO= 1
##$TYPE= <nmr>
##$USER= <she>
##$AMP= (0..31)
100 100 100 100 100 100 100 100 100 100 100 100 100 100 100 100 100 100 
100 100 100 100 100 100 100 100 100 100 100 100 100 100 
##$AQSEQ= 0
##$AQ_mod= 1
##$AUNM= <au_zg>
##$AUTOPOS= <>
##$BF1= 200.13
##$BF2= 200.13
##$BF3= 200.13
##$BF4= 200.13
##$BF5= 200.13
##$BF6= 200.13
##$BF7= 200.13
##$BF8= 200.13
##$BYTORDA= 1
##$CFDGTYP= 0
##$CFRGTYP= 5
##$CHEMSTR= <none>
##$CNST= (0..31)
1 1 145 1 1 1 1 1 1 1 1 1 1 1 1 1 1 1 1 1 1 1 1 1 1 1 1 1 1 1 1 1 
##$CPDPRG= <>
##$CPDPRG1= <>
##$CPDPRG2= <>
##$CPDPRG3= <>
##$CPDPRG4= <mlev>
##$CPDPRG5= <mlev>
##$CPDPRG6= <mlev>
##$CPDPRG7= <mlev>
##$CPDPRG8= <mlev>
##$CPDPRGB= <>
##$CPDPRGT= <>
##$D= (0..31)
0 1.2 0 0 0 0 0 0 0 0 0 0.03 0 0 0 0 0 0 0 0 0 0 0 0 0 0 0 0 0 0 0 0 
##$DATE= 1564743524
##$DBL= (0..7)
120 120 120 120 120 120 120 120 
##$DBP= (0..7)
150 150 150 150 150 150 150 150 
##$DBP07= 0
##$DBPNAM0= <>
##$DBPNAM1= <>
##$DBPNAM2= <>
##$DBPNAM3= <>
##$DBPNAM4= <>
##$DBPNAM5= <>
##$DBPNAM6= <>
##$DBPNAM7= <>
##$DBPOAL= (0..7)
0.5 0.5 0.5 0.5 0.5 0.5 0.5 0.5 
##$DBPOFFS= (0..7)
0 0 0 0 0 0 0 0 
##$DE= 6
##$DECBNUC= <off>
##$DECIM= 24
##$DECNUC= <off>
##$DECSTAT= 4
##$DIGMOD= 1
##$DIGTYP= 9
##$DL= (0..7)
0 120 120 120 120 120 120 120 
##$DP= (0..7)
150 150 150 150 150 150 150 150 
##$DP07= 0
##$DPNAME0= <>
##$DPNAME1= <>
##$DPNAME2= <>
##$DPNAME3= <>
##$DPNAME4= <>
##$DPNAME5= <>
##$DPNAME6= <>
##$DPNAME7= <>
##$DPOAL= (0..7)
0.5 0.5 0.5 0.5 0.5 0.5 0.5 0.5 
##$DPOFFS= (0..7)
0 0 0 0 0 0 0 0 
##$DQDMODE= 0
##$DR= 18
##$DS= 0
##$DSLIST= <SSSSSSSSSSSSSSS>
##$DSPFIRM= 0
$$ [...]
##$SUBNAM2= <"">
##$SUBNAM3= <"">
##$SUBNAM4= <"">
##$SUBNAM5= <"">
##$SUBNAM6= <"">
##$SUBNAM7= <"">
##$SUBNAM8= <"">
##$SUBNAM9= <"">
##$SW= 24.9336996594482
##$SWIBOX= (0..15)
0 0 2 0 0 0 0 0 0 0 0 0 0 0 0 0 
##$SW_h= 4990.01996007984
##$TD= 16384
##$TD0= 1
##$TE= 0
##$TE2= 300
##$TE3= 300
##$TEG= 300
##$TL= (0..7)
0 120 120 120 120 120 120 120 
##$TP= (0..7)
150 150 150 150 150 150 150 150 
##$TP07= 0
##$TPNAME0= <>
##$TPNAME1= <>
##$TPNAME2= <>
##$TPNAME3= <>
##$TPNAME4= <>
##$TPNAME5= <>
##$TPNAME6= <>
##$TPNAME7= <>
##$TPOAL= (0..7)
0.5 0.5 0.5 0.5 0.5 0.5 0.5 0.5 
##$TPOFFS= (0..7)
0 0 0 0 0 0 0 0 
##$TUNHIN= 0
##$TUNHOUT= 0
##$TUNXOUT= 0
##$USERA1= <user>
##$USERA2= <user>
##$USERA3= <user>
##$USERA4= <user>
##$USERA5= <user>
##$V9= 5
##$VALIST= <valist>
##$VCLIST= <CCCCCCCCCCCCCCC>
##$VD= 0
##$VDLIST= <DDDDDDDDDDDDDDD>
##$VPLIST= <PPPPPPPPPPPPPPP>
##$VTLIST= <TTTTTTTTTTTTTTT>
##$WBST= 1024
##$WBSW= 4
##$XGAIN= (0..3)
0 0 0 0 
##$XL= 0
##$YL= 0
##$YMAX_a= 78766
##$YMIN_a= -169809
##$ZGOPTNS= <>
##$ZL1= 120
##$ZL2= 120
##$ZL3= 120
##$ZL4= 120
##$ABSF1= 10
##$ABSF2= 0
##$ABSG= 5
##$ABSL= 3
##$ALPHA= 0
##$AQORDER= 0
##$ASSFAC= 0
##$ASSFACI= 0
##$ASSFACX= 0
##$ASSWID= 0
##$AUNMP= <proc_1d>
##$AZFE= 0.1
##$AZFW= 0.1
##$BCFW= 1
##$BC_mod= 2
##$BYTORDP= 1
##$COROFFS= 0
##$CY= 11.3945322036743
##$DATMOD= 1
##$DC= 2
##$DFILT= <>
##$DTYPP= 0
##$F1P= 20.1537800932815
##$F2P= 0.134698688090026
##$FCOR= 0.5
##$FTSIZE= 0
##$FT_mod= 4
##$GAMMA= 1
##$GB= 0.15
##$INTBC= 1
##$INTSCL= 1
##$ISEN= 128
##$LB= 0.24
##$LEV0= 0
##$LPBIN= 0
##$MAXI= 10000
##$MC2= 0
##$MEAN= 0
##$ME_mod= 0
##$MI= 1.114404
##$NCOEF= 0
##$NC_proc= 0
##$NLEV= 6
##$NOISF1= 3.799351
##$NOISF2= 2.8
##$NSP= 1
##$NTH_PI= 0
##$NZP= 0
##$OFFSET= 15.70392
##$PC= 1
##$PHC0= -9223.869
##$PHC1= 16.40097
##$PH_mod= 1
##$PKNL= yes
##$PPARMOD= 0
##$PSCAL= 0
##$PSIGN= 0
##$REVERSE= no
##$SF= 200.130013532006
##$SI= 16384
##$SIGF1= 3
##$SIGF2= 2
##$SINO= 400
##$SIOLD= 16384
##$SREGLST= <1H.CDCl3>
##$SSB= 0
##$STSI= 0
##$STSR= 0
##$SW_p= 3612.71676300578
##$SYMM= 0
##$S_DEV= 0
##$TDeff= 0
##$TDoff= 0
##$TI= <>
##$TILT= no
##$TM1= 0
##$TM2= 0
##$TOPLEV= 0
##$USERP1= <user>
##$USERP2= <user>
##$USERP3= <user>
##$USERP4= <user>
##$USERP5= <user>
##$WDW= 1
##$XDIM= 8192
##$YMAX_p= 0
##$YMIN_p= 0
$$ End of Bruker specific parameters
$$ ---------------------------------
##NTUPLES= NMR FID
##VAR_NAME=  TIME,          FID/REAL,        FID/IMAG
##SYMBOL=    X,             R,               I
##VAR_TYPE=  INDEPENDENT,   DEPENDENT,       DEPENDENT
##VAR_FORM=  AFFN,          ASDF,            ASDF
##VAR_DIM=   8192,          8192,            8192
##UNITS=     SECONDS,       ARBITRARY UNITS, ARBITRARY UNITS
##FACTOR=    0.0002004,     1,               1
##FIRST=     0,             0,               0
##LAST=      1.6414764,     0,               0
##MIN=       0,             -169809,         0
##MAX=       1.6414764,     78766,           0
$$ Real data points
##PAGE= N=1
##DATA TABLE= (X++(R..R)), XYDATA
$$ [...]
$$ plain form
2046 -602 396 1124 527 -186 -695 -599 -94 -305 -406 -38 781 318 -382 -695 -888 -130 570 235 -226 -217 -164
2067 -164 -794 -744 216 562 546 318 -281 -597 -148 -338 -209 340 721 549 -301 -696 -569 11 660 491 68
2088 68 139 -28 -168 -447 -62 233 618 563 -275 -508 -154 -104 10 339 449 -153 -218 -638 -803 102 595 551
2110 551 402 -210 -200 -709 -1165 -192 598 914 688 -569 -626 -366 -361 209 557 552 -19 180 -724 -883 -94 462
2132 462 411 441 105 -56 -388 -426 -139 414 1220 713 -190 -525 -166 288 265 131 290 638 100 -749 -915
2153 -915 60 757 630 632 -169 54 -92 -533 -509 355 933 543 22 -443 -459 -193 201 123 452 901 291 -524
2175 -524 -876 -196 537 691 489 -316 -353 -85 -174 -147 304 841 572 -165 -813 -800 -170 690 756 580 453 164
2197 164 -540 -622 -228 583 998 628 -160 -119 -334 -229 -450 96 855 847 483 -432 -732 -128 452 187 27
$$ packed form
2046f02R98P28n97p13n09R6N05k11j01L68Q19m63p00l13j93P58P00l35m61RN3
2067a64o30N0R60L46j6k28n99l16M49j90J29N49L81j72q50l95J27N80O49j69m23
2088F8P1j67j40k79L85K95L85n5q38k33L54N0J14L29J10o02o5m20j65R05M93m4
2110E51j49o12J0n09m56R73P90L16k26j257n7K60NN70L48nn71J99r04j59P89N56
2132D62n1L0l36j61l32l8K87N53Q06n07r03l35L59M54k3j34J59L48n38q49j66
2153i15R75O97j27Kq01K23j46m41K4Q64N78l90n21m65j6K66L94p8L29M49o10q15
2175e24l52O80P33J54k02q05l7K68q9K7M51N37k69p37o48J3O30Q60O6j76j27k89
2197A64p04q2L94Q11M15l70p88M1k15J05k21N46P59ql64r15l00O04N80k65j60
$$ plain form
2218 27 593 182 -261 -691 -658 -53 543 351 -239 -250 -317 -479 -531 388 567 490 65 -780 -841 38 285 518
2240 518 339 -20 -68 -208 -960 -849 189 1048 648 -143 -371 -684 -390 -73 34 268 456 604 -568 -842
2260 -842 -460 28 156 418 1 -382 105 -714 -1130 -270 418 319 -373 -486 -802 -280 94 -353 -227 124
2280 124 55 -738 -744 -540 -194 526 200 -283 -141 -151 -729 -935 265 651 235 -102 -435 -706 10 16 -122 429
2302 429 879 271 -541 -600 -360 104 1097 809 105 -7 16 -666 -392 133 401 790 371 -488 -631 -133 -71
2323 -71 329 274 279 438 -106 -655 -888 56 598 267 -172 21 144 -189 -249 -230 213 887 187 -129 -679 -298
2345 -298 0 388 441 607 -26 179 -187 -639 90 843 993 385 -18 33 -77 139 121 753 872 649 -531
2366 -531 -688 139 355 464 707 448 228 146 -314 -655 159 610 831 760 264 -396 -620 -481 -191 269 747
$$ packed form
2218B7N66m11m43m30L3O05N96j92n90j1o7j62n2R19J79p7m25q45o1Q79K47K33
2240E18j79l59m8j40p52J11J038Q59m00p91k28l13K94L17J07K34J88J48j172k74
2260h42L82M88J28K62m17l83M87q19m16Q60O88r9o92j13l16N22L74m47J26L51
2280A24o9p93oK04L46P20l26m83J42j0n78k06J200L86m16l37l33k71P16Oj38N51
2302D29M50o08q12n9K40M64R93k88p04j12K3o82K74N25K68L89m19q59j43M98O2
2323g1M00n5NJ59n44n49k33R44N42l31m39J93J23l33o0J9M43O74p00l16n50L81
2345b98K98L88N3J66o33K05l66m52P29P53J50o08m03N1j10K16j8O32J19k23j180
2366e31j57Q27K16J09K43k59k20q2m60l41Q14M51K21p1m96o60k24J39K90M60M78
$$ plain form
2387 747 556 -66 -247 -303 13 273 206 10 165 85 -317 -548 -28 199 978 721 -286 -453 119 -13 -22
2408 -22 151 549 335 18 -203 -753 -89 520 374 252 495 -15 -670 -227 -123 510 409 398 -275 7 57
2429 57 -237 -365 165 535 288 3 -846 -899 -356 343 485 59 -18 -415 -857 -453 -487 184 762 473 -552
2450 -552 -633 -650 -338 -598 45 407 382 170 -688 -948 -274 196 209 374 175 64 45 -64 -606 -340 552 757
2472 757 -124 -144 -429 102 165 115 450 248 5 -522 -500 -181 219 556 558 -24 36 -371 -722 -825 16 788
2494 788 379 -208 -354 -1054 -636 226 354 24 323 -14 -527 -660 -603 -204 217 436 -261 -149 216 -165
2514 -165 -510 130 557 790 114 -240 -386 107 445 -17 61 597 408 194 -476 -242 57 941 725 156
2534 156 -168 -39 -260 -179 45 384 584 633 -192 -604 -250 53 190 607 445 335 -345 -486 -651 -124 878
$$ packed form
2387G47j91o22j81n6L16K60o7j96J55q0m02k31N20K27P79k57j007j67N72j32r
2408b2J73L98k14l17k21n50O64O09j46j22K43n10o55M43J04O33j01j1o73K82N0
2429E7k94j28N30L70k47k85q49n3N43O99J42m26p7l97m42M04l4O71N78k89j025
2450e52q1j7L12k60O43L62k5k12q58k60O74M70J3J65j99j11j9j09n42K66Q92K05
2472G57q81k0k85N31O3n0L35k02k43n27K2L19M00L37Kn82O0m07l51j03Q41P72
2494G88m09n87j46p00M18Q62J28l30K99l37n13j33N7L99M21K19o97J12L65l81
2514a65l45O40M27K33o76l54j46M93L38m62P8N36j89k14o70K34K99Q84k16n69
2534A56l24J29k21Q1K24L39K00M9q25m12L54L03J37M17j62j10o80j41j65N27J002
$$ plain form
2555 878 151 123 -318 -431 -322 -45 24 46 518 470 -335 -815 -119 51 228 674 511 230 -202 -102 -558
2576 -558 49 601 525 310 221 -424 -126 -31 169 -111 863 551 -190 -475 -434 -102 403 418 173 52 37 -353
2598 -353 -505 -50 20 531 466 126 -452 -356 -46 101 286 636 129 -381 -393 -449 -198 574 296 -200 -15 7
2620 7 -697 -680 -315 182 414 514 -230 -802 -291 124 -192 124 228 166 -247 -134 -365 -88 391 274 204 522
2642 522 -61 -357 7 -24 323 581 869 -40 -475 133 28 -92 187 189 125 310 -146 -722 -96 503 238
2663 238 -151 -16 -404 -392 -252 -157 160 418 400 -354 -344 -226 -426 23 56 68 214 69 -133 -564 -112 447
2685 447 372 370 267 77 73 42 33 -163 443 549 98 0 128 -243 220 565 261 446 575 -400 -292 2 321
2708 321 250 537 45 258 411 67 -281 70 780 -148 -23 -171 -582 -445 363 447 -42 155 -300 -529 -81
$$ packed form
2555H78p27k8m41j13J09K77O9K2M72m8q05m80O96J70J77M46j63k81m32J00m56
2576e58O07N52p6k15q9o45K98R5K00k80R74l12p41k85M1L32N05J5k45j21j5l90
2598c53j52M55P0N11o5l40n78R6L10J47J85L50n07n10j2n6K51P72k78m96J85K2
2620Gp04J7L65M97K32J00p44n72N11M15l16L16J04o2m13J13k31K77M79j17p0L18
2642E22n83k96L64l1L47K58K88r09m35O08j05j20K79Ko4J85m56n76O26N99k65
2663B38l89J35l88J2J40R5L17K58j8p54J0J18k00M49L3J2J46j45k02m31M52N59
2685D47p5kj03j90ml1rj96O06J06m51r8J28l71M63L45l04J85J29r75J08K94L19
2708C21p1K87m92K13J53l44l48L51P10r28J25j48m11J37Q08Q4m89J97m55k29M48
$$ plain form
2729 -81 -59 74 357 491 -180 -304 -192 -128 -453 -77 318 120 -125 -416 -345 -261 164 145 -114 256 318 -263
2751 -263 -123 52 -213 371 622 156 -17 -116 -38 -170 336 312 262 60 -277 -518 -176 -6 -149 249 240 262
2773 262 -348 -84 -411 -351 344 383 -142 -270 -364 -498 -286 -9 -17 139 173 -245 -678 -521 -336 -32 256 78
2795 78 -317 -333 -200 -178 16 190 205 -266 -177 -192 -98 104 -106 116 224 280 -514 -46 -116 -129 162 313 56
2818 56 -151 -140 -246 -224 -133 153 290 -84 280 121 -181 61 -46 -1 207 175 -187 -422 -317 -113 -79 32
2840 32 -276 -30 166 -94 -149 -278 -75 -103 297 218 -479 -258 10 -151 95 -26 -137 -64 -33 -79 -150 324 339
2863 339 72 356 266 -140 77 177 381 328 197 296 -202 169 151 330 249 243 21 248 125 -291 -328 320 210
2886 210 -196 108 -146 -490 181 -16 117 -111 123 18 -37 439 117 -106 161 -108 41 186 233 -167 -137
$$ packed form
2729h1K2J33K83J34o71j24J12O4l25L76L95j98k45k91P1Q4M25j9k59L70O2n81
2751b63J40J75k65N84K51m66j73r9P8j32N06k4n0k02l37k41L42J70j43L98rK2
2773B62o10K64l27O0O95L9n25j28r4j34K12K77qJ56L4m18m33J57J85L04K88j78
2795G8l95j6J33K2J94J74J5m71Q9j5R4K02k10K22J08N6p94M68p0j3K91J51k57
2818E6k07J1j06K2R1K86J37l74L64j59l02K42j07M5K08l2l62k35J05K04L4J11
2840C2l08K46J96k60n5j29K03k8M00p9o97K21K68j61K46j21j11P3L1m6p1M74J5
2863C39k67K84r0m06K17J00K04n3j31R9m98L71j8J79q1ok22K27j23m16l7O48j10
2886B10m06L04k54l44O71j97J33k28K34j05n5M76l22k23K67k69J49J45M7m00L0
$$ plain form
2907 -137 271 134 227 348 85 -107 -16 -14 -83 593 163 -381 -69 -163 -181 251 351 -11 28 601 194 102 303
2930 303 251 338 232 61 -59 -118 246 7 122 353 -261 -56 82 161 -435 12 246 -182 112 -268 -229 -207
2952 -207 73 68 12 -38 -145 -39 -159 -35 -303 17 510 -103 -336 -191 -182 -343 -79 42 -53 348 59 37 -107
2975 -107 -37 -148 -248 208 50 -306 65 -372 -225 210 6 -144 -10 177 -411 109 185 -327 -111 -133 200
2996 200 0 -3 -261 -113 189 -112 -124 -103 -125 -286 -132 99 -56 -256 17 -235 -372 -123 -92 -75 6 -177 -53
3019 -53 -13 -144 -339 -250 150 99 -22 84 162 26 -94 148 -52 23 51 135 -407 60 -62 -235 140 113 60
3042 60 70 297 -179 256 243 -314 -160 -63 79 -167 55 -146 -25 296 65 402 172 134 -264 -39 -40 -163
3064 -163 -340 167 -101 -78 -53 -58 -189 22 207 -267 -300 93 -144 12 139 228 -205 169 125 63 22 277 147
$$ packed form
2907a37M08j37R3J21k63j92R1Ko9O76m30n44L12r4j8M32J00l62L9N73m07r2K01
2930C03n2Q7j06j71j20n9L64k39J15K31o14K05J38P9n96M47K34m28K94l80L9K2
2952b07K80nn6n0j07J06j20J24k68L20M93o13k33J45Rj61K64J21r5M01k89k2j44
2975a07P0j11j00M56j58l56L71m37J47M35k04j50J34J87n88N20P6n12K16k2L33
2996B00k00lk58J48L02l01j2K1k2j61J54K31j55k00K73k52j37K49L1J7Q1j83J24
3019e3M0j31j95Q9M00n1j21J06P8j36j20K42k00P5K8Q4n42M67j22j73L75k7n3
3042F0J0K27m76M35j3n57J54R7J42k46K22k01J21L21k31L37k30l8l98K25jj23
3064a63j77N07k68K3K5nj31K11J85m74l3L93k37J56J27Q9m33L74m4o2m1K55j30
$$ plain form
3087 147 70 226 -50 -27 243 -184 164 111 246 -211 132 319 -157 291 54 -117 -119 540 400 18 421 -88
3109 -88 -20 112 57 -84 33 110 -244 -24 -97 -394 -352 -134 -26 -82 -80 -4 -169 178 421 29 -87 62 43 -14
3133 -14 -218 -168 -116 17 520 -250 185 -65 -34 38 356 78 -358 350 4 100 352 356 59 -15 -8 132 182 262
3157 262 -192 11 33 105 -305 191 -240 74 101 -161 -441 -238 260 -210 -109 226 -105 -327 95 289 -227
3178 -227 -12 -361 16 189 55 -20 -174 31 102 -294 -100 145 -279 -6 175 92 -99 287 -110 349 519
3199 519 127 -47 159 97 122 247 419 281 418 -74 -29 75 195 -2 -302 248 -13 -10 174 137 108 324
3221 324 19 -153 -41 294 48 -16 -43 252 -311 377 116 -91 -298 159 193 -42 207 -306 -94 181 -138
3242 -138 204 -13 -75 9 179 67 -145 198 319 -175 201 166 -73 -279 157 -57 225 388 104 13 142
$$ packed form
3087A47p7J56k76K3K70m27L48n3J35m57L43J87m76M48k37j71kO59j40l82M03n09
3109h8O8J32n5j41J17P7l54K20p3k97M2K18J08n6KP6j65L47K43l92j16J49j9n7
3133a4k04N0N2J33N03p70M35k50L1P2L18k78m36P08l46R6K52Mk97p4PJ40N0Q0
3157B62m54K03K2P2m10M96m31L14K7k62k80K03M98m70J01L35l31k22M22J94n16
3178b27K15l49L77J73j34p5j54K05P1l96J94K45m24K73J81q3j91L86l97M59J70
3199E19l92j74K06o2K5J25J72j38J37m92M5J04J20j97l00N50k61LJ84l7k9K16
3221C24l05j72J12L35k46o4k7K95n63O88k61k07k07M57L4k35K49n13K12K75l19
3242a38L42k17o2Q4J70j12k12L43J21m94L76l5k39k06M36k14K82J63k84r1J29
$$ plain form
3263 142 113 5 190 360 288 320 156 59 -234 318 184 -25 79 -38 -26 -17 66 14 -100 15 -82 -46 -127 77
3287 77 -164 -143 307 -258 85 -13 -488 -257 -114 -155 -268 25 -418 -199 -84 194 8 -83 497 72 41 307
3309 307 -35 -284 -115 305 155 123 -113 -369 280 264 132 22 -113 255 244 -258 -153 -164 89 238 -103
3330 -103 273 -201 -251 -93 146 2 -92 -33 -398 -99 -89 -86 -332 182 -27 -77 -89 -486 -378 -397 66 -54 38
3353 38 2 28 -123 -19 18 -320 -105 187 -90 -58 143 -485 -13 -4 148 -332 66 -185 -243 112 219 -52 -288
3376 -288 55 -162 -61 382 35 206 340 58 -196 -158 -440 -118 106 -33 120 185 -2 145 -181 -20 72
3397 72 -130 346 3 -207 -196 76 -181 30 480 129 -105 -39 -94 -211 426 231 -99 34 95 -14 -10 465
3419 465 -228 -68 98 235 46 166 14 288 226 229 212 -274 156 -33 105 157 237 -294 141 54 -134 -3
$$ packed form
3263A42k9j08J85J70p2L2j64r7k93N52j34k09J04j17J2RQ3n2j14J15r7L6q1K04
3287G7k41K1M50n65L43r8m75K31J43m1j13K93m43K19J15K78j86r1N80m25l1K66
3309C07l42k49J69M20j50l2k36k56O49j6j32j10j35L68j1n02J05j1K53J49l41
3330a03L76m74n0J58K39j44r4N9l65K99J0Lk46N14k09n0j2l97J08j9M63j20R2
3353C8l6K6j51J04L7l38K15K92k77L2K01o28M72RJ52m80L98k51n8L55J07k71k36
3376b88L43k17J01M43l47J71J34k82k54L8k82L22K24j39J53O5j87J47l26J61R2
3397G2k02M76l43k10J1K72k57K11M50l51k34O6n5j17O37j95l30J33O1j09MM75
3419D65o93J60J66J37j89J20j52K74o2Lj7m86M30j89J38N2Q0n31M35q7j88J31
$$ plain form
3441 -3 166 235 509 226 -147 -265 -138 -148 187 -36 -51 -21 113 -82 -136 -151 -51 -35 229 126 -50 -256 -137
3464 -137 -107 80 193 120 -7 -211 179 -23 -156 162 -70 28 328 -1 -388 -50 -48 147 298 149 -167 -412
3486 -412 -119 52 127 453 -57 15 12 -21 -202 -197 271 -89 338 52 -398 -336 129 17 69 226 33 -9 31 -313
3510 -313 -62 -124 198 33 309 269 -280 -328 -199 -93 24 -2 -70 -498 -205 -51 -55 128 61 81 -15 -116 -233
3533 -233 -371 61 442 162 230 -257 -175 -6 323 139 -61 125 -167 -199 45 29 -76 100 124 150 228 189 -58
3556 -58 -278 -248 -94 -54 102 -454 -140 111 348 -36 -16 -150 40 -136 -400 -29 8 -3 -10 -105 -245 -226 39
3579 39 259 276 -174 -135 -39 15 -332 -164 26 -102 282 197 215 -104 28 -169 244 133 324 203 251 84 73
3602 73 -32 368 -182 154 528 41 26 197 31 -27 437 41 15 -95 -231 -34 -29 332 -263 -147 -54 -291
$$ packed form
3441cJ69O9K74k83l73j18J27j0L35k23j5L0J34j95n4j5J00J6K64j03j76k06J19
3464a37L0J87J13p3j27k04L90k02j33L18k32R8L00l29l87L38KJ95J51j49l16k45
3486d12K93J71P5L26n10P2ll3j81NM68l60M27k86m50O2M65j12N2J57j93m2M0l44
3510c13K51o2L22j65K76m0n49m8J29J06J17k6o8m28K93J54mJ83o7K0r6j01j17
3533b33j38M32L81k80O8m87Q2J69L29j84k00J86k92l2K44j6j05J76K4K6P8l9k47
3556e8k20L0J54M0J56n56L14K51K37l84K0j34J90j76k64L71L7j1pr5j40J9K65
3579C9K20J7m50L9R6N4l47J68J90j28L84q5J8l19J32j97M13j11J91j21M8j67j1
3602G3j05M00n50L36L74m87j5J71j66n8M64l96k6j10j36J97NL61n95J16R3k37
$$ plain form
3624 -291 -78 -235 -1 -14 57 52 -314 -349 -254 -246 239 509 113 82 33 38 66 -113 330 271 417 148 -160 137 -57
3649 -57 -43 112 127 326 -125 -149 -10 278 322 -87 33 -82 -12 155 -219 -69 -39 359 305 20 -357 16 -82
3672 -82 250 54 -174 96 -160 57 -205 -24 -32 40 46 -15 -36 -122 57 67 7 168 307 -93 -88 -364 -283 -13 -55
3697 -55 -98 -61 144 -18 -255 -259 -43 82 215 381 165 -165 -83 111 38 228 -60 -24 -188 -172 14 -169 129
3720 129 14 -52 162 -46 -196 -143 120 -26 93 197 -215 -219 -14 -26 -136 -188 -309 136 9 -189 -158 -116 -71
3743 -71 -53 25 212 -286 -469 -65 -199 -139 83 25 -278 159 54 -130 -361 225 -121 1 71 -11 -274 20
3765 20 29 144 -198 -193 116 239 81 114 369 137 79 137 16 49 -333 53 36 436 189 -120 -170 -343 42 94
3789 94 193 -72 278 47 -44 -12 -103 -31 -125 66 -282 -66 -309 -153 75 138 14 114 -262 -241 -132 40 23
$$ packed form
3624b91K13j57K34j3P1nl66l5R5QM85K70l96l1m9NK8j79M43n9J46k69l08K97j94
3649e7J4J55J5J99m51k4J39K88M4m09J20j15P0J67l74J50L0L98n4k85l77L73r8
3672h2L32j96k28K70k56K17k62J81qP2Oo1k1q6J79J0o0J61J39m00Nk76Q1K70m2
3697e5m3L7K05j62k37mK16J25J33J66k16l30Q2J94p3J90k88L6j64J6J86j83K98
3720A29j15o6K14k08j50N3K63j46J19J04m12mK05j2j10n2j21M45j27j98L1M2M5
3743g1J8P8J87m98j83M04j34O0K22n8l03M37j05j84k31N86l46J22P0q2k63K94
3765B0RJ15l42NL09J23j58L3K55k32n8N8j21L3l82L86j7M00k47l09n0j73L85N2
3789I4R9k65L50k31r1L2r1P2r4J91l48K16k43J56K28O3j24J00l76K1J09J72j7
$$ plain form
3812 23 44 -138 -75 -59 69 -94 51 53 643 259 76 -7 -341 -265 -120 179 150 254 94 -288 -328 -306 118 58
3836 58 -84 -167 176 41 -279 15 94 184 211 105 -164 37 -285 112 -12 159 135 163 -122 -371 -190 -27
3858 -27 4 208 -67 -136 -96 -107 -213 -53 -39 83 -161 -254 -413 240 217 -155 -121 252 -171 -121 -153 -8 289 265
3882 265 80 -362 149 -207 -169 176 39 24 11 236 -420 -110 -254 79 60 -92 108 140 256 -110 183 -21
3904 -21 20 303 94 81 86 -213 -171 -268 96 311 -83 -102 -363 -126 -98 -112 81 299 67 179 -28 -138 -152 138
3928 138 136 24 -115 -41 -182 124 -40 170 225 109 -167 114 84 25 302 62 103 15 -7 -74 -103 -32 -18 354
3952 354 104 -155 21 -56 -157 -22 103 21 -158 10 -87 -148 -72 203 159 206 -363 -275 -472 -185 39 -12 400
3975 400 189 -86 102 -82 -86 -231 -68 -87 2 5 -122 -269 134 172 -158 301 19 -156 -180 81 17 -65 -3 18
$$ packed form
3812B3K1j82O3J6J28j63J45KN90l84j83q3l34P6J45K99k9J04j60l82m0K2M24o0
3836E8j42q3L43j35l20K94P9R0K7j06k69K01l22L97j24J71k4K8k85k49J81J63
3858b7L1K04k75o9M0j1j06J60J4J22k44r3j59O53k3l72L4L73m23N0l2J45K97k4
3882B65j85m42N11l56L8L45j37j5j3K25o56L10j44L33j9j52K00L2J16l66K93k04
3904b1M1K83k09j3Nk99M2r7L64K15l94j9k61K37K8j4J93K18k32J12k07j10j4K90
3928A38kj12j39P4j41L06j64K10N5j16k76K81l0n9K77k40M1q8k2o7k9P1J4L72
3952C54k50k59J76p7j01J35J25q2j79J68r7o1P6K75m4M7n69Q8j97K87K24n1M12
3975D00k11k75J88j84mj45J63j9Q9Lj27j47M03L8l30M59k82j75k4K61o4q2O2K1
$$ plain form
3999 18 -226 -57 90 303 65 -23 -16 101 166 -186 -6 -21 262 212 184 -291 25 -276 -71 3 -83 336 -340
4022 -340 -79 -153 -440 -248 -58 178 -108 -38 -260 -229 -77 95 -59 -80 433 -151 158 -129 -89 -129 305 315
4044 315 107 -144 -209 159 -95 242 97 43 36 -53 -284 70 -29 30 51 144 -26 -63 282 -13 -67 274 40 -488
4068 -488 65 -219 -548 79 27 50 92 -64 -229 -338 5 9 248 402 16 126 -360 -117 -129 -31 151 130 -154
4091 -154 -42 -40 -321 179 42 -18 8 -79 -110 117 -259 -170 184 272 119 -43 120 119 -183 -70 290 170 255 152
4115 152 -339 -120 -81 -73 184 -4 -43 212 229 -96 -47 -96 75 -10 -245 75 106 -153 -59 115 84 31 -14 -270
4139 -270 -298 221 167 306 53 129 -152 127 -229 -77 -409 -119 -250 -225 -96 -308 115 -247 140 -150 430
4160 430 161 245 -249 -215 -164 274 126 -146 -68 -87 103 152 216 257 440 242 -78 3 261 -7 -61 -93 66 15
$$ packed form
3999A8k44J69J47K13k38q8PJ17O5l52J80j5K83n0k8m75L16l01K05P4q6M19o76
4022c40K61p4k87J92J90K36k86P0k22L1J52J72j54k1N13n84L09k87M0m0M34J0
4044C15k08k51o5L68k54L37j45n4pq9k31L54r9N9K1R3j70l7L45k95n4L41k34n28
4068d88N53k84l29O27n2K3M2j56j65j09L43MK39J54l86J10m86K43j2R8J82k1k84
4091a54J12Kk81N00j37o0K6q7l1K27l76Q9L54Q8j53j62J63jl02J13L60j20Q5j03
4115A52m91K19L9QK57j88l9K55J7l25M9m9J71q5k35L20L1k59R4J74l1n3m5k56
4139b70k8N19n4J39k53P6k81K79l56J52l32K90j31K5J29k12M23l62L87k90N80
4160D30k69Q4m94L4N1M38j48k72P8j9J90M9O4M1J83j98l20Q1K58k68n4l2J59n1
$$ plain form
4184 15 -32 -270 34 -50 130 -5 -67 259 144 -249 155 -83 155 125 132 -73 -224 -70 -98 176 19 107 -11
4207 -11 161 -138 -261 15 36 154 52 30 -56 -155 248 182 37 -21 247 -70 -80 99 4 -192 -89 36 54
4230 54 85 -41 -108 4 265 204 61 44 -77 -177 94 64 176 101 -46 -29 -47 -54 -193 26 -136 19 316 -223
4254 -223 -327 40 -319 210 -218 251 25 114 -102 131 22 -7 75 104 -34 -10 -116 9 19 89 114 107 -32
4277 -32 -395 4 122 -110 -6 132 -82 -50 -49 -214 6 185 254 45 5 -281 -256 303 254 -13 -211 168 212
4300 212 20 160 -44 102 186 -130 -382 49 -99 -113 118 143 122 192 293 98 -273 85 -206 79 81 42 208
4323 208 -273 236 -244 -192 450 125 -124 -167 -107 83 -70 -101 143 266 87 96 64 -18 83 -17 115 -156 -200
4346 -200 -349 -332 -53 -36 230 5 -80 -197 -29 -323 80 -277 191 -100 380 41 -333 -118 94 -433 -273
$$ packed form
4184A5m7k38L04q4J80j35o2L26j15l93M04k38K38l0Pk05j51J54k8K74j57Q8j18
4207a1J72k99j23K76K1J18j02k2q6r9M03o6j45n8K68l17j0J79r5j96J03J25J8
4230E4L1j26o7J12K61o1j43j7j21j00K71l0J12p5j47J7j8pj39K19j62J55K97n39
4254b23j04L67l59N29m28M69k26Q9k16K33j09k9Q2K9j38K4j06J25J0P0K5pj39
4277c2l63L99J18k32J04J38k14L2Jj65K20J79O9k09m0k86K5N59m9k67j98L79M4
4300B12j92J40k04J46Q4l16k52M31j48j4K31K5k1P0J01j95l71L58k91K85Kl9J66
4323B08m81N09m80N2O42l25k49m3O0J90j53l1K44J23j79Rl2q2J01j00J32k71m4
4346b00j49J7K79J7K66k25q5j17J68k94M03l57M68k91M80l39l74K15K12n27J60
$$ plain form
4367 -273 187 -155 -130 -7 -8 -170 -155 -12 84 -198 -42 -328 141 47 -142 272 -116 -105 -252 -26 -74 128 301
4390 301 17 140 302 130 -46 2 61 89 61 -399 -231 -208 -106 36 -23 258 104 -258 -179 -146 -23 17 207
4413 207 82 338 16 70 -170 5 -51 -381 194 -68 -38 -18 -421 130 -14 5 -221 -66 155 -5 -214 95
4435 95 68 99 -117 -263 -96 121 -134 50 119 102 -57 -18 55 -92 -122 -143 82 -27 93 49 90 -72 27 115
4459 115 -35 -216 -369 77 -27 107 123 -63 24 -49 -12 -210 17 333 287 -181 23 39 -389 -472 -167 -34
4481 -34 -72 -13 -60 -117 -105 178 85 -34 243 370 116 128 277 4 3 264 304 130 207 135 192 248 170 56 196
4506 196 15 -8 90 -120 28 -8 -142 -110 78 246 -34 140 -49 -356 153 6 158 7 -9 171 -11 60
4528 60 -12 21 -115 -124 87 352 35 180 90 -62 146 -27 211 274 -41 82 -73 -113 273 4 -317 20 95
$$ packed form
4367b73M60l42K5J23jj62J5J43R6k82J56k86M69r4j89M14l88J1j47K26m8K02J73
4390C01k84J23J62j72j76M8N9K8k8m60J68K3J02J42n9K81j54l62P9L3J23M0J90
4413B07j25K56l22N4k40J75n6l30N75k62L0K0m03N51j44J9k26J55K21j60k09L09
4435I5k7L1k16j46J67K17k55J84O9j7j59L9P3j47l0k1K25j09J20m4M1j62R9Q8
4459A15j50j81j53M46j04J34J6j86Q7p3L7j98K27L16m6m68K04J6m28q3L05J33
4481c4l8N9m7n7J2K83r3j19K77J27k54J2J49k73jK61M0j74P7p2N7N6p8j14J40
4506A96j81k3R8k10J48l6j34L2J88J68k80J74j89l07N09j47J52j51j6J80j82P1
4528F0p2L3j36rK11K65l17J45r0j52K08j73K38O3l15J23j55m0L86k69l21L37P5
$$ plain form
4551 95 211 91 -46 -82 7 203 -87 71 200 -118 107 -28 66 57 -61 5 111 21 -128 -31 254 134 76
4574 76 -8 -185 -39 71 -198 -44 267 261 12 -228 22 -99 -166 113 64 184 -17 -37 -67 179 3 -215 43
4597 43 -100 271 15 -86 -171 266 -147 -149 156 210 44 198 3 -48 155 223 -12 212 -50 141 -160 -179 -36
4620 -36 -343 282 5 -103 -132 -109 37 57 106 46 -107 46 5 -216 55 -85 -124 84 -50 -196 27 6 -151
4643 -151 150 334 23 -351 -129 79 2 -66 -204 -128 -57 -142 -170 174 181 70 -32 -68 -13 -309 -204 166 -10
4666 -10 50 77 47 148 133 -52 -128 10 -9 -206 -28 -17 -259 15 -144 50 103 177 -277 50 143 -171 254 363
4690 363 59 -78 -72 78 159 33 47 -157 54 55 -73 -265 36 -85 216 256 -26 -27 358 31 -126 -218 9
4713 9 200 103 227 147 52 42 132 107 -229 -162 52 -148 77 53 -10 14 114 -393 127 18 31 -276 133 227 31
$$ packed form
4551I5J16j20j37l6Q9J96k90J58J29l18K25j35R4rj18O6J06r0j49R7K85j20n8
4574G6q4j77J46J10k69J54L11ok49k40K50j21o7K79m9J20k01k0l0K46j76k18K58
4597D3j43L71k56j01q5M37m13kL05N4j66J54j95n1K03O8k35K24k62J91l01j9J43
4620c6l07O25k77j08k9K3J46K0M9o0j53J53m1k21K71j40l9K08j34j46K23k1j57
4643a51L01J84l11l74K22K08p7o8j38P6P1q5k8L44Pj11j02l6N5k96J05L70j76
4666a0O0K7l0J01j5j85p6J38j9j97J78J1k42K74j59J94N3P4m54L27R3l14M25J09
4690C63l04j37OJ50Q1j26J4k04K11Jj28j92L01j21L01M0k82jL85l27j57r2K27
4713IJ91r7J24q0r5j0R0k5l36O7K14k00K25k4o3K4J00n07N20j09J3l07M09R4j96
$$ plain form
4738 31 8 -6 -9 180 -211 126 82 -7 14 -90 -123 -176 -96 -22 -119 -66 82 -98 73 -31 -91 -16 -86 31 -21 10
4764 10 182 67 329 52 -213 142 164 -405 -19 60 1 -38 -211 -119 73 -54 -78 -136 43 392 108 -197 22
4787 22 86 -139 408 137 -19 -19 11 -28 279 -12 16 -188 224 -1 -229 -69 267 -362 -227 -79 -24 -41 108
4810 108 53 -53 280 69 -68 -233 -10 252 -235 -33 -67 -77 231 -145 169 115 62 60 319 47 -129 169
4832 169 -206 -17 238 153 17 160 -52 -20 107 -192 -125 87 138 221 -94 25 291 -131 97 37 -151 228
4854 228 262 178 -7 38 -20 -109 -6 -151 105 78 367 -151 -371 -5 -45 -86 -95 60 -33 -18 106 -240 -192 -107 -101
4879 -101 149 223 41 340 -97 -278 -192 -242 -6 152 112 -13 86 75 42 -177 -254 90 -156 108 87 10 -199
4902 -199 212 98 92 105 -216 -9 -7 25 -88 -56 98 157 -112 -109 -155 243 293 213 116 -216 224 -282 -138 -171 6
$$ packed form
4738C1k3j4lJ89l91L37m4q9K1j04l3n3Q0P4r7N3J48j80J71j04o0P5p0J17n2L1
4764A0J72j15K62k77k65L55K2n69L86P9n9l9j73R2J92j27k4n8J79L49k84l05K19
4787B2O4k25N47k71j56%L0l9L07k91K8k04M12k25k28J60L36o29J35J48N5j7J49
4810A08n5j06L33k11j37j65K23K62m87K02l4j0L08l76L14n4n3kK59k72j76K98
4832A69l75J89K55q5j36J43k12L2J27k99O7K12N1Q3l15J19K66m22K28o0j88L79
4854B28L4q4j85M5n8q9J03j45K56k7K89n18k20L66m0m1rJ55r3J5J24l46M8Q5O
4879a01K50P4j82K99m37j81Q6n0K36J58m0j25R9j1l3k19p7L44k46K64k1p7k09
4902a99M11j14oJ3l21K07KL2j13L2J54N9k69Lm6L98N0q0r7l32M40n06J44l3J77
$$ plain form
4927 6 -15 -97 139 8 -148 24 -108 -63 11 351 172 98 170 -190 -62 30 -20 -17 -86 38 -52 -192 137 21 161
4952 161 232 137 65 -242 33 52 138 -250 160 132 -305 -145 -43 52 182 257 -245 1 173 168 -23 110 5
4975 5 45 -106 -206 66 -144 69 -30 -80 -33 -113 -22 108 -18 -175 112 -4 -21 7 207 101 257 19 135
4998 135 126 183 160 -42 -286 173 52 67 214 -155 84 174 -209 -27 112 203 145 -198 83 -53 26 324 174
5021 174 75 288 -41 -238 236 248 -210 -85 -132 244 -180 94 -61 -120 174 -92 45 -140 -64 22 184 -86
5043 -86 -87 -92 14 143 63 -21 36 -112 -238 84 -93 82 -39 262 -1 -189 -38 -193 -54 373 -20 -45 147
5066 147 33 -32 73 -172 98 192 -235 43 18 -198 -56 -15 97 -257 100 355 -33 82 -59 -193 4
5087 4 -157 -4 122 14 -100 -217 46 -74 111 -212 -94 134 46 -119 15 -323 7 280 53 158 81
$$ packed form
4927Fk1q2K36j31j56J72j32M5P4L40j79p4P2l60J28R2n0Lo9J24r0j40L29j16J40
4952A61P1r5p2l07K75J9Q6l88M10k8m37J60J02R5J30P5n02K46J72nj91J33j05
4975EM0j51j00K72k10K13r9n0M7q0R1J30j26j57K87j16j7K8K00j06J56k38J16
4998A35rN7k3k02k44M59j21J5J47l69K39R0l83J82J39R1n8l43K81j36P9K98j50
5021A74r9K13l29j97M74J2m58J25m7L76m24K74j55n9K94k66J37j85P6Q6J62k70
5043h6jnJ06J29q0q4N7j48j26L22j77J75j21L01k63j88J51j55J39M27l93k5J92
5066A47j14o5J05k45K70R4m27K78k5k16J42M1J12l54L57K55l88J15j41j34J97
5087Dj61J53J26j08j14j17K63j20J85l23J18K28q8j65J34l38L30K73k27J05p7
$$ plain form
5108 81 -138 -470 16 -52 44 94 -117 150 17 -88 -105 -32 -64 -63 -208 -177 22 -94 185 -167 49 -36 11 -16
5132 -16 -237 -160 -237 -84 -26 -2 -69 67 -25 42 -163 -223 -12 -244 -119 148 305 -24 -78 247 16 130 25
5155 25 113 74 -58 105 -74 95 -171 238 -73 105 118 120 62 -315 102 -83 -144 66 25 118 60 -80 -215 20
5179 20 197 -32 196 -186 190 25 113 -23 -32 0 24 91 29 -41 -17 190 197 89 56 77 37 86 -171 -131 234 190
5205 190 21 100 390 42 261 -154 25 -228 243 112 179 -198 -162 68 -54 -22 344 61 -272 -32 -252
5226 -252 212 136 96 -119 86 -107 24 3 -171 96 209 135 -58 119 -101 46 82 187 118 -176 -55 18
5248 18 -114 195 -265 -22 234 -87 -30 -2 -199 -64 63 -8 93 -163 340 3 -153 -221 298 -129 -26 102
5270 102 -71 125 66 35 127 -245 73 3 9 -135 120 -63 -25 76 -63 49 -216 -112 -102 202 150 10 40
$$ packed form
5108H1k19l32M86o8R6N0k11K67j33j05j7P3l2Jj45L1J99j16K79l52K16q5M7k7
5132a6k21P7p7J53N8K4o7J36r2O7k05o0K11k32J25K67J57l29n4L25k31J14j05
5155B5Q8l9j32J63j79J69k66M09l11J78J3Kn8l77M17j85o1K10m1R3n8j40j35K35
5179B0J77k29K28l82L76j65Q8j36rL2K4O7o2p0K4K07Pj08l3K1m0M9k57M0L65m4
5205A90j69P9K90l48K19m15J79k53M71j31O7l77L6K30j22L2L66k83l33K40k20
5226b52M64p6m0k15K05j93J31k1j74K67J13p4j93J77k20J47L6J05o9k94J21P3
5248A8j32L09m60K43K56l21N7K8j97J35J27p1J01k56N03l37j56o8N19m27J03J28
5270A02j73J96n9l1R2l72L18p0Oj44K55j83L8J01j39J12k65J04J0L04n2j40L0
$$ plain form
5293 40 45 -265 -44 185 -95 -114 78 77 -256 -191 -236 191 -204 -33 -132 -283 18 -282 -32 44 64 146 -148 8
5317 8 73 52 37 46 107 331 70 -98 -79 0 281 -114 198 134 -148 125 -104 -38 65 -265 -37 144 239 -94
5341 -94 -124 -5 -124 97 24 82 139 -283 -44 41 -112 130 267 -244 24 -252 -215 -231 39 -75 49 -63 242
5364 242 68 -67 -43 -267 62 -113 -1 -153 -213 -207 116 -168 -247 206 -88 -127 -50 -224 76 -36 -55 97 -269
5387 -269 -138 -278 207 53 -53 -159 109 182 -10 262 248 90 -138 66 -168 -169 56 -175 252 58 263
5408 263 46 -211 -201 -66 -19 66 -162 221 341 192 74 49 -72 99 126 52 -110 20 21 -58 -344 -97 -78
5431 -78 -290 257 -17 121 99 38 -32 -50 -158 -28 -187 -1 -9 -84 264 66 43 -76 22 372 129 35 226 -329
5455 -329 49 -94 -30 -16 82 71 40 -154 54 -96 -173 251 187 233 -105 334 -190 38 74 246 -111 79 -48
$$ packed form
5293D0Nl10K21K29k80j9J92jl33O5m5M27l95J71r9j51L01l00K50P6K0Q2k94J56
5317HO5k1j5RO1K24k61j68J9P9K81l95L12o4k82K73k29O6J03l30K28J81R5l33
5341i4l0J19j19K21p3N8N7m22K39Q5j53K42J37n11K68k76L7j6K70j14J24j12L05
5364B42j74j35K4k24L29j75J12j52o0OL23k84p9M53k94l9P7j74L00j12j9J52l66
5387b69J31j40M85j54j06j06K68P3j92K72j4j58k28K04k34jK25k31M27j94K05
5408B63k17k57J0J35M7Q5k28L83J20j49j18k5j21J71K7p4j62J30Jp9k86K47J9
5431g8k12N47k74J38k2o1p0j8j08J30j59J86qp5L48j98k3j19R8L50k43r4J91n55
5455c29L78j43O4J4R8j1l1j94K08j50p7M24o4M6l38M39n24K28L6J72l57J90j27
$$ plain form
5478 -48 21 -193 263 211 -139 -215 -157 -71 44 61 -132 403 63 152 102 115 388 -181 -189 240 -91 194 -75 -118
5502 -118 -161 54 -42 -81 -95 -38 -145 344 12 95 -61 194 95 110 30 -37 -214 -99 57 -89 37 -177 296
5525 296 -130 -125 121 -73 18 58 151 170 65 48 31 -22 4 -69 -76 -123 -109 -195 -112 -146 2 -289 161 -24 98 -65
5551 -65 -117 2 141 156 -240 217 -117 -182 -4 24 -88 212 72 -91 139 219 79 172 -15 184 -215 -241 -28
5574 -28 -21 80 -36 -10 -32 30 -104 -84 164 -11 45 209 46 -161 -120 105 -42 -88 -258 -2 89 50 -333 -221
5598 -221 -129 107 -131 74 27 102 26 21 -140 46 109 86 125 -25 -43 193 -216 248 -132 -15 31 151 9 179
5622 179 -135 -83 -147 49 -103 -41 101 39 421 -13 -25 40 -190 50 -143 -106 145 31 104 70 -105 -42 64
5645 64 -230 -288 246 293 -149 -60 -80 -116 -3 108 -373 -146 -28 300 -95 -127 95 210 117 -12 0 -170 -178 98
$$ packed form
5478d8O9k14M56n2l50p6N8Q6J15J7j93N35l40Q9n0J3K73n69qM29l31K85k69m3
5502a18m3K15r6l9j4N7j07M89l32Q3j56K55r9J5q0o7j77J15J56j46J26k14M73
5525B96m26NK46j94R1M0R3J9j05j7j7n3K6p3pm7J4q6Q3l4J48k91M50j85J22j63
5551f5n2J19J39J5l96M57l34o5J78K8j12L00j40j63K30Q0j40R3j87J99l99k6K13
5574b8PJ01j16K6k2O2j34K0K48j75N6J64j63k07M1K25j47m6j70K56R1l9l83J12
5598b21R2K36k38K05m7P5p6nj61J86O3k3L9j50j8K36m09M64l80J17M6J20j42J70
5622A79l14N2o4J96j52O2J42o2L82m34j2O5k30K40j93L7K51j14P3l4j75O3J06
5645F4k94n8N34M7m42Q9k0l6J13J11m81K27J18L28l95l2K22J15r3j29J2j70qK76
$$ plain form
5669 98 57 36 65 189 382 -42 175 -86 194 -105 8 -302 45 63 262 -58 33 18 304 8 121 187 42
5692 42 147 -162 12 -57 -28 -4 -227 26 -18 4 43 -93 227 -20 -93 -197 167 304 200 -81 -308 -278 60
5715 60 -100 -108 -21 40 -75 -139 -230 43 -50 94 -132 -53 184 149 -78 -152 128 134 25 -69 -101 74 26 -130 291
5740 291 208 -13 180 -3 -26 218 484 -39 135 79 -18 -16 60 -83 4 101 39 140 155 26 -289 290 58 -173
5764 -173 -28 49 66 73 161 -71 155 -336 230 77 130 -210 -39 -52 -281 208 -109 80 -245 135 5 80 -85
5787 -85 -36 238 -46 124 -93 -219 -72 164 219 16 47 339 -248 -46 139 -110 21 108 -102 -166 -154 -164 -96
5810 -96 99 -64 115 -138 -286 45 164 201 105 -52 124 -108 300 88 -1 -291 -144 77 285 105 7 6
5832 6 159 179 93 -253 -10 61 152 294 7 193 -256 -158 -128 266 101 -155 5 175 -155 -45 -21 318 72
$$ packed form
5669I8m1k1K9J24J93m24K17k61K80k99J13l10L47J8J99l20R1j5K86k96J13O6j45
5692D2J05l09J74o9K9K4k23K53m4K2L9j36L20k47p3j04L64J37j04k81k27L0L38
5715F0j60qQ7O1j15o4r1K73r3J44k26P9K37l5k27p4K80Oj09r4l2J75m8j56M21
5740B91q3k21J93j83k3K44K66n23J74n6r7KP6j43Q7R7o2J01J5j29l15N79k32k31
5764a73J45P7J7PQ8k32K26m91N66j53N3l40J71j3k29M89l17J89l25L80j30P5j65
5787h5M9K74k84J70k17j26J47K36N5k03L1K92n87K02J85k49J31Q7k10o4J2j0O8
5810i6J95j63J79k53j48L31J19L7r6j57J76k32M08k12q9k90J47K21K08j80r8j
5832FJ53K0q6l46K43P1R1J42k87J86m49R8L0L94j65k56J60J70l30J10K4L39k46
$$ plain form
5855 72 12 199 -163 227 -210 -291 236 165 81 -158 166 82 89 -199 -157 111 -232 -217 41 47 155 -110 -155 -128 -266
5880 -266 -25 101 -5 176 178 -218 156 133 -207 -40 -41 -78 -181 -20 306 -77 -41 -97 -69 53 131 139 -242 -246 66
5905 66 -16 -141 108 -99 -249 86 -144 -102 190 143 10 164 -107 124 -24 -10 49 270 -99 20 104 -168
5927 -168 -24 93 390 26 82 87 -119 35 1 -292 32 135 -189 4 -67 -197 11 -323 190 29 57 174
5949 174 111 -97 104 373 101 -41 -68 -107 58 -263 -369 140 119 26 370 -131 106 -42 178 114 266 156
5971 156 -105 11 -104 37 -110 322 183 -126 148 5 -249 3 195 61 -93 111 165 207 341 -134 -57
5992 -57 -75 72 -82 159 11 168 -261 -271 225 91 14 62 -71 -32 178 -245 113 147 -52 39 -242 14 10
6015 10 -154 -16 199 -181 -176 19 -166 38 -58 172 -26 -193 56 79 -189 44 -244 -87 -119 123 3 -155
$$ packed form
5855G2o0J87l62L90m37q1N27p1q4k39L24q4Pk88M2K68l43J5K58OJ08k65m5K7j38
5880b66K41J26j06J81Kl96L74k3l40J67jl7j03J61L26l83L6n6K8J22P8Ql81mL12
5905F6q2j25K49k07j50L35k30M2K92m7j33J54k71K31j48J4N9K21l69J19Q4k72
5927a68J44J17K97l64N6Nk06J54l4k93L24J03l24J93p1j30K08l34N13j61K8J17
5949A74o3k08K01K69k72j42k7l9J65l21j06N09k1r3L44n01K37j48K20o4J52j10
5971A56k61J16j15J41j47M32j39l09K74j43k54K52J92j34j54K04N4M2J34m75P7
5992e7j8J47j54K41j48J57m29j0M96j34p7M8j33L9K10m23L58L4j99R1k81K56m
6015A0j64J38K15l80NJ95j85K04r6K30j98j67K49K3k68K33k88J57l2K42j20j58
$$ plain form
6037 -155 121 -33 159 -29 -105 -144 45 4 -242 161 -185 362 64 -170 72 -41 -55 47 130 -27 -84 -176
6059 -176 -49 -87 8 203 -28 35 -362 -87 -245 -155 -120 273 -133 170 136 -318 -105 124 -220 -19 178 181 66
6082 66 142 -6 -25 -75 -166 255 8 154 -171 -268 63 31 -108 3 63 140 -179 -27 -83 -122 141 86 258 206
6106 206 -58 153 118 -42 -126 152 -142 -64 126 -54 8 -75 125 -30 12 140 235 -83 -141 -89 2 42 -138 -120
6130 -120 127 -71 -153 71 -43 87 -127 -119 -4 -91 -140 143 343 28 -388 -62 63 -80 -196 201 312 66
6152 66 256 -99 177 403 93 -72 -18 57 -350 188 57 121 -203 -86 -172 96 -174 -13 130 -100 -125 -152
6174 -152 107 288 151 33 -96 48 82 -200 68 4 -68 197 -91 -103 200 245 13 179 -169 -40 -33 -346
6196 -346 66 51 269 171 460 161 -122 119 273 168 315 326 28 -51 36 448 -72 45 261 16 -29 -35 228
$$ packed form
6037a55K76j54J92j88p6l9J89m1k46M03l46N47k98k34K42j13j4J02Q3j57n7r2
6059a76J27l8R5J95k31O3l97K75j58R0L5L93m06L03l4m54K13K29l44K01J97Lj15
6082F6P6j48j9n0r1M21k47J46l25r7L31l2j39J11O0P7l19J52n6l9K63n5J72n2
6106B06k64K11l5j60q4K78k94P8J90j80O2q3K00j55M2J28R5l18n8N2R1M0j80J8
6130a20K47j98q2K24j14J30k14QJ15q7m9K83K00l15m16L26J25j43j16L97J11k46
6152F6J90l55K76K26l10j65N4P5m07N38j31O4l24J17q6K68k70J61J43k30k5k7
6174a52K59J81j37j18j29J44L4k82K68o4p2K65k88j2L03M5k32J66l48J29Pl13
6196c46M12j5K18r8K89k99k83K41J54j05J47J1k98p9Q7M12n20J17K16k45m5oK63
$$ plain form
6219 228 -20 87 155 165 0 -10 76 -123 -258 16 60 134 -45 21 -55 101 -72 -69 -72 101 74 -130 202 -121
6243 -121 258 -250 153 80 -143 -35 -46 125 44 193 -23 92 168 -129 -107 243 -56 -95 -282 32 -49 -108 -51
6266 -51 59 7 -15 64 62 -2 61 4 -9 -193 439 -184 -73 -63 -180 -276 -47 307 -163 -200 -209 222 215 -152 -132 -75
6292 -75 -25 83 -73 -169 -165 -198 267 157 -210 -227 -76 -145 176 -156 -8 57 90 -187 209 -104 237 -517 -182
6315 -182 262 -92 20 27 91 10 -88 78 78 -329 -249 -135 -81 -9 -59 16 2 -143 -83 228 -281 -7 -123 -493 -80
6340 -80 -131 18 60 -303 -26 -124 36 -268 -285 67 131 119 -83 25 84 50 79 -159 -18 144 96 27 -131 337
6364 337 -112 -301 -28 -299 111 119 -107 -137 -57 -7 -90 -286 -65 -76 107 105 -26 100 -75 -188 85 191 102
6387 102 -102 -65 -75 142 325 36 -77 -26 -106 91 89 -233 56 -203 50 232 -293 2 -49 55 9 -42 -84
$$ packed form
6219B28k48J07O8J0j65j0Q6j99j35K74M4P4j79O6p6J56j73LlJ73k7k04L32l23
6243a21L79n08M03p3k23J08j1J71q1J49k16J15P6k97K2L50k99l9j87L14q1n9N7
6266e1J10n2k2P9ko4O3n7j3j84O32o23J11J0j17r6K29L54m70l7rM31pl67K0N7
6292g5N0J08j56r6Ml3M65j10l67j7J51o9L21l32J48O5L3k77L96l13L41p54L35
6315a82M44l54J12PO4q1r8J66%m07Q0J14N4P2n0P5j4j45O0L11n09K74j16l70M13
6340h0n1J49M2l63K77r8J60l04j7L52O4j2k02J08N9l4K9k38J41J62m8o9j58M68
6364C37m49j89K73k71M10Qk26l0Q0N0q3j96K21j1J83kj31J26j75j13K73J06q9
6387A02k04L7j0K17J83k89j13N1q0J97kl22K89k59K53J82n25K95n1J04m6n1m2
$$ plain form
6410 -84 -96 -49 114 34 -63 -259 -204 -34 31 73 207 81 -157 -189 -116 80 -216 265 -30 -46 -126 -156 -104 -40 -9
6435 -9 -182 -73 -214 8 109 86 66 254 -157 16 86 -97 -119 -221 60 -32 308 -63 19 -14 -216 -150 -211 -17
6459 -17 96 4 11 -316 84 132 163 58 64 -105 91 -76 174 -313 -16 -241 258 35 -53 150 16 -39 78
6482 78 291 250 249 389 -21 -407 98 -292 -63 -1 83 -13 -284 -219 155 16 72 -51 -49 68 114 22 62 178 59
6507 59 -75 -192 -82 188 -233 -37 -38 151 54 -176 -166 147 -200 -144 16 -326 -221 -73 -109 8 36 -51 80
6530 80 84 -31 54 -122 4 -24 35 196 292 28 -172 -55 -68 -93 15 -53 169 214 123 -26 -118 69 -257 39
6554 39 102 -70 16 -178 137 88 -255 -186 -33 126 269 -25 206 153 -45 -74 130 3 -12 54 -7 239 39
6577 39 -173 -112 -81 -83 101 -367 -9 -140 91 307 -29 -76 -90 -53 -157 -100 -7 -205 104 137 120 -251 -204 289
$$ packed form
6410h4j2M7J63q0r7j96N5J70O5M2J34j26k38l2P3J96k96M81k95j6q0l0N2O4L1
6435ij73J09j41K22J01k3k0J88m11J73P0j83k2j02K81r2L40l71Q2l3k02O6o1J94
6459a7J13r2Pl27M00M8L1j05Oj69J96j67K50m87K97k25M99k23q8K03j34n5J17
6482G8K13m1jJ40m10l86N05l90K29O2Q4r6k71O5L74j39N6j23KJ17M6r2M0J16j19
6507E9j34j17J10K70m21J96jJ89r7k30J0L13l47N6J60l42J05J48l6J17K8q7J31
6530H0Mj15Q5j76J26k8N9J61R6k64k00J17j3k5J08o8K22M5r1j49r2J87l26K96
6554C9O3j72Q6j94L15m9l43O9J53J59J43k94K31n3j98k9K04j27j5O6o1K46k00
6577C9k12O1L1kJ84m68L58j31K31K16l36m7j4L7j04N7R3j98L09L3j7l71M7M93
$$ plain form
6601 289 36 296 166 223 -141 -47 -9 111 120 -120 -121 12 31 39 98 168 139 110 58 -11 144 102 -5 167 160 -55
6627 -55 34 118 176 124 25 -131 178 168 163 2 -127 42 23 -92 -49 100 -85 -144 -71 -105 -159 -52 62 -79 -95
6652 -95 -228 -156 -131 -37 149 -201 -24 -79 176 -146 71 -56 -26 156 -181 -107 6 41 92 -214 -25 58 95 91
6676 91 146 125 -20 -149 180 -230 3 -188 -150 133 -305 -174 133 81 257 74 69 -100 83 -25 95 98 279
6699 279 -278 4 -114 85 159 19 -187 -255 -178 55 -221 -249 346 79 204 93 49 244 389 -64 156 -44
6721 -44 127 197 125 -311 -46 179 96 171 -50 90 18 149 -66 -255 50 9 71 80 -90 22 -12 -79 -29 211
6745 211 -18 -73 24 175 -120 -78 225 115 -213 118 -19 -23 -53 56 85 28 -197 77 -94 109 -12 150 -118
6768 -118 71 -49 -271 91 105 -41 205 102 -274 -213 61 -283 -64 235 369 51 -330 96 23 255 57
$$ packed form
6601B89k53K60j30N7l64R4L8J20Rk40jJ33J9QN9P0k9k9n2o9J55m2j07J72pk15
6627e5Q9Q4N8n2r9j56L09j0nj61j29J69j9j15M3J49j85n9P3l4n4J07J14j41j6
6652i5j33P2K5R4J86l50J77n5K55l22K17j27L0J82l37P4J13L5N1l06J89Q3L7m
6676I1N5k1j45j29L29m10K33j91L8K83m38J31L07n2J76j83nj69J83j08J20LJ81
6699B79n57K82j18J99P4j40k06o8P7K33k76k8N95k67J25j11m4J95J45m53K20k00
6721d4J71P0p2m36K65K25q3P5k21J40p2J31k15j89L05m1O2Rj70J12l4o7N0K40
6745B11k29n5R7J51k95M2L03j10l28L31j37ml0J09K9n7k25K74j71K03j21J62k68
6768a18J89j20k22L62J4j46K46j03l76O1K74l44K19K99J34l18l81M26p3K32j98
$$ plain form
6789 57 100 53 -12 97 193 -191 -22 -57 -353 -40 -223 96 5 237 -244 -223 -94 43 -142 -86 177 123 -8
6812 -8 140 225 41 -15 -71 45 23 41 134 -23 187 267 -33 174 9 131 -18 -40 -79 -35 247 -83 177 -17
6836 -17 64 -72 -67 149 -19 -215 -47 39 -3 16 -195 -79 65 241 2 209 190 121 33 -80 204 -121 -195 7
6860 7 -323 -77 56 255 -291 -323 -76 149 26 263 -169 -38 -43 12 -24 -48 241 51 -12 337 184 -181 -79
6883 -79 -135 -26 260 10 -58 46 80 122 111 141 -63 -86 -195 -242 204 -150 -236 159 -128 123 201 -137 -14 187
6907 187 -123 145 -57 -43 25 7 85 52 -141 16 -6 60 114 -129 30 51 -197 130 -297 121 42 238 128
6930 128 80 109 -97 56 -64 -23 52 -224 196 35 -111 -136 -149 37 -157 95 -145 262 -169 236 -92 24
6952 24 -20 -96 -105 -63 25 -205 -125 -71 43 -102 263 -204 -114 -161 111 -231 -61 -224 -134 150 164 -29 -219 281
$$ packed form
6789E7M3m7o5J09R6l84J69l5k96L13j83L19r1K32m81K1J29J37j85N6K63n4j31
6812hJ48Q5j84n6n6J16k2J8R3j57K10Q0l00K07j65J22j49k2l9M4K82l30K60j94
6836a7Q1j36NK16j68j96J68Q6m2J9k11J16J44J76k39K07j9o9q8j13K84l25p4K02
6860Gl30K46J33J99n46l2K47K25j23K37m32J31nN5l6k4K89j90o3L49j53l65J02
6883g9n6J09K86k50o8J04L4M2j1L0k04k3j09m7M46l54q6L95k87K51P8l38J23K01
6907A87l10K68k02J4O8j8P8l3j93J57k2O6N4k43J59K1k48L27m27M18p9J96j10
6930A28m8K9k06J53j20M1P5k76M20j61j46k5j3J86j94K52k40M07m31M05l28J16
6952B4m4p6rM2Q8k30Q0N4J14j45L65m67R0m7K72l42J70j63R0K84J4j93j90N00
$$ plain form
6976 281 -302 119 -75 -154 -7 -72 77 70 -244 -3 42 100 86 38 195 88 166 -220 -105 -16 -287 -102 308
6999 308 190 -51 -60 -109 -45 -297 79 -67 -77 -236 64 -140 89 -137 43 -12 -171 -118 317 65 -26 195 -8
7022 -8 82 -103 -164 -27 136 -238 -68 9 -204 279 175 -55 -130 417 -36 47 104 181 -154 147 40 171 76
7045 76 199 -76 -265 202 -232 76 114 177 -89 161 -88 -162 22 72 53 226 -65 2 296 -109 95 165 -30
7068 -30 -209 143 -99 -11 62 -128 -5 62 -34 35 -104 -57 131 -137 59 138 -210 -47 80 322 96 47 -201
7091 -201 48 60 329 252 163 180 -143 -120 40 -175 47 234 51 -20 182 53 300 1 -124 68 85 214
7113 214 -61 -23 3 58 21 -257 -198 -66 87 115 -210 -180 -111 -34 -255 -139 75 51 -86 43 1 -44 206 47
7137 47 -196 -111 -190 22 -160 -1 -325 58 107 146 186 -187 259 -33 -15 151 -49 12 88 267 17 296 10
$$ packed form
6976B81n83M21j94p9J47o5J49pl14K41M5N8j4m8J57j07P8l86J15Q9k71J85M10
6999C08j18k41rm9O4k52L76j46j0j59L00k04K29k26J80n5j59N3M35k52r1K21k03
7022hR0j85o1J37J63l74J70P7k13M83j04k30p5N47m53Q3N7P7l35L01j07J31r5
7045G6J23k75j89M67m34L08L8O3k66K50k49p4J84N0j9J73k91O7K94m05K04P0j95
7068c0j79L52k42Q8P3j90J23O7r6O9j39M7J88k68J96P9l48J63J27K42k26m9k48
7091b01K49J2K69p7q9J7l23K3J60k15K22J87j83p1K02j29K47k99j25J92J7J29
7113B14k75L8K6N5l7k78N9J32J53K8l25L0O9P7k21J16K14k4j37J29m2m5K50j59
7137D7k43Q5p9K12j82J59l24L83M9L9M0l73M46k92J8J66k00O1P6J79k50K79k86
$$ plain form
7160 10 -142 -188 166 2 -132 -24 -97 260 -96 275 -53 80 -223 -43 95 16 -6 -144 -83 27 31 2 -74
7183 -74 -275 185 60 -154 47 -110 -260 175 294 -29 -103 69 -236 -96 128 15 323 82 146 134 112 194
7205 194 100 -8 83 -105 197 -179 12 141 -36 80 98 104 34 109 42 64 -85 104 -126 75 -155 144 295
7228 295 411 -82 -27 171 -321 -18 -149 -206 143 68 174 -8 -180 -218 -76 -37 -46 152 -344 -95 -136 96 271
7251 271 4 -272 80 103 -224 147 -22 -39 11 134 315 275 2 282 149 11 -298 13 -130 30 29 181
7273 181 -230 75 280 134 -100 141 69 123 -206 -75 112 -97 -19 -140 -255 167 63 -85 -178 -195 235 136
7295 136 146 25 -96 -20 -94 -102 108 -172 -16 -86 -315 65 152 -115 251 72 32 25 77 114 240 180 17 -314
7319 -314 -49 116 65 102 -66 -230 -82 -134 -351 -129 -100 -95 235 -7 16 99 -116 -30 -8 93 -326 -145 35
$$ packed form
7160A0j52m6L54j64j34J08p3L57l56L71l28J33l03J80J38p9k2j38O1J10Mk9p6
7183g4k01M60j25k14K01j57j50M35J19l23p4J72l05J40K24j13L08k41O4j2k2Q2
7205A94r4j08R1j88L02l76J91J29j77J16J8Op0P5o7K2j49J89k30K01k30K99J51
7228B95J16m93N5J98m92L03j31n7L49p5J06j82j72l8J42L9rJ98m96K49m1K32J75
7251B71k67k76L52K3l27L71j69j7N0J23J81m0k73K80j33j38l09L11j43J60jJ52
7273A81m11L05K05j46k34K41p2N4l29J31J87k09P8j21j15M22j04j48r3j7M30r9
7295A36J0j21j21P6p4qK10k80J56p0k29L80Q7k67L66j79m0pN2L7J26o0j63l31
7319c14K65J65n1L7j68j64J48n2k17K22K9NL30k42K3Q3k15Q6K2J01m19J81J80
$$ plain form
7342 35 87 -14 168 15 110 -47 -176 179 -80 -245 -77 -1 -140 -215 366 115 192 -58 110 -179 -200 -11
7364 -11 56 169 2 -197 89 169 -61 -318 -208 -31 152 -46 175 -53 61 197 -105 47 88 136 -196 -236
7386 -236 101 -66 54 29 -51 67 -82 37 126 103 -99 92 53 95 -104 -140 -118 153 61 8 41 140 -96 36
7410 36 -37 128 6 50 45 154 29 -94 100 -253 -86 -60 86 15 135 -86 -7 -58 19 -8 3 62 -86 -30 117
7435 117 196 -183 230 -16 207 149 -87 200 57 97 104 77 -30 33 -140 217 199 -277 74 72 124 250 341 -226
7459 -226 -125 81 44 -74 173 -107 -93 172 -232 174 3 -91 -74 -179 106 -64 -29 192 74 -96 193 -22
7481 -22 105 248 11 -34 137 16 40 306 372 -40 -345 -222 -3 60 171 54 -89 64 -65 -30 -43 -71 62
7504 62 69 21 62 142 -120 219 -28 49 -45 96 14 -161 -49 -81 -8 86 130 195 94 74 343 -28 -17 -68 -94 -334
$$ packed form
7342C5N2j01J82j53R5j57j29L55k59j65J68P6j39p5N81k51P7k50J68k89k1J89
7364a1O7J13j67j99K86Q0k30k57J10J77J83j98K21k28J14J36l02J52M1M8l32m0
7386b36L37j67J20k5q0J18j49J19Q9k3k02J91l9M2j99l6K2K71r2n3L3R9k36J32
7410C6p3J65j22M4nJ09j25j23J94l53J67K6J46p1J20k21P9n1P7k7J1N9j48N6J47
7435A17P9l79M13k46K23n8k36K87j43M0Pk7j07O3j73L57j8m76L51kN2J26R1n67
7459b26J01K06l7j18K47k80J4K65m04M06j71r4J7j05K85j70L5K21j18j70K89k15
7481b2J27J43k37m5J71j21K4K66O6m12l05J23K19O3J11j17j43J53j29L5j3k8J33
7504F2Pm8M1Q0k62L39k47P7r4J41q2j75J12l2P3R4M4O5j01k0K69l71J1n1k6k40
$$ plain form
7530 -334 -11 157 -126 110 -109 -119 88 74 -213 191 -148 -218 142 78 128 -20 -101 -113 -161 -83 166 231 35
7553 35 175 358 -173 -299 19 -32 -188 -223 49 -7 80 -27 -226 212 6 -239 -348 45 309 278 -12 55
7575 55 -14 248 -151 225 161 61 51 -2 101 -288 -343 -122 -84 8 -75 197 183 0 251 195 33 -199 273 -50
7599 -50 -180 23 -130 -10 102 71 145 -60 94 -79 -276 -116 175 -143 25 176 -74 -216 34 -339 -80
7620 -80 147 -1 70 -109 -257 -59 -59 10 275 79 -8 229 1 -181 -153 -180 246 -367 -84 231 3 132 49
7643 49 -78 -155 263 -163 2 119 -6 105 38 -171 -123 71 20 151 187 -117 136 115 -6 107 -1 -52 38
7666 38 -69 51 -99 18 -91 -124 -69 20 12 214 104 234 35 -248 2 148 -146 10 301 112 243 173
7688 173 31 62 -38 -110 33 -124 190 202 13 -45 119 385 -75 -144 -46 128 130 -61 -201 8 -225 118 -144
$$ packed form
7530c34L23J68k83K36k19j0K07j4k87M04l39p0L60o4N0j48q1j2m8P8K49O5j96
7553C5J40J83n31j26L18n1j56l5K72n6Q7j07j99M38k06k45j09L93K64l1k90O7
7575E5o9K62l99L76o4j00j0n3J03l89n5K21L8R2q3K72j4j83K51n6j62k32M72l23
7599e0j30K03j53J20J12l1P4k05J54j73j97J60K91l18J68J51k50j42K50l73K59
7620h0K27j48P1j79j48J98%O9K65j96q7K37k28j82K8k7M26o13K83L15k28J29q3
7643D9j27p7M18m26J65J17j25J11o7k09M8J94n1J31L6l04K53k1j21J13j08n1R0
7666C8j07J20j50J17j09l3N5Q9qK02j10J30j99k83K50J46k94J56K91j89J31p0
7688A73j42L1j00p2J43j57L14J2j89n8J64K66m60o9R8J74Kj91j40K09k33L43k62
$$ plain form
7711 -144 -72 -51 -124 13 -222 -107 -120 -16 -147 -357 101 30 63 52 221 50 -119 -182 -174 155 263 -53 60
7734 60 -204 286 115 74 91 1 46 170 -19 -38 -26 -244 159 129 -132 215 -182 -228 132 270 236 -228 -67
7757 -67 163 163 -35 -18 228 269 -102 114 -60 49 -55 88 150 -163 8 -273 95 -163 103 -119 4 -53
7779 -53 -59 -63 -188 -79 -153 -180 -72 20 27 155 119 -191 -146 -95 119 60 20 144 191 130 -90 -55 81 -67 -180 -33
7805 -33 31 -121 144 78 -100 223 -7 -113 -239 155 41 -96 161 271 -155 -290 284 14 65 -189 -6
7826 -6 -137 17 122 -27 -190 -71 -7 359 -18 -165 65 16 87 -100 -69 -125 -57 43 -229 -13 151 -106 -21
7849 -21 43 55 -13 233 93 -96 80 10 135 132 -312 514 -77 77 77 64 24 63 -116 178 95 430 -13 30 -132
7874 -132 -89 100 92 -22 183 218 -44 94 95 194 12 -27 39 -72 -55 -48 -63 -256 403 -148 98 106 130 12 145
$$ packed form
7711a44P2K1p3J37k35J15j3J04j31k10M58p1L3j1J69j71j69o3QL29J08l16J13
7734F0k64M90j71m1J7r0M5J24j89j9J2k18M03l0k61L47l97m6L60J38l4m64J61
7757f7K30%j98J7K46M1l71K16j74J09j04J43O2l13J71k81L68k58K66k22J23n7
7779e3omj25J09p4k7J08R2PJ28l6l10M5N1K14n9m0J24M7o1k20L5J36j48j13J47
7805c3O4j52K65o6j78L23k30j06j26L94j14j37K57J10m26j35N74k70N1k54J83
7826fj31J54J05j49j63J19O4L66l77j47K30m9P1j87L1n6O8J00k72K16J64k57Q5
7849b1O4J2o8K46j40j89J76p0J25lm44Q26n91J54%j3m0L9j79K94q3L35m43M3j62
7874a32M3J89qj14K05L5k62J38JR9j82l9O6j11J7Pj5j93O59n51K46QK4j18J33
$$ plain form
7899 145 -149 105 205 -121 -94 -189 -126 -126 -23 -138 -9 -12 -72 166 87 89 304 -262 -121 -290 -302 180 98 -30
7923 -30 -141 -19 223 113 -31 76 44 56 -47 63 78 39 64 44 -304 -17 -186 59 -64 137 67 104 128
7946 128 25 -68 120 396 -340 17 30 101 86 149 70 -228 -131 -1 -79 -59 136 -96 -41 99 -44 -25 85 157
7970 157 99 108 -83 -51 -48 125 34 -84 4 152 60 -247 -127 -49 140 126 75 -44 91 119 -44 15 66 97 -190
7995 -190 185 7 50 -107 30 -147 -40 87 -241 -172 -30 207 82 -51 -186 -56 112 -290 -51 -141 40
8016 40 -289 -55 -4 -208 -4 -82 -164 -213 -33 -73 184 -25 -21 -40 14 274 -49 82 13 115 -87 -74 -140 -184 186
8041 186 -146 -408 -174 -144 -281 25 89 101 -93 -128 -110 176 21 4 -105 165 -123 307 -12 -121 48 235
8063 235 -237 -108 18 -160 136 43 223 39 119 62 -316 -54 108 2 85 -27 -30 -96 -93 -13 -65 -109 -28 79
$$ packed form
7899A45k94K54J00l26K7r5O3%J03j15J29lo0K38p9KK15n66J41j69j2M82q2j28
7923c0j11J22K42j10j44J07l2J2j03J10J5l9K5k0l48K87j69K45j23K01p0L7K4
7946A28j03r3J88K76p36L57J3P1j5O3p9k98R7J30p8K0J95k32N5J40j43J9J10P2
7970A57n8Rj91L2LJ73r1j18Q8J48r2l07J20P8J89j4n1j19J35K8j63N9N1L1k87
7995a90L75j78M3j57J37j77J07J27l28O9J42K37j25j33j35J30J68m02K39r0J81
8016D0l29K34N1k04K04p8q2m9J80m0K57k09Mj9N4K60l23J31o9J02k02J3o6m4L70
8041A86l32k62K34L0j37L06O4J2j94l5J8K86j55j7j09K70k88M30l19j09J69J87
8063B35m72J29J26j78K96r3J80j84Q0n7l78K62J62j06Q3j12lo6LQ0n2m4Q1J07
$$ plain form
8087 79 -98 -282 -28 53 157 -152 -104 195 104 -28 132 -89 -78 -23 -46 -93 328 4 75 192 -148 -211 -113 -40
8111 -40 -98 -263 65 77 117 21 -205 43 -138 24 -121 -95 99 -34 -92 -206 237 20 -125 85 100 -177 158
8134 158 -136 44 -101 127 191 -171 -59 93 124 -210 57 65 142 -251 -6 67 -59 217 -188 -60 54 67
8156 67 113 -54 -42 213 246 -150 83 9 -182 -116 -182 169 31 14 -92 58 28 -36 17 -143 -67 -38 -151 41
8180 41 44 -45 199 -303 -137 287 -88 23 160 2 -132
$$ packed form
8087G9j77j84K54Q1J04l09M8K99r1j32J60k21J1N5k3m7M21l24P1J17l40o3R8P3
8111d0n8j65L28J2M0r6k26K48j81J62j45K6J94j33n8j14M43k17j45K10J5k77L35
8134A58k94J80j45K28O4l62J12J52L1l34K67QP7l93K45P3j26K76m05J28J14J3
8156F7M6j67J2K55L3l96K33p4j91O6o6L51j38j7j06J50l0o4N3j60P6K9j13J92
8180D1Lq9K44n02J66M24l75J11J37j58j34
8191a32
$$ Imaginary data points
##PAGE= N=2
##DATA TABLE= (X++(I..I)), XYDATA
$$ plain form
0 0 0 0 0 0 0 0 0 0 0 0 -8 8 -8 8 -9 16 -16 17 -24 25 -32 34 -41 48 -56 63 -72 81 -94 103 -119 134 -148
33 -148 166 -185 206 -229 253 -281 312 -343 382 -422 468 -519 576 -640 715 -798 898 -1017 1156
52 1156 -1332 1554 -1850 2260 -2872 3883 -5855 11176 -55352 -169809 -87109 -16081 -1992 -13901
66 -13901 -3883 -11972 -43394 -99160 -118654 -69066 157 9721 -16280 -46376 -66994 -65779 -44815
79 -44815 -38849 -25665 10542 15510 -32683 -65353 -47301 -5269 26739 19893 -16132 -21362 -2069
92 -2069 -20210 -49369 -15428 47430 61808 19770 -34958 -55308 -26349 -1406 -7329 7568 43954
105 43954 29759 -30094 -63079 -51310 -20127 11722 18083 4775 -242 -16505 -56177 -66107 -26154
118 -26154 12227 27918 20509 -21693 -60965 -44630 -9083 -4532 -1730 24336 35487 4993 -45401
$$ packed form
0@%%%%%%%%%%qJ6j6J6j7K5l2L3m1M9n7O6p5Q9j04J19j35J53j75J97k22K53k82
33a48L14l51L91m35M82n34N93o55P25q04Q90r87J095j216J355j513J696j915K173
52A156k488K886l404M110n132O755r738J7031o6528j14457Q2700P1028J4089j1909
66a3901J0018q089l1422n5766j9494M9588O9223R564k6001l0096k0618J215K0964
79d4815N966J3184L6207M968m8193l2670J8052M2032L2008o846l6025n230J9293
92b069j8141k9159L3941O2858J4378m2038n4728k0350K8959K4943n923J4897L6386
105D3954j4195n9853l2985J1769L1183L1849O361j3308n017j6263l9672r930L9953
118b6154L8381J5691p409m2202l9272J6335L5547M551K802K6066J1151l0494n0394
$$ plain form
131 -45401 -62464 -12966 47799 45898 15694 16699 14626 -19153 -35297 -6590 37790 66718 53787
144 53787 5909 -18021 -3608 3147 2269 25727 50764 47114 23049 -11979 -35154 -9755 37454
157 37454 48038 28072 9529 -5692 -12936 -10189 -12273 2860 44205 52032 -401 -40760 -28473
170 -28473 -3991 6579 14058 21847 28033 12769 -34389 -57437 -13350 36095 36119 17753 6762
183 6762 -7911 -21105 -24327 -17908 8944 43537 41596 4670 -27823 -39339 -23447 15507 34007
196 34007 18354 11603 13324 -15750 -47692 -32787 8833 34340 29639 1277 -19822 -15803 -18108
209 -18108 -32971 -14799 28300 35833 2605 -29429 -38754 -22086 3405 6438 -513 10073 11247
222 11247 -15951 -33820 -24413 -5610 17512 29734 8311 -21239 -23848 -14701 -9136 4445 19547
$$ packed form
131d5401j7063M9498O0765j901l0204J005k073l3779j6144K8707M4380K8928j2931
144E3787m7878k3930J4413O755q78K3458K5037l650k4065l5028k3175K5399M7209
157C7454J0584j9966j8543j5221p244K747k084J5133M1345P827n2433m0359J2287
170b8473K4482J0570P479P789O186j5264m7158k3048M4087M9445K4j8366j0991
183F762j4673j3194l222O419K6852L4593j941l6926l2493j1516J5892L8954J8500
196C4007j5653o751J721k9074l1942J4905M1620K5507m701k8362k1099M019k305
209a8108j4863J8172M3099P533l3228l2034r325J6668K5491L033o951J0586J174
222A1247k7198j7869R407J8803K3122J2222k1423k9550k609R147N565J3581J5102
$$ plain form
235 19547 24568 17126 -12197 -43005 -27113 15658 24670 11613 15958 17893 -6611 -33935 -35782
248 -35782 -3578 39386 44469 7663 -16954 -14505 -15510 -14831 4338 22535 28232 23723 -1836
261 -1836 -32302 -29175 772 21059 28168 23225 6207 -5626 -10611 -20419 -11425 26399 44742
274 44742 19805 -8800 -14279 -7429 2133 5427 7516 25433 36023 4664 -31476 -22865 8234
287 8234 21623 20892 12737 247 -5013 -10779 -17880 -3792 22060 25656 10511 -4930 -21491 -27571
301 -27571 -8534 9627 12299 17793 19664 -4640 -32544 -34464 -12112 17732 28612 9994 -6047
314 -6047 -1044 -8227 -31361 -25105 11029 31463 22575 -1083 -21033 -18805 -4542 -3276 -1864 15515
328 15515 20692 -236 -18962 -20381 -10235 8786 18100 5399 -5813 -3322 -9062 -19360 -13776
$$ packed form
235A9547N021p442k9323l0808J5892M2771R012j3057M345J935k4504k7324j847
248c5782L2204M2964N083l6806k4617K449j005O79J9169J8197N697m509k5559
261a836l0466L127K9947K0287P109m943j7018j1833m985r808Q994L7824J8343
274D4742k4937k8605n479O850R562L294K089J7917J0590l1359l6140Q611L1099
287H234J3389p31q155j2490n260n766p101J4088K5852L596j5145j5441j6561o080
301b7571J9037J8161K672N494J871k4304k7904j920K2352K9844J0880j8618j6041
314f047N003p183k3134O256L6134K0434q888k3658j9950K228J4263J266J412J7379
328A5515N177k0928j8726j419J0146J9021R314j2701j1212K491n740j0298N584
$$ plain form
341 -13776 2429 18754 23687 290 -33989 -32282 -3983 6764 1018 4688 11384 7116 -13180
354 -13180 -35611 -29044 7934 26342 9483 -3019 -2615 -11372 -21345 -14468 2111 18935 24043
367 24043 4908 -18101 -18474 -6749 1576 11086 15647 9530 4944 -2370 -20483 -21166 9619 33661
381 33661 25803 5297 -9420 -13674 -6675 -2960 -326 19211 34602 14877 -14065 -17844 -7036
394 -7036 1950 10496 14702 16487 16804 789 -22087 -17760 8535 19453 14398 8581 208 -5234
408 -5234 -1677 -2461 -3940 8199 19179 10671 -5068 -15075 -14389 3454 19740 10933 -822 2704
422 2704 -613 -17276 -18397 1611 18758 19625 3927 -13159 -12791 -6098 -11788 -8508 14577 25328
436 25328 9832 -11111 -23439 -21783 -4466 11182 10617 7728 6765 -4328 -16811 -17819 -11661 2390
$$ packed form
341a3776J6205J6325M933k3397l4279J707K8299J0747n746L670O696m268k0296
354a3180k2431O567L6978J8408j6859j2502M04q757r973O877J6579J6824N108
367B4043j9135k3009l73J1725Q325R510M561o117m586p314j8113o83L0785K4042
381C3661p858k0506j4717m254O999L715K634J9537J5391j9725k8942l779J0808
394g036Q986Q546M206J785L17j6015k2876M327K6295J0918n055n817q373n442
408e234L557p84j479J2139J0980q508j5739j0007O86J7843J6286q807j1755L526
422B704l317j6663j121K0008J7147Q67j5698j7086L68O693n690L280K3085J0751
436B5328j5496k0943j2328J656J7317J5648n65k889r63j1093j2483j008O158J4051
$$ plain form
450 2390 19392 16397 -4637 -14275 -11315 -11539 -8799 2469 9476 9498 -467 -18981 -22489 -3502 6553
465 6553 -2194 -3660 2564 -2037 -13957 -20367 -14580 3975 15690 2410 -14781 -15483 -13051 -12240
479 -12240 -2339 7246 5873 2595 -2864 -17111 -22468 -9342 5539 12854 12413 3052 -6484 -7948
493 -7948 -11704 -12056 6649 25933 17732 -1904 -8423 -5981 -1179 3542 6264 12147 20779 12212 -8550
508 -8550 -12789 22 8966 14012 15313 7428 -703 -2111 -5631 -3709 8934 16893 12066 5157 -3121
523 -3121 -10877 -6606 4197 5852 7280 14024 10218 -5422 -14480 -9924 4125 17410 14037 389
537 389 164 5359 -3208 -9347 2441 16260 17088 10947 13 -5535 181 6882 8920 15012 17093
552 17093 7222 -1321 -1130 -353 6256 19626 20246 8266 1454 -459 -3130 -1338 4639 11510 18582
$$ packed form
450B390J7002k995k1034r638K960k24K740J1268P007K2r965j8514l508J8987J0055
465F553q747j466O224m601j1920o410N787J8555J1715j3280j7191p02K432Q11
479a2240R901R585j373l278n459j4247n357J3126J4881P315m41r361r536j464
493g948l756l52J8705J9284q201j9636o519K442M802M721K722N883Q632q567k0762
508h550m239J2811Q944N046J301p885q131j408l520J922J2643P959m827o909q278
523c121p756M271J0803J655J428O744l806j5640r058M556J4049J3285l373j3648
537C89k25N195q567o139J1788J3819Q28o141j0934n548N716O701K038O092K081
552A7093r871q543J91P77O609J3370O20j1980o812j913k671J792N977O871P072
$$ plain form
567 18582 14927 -5499 -18310 -8612 2546 4548 6624 7000 1725 -4915 -12730 -17352 -7237 6501
581 6501 4983 -849 -2149 -8518 -17006 -13439 -4345 2019 6210 3003 -8642 -13484 -9415 -6242 -203
596 -203 6152 3559 -602 514 -4843 -13546 -6107 9297 13243 6712 -1110 -6651 -4667 -718 -1966
611 -1966 2379 13098 9267 -5612 -9534 -4527 -2000 1574 4940 3659 1499 -2757 -12747 -16320 -5176
626 -5176 4824 5751 2652 -6742 -16229 -13509 -6776 -7079 -4372 3288 3282 -4370 -12860 -18862 -14650 501
642 501 6150 179 -1189 -591 -8655 -14575 -8446 -64 5917 5779 -2268 -5628 -2017 -3525 -7764 -636
658 -636 8621 6248 -276 -4198 -8674 -6149 3589 6828 3106 755 -3403 -7100 -4702 -3609 -2572
673 -2572 5335 9636 -1189 -11334 -9156 -6482 -4508 933 5249 4467 -366 -9965 -16194 -7168 3684
$$ packed form
567A8582l655k0426j2811R698J1158K002K076L76n275o640p815m622J0115J3738
581F501j518n832j300o369q488L567R094O364M191l207j1645m842M069L173O039
596b03O355k593m161J116n357q703P439J5404L946o531p822n541J984L949j248
611a966M345J0719l831j4879l922N007K527L574L366j281k160m256r990l573J1144
626e176J0000R27l099r394r487K720O733l03K707P660op652q490o002M212J5151
642E01N649n971j368N98q064n920O129Q382N981j38q047l360L611j508m239P128
658f36R257k373o524l922m476K525R738L239l722k351m158l697K398J093J037
673b572P907M301j0825j0145K178K674J974N441M316p82m833r599o229R026J0852
$$ plain form
688 3684 2819 143 2345 -717 -6646 -8507 -7896 -2756 6711 8432 553 -5085 -6777 -6839 -1776 5217
704 5217 4704 2675 3460 -682 -6640 -3868 1814 4704 7046 4820 -556 -1052 -181 -4369 -1449 10380
720 10380 11292 1438 -3587 -2988 -1134 2179 3621 3883 6970 6667 -1717 -6181 -1487 1376 3824 9305
736 9305 7148 -908 -3374 -2614 -2822 2032 7738 6731 4415 1264 -4336 -4600 2522 4532 2922 6509
752 6509 7708 597 -4933 -3590 698 8522 10493 3222 -1161 1299 259 -2474 2860 8070 6359
767 6359 4814 2033 -2593 -2729 1043 3348 6665 9895 4012 -2397 -1958 -1397 -905 4816 9384 4814
783 4814 107 -31 -1340 -1720 -110 1819 5395 8742 2215 -5944 -3566 1562 1222 2380 4697 1731
799 1731 -1879 -2181 -2403 -761 3739 3080 -88 389 -1045 -6020 -4519 952 2383 3682 3571 -2571
$$ packed form
688C684q65k676K202l062n929j861O11N140R467J721p879n638j692o2N063O993
704E217n13k029P85m142n958K772N682K890K342k226n376m96Q71m188K920J1829
720A0380R12r854n025N99J854L313J442K62L087l03q384m464M694K863K448N481
736I305k157q056k466P60k08M854N706j007k316l151n600k64P122K010j610L587
752F509J199p111n530J343M288P824J971p271m383K460j040k733N334N210j711
767F359j545k781m626j36L772K305L317L230n883o409M39N61M92N721M568m570
783D814m707j38j309l80J610J929L576L347o527q159K378N128l40J158K317k966
799A731l610l02k22J642M500o59l168M77j434m975J501N471J431J299j11o142
$$ plain form
815 -2571 -7508 -5054 -1715 1015 4898 3134 -2029 -1918 -1323 -6410 -6407 1043 4952 3691 1496 -3013
831 -3013 -5095 -2670 -1297 -1154 3352 4109 -2109 -3847 -541 -1294 -1970 805 1362 509 112 -2501 -5123
848 -5123 -1659 1034 511 1708 708 -5687 -6956 -537 499 -1115 361 710 -1532 -3211 -5142 -6281
864 -6281 -1194 2866 338 -717 -331 -4246 -6703 -2005 1503 1429 1787 -326 -3307 -1935 -574 -2326
880 -2326 -572 3854 2404 -400 276 -1826 -2823 1270 4689 3505 1804 -228 -2526 -235 2281 484
896 484 1845 5313 3179 -1946 -957 259 -1048 1021 3451 2982 2188 -479 -4316 -2004 2911 1722
912 1722 -386 1828 1333 -2260 -1421 -232 -1387 10 2589 880 -416 -1284 -3137 -1008 3344 2712
928 2712 -888 -395 306 -2564 -1176 1150 1147 1675 1987 -576 -1179 449 -1121 -1323 3290 4848 429
$$ packed form
815b571m937K454L339K730L883j764n163J11N95n087LP450L909j261k195m509
831c013k082K425J373J43M506P57o218j738L306p53o76K775N57q53l97k613k622
848e123L464K693n23J197j000o395j269O419J036j614J476L49k242j679j931j139
864f281N087M060k528j055L86l915k457M698L508p4L58k113k981J372J361j752
880b326J754M426j450k804O76k102r97M093L419j184j701k032k298K291K516j797
896D84J361L468k134n125R89J216j307K069K430m69p94k667l837K312M915j189
912A722k108K214m95l593Q39J189j155J397K579j709j296q68j853K129M352o32
928B712l600M93P01k870J388K326lN28L12k563o03J628j570k02M613J558m419
$$ plain form
945 429 -1725 -1480 -1564 -181 2113 912 732 1717 -695 -2081 12 -65 -1800 997 2854 -1232 -3016
962 -3016 -1772 -1871 -838 916 75 -1433 -1081 -2947 -3760 -424 123 -2780 -1806 680 -1349 -3585 -2968
979 -2968 -2370 -618 1614 -377 -2819 -2033 -1970 -3093 -490 1146 -1495 -1740 225 -567 -1792 -668 -544
996 -544 -624 1963 1176 -1594 -884 359 -1061 508 2811 828 -1537 64 596 299 1013 -57 -535
1013 -535 1857 1788 -2080 -1876 977 588 277 2193 1057 -1800 -823 45 -122 704 178 -1546 366 1582
1031 1582 -1160 -1960 480 -115 -838 1449 914 -1300 -798 317 380 1430 1347 -1156 -146 2572 1368
1048 1368 -229 1499 1779 736 1940 1800 196 952 2429 1441 2344 3394 410 -217 2470 2962 987
1065 987 1661 2299 1127 1761 2352 549 786 1912 667 1428 3251 889 -1025 1601 2754 579 261
$$ packed form
945D29k154K45q4J383K294j201j80R85k412j386K093p7j735K797J857m086j784
962c016J244r9J033J754q41j508L52j866q13L336N47k903R74K486k029k236O17
979b968N98J752K232j991k442P86O3j123K603J636k641k45J965p92j225J124J24
996e44q0K587p87k770P10J243j420J569K303j983k365J601N32k97P14j070m78
1013e35K392o9l868K04K853l89l11J916j136k857R77Q68j67Q26n26j724J912J216
1031A582k742q00K440n95p23K287n35k214N02J115O3J050q3k503J010K718j204
1048A368j597J728K80j043J204j40j604P56J477r88R03J050k984o27K687M92j975
1065I87O74O38j172O34N91j803K37J126j245P61J823k362j914K626J153k175l18
$$ plain form
1082 261 808 423 1010 1383 296 169 1628 486 -364 2045 1020 -1423 154 1928 892 337 846
1099 846 -120 572 2229 648 39 1159 675 -259 1934 2161 -461 -137 1746 883 509 1024 184 717
1117 717 2385 1155 -643 456 644 -699 932 2152 210 -765 171 185 -12 832 -747 -979 820
1134 820 486 -1771 -895 33 -1556 -886 544 -1019 -2679 -1125 -908 -830 -120 -1505 -2971 -979 -770
1151 -770 -2779 -1992 -395 -1335 -1872 -511 -1420 -2817 -2060 -1493 -1206 307 -480 -2562 -1440 -95 -1532
1168 -1532 -1369 -292 -784 -1538 33 -558 -2077 -987 -455 -767 501 194 -2071 -2386 105 -213 -964
1185 -964 173 -452 -1611 -1093 -1264 -1763 -714 -212 -1388 -454 204 -2280 -3350 -891 -74 -518 -298 -880
1203 -880 -2068 -1409 -876 -1792 -851 262 -806 -732 391 -1537 -2813 -478 866 249 378 145 -977
$$ packed form
1082B61N47l85N87L73j087j27J459j142q50K409j025k443J577J774j036n55N09
1099H46r66O92J657j581o09J120m84r34K193K27k622L24J883q63l74N15q40N33
1117G17J668j230j798J099J88j343J631J220j942r75R36J4j97Q44j579k32J799
1134H20l34k257Q76R28j589O70J430j563j660J554K17P8P10j385j466J992K09
1151g70k009P87J597r40n37J361r09j397P57N67K87J513p87k082J122J345j437
1168a532J63J077m92p54J571n91j519J090N32l12J268l07k265l15K491l18p51
1185i64J137o25j159N18j71m99J049N02j176R34O58k484j070K459Q17m44K20n82
1203h80j188O59N33r16R41J113j068P4J123j928j276K335J344o17J29k33j122
$$ plain form
1220 -977 -587 403 105 769 1457 -2 -645 1215 596 -736 401 2006 1199 1351 246 -872 131
1237 131 1711 1461 944 1808 712 -600 149 1109 119 1037 1555 754 190 -136 -1530 -937 1584 1437
1255 1437 297 646 -495 -2066 -672 1016 550 411 565 21 105 -274 -1558 -794 2061 1992 132 253
1273 253 365 -592 -60 1677 1419 1339 1356 252 -98 1302 988 611 1939 2589 1065 744 752 -234 287 2585
1293 2585 2229 1262 399 -231 -600 963 807 326 1446 2050 -201 -941 -284 -425 34 1603 952 -292
1311 -292 -126 -1336 -1823 46 1649 601 -40 122 -992 -1235 -374 335 188 1519 1377 -663 -994 -864
1329 -864 -946 1336 2527 837 -352 462 -490 -1025 310 1064 973 1436 812 -802 -366 -2 -229 303 2245
1348 2245 1019 -891 -786 -1023 -643 1017 1414 -78 129 120 -1475 -1675 -143 -449 348 1351 109 -1826
$$ packed form
1220i77L90R90k98O64O88j459o43J860o19j332J137J605q07J52j105j118J003
1237A31J580k50n17Q64j096j312P49R60r90R18N18q01n64l26j394N93K521j47
1255A437j140L49j141j571J394J688m66j39J54n44Q4l79j284P64K855o9j860J21
1273B53J12r57N32J737k58q0J7j104l50J400l14l77J328O50j524l21Qr86N21K298
1293B585l56r67q63o30l69J563j56m81J120O04k251p40O57j41M59J569o51j244
1311b92J66j210m87J869J603j048o41J62j114k43Q61P09j47J331j42k040l31J30
1329h64q2K282J191j690j189Q14r52n35J335P54r1M63o24j614M36L64k27N32J942
1348B245j226j910J05k37L80J660L97j492K07rj595k00J532l06P97J003j242j935
$$ plain form
1366 -1826 -1902 -843 -956 722 1075 -517 -610 -1015 -2075 -1436 595 282 -560 -111 -31 -1368 -1599 -856 204
1385 204 1312 1407 -1315 -1914 -611 -525 79 1337 1412 2 -41 -401 -1724 -1087 513 1202 1671 1623 -407
1404 -407 -1603 -912 -542 -324 1582 2162 -169 -1048 -567 -975 -654 347 200 573 1305 -647 -2522 -1359
1422 -1359 299 111 694 273 -1350 -1639 -608 -750 -93 951 250 -693 -963 -1470 -1876 -323 1114 934
1440 934 990 -2 -1330 -2300 -686 590 1306 2205 332 -777 -430 -96 -819 -95 1749 2113 1127 374
1458 374 -1178 -1315 734 1041 741 1296 765 -1232 -943 -190 80 581 1590 406 -503 -641 -824 -921 242
1477 242 1330 677 680 -354 -2244 -1577 649 1211 755 827 51 -1017 -857 -1092 -1079 1277 1702 591 -286
1496 -286 -274 -1725 -1281 613 985 1412 1509 -196 -1460 -601 222 -156 1390 1457 150 -108 -153 -927 -897 1641
$$ packed form
1366a826p6J059j13J678L53j592r3m05j060O39K031l13q42M49Q0j337k31P43J060
1385B04J108R5k722n99J303Q6O04J258P5j410m3l60j323O37J600O89M69m8k030
1404d07j196O91L70K18J906N80k331q79M81m08L21J001j47L73P32j952j875J163
1422a359J658j88N83m21j623k89J031j42O57J044p01r43k70n07m06J553J437j80
1440I34N6r92j328r70J614J276P16Q99j873j109L47L34p23P24J844L64r86p53
1458C74j552j37K049L07l00N55n31j997K89P53K70N01J009j184r09j38j83r7J163
1477B42J088o53Lj034j890O67K226N62m56P2p76j068J60k35J3K356M25j111q77
1496b86J2j451M44J894L72M27R7j705j264Q59Q23l78J546O7j307k58m5p74L0K538
$$ plain form
1516 1641 2117 997 -369 -1226 -1212 42 1096 660 751 1251 -259 -1801 -1020 -380 10 1065 1163 -247
1534 -247 -866 -1425 -2432 -1052 1152 1173 294 -197 -1373 -2045 -1275 -373 -24 697 1153 -87 -1284 -1669
1552 -1669 -1255 131 1584 939 -323 -689 -290 -961 -279 994 1076 1133 -90 -1813 -816 640 128 346
1570 346 1404 1370 -543 -1514 -1302 -517 1221 2169 943 -326 -108 -1064 -1083 -443 41 520 2089 1048
1588 1048 -1340 -1445 -322 42 406 1325 776 -60 -465 -1526 -1153 714 1409 241 129 108 -467 -398 1
1607 1 325 1418 2252 639 -1169 -968 -82 473 1806 2046 1119 575 160 -1255 -821 715 1568 1737 1417
1626 1417 -150 -958 -351 -109 411 1692 2186 123 -761 -862 -699 508 1187 743 454 433 -173 -1682
1644 -1682 -854 857 1378 1641 1125 -297 -1210 -652 -285 -172 1101 1516 163 -585 -971 -1349 -124 812
$$ packed form
1516A641M76j120j366q57J4J254J054m36R1N00j510j542P81O40L90J055R8j410
1534b47o19n59j007J380K204K1q79m91j176o72P70R02L49P21M56j240j197l85
1552a669M14J386J453o45j262l66L99o71O82J273Q2N7j223j723R97J456n12K18
1570C46J058l4j913r71K12P85J738R48j226j269K18r56j9O40M84M79J569j041
1588A048k388j05J123L64L64R19n49q36m05j061L73J867O95j168j12k1n75O9L99
1607AL24J093Q34j613j808K01Q86N55J333K40r27n44m15j415M34J536Q53J69l20
1626A417j567q08O07K42N20J281M94k063q84j01J63J207O79m44k89k1o06j509
1644a682Q28J711N21K63n16j422r13N58L67J13J273M15j353p48l86l78J225R36
$$ plain form
1662 812 582 476 898 -568 -1275 -1181 -29 1297 1699 285 -1535 -578 438 -307 -229 856 1086 422
1680 422 -499 -1699 -1345 504 1196 698 697 170 -1080 -1476 -772 -360 946 1480 580 -707 -1017 -649 -893
1699 -893 -640 311 797 914 -48 -1923 -1765 -356 601 383 -162 -184 -840 -732 -983 -690 225 1011 85 -1294
1719 -1294 -1117 -1369 -1033 -134 584 596 803 -584 -2016 -1552 -156 693 818 703 -337 -866 -791 -1071 -1163
1738 -1163 663 1702 951 21 -1107 -1185 -556 371 214 461 910 -111 -1430 -1089 -139 530 881 539
1756 539 -352 -561 -677 -1036 -466 467 983 416 -506 -1724 -1645 -285 704 141 71 212 -297 -1289 -1139 -907
1776 -907 216 1471 706 -400 -487 -612 -836 -128 698 912 900 250 -509 -726 143 475 227 1056 1119 479
1796 479 -405 -612 -360 872 1770 1115 -266 -177 -228 -145 148 543 793 1218 816 -981 -958 15 375 573
$$ packed form
1662H12k30j06M22j466p07R4J152J326M02j414j820R57J016p45P8J085K30o64
1680D22r21j200L54J849O92m98jn27j250l96P04M12J306N34r00j287l10L68k44
1699h93K53R51M86J17r62j875J58J409R57k18n45k2o56J08k51K93R15P86r26j379
1719a294J77k52L36Q99P18J2K07j387j432M64J396Q49J25j15j040n29P5k80r2
1738a163J826J039p51r30j128p8O29R27j57K47M49j021j319L41R50O69L51l42
1756E39q91k09j16l59N70R33N16n67r22j218P9J360R89n63p0J41n09r92J50K32
1776i07J123J255p65j106q7j25k24P08Q26K14j2o50p59k17Q69L32k48Q29O3o40
1796D79q84k07K52J232Q98o55j381Q9n1Q3K93L95K50M25m02j797K3R73L60J98
$$ plain form
1816 573 1020 730 -198 -759 -1204 -744 1063 1418 725 -239 -456 -572 -466 61 380 1166 1375 222 -688
1835 -688 -1013 -229 369 922 1222 493 435 185 -517 -358 688 1074 1045 287 -316 -374 -170 467 226 946 1445
1856 1445 284 -998 -967 -279 790 1148 587 8 -85 -497 -1286 -717 379 1055 697 205 -863 -1507 -555
1875 -555 -471 -391 614 820 183 -477 -1045 -1135 -68 706 628 45 215 -108 -498 -518 32 605 917 207 -1022
1896 -1022 -887 -113 97 202 426 197 119 -271 -778 -995 208 602 645 166 -218 -673 -977 -638 -86 524
1916 524 780 172 -886 -816 -487 -275 182 285 250 527 -180 -1461 -1189 -68 672 369 -81 -272 -792 -1107
1936 -1107 -544 -136 222 533 -64 -699 -707 -779 -355 251 383 396 444 -77 -1106 -921 71 939 975 63 -281
1957 -281 -602 251 -73 -696 633 951 603 -205 -520 -427 125 559 525 299 558 -152 -881 -385 29 331
$$ packed form
1816E73M47k90r28n61m45M60J807L55o93r64k17j16J06N27L19P86K09j153r10
1835f88l25P84N98N53L00p29n8k50p02J59J046L86k9p58o03n8K04O37k41P20M99
1856A445j161j282L1O88J069L58n61n79r3m12p89N69J096O76l58m92j068o44R52
1875e55Q4Q0J005K06o37o60n68r0J067P74p8n83J70l23l90k0N50N73L12p10j229
1896a022J35P74K10J05K24k29p8l90n07k17J203L94M3m79l84m55l04L39N52O10
1916E24K56o08j058P0L29K12M57J03l5K77p07j281K72J121P40l03m50j91n20l15
1936a107N63M08L58L11n97o35qp2M24O06J32J3M8n21j029J85R92Q68L6r12l44
1957b81l21Q53l24o23J329L18l48q08l15R3N52M34l4k26K59p10p29M96M14L02
$$ plain form
1977 331 555 14 -374 -622 -100 -454 -27 599 833 224 -94 -1042 -911 417 445 35 -121 316 -142 -300
1997 -300 -542 -18 480 1037 177 -526 -321 -201 -278 -114 812 1063 652 -102 -676 -660 570 585 632 470 733
2018 733 -79 -332 -626 -339 491 1229 482 -478 -420 -363 -30 2 74 268 450 -24 -896 -1011 75 77 447 380
2040 380 -93 -329 -513 -843 -626 606 903 -79 -569 -736 -407 -294 74 281 410 317 117 -757 -822 -254
2060 -254 408 876 633 -358 -223 32 -286 -662 569 747 641 -64 -590 -462 -134 208 217 445 663 -88
2080 -88 -677 -644 -188 458 779 67 -211 -71 4 -190 -303 418 394 429 -160 -529 -1080 -164 270 93 133 439
2102 439 -362 -420 -653 -228 584 871 149 -321 -391 -182 -451 -180 254 741 676 270 -833 -707 -43 221 437
2123 437 744 496 -345 -153 -785 -325 248 664 338 186 191 -187 -516 -231 423 338 818 312 -704 -351 258
$$ packed form
1977C31K24n41l88k48N22l54M27O26K34o09l18r48J31J328K8m10j56M37m58j58
1997c00k42N24M98N57q60p03K05J20p7J64R26K51m11p54n74J6J230J5M7j62K63
2018G33q12k53k94K87Q30P38p47r60N8N7L33L2P2J94J82m74q72j15J086KL70o7
2040C80m73k36j84l30K17J232K97r82m90j67L29J13L68K07J29r3k00q74o5N68
2060b54O62M68k43r91J35K55l18l76J231J78j06p05n26J28L28L42RK28K18p51
2080h8n89L3M56O46L21p12k78J40P5j94j13P21k4L5n89l69n51R16M34j77M0L06
2102D39q01n8k33M25Q12K87p22m70p0K09k69K71M34M87o5m06j103J26O64K64K16
2123D37L07k48q41J92o32M60N73M16l26j52Nl78l29K85O54q5M80n06j016L53O09
$$ plain form
2144 258 364 262 131 338 168 -186 -573 -743 541 1073 420 -123 -320 -654 -318 -137 -8 391 798 244
2164 244 -765 -694 -402 44 477 626 -12 31 34 -859 -687 297 1032 896 316 -423 -456 -23 138 -30 414
2185 414 96 -13 -247 -694 -449 249 872 395 -65 -100 -554 -1037 -491 132 519 551 -57 -736 -396 -295 -383
2206 -383 -506 261 713 112 -408 -839 -1163 134 519 -30 -453 200 -8 -648 -525 -173 402 361 27 -528
2226 -528 -582 -159 -273 -29 327 353 -78 -667 -637 -720 233 562 384 -271 -44 -499 -395 -502 -344 693 952
2247 952 102 -584 -1047 -631 -259 301 474 188 527 -611 -836 -1017 -207 471 327 128 -106 -358 -480 -814
2267 -814 -449 376 907 198 -723 -460 -334 -59 413 -64 141 88 405 -776 -350 -87 560 827 448 -145
2287 -145 93 113 -108 33 842 1064 345 -461 -603 -79 357 803 273 213 566 -49 -773 -720 90 871 1214
$$ packed form
2144B58J06j02j31K07j70l54l87j70J284N32o53n43j97l34L36J81J29L99M07n54
2164B44j009P1K92M46M33J49o38M3Lq93J72R84P35j36n80p39l3M33J61j68M44
2185D14l18j09k34m47K45O98O23m77m60l5m54m83N46O23L87L2o08o79L40J01q8
2206c83j23P67M52o01n20m31l24J297L85n49m23O53k08o40J23L52N75m1l34n55
2226e28n4M23j14K44L56K6m31n89L0q3R53L29j78o55K27m55J04j07J58J037K59
2247I52q50o86m63M16L72N60J73k86L39j138k25j81Q10O78j44j99k34k52j22l34
2267h14L65Q25N31p09r21K63J26K75M72m77K05n3L17j181M26K63O47K67l79n93
2287a45K38K0k21J41Q09K22p19q06j42N24M36M46n30o0L53o15p24N3Q10P81L43
$$ plain form
2308 1214 365 -327 -483 23 -180 -291 635 679 373 239 -388 -369 196 377 257 390 376 -129 -522 -360 -414
2329 -414 665 1126 404 -449 -99 184 19 161 584 875 702 474 -698 -653 266 608 523 559 182 69
2349 69 -81 -338 90 189 924 736 -135 -85 -271 -119 200 374 814 589 363 -811 -576 139 321 598 443
2370 443 -295 -242 -294 -964 -297 418 815 386 70 -251 -598 -442 80 371 590 873 212 -576 -485 -190 78
2391 78 304 495 -30 -65 -233 -567 -761 548 1219 591 -44 -468 -617 -177 355 50 359 322 -43 -610 -461
2412 -461 -601 3 411 290 -84 -197 -563 -797 -549 192 227 298 -366 -1063 -1030 -142 1 -144 170 -18 -167
2433 -167 -640 -988 -666 -44 786 212 -513 -349 -652 -847 -324 -86 492 407 183 -539 -735 -180 -271 -92 638
2454 638 513 56 -143 -811 -621 9 629 467 305 196 -558 118 21 -301 -159 639 318 -74 -506 -224
$$ packed form
2308A214q49o92j56N06k03j11R26M4l06j34o27J9N65J81j20J33j4n05l93J62n4
2329d14J079M61p22q53L50K83j65J42M23K91j73k28j172M5R19L42q5L6l77j13
2349F9j50k57M28R9P35j88q71N0j86J52L19J74M40k25k26j174K35P15J82K77j55
2370D43p38N3n2o70O67P15L97m29l16l21l47J56N22K91K19K83o61p88R1K95K68
2391G8K26J91n25l5j68l34j94J309O71o28o35m24j49M40N32l05L09l7l65n67J49
2412d61j40O04M08j21l74j13l66k34K48P41L5P1o64o97L3Q88J43j45L14j88j49
2433a67m73l48L22O22Q30n74p25J64l03j95N23K38N78q5k24p22j96N55r1J79P30
2454F38j25m57j99o68J90O30O20j62j62j09p54O76r7l22J42P98l21l92m32K82
$$ plain form
2474 -224 101 271 393 57 24 -251 -377 -280 516 491 66 33 -460 -497 -327 117 89 665 879 124 -478 -648
2496 -648 -407 198 377 692 459 424 -298 -350 -269 -147 404 809 538 -51 -327 -5 -60 -203 578 733 699 -341
2518 -341 -484 -311 380 730 319 247 89 415 -259 -278 -45 604 1001 578 -322 -736 -255 -40 -14 537 475
2539 475 206 -83 -240 -560 -151 702 464 591 166 -413 -680 -458 -426 201 593 482 -279 -474 -277 -154
2559 -154 -217 331 310 138 275 -464 -578 -6 203 616 362 221 -445 -344 -263 -83 409 860 118 -371 -151
2580 -151 -2 183 60 321 397 603 127 -809 -820 -117 173 687 332 -89 -24 -191 -219 -278 231 430 121 -37
2602 -37 -243 -525 -122 53 344 -67 80 -167 -874 -279 -68 140 456 155 -345 -212 111 -324 -194 423
2622 423 480 487 36 -551 -698 -165 606 411 157 396 336 -315 -206 1 226 525 377 84 -85 -113 -262 -8
$$ packed form
2474b24L25J70J22l36l3k75j26R7P96k5m25l3m93l7J70M44k8N76K14p55o02j70
2496f48K41O05J79L15k33l5p22n2Q1J22N51M05k71n89k76L22n5j43P81J55l4j040
2518c41j43J73O91L50m11p2j58L26o74j9K33O49L97m23r00m14M81K15K6N51o2
2539D75k69k89j57l20M09Q53k38J27m25n79k67K22L2O27L92j11p61j95J97J23
2559a54o3N48k1j72J37p39j14N72K09M13k54j41o66J01Q1J80M92M51p42m89K20
2580a51J49J85j23K61P6K06m76r36j1P03K90N14l55m21O5j67k8n9N09J99l09j58
2602c7k06k82M03J75K91m11J47k47p07N95K11K08L16l01n00J33L23m35J30O17
2622D23N7Pm51n87j47N33P71j95k54K39o0o51J09K07K25K99j48k93j69k8j49K54
$$ plain form
2644 -8 387 163 235 675 -342 -729 163 110 -208 30 -16 -83 -13 -168 -658 165 709 211 -384 -168 -426 -492
2666 -492 -94 220 401 309 274 -428 -259 -137 47 213 248 83 -224 -157 -206 -584 283 481 490 154 -64 -147 -177
2689 -177 -90 120 -45 295 469 -353 -409 -371 144 214 535 229 -145 56 -578 -662 367 231 -109 -58 -273 -59
2711 -59 -251 91 -27 -215 122 131 -49 -260 -352 -302 480 314 -248 -82 -216 -345 -267 223 -9 117 116 -20 -408
2734 -408 -144 160 1 195 646 -80 -383 -318 -162 -49 422 231 -155 -3 -421 -482 -215 126 -273 96 393
2755 393 -48 -431 -304 -152 -17 353 -5 -33 -279 -513 -393 -246 -179 -224 165 92 -158 -282 -584 -253 -160 178
2777 178 -43 -414 -319 -140 -160 -151 -54 108 196 -78 1 -465 -226 399 133 234 524 -119 -161 -358 253 39 283
2800 283 123 -164 161 -148 286 309 122 -78 124 188 -120 57 109 380 307 101 -144 -572 -26 180 -97
$$ packed form
2644hL95k24P2M40j017l87Q92n3l18K38m6o7P0j55m90Q23N44m98n95K16k58o6
2666d92L98L14J81r2l5p02J69J22J84J66L5j65l07O7m9l78Q67J98Rl36k18q3l0
2689a77Q7K10j65L40J74q22n6L8N15P0L21l06l74K01o34q4J029j36l40N1k15K14
2711e9j92L42j18j88L37Rj80k11r2N0P82j66n62J66j34j29P8M90k32J26jj36l88
2734d08K64L04j59J94M51p26l03O5J56J13M71j91l86J52m18o1K67L41l99L69K97
2755C93m41l83J27J52J35L70l58k8k46k34J20J47O7m5L89p3k50j24l02L31R3L38
2777A78k21l71R5J79k0RR7J62Q8k74P9m66K39O25k66J01K90o43m2j97O11k14K44
2800B83j60k87L25l09M34K3j87k00K02O4l08J77N2K71p3k06k45m28N46K06k77
$$ plain form
2821 -97 92 208 17 150 164 -320 -217 216 196 -23 174 130 -114 -236 -45 -60 334 588 31 -245 159 210
2843 210 -105 167 219 389 49 44 -130 -24 213 470 195 608 94 -17 225 230 154 272 425 117 243 88
2865 88 -226 -240 483 300 455 274 -166 -19 -447 576 395 7 306 -125 -147 219 -209 93 157 221 -68
2886 -68 -314 -192 -304 -84 11 178 227 342 -373 -353 264 -101 -196 172 263 27 188 -118 -240 -164 528 136
2908 136 -214 -86 -129 -413 328 160 -204 117 -12 -388 -125 72 -177 -10 210 -181 -120 -140 -325 -221 -51
2929 -51 588 -307 -131 -204 -435 -297 -210 -102 -396 -3 53 -313 -294 -67 -408 199 317 -105 -269 -208 -217 -462 34
2952 34 173 -392 40 -164 -157 65 30 -121 -252 308 281 -205 -340 -133 -230 210 329 -156 -65 -98 -243 -241 84
2975 84 -238 -89 131 -61 -423 -70 -9 -190 82 8 42 -139 -310 -224 -388 11 -184 -133 -18 73 -178 -9
$$ packed form
2821i7J89J16j91J33J4m84J03M33k0k19J97m4k44j22J91j5L94K54n57k76M04N1
2843B10l15K72N2J70l40nj74J06K37K57k75M13n14j11K42Np6J18J53l08J26j55
2865H8l14j4P23j83J55j81m40J47m28J023j81l88K99m31k2L66m28L02O4O4k89
2886f8k46J22j12K20R5J67M9J15p15K0O17l65r5L68R1k36J61l06j22P6O92l92
2908A36l50J28m3k84P41j68l64L21j29l76K63J97k49J67K20l91O1k0j85J04J70
2929e1O39q95J76p3k31J38Q7J08k94L93N6l66J9K27l41O07J18m22j64O1rk45M96
2952C4J39n65M32k04PK22l5j51j31N60k7m86j35K07r7M40J19m85R1l3j45KL25
2975H4l22J49K20j92l62L53O1j81K72p4L4j81j71Q6j64L99j95N1J15R1k51J69
$$ plain form
2997 -9 -179 -300 -27 -279 -73 -204 -70 -205 -264 41 139 -305 131 98 15 126 216 -26 -30 267 225 -448 -66
3020 -66 -16 -48 202 431 -254 -77 114 70 262 145 57 210 231 -125 -2 -98 -152 -98 369 298 -101 104 47 231
3044 231 -54 66 13 -153 242 -39 -126 35 -106 31 401 218 -224 -63 -21 -38 202 332 -198 59 214
3065 214 157 79 305 58 184 219 344 16 -170 116 443 364 119 132 -160 -130 308 -118 279 473 30 94
3087 94 48 187 69 5 99 15 187 312 -180 -254 178 -231 -10 52 131 -243 73 268 -247 -224 -105 -200 -36
3110 -36 221 -117 -228 22 41 -39 97 -160 -148 -66 172 301 4 -6 -141 289 398 -20 -45 116 210 373 84
3133 84 61 135 206 203 -149 10 83 44 228 326 -259 -344 116 141 111 248 -132 22 -53 336 -120 -72 -56 -302 -203
3158 -203 298 84 -253 -185 112 41 60 45 -52 -294 23 211 -453 61 -4 -163 218 104 -83 -87 128 -101 -177
$$ packed form
2997ij70j21K73k52K06j31J34j35n9L05R8m44M36l3q3J11R0k42mK97m2o73L82
3020f6N0l2K50K29o85J77J91m4J92j17q8J53K1l56J23r6n4N4M67p1l99K05n7J84
3044B31k85J20n3j66L95k81q7J61j41J37L70j83m42J61M2j7K40J30n30K57J55
3065B14n7p8K26k47J26L5J25l28j86K86L27p9k45J3k92L0M38m26L97J94m43O4
3087I4m6J39j18o4R4q4J72J25m92p4M32m09K21O2P9l74L16J95n15K3J19r5J64
3110c6K57l38j11K50J9q0J36k57J2Q2K38J29k97j0j35M30J09m18k5J61R4J63k89
3133H4k3P4P1ll52J59P3l9J84R8n85q5M60K5l0J37l80J54p5L89m56M8J6k46R9
3158b03N01k14l37O8K97p1J9j5r7k42L17J88o64N14o5j59L81j14j87mK15k29p6
$$ plain form
3181 -177 68 -28 -222 106 213 332 265 -285 -13 262 372 -198 310 115 4 -130 94 45 -73 -27 -61 80
3203 80 133 -114 -55 99 247 -144 27 112 -81 71 165 30 -428 -69 3 -217 437 -256 -149 -205 359 -152
3225 -152 -176 -37 38 -376 -3 150 -382 169 -93 174 -276 201 -72 -83 250 62 -85 200 -25 -133 79
3246 79 407 227 -168 262 145 116 125 -261 -208 387 374 -63 259 15 20 -112 -229 199 -29 159 192 -463 -105
3269 -105 18 -249 -227 181 -280 168 35 -405 -107 43 53 -221 204 -240 -256 61 291 -241 7 505 -128
3290 -128 10 -100 -313 -16 -88 -97 -68 -131 -146 -64 16 -53 -73 -41 70 67 -111 26 -166 -8 404 178 -60 -178
3314 -178 -3 -266 163 335 -21 -366 180 -295 -296 27 -14 -51 170 371 -277 -220 -241 -445 61 306 74 -88
3336 -88 -118 61 -290 151 -218 -180 -41 -40 -155 -298 -215 -43 67 350 335 -72 28 -22 232 38 112 -62 -2
$$ packed form
3181a77K45r6j94L28J07J19o7n50K72K75J10n70N08j95j11j34K24m9j18M6l4J41
3203H0N3k47N9J54J48l91J71Q5j93J52R4j35m58L59P2k20O54o93J07n6N64n11
3225a52k4J39P5m14L73J53n32N51k62K67m50M77k73j1L33j88j47K85k25j08K12
3246G9L28j80l95M30j17k9Rl86N3N95j3m37L22k44Nj32j17M28k28J88L3o55L58
3269a05J23k67K2M08m61M48j33m40K98J50J0k74M25m44j6L17K30n32K48M98o33
3290a28J38j10k13K97p2rK9o3j5Q2Q0o9k0L2J11lj78J37j92J58M12k26k38j18
3314a78J75k63M29J72l56l45N46m75jL23m1l7K21K01o48N7k1k04N06K45k32j62
3336h8l0J79l51M41l69L8J39Jj15j43Q3J72J10K83j5m07J00n0K54j94P4j74O0
$$ plain form
3359 -2 177 173 109 296 40 206 376 121 36 -9 356 -62 150 -48 -58 -111 71 3 265 232 70 -99 96 144
3383 144 -211 41 38 -221 54 283 -60 105 -103 -425 -131 138 13 -67 240 -118 -243 20 -59 25 39 326
3405 326 -22 -214 15 -66 251 319 353 62 -111 245 -57 39 234 294 117 110 -177 -142 47 97 34 246 55
3428 55 143 -230 -289 -50 274 169 255 -114 -126 -327 -321 -330 61 -27 360 -223 66 -377 -224 157 -231 252 -3
3451 -3 -103 -214 -277 -273 -11 -20 264 -35 122 -425 -716 96 229 16 127 184 -98 -29 -114 111 103 -111 -86 86
3475 86 64 -263 -460 -147 -77 -174 -62 -130 -14 -152 175 -30 112 12 132 -144 -464 48 -473 -294 153 -371
3497 -371 -90 -67 -150 9 -105 16 -205 -29 -98 -148 -165 317 -109 -250 248 -219 24 -109 -285 -142 -131 458
3519 458 -51 376 -257 -287 -128 224 279 145 246 -54 -92 -208 237 -271 63 169 -20 -2 -152 -58 -17 158
$$ packed form
3359bJ79mo4J87k56J66J70k55q5m5L65m18K12j98j0n3J82o8K62l3j62j69J95M8
3383A44l55K52lk59K75K29l43J65k08l22K94K69j25q0L07l58j25K63p9Q4J4K87
3405C26l48j92K29q1L17O8L4k91j73L56l02R6J95O0j77pk87L5J89N0o3K12j91
3428E5Q8l73n9K39L24j05Q6l69j2k01OrL91q8L87n83K89m43J53L81l88M83k55
3451cj00j11o3MK62rK84k99J57n47k91Q12J33k13J11N7k82O9q5K25qk14K5J72
3475H6k2l27j97L13P0r7J12o8J16j38L27k05J42j00J20k76l20N12n21J79M47n24
3497c71K81K3q3J59j14J21k21J76o9n0j7M82m26j41M98m67K43j33j76J43J1N89
3519D58n09M27o33l0J59L52N5j34J01l00l8j16M45n08L34J06j89J8j50R4M1J75
$$ plain form
3541 158 251 46 53 244 -196 50 67 193 171 306 18 -180 -5 -154 -1 -29 343 -168 -114 -125 -173 146 464
3564 464 -124 235 144 -70 152 5 117 2 502 490 114 74 -268 -96 423 406 111 -56 123 -68 -279
3585 -279 120 -66 222 251 44 49 -238 -60 177 11 15 257 -95 121 -257 72 49 52 -169 -52 205 -40 83
3608 83 172 209 364 79 -93 -149 -77 -19 -84 57 120 -153 -387 -110 -82 -227 515 30 -19 194 362 -406 -285
3631 -285 -145 -138 -246 210 174 -62 -161 -304 207 241 310 263 160 -134 -259 -136 -40 -231 171 258 205 -207 -59
3654 -59 65 -227 414 -69 -188 -58 -10 -13 -386 175 252 -4 211 -142 -225 -74 83 289 -74 299 -197 -247
3676 -247 32 -154 70 -67 -4 -34 -14 -158 -515 -161 -63 25 271 416 -339 -302 -159 -31 41 -2 171 -162 -223
3699 -223 -141 170 -47 -56 116 -38 83 -227 -306 -12 -35 50 322 96 -303 -204 15 -3 30 147 -130 -14 101
$$ packed form
3541A58R3k05PJ91m40K46J7J26k2J35k88j98J75j49J53k8L72n11N4j1m8L19L18
3564D64n88L59r1k14K22j47J12j15N00j2l76m0l42J72N19j7k95j67J79j91k11
3585b79L99j86K88K9k07Nk87J78K37j66MK42l52K16l78L29k3Lk21J17K57k45J23
3608H3Q9L7J55k85j72n6P2N8o5J41O3k73k34K77K8j45P42m85m9K13J68p68J21
3631b85J40Pj08M56l6k36r9j43N11L4O9m7j03k94j25J23R6j91M02Q7n3m12J48
3654e9J24k92O41m83j19J30M8ll73N61P7k56K15l53q3J51J57K06l63L73m96n0
3676b47K79j86K24j37O3l0K0j44l57L54R8Q8K46J45p55L7J43J28P2m3J73l33o1
3699b23Q2L11k17rJ72j54J21l10p9K94k3Q5K72k26l99R9K19j8L3J17k77J16J15
$$ plain form
3722 101 -303 -140 89 -50 17 257 -108 -313 -92 110 -61 52 -80 113 56 -223 -36 -102 -335 11 24
3743 24 354 125 -97 -90 92 269 173 -127 -162 -82 -193 209 73 264 183 -52 28 -29 -251 -163 48 -13 453 22
3767 22 -132 -68 -50 147 26 84 165 -244 176 -301 -120 -73 -133 188 27 114 -304 -388 52 5 216 -57 6 -232
3791 -232 3 99 -66 69 -97 134 -59 -103 -68 -49 -40 312 223 -104 -142 -103 15 -107 170 125 69 172 -15 48
3815 48 -142 -47 109 175 285 -66 -158 -94 39 -17 363 -14 -20 197 -107 -343 -248 -35 150 -96 141 100 -354
3838 -354 -224 -170 -64 227 -2 -153 -113 -159 -39 11 92 -213 -213 -81 -320 -436 -171 -201 190 147 177 -162 -209 40
3862 40 142 221 100 -71 -223 188 32 -80 251 269 -55 125 238 -121 -215 -443 -30 231 563 -35 -367
3883 -367 -68 -55 -127 162 327 -142 77 129 -423 61 -334 -34 182 109 85 123 -251 -116 6 150 115 225
$$ packed form
3722A01m04J63K29j39O7K40l65k05K21K02j71J13j32J93n7k79J87o6k33L46J3
3743B4L30k29k22PJ82J77r6l00l5Q0j11M02j36J91q1k35Q0n7k22Q8K11o1M66m31
3767B2j54O4J8J97j21N8Q1m09M20m77J81M7o0L21j61Q7m18q4M40m7K11k73O3k38
3791b32K35R6j65J35j66K31j93m4L5J9RL52q9l27l8L9J18j22K77m5n6J03j87O3
3815D8j90R5J56O6J10l51r2O4J33n6L80l77oK17l04k36R5K13J85k46K37m1m54
3838c54J30N4J06K91k29j51M0m6J20N0Q1l05%J32k39j16K65l0L91m3L0l39m7K49
3862D0J02P9j21j71j52M11j56j12L31J8l24J80J13l59r4k28M13K61L32n98l32
3883c67K99J3p2K89J65m69K19N2n52M84l95L00K16p3k4L8l74J35J22J44l5J10
$$ plain form
3905 225 -208 -32 58 -105 -61 -245 22 74 -50 -264 -164 257 46 324 244 51 -29 -20 -365 -189 328 217
3927 217 344 84 -123 -108 -146 426 60 238 318 -136 -107 -43 61 213 56 198 266 151 -64 -202 67 199
3949 199 145 -360 -38 -251 -96 5 285 -99 205 61 -26 -2 -186 69 94 467 310 -59 81 -242 -292 206
3971 206 246 -47 7 20 -173 -125 198 190 -99 239 264 231 145 54 -67 33 56 -167 -251 -118 42 -118 -183 -6
3995 -6 65 -100 -550 -615 -317 16 36 71 88 143 99 -379 -188 34 -10 211 -262 -52 -61 -159 -95 -133 -78 293 -224
4020 -224 231 -264 -185 -186 -363 -147 -22 -33 -165 53 -263 -158 107 202 233 103 -69 -62 119 39 -292 77 223
4043 223 204 -236 -5 -15 -99 327 86 41 -35 10 -178 -162 4 -209 146 193 -429 -218 -34 154 2 244 24
4066 24 -253 67 -336 -120 124 37 -131 118 46 60 -377 15 -305 53 165 22 -3 -318 136 128 161 301 191
$$ packed form
3905B25m33J76R0j63M4j84K67N2j24k14J00M21k11K78q0j93q0Rl45J76N17j11
3927B17J27k60k07J5l8N72l66J78Q0m54K9O4J04J52j57J42O8j15k15j38K69J32
3949A99n4n05L22k13J55J01K80l84L04j44q7K4j84K55K5L73j57l69J40l23n0M98
3971B06M0k93N4J3j93M8L23qk89L38K5l3q6r1j21J00K3k23q4J33J60j60o5J77
3995fP1j65m50o5K98L33K0L5J7N5m4m78J91K22m4K21m73K10rr8O4l8N5L71n17
4020b24M55m95P9jj77K16J25j1j32K18l16J05K65R5L1j30j72PJ81q0l31L69J46
4043B23j9m40K31j0q4M26k41m5p6M5j88J6J66k13L55M7o22K11J84J88j52K42k20
4066B4k77L20m03K16K44q7j68K49p2J4m37L92l20L58J12j43k5l15M54qL3J40j10
$$ plain form
4089 191 -198 6 -402 -77 182 -19 94 29 287 119 -58 -20 20 54 249 -119 -27 -199 78 -151 -112 243
4111 243 -98 26 102 -356 75 -59 -67 -63 -48 313 -171 -253 20 -158 261 331 262 69 125 82 -193 -26 2 287
4135 287 272 -13 -11 -204 -2 -80 -191 246 -47 -211 -41 -6 18 155 204 267 42 41 -190 -24 116 91 7 -13
4159 -13 36 -249 12 -8 19 396 99 95 -73 -188 -238 -151 42 246 -29 109 -294 -313 133 -95 159 334 -88
4182 -88 13 91 -195 -135 -76 -170 -74 10 -84 -29 -207 -165 -29 89 301 47 -38 -200 35 165 -166 147 203 -100
4206 -100 168 62 211 237 535 30 56 -623 -220 -63 -43 41 -282 265 100 -86 -157 -22 -87 100 61 -24 155
4229 155 102 22 75 -115 79 -91 -82 173 -58 -230 125 77 106 124 285 -76 213 -100 151 167 294 46 -87
4252 -87 -92 34 -57 281 137 75 116 0 -432 -185 116 -272 178 -174 91 221 33 -104 -226 88 66 -65
$$ packed form
4089A91l89K04m08L25K59k01J13o5K58j68j77L8M0L4J95l68R2j72K77k29L9L55
4111B43l41J24P6m58M31j34qMJ5L61m84q2K73j78M19P0o9j93N6m3k75J67K8K85
4135B87j5k85Kj93K02p8j11M37k93j64J70L5K4J37M9O3k25jk31J66J40k5q4k0
4159a3M9k85K61k0K7L77k97mj68j15n0Q7J93K04k75J38m03j9M46k28K54J75m22
4182h8J01P8k86O0N9r4R6Q4r4N5j78M2J36J18K12k54q5j62K35J30l31L13N6l03
4206a00K68j06J49K6K98n05K6o79M03J57K0Q4l23N47j65j86p1J35o5J87l9q5J79
4229A55n3q0N3j90J94j70RK55k31j72L55m8K9J8J61l61K89l13K51J6J27k48j33
4252h7nJ26r1L38j44o2M1j16m32K47L01l88M50l52K65J30j88j37j22L14k2j31
$$ plain form
4274 -65 339 -44 -193 101 136 -235 -92 73 -138 -102 -375 75 41 100 237 -58 -318 -115 95 28 -235 -222
4296 -222 290 -151 -35 -16 -231 228 -118 280 -197 73 -192 -286 91 179 34 44 52 -7 244 -190 188 234 338
4319 338 92 -53 -75 -121 -90 -126 113 298 -207 -273 -328 -180 -182 175 39 124 -201 -144 -131 -177 -96 175 116 59 62 -207
4345 -207 119 -243 -110 37 -21 28 -34 -90 -34 36 -8 -150 158 227 -50 128 -46 56 -127 329 270 -95 107
4368 107 -106 288 -65 -193 205 -106 91 -166 34 137 16 -140 18 -157 144 -228 -117 99 -111 -89
4388 -89 417 17 -65 128 -54 169 273 40 -66 -99 20 2 31 -91 155 -38 -89 -116 -206 -135 -32 15 224
4411 224 -8 1 8 96 -78 30 -220 -218 187 257 -28 18 -8 -57 76 218 -112 151 -91 164 48 -230 156 -1
4435 -1 67 97 -151 234 258 -119 1 192 180 -44 191 -34 -87 131 -97 107 98 -43 -27 -68 239 93 -195 29
$$ packed form
4274f5M04l83j49K94L5l71J43J65k11L6k73M50l4N9J37k95k60K03K10o7k63J3
4296b22N12m41J16J9k15M59l46L98m77K70k65r4L77Q8j45J0Qn9K51m34L78M6J04
4319C38k46j45k2m6L1l6K39J85n05o6n5J48kL57j36Q5l25N7J3m6Q1K71n9n7Lk69
4345b07L26l62J33J47n8M9o2n6N6P0m4j42L08O9k77J78j74J02j83M56n9l65K02
4368A07k13L94l53j28L98l11J97k57K00J03j21j56J58j75L01l72J11K16k10K2
4388h9N06m00q2J93j82K23J04k33j06l3J19j8K9j22K46j93n1k7r0P1J03M7K09
4411B24k32RPQ8j74J08k50KM05P0k85M6k6m9J33J42l30K63k42K55j16k78L86j57
4435aO8L0k48L85K4l77J20J91j2k24K35k25n3K18k28K04rj41J6m1L07j46k88K24
$$ plain form
4459 29 -145 -56 153 83 4 -113 -32 77 298 14 26 -186 -104 77 -68 276 121 113 -138 23 103 331 225
4482 225 71 -51 251 53 -50 55 145 4 -301 181 219 65 330 -81 -329 -138 -236 159 -12 6 264
4503 264 108 29 -108 -301 -45 34 -136 -22 212 123 -395 -152 -146 42 173 -6 144 -153 -72 120 -15 120
4525 120 -49 219 -59 48 34 -2 296 -168 18 28 -246 -104 -210 67 29 97 -229 4 172 0 45 -38
4547 -38 -138 -181 194 -43 -9 9 60 46 -177 468 72 171 -35 -39 -192 -121 -14 -140 -290 48 131 45 34 19 -131
4572 -131 26 14 -337 -78 -75 -69 -101 -223 46 82 -27 -120 76 148 263 49 109 -96 -409 -151 -322 -192 152
4595 152 -127 126 -117 80 -125 166 143 33 -4 96 -87 176 37 -147 83 208 25 166 -269 -309 -154
4616 -154 88 235 108 58 -194 -11 -1 -178 -300 123 -197 -76 -52 -70 106 -271 56 188 37 -49 -158 127
$$ packed form
4459B9j74Q9K09p0p9j17Q1J09K21k84J2k12Q2J81j45L44j55qk51J61Q0K28j06
4482B25j54j22L02j98j03J05R0j41l05M82L8j54K65m11k48J91r8L95j71J8K58
4503B64j56p9j37j93K56P9j70J14K34q9n18K43OJ88J31j79J50k97Q1J92j35J35
4525A20j69K68k78J07j4l6K98m64J86J0k74J42j06K77l8O8l26K33J68j72M5q3
4547c8j00m3L75k37L4J8N1j4k23O45l96R9k06mj53P1J07j26j50L38Q3q6j1j5j50
4572a31J57j2l51K59LOl2j22K69L6j09r3J96P2J15k14O0k05l13K58j71J30L44
4595A52k79K53k43J97k05K91k3j10l7J00j83K63j39j84K30J25j83J41m35m0J55
4616a54K42J47j27n0k52J83J0j77j22M23l20J21K4j8J76l77L27J32j51q6j09K85
$$ plain form
4638 127 340 276 114 -66 219 130 19 60 133 64 112 239 172 12 -150 -175 14 231 225 121 -56 233 21
4661 21 -77 95 154 -191 107 -261 164 -88 56 47 79 90 -76 -60 -82 -289 -298 -17 193 120 -72 -61 17 -105 -34
4686 -34 122 -234 16 -315 84 2 41 -74 -162 33 -120 -101 -164 -19 12 20 9 -213 70 5 -83 -197 -70 228
4710 228 -87 83 -98 11 -16 282 -75 6 -144 -188 13 -83 -14 148 57 178 115 69 -115 -241 -223 102 175
4733 175 65 -134 -56 -41 -190 -260 -127 214 191 -206 -213 -162 -148 3 239 -56 24 -11 -5 -217 12 42 -14 -165 139
4758 139 -223 -71 125 -487 -124 273 251 175 -101 -296 121 -67 56 38 267 -29 -124 -131 -2 -76 182 203 69
4781 69 -182 193 133 24 -67 -207 -195 -267 207 -335 112 109 -118 32 124 85 20 -70 15 55 6 -37 -103 163 116 176
4807 176 -30 157 -287 170 137 -56 -148 -220 53 -88 235 20 156 94 0 169 -153 110 41 43 -52 181 184 177
$$ packed form
4638A27K13o4j62j80K85q9j11M1P3o9M8J27o7j60j62k5J89K17oj04j77K89k12
4661B1r8J72N9l45K98l68M25k52J44rL2J1j66J6k2k07rK81K10p3j92J1P8j22P1
4686c4J56l56K50l31L99q2L9j15q8J95j53J9o3J45L1Qj1k22K83o5q8j14J27K98
4710B28l15J70j81J09k7K98l57Q1j50m4K01r6O9J62r1J21o3m6j84j26J8L25P3
4733A75j10j99P8J5j49p0J33L41k3l97pN1J4J51K36k95Q0l5Ok12K29L0n6j51L04
4758A39l62J52J96o12L63L97k2p6k76j95M17j88J23j8K29k96r5pJ29p4K58K1j34
4781F9k51L75o0j09r1j40J2p2M74n42M47lk27J50R2l9o5r0Q5M0m9m3o6K66m7O0
4807A76k06J87m44M57l3j93r2p2K73j41L23k15J36o2r4J69l22K63o9Kr5K33Lp
$$ plain form
4831 177 -67 189 -88 131 -103 -121 32 192 59 -6 82 447 -56 247 40 -215 305 28 -79 78 -16
4852 -16 -86 272 -159 246 308 -41 66 -279 56 198 -75 78 165 -278 89 -240 -66 27 -56 92 29 194
4874 194 -233 -311 176 167 112 -249 -49 271 -9 79 -129 -96 355 -63 -117 174 -4 299 -2 210 -100 -99 -311
4897 -311 51 -295 -370 186 -343 417 3 -303 44 -208 56 152 -238 96 -115 -72 -12 29 -44 -75 -52 210 -132
4920 -132 -27 119 -1 -303 -63 79 -98 -185 -236 -3 -43 -151 340 126 258 306 -61 -128 -99 78 -255 -103
4942 -103 146 -76 -293 -49 -68 -95 206 -117 16 223 25 91 160 67 -99 99 -186 -66 -6 -245 173 -140
4964 -140 -35 -76 -168 -39 -217 127 89 3 91 -164 -133 27 172 -110 -102 -58 25 161 177 70 -39 163 -53 264
4988 264 298 -23 46 -107 18 94 -2 -9 240 -107 22 -256 -13 199 285 -13 -87 -38 322 -75 123 90 -110
$$ packed form
4831A77k44K56k77K19k34j8J53J60j33o5Q8L65n03L03k07k55N20k77j07J57r4
4852a6p0L58m31M05O2l49J07l45L35J42k73J53Q7m43L67l29J74R3q3J48o3J65
4874A94m27p8M87rn5l61K00L20k80Q8k08L3M51m18n4K91j78L03l01K12l10Jk12
4897c11L62l46p5N56n29P60m14l06L47k52K64R6l90L34k11M3O0M1p3l1K3K62l42
4920a32J05J46j20l02K40J42j77q7n1K33m0j08M91k14J32M8l67o7K9J77l33J52
4942a03K49k22k17K44j9k7L01l23J33K07j98O6O9r3j66J98k85J20O0k39M18l13
4964a40J05m1r2J29j78L44l8q6Q8k55L1J60J45k82QM4Q3J36J6j07j09K02k16L17
4988B64L4l21O9j53J25P6r6pK49l47J29k78K43K12Q6k98p4M9L60l97J98l3k00
$$ plain form
5011 -110 44 168 61 55 -247 -41 275 -124 3 45 223 -33 -158 -38 -50 132 -56 312 166 -21 78 175
5033 175 -4 334 -58 -5 -127 30 34 -146 -203 -170 101 66 15 -205 58 -3 121 -32 -42 -92 18 -66 206 -102
5057 -102 -60 -26 -6 13 -210 12 -255 -72 -26 -88 -41 95 -127 -260 28 54 186 106 -78 163 -208 -51 79
5080 79 -91 -67 -72 230 -33 -61 9 -196 198 -144 71 -30 -166 -106 30 -215 -136 -82 -231 -1 -22 238 13
5103 13 -76 -52 145 38 -44 -409 -77 41 4 21 -28 -91 -236 419 -193 26 -121 124 164 91 -13 51 56 199
5127 199 -273 129 169 -90 78 -12 -55 345 113 218 -146 -141 -279 -79 374 112 21 -140 -72 -188 -106 -324 -103
5150 -103 -266 -46 93 -118 -180 -76 -63 153 41 -194 350 86 297 313 16 125 -217 4 -101 -33 -88 265
5172 265 -6 -144 312 -93 15 139 -10 -268 96 56 -160 154 47 145 138 233 24 -43 208 146 -185 -36
$$ packed form
5011a10J54J24j07ol02K06L16l99J27M2J78k56j25J20j2J82j88L68j46j87R9R7
5033A75j79L38l92N3j22J57Mj80n7L3K71l5n1k20K63o1J24j53j0n0J10q4K72l08
5057a02M2L4K0J9k23K22k67J83M6o2M7J36k22j33K88K6J32q0j84K41l71J57J30
5080G9j70K4nL02k63k8P0k05L94l42K15j01j36O0J36k45P9N4j49K30k1K60k25
5103A3q9K4J97j07q2l65L32J18l7J7m9o3j45O55o12K19j47K45M0p3j04O4NJ43
5127A99m72M02M0k59J68r0m3M00k32J05l64Nj38K00M53k62r1j61O8j16Q2k18K21
5150a03j63K20J39k11o2J04J3K16j12k35N44k64K11J6k97J09l42K21j05O8n5L53
5172B65k71j38M56m05J08J24j49k58L64m0k16L14j07R8pR5k09o7K51o2l31J49
$$ plain form
5194 -36 5 -176 18 127 -135 160 -54 246 299 -21 -9 216 -82 36 54 38 31 -479 76 7 -190 -29 -6
5217 -6 157 -95 8 200 -168 198 200 186 200 186 17 -39 221 141 -49 94 462 9 -108 330 141 151 -175
5240 -175 27 -91 -313 51 9 -13 -129 -19 68 278 -138 56 -115 -44 -37 24 157 21 106 57 -58 -36 -159
5263 -159 2 60 -95 154 12 -67 -19 250 6 36 -233 259 147 -30 33 346 -449 200 206 -26 -37 158 369
5286 369 93 -472 -259 -119 6 -64 -70 57 -120 -9 -181 133 90 -3 96 -115 -190 42 35 45 80 33 -71 -266
5310 -266 -89 26 248 193 -126 -27 54 -15 -225 -30 -75 -138 -155 -91 125 -154 139 83 -194 69 79 2 -62 202
5334 202 17 -37 85 -2 -49 19 -192 -29 199 -17 -76 250 -241 89 -165 -281 -88 -88 31 172 -54 -205
5356 -205 122 -81 -166 103 -115 -86 87 17 -273 0 1 -60 88 -95 -125 152 -179 12 114 16 -112 70 -163
$$ packed form
5194c6M1j81J94J09k62K95k14L00N3l20J2K25k98J18J8j6pn10N55o9j97J61K3
5217fJ63k52J03J92l68L66Kj4J4j4j69n6K60q0j90J43L68m53j17M38j89J0l26
5240a75K02j18k22L64m2k2j16J10Q7K10m16J94j71P1PO1J33j36Q5m9j15K2j23
5263a59J61N8j55K49j42p9M8K69k44L0k69M92j12j77O3L13p95O49Ok32j1J95K11
5286C69k76n65K13J40J25p0oJ27j77J11j72L14m3r3R9k11p5K32pJ0L5m7j04j95
5310b66J77J15K22n5l19R9Q1o9k10J95m5o3j7O4K16k79K93n6k77K63J0p7o4K64
5334B02j85n4J22q7m7O8k11J63K28k16n9L26m91L30k54j16J93%J19J41k26j51
5356b05L27k03q5K69k18K9J73p0k90K73Jo1J48j83l0K77l31J91J02r8j28J82k33
$$ plain form
5379 -163 158 -283 22 -142 -110 337 95 -163 -323 104 170 -31 -38 215 -102 -42 -271 248 187 79 -161 -394
5401 -394 90 -61 108 380 -23 284 145 -33 64 67 0 -443 -24 -42 -130 216 91 -198 -141 -99 -150 56 93
5424 93 111 60 -91 218 153 149 55 153 -92 -171 -34 -115 97 153 -130 125 116 -308 292 185 -268 -106 166 -5
5448 -5 178 161 -152 122 71 245 -56 -29 -589 -14 233 -218 -427 -54 197 1 289 -195 -135 115 4 -262
5470 -262 -93 -47 199 298 -121 208 53 67 69 277 36 -10 112 -32 -27 45 126 -156 -27 -155 -79 105 -251 229
5494 229 140 220 49 98 288 -83 -59 19 -4 8 -120 301 80 71 -319 -124 135 -217 -204 -109 107 215 -10 15
5518 15 -17 -463 148 18 66 73 -224 -259 -107 209 -22 188 112 -31 15 127 105 -80 144 226 -104 -124 -83 138
5542 138 20 237 36 -49 115 -17 -225 -6 -78 74 -161 155 94 -157 -2 -94 -3 -134 183 77 112 -87
$$ packed form
5379a63L21m41L05j64L2M47k42k58j60M27O6k01pK53l17O0k29N19o1j08k40k33
5401c94M84j51J69K72m03L07j39j78R7Lo7m43M19j8q8L46j25k89N7M2n1K06L7
5424I3J8n1j51L09o5mr4R8k45p9J37q1K12N6k83K55rm24O00j07m53J62K72j71
5448eJ83j7l13K74n1J74l01K7n60N75K47m51k09L73K51j96K88m84O0K50j11k66
5470b62J69M6K46R9m19L29j55J4KK08k41m6J22j44NP2Q1k82J29j28P6J84l56M80
5494B29q9Q0j71M9J90l71K4P8k3J2j28M21k21rl90J95K59l52J3R5K16J08k25K5
5518A5l2m46O11j30M8Pk97l5J52L16k31K10p6j43M6J12k2j85K24Q2l30k0M1K21
5542A38j18K17k01q5J64j32k08K19p2J52k35L16o1k51J55r2R1j31L17j06L5j99
$$ plain form
5564 -87 -428 -83 -150 113 61 132 94 -40 133 184 99 0 29 -195 -111 -27 -131 117 -84 -78 45 -200 -384 -68
5588 -68 134 -8 -87 -61 190 -130 -153 31 -89 -139 -72 -11 184 -30 43 -64 -198 180 216 312 142 80 -158 110
5612 110 32 148 11 -43 -133 190 61 127 21 32 175 135 134 167 55 150 -276 226 -79 -27 152 -57 -45 -137
5636 -137 231 -1 -22 110 89 141 29 -28 146 -127 -251 -31 133 138 -237 -163 64 57 -9 70 -152 60 121 -45
5660 -45 67 329 108 191 89 -178 -147 88 -119 -63 -76 -9 -48 -299 103 -219 0 85 256 -168 101 45 13
5683 13 -208 -250 -118 92 -87 -107 43 -92 -261 227 158 185 7 -1 29 69 -96 23 -271 -62 6 197 -26
5706 -26 -23 385 -9 -15 41 -141 63 227 -124 -44 -53 -42 -35 -192 -137 180 -49 34 -13 73 -369 40 -69 -250 -94
5731 -94 71 197 -311 141 40 -9 13 5 -177 -54 -30 80 146 3 171 -130 -246 -77 192 0 97 -19 -180
$$ packed form
5564h7l41L45o7K63n2P1l8j34J73N1q5r9K9k24Q4Q4j04K48k01OJ23k45j84L16
5588f8K02j42p9K6K51l20k3J84j20n0O7O1J95k14P3j07j34L78L6R6j70o2k38K68
5612A10p8J16j37n4r0L23j29O6j06J1J43m0jL3j12R5m26N02l05N2J79k09J2r2
5636a37L68k32k1J32k1N2j12n7J74k73j24K20J64Nl75P4K27po6P9k22K12O1j66
5660d5J12K62k21Q3j02k67L1K35k07N6j3O7l9k51M02l22K19Q5J71m24K69n6l2
5683A3k21m2J32K10j79k0J50j35j69M88o9K7j78qL0M0j65J19k94K09O8J91k23
5706b6LM08l94oN6j82K04J64l51Q0rJ1Pj57N5L17k29Q3m7Q6m42M09j09j81J56
5731i4J65J26n08M52j01m9K2qj82J23K4J10O6j43J68l01j16J69K69j92R7j16j61
$$ plain form
5754 -180 3 -164 75 104 -195 -22 82 152 -180 109 -176 93 348 -12 -169 -189 119 -190 -102 -166 27 -81
5776 -81 199 23 114 -112 259 122 282 67 118 -190 58 -8 -251 68 -47 33 30 -15 20 -31 102 179 155 19
5800 19 -98 -128 -194 92 104 228 101 -130 133 -68 16 78 -98 170 -210 -256 61 -20 54 -456 -178 139 88
5823 88 245 46 -111 133 -85 -230 -42 192 253 -70 209 60 36 124 37 189 -205 28 263 -14 46 -103
$$ packed form
5754a80J83j67K39K9k99J73J04P0l32K89k85K69K55l60j57k0L08l09Q8o4J93j08
5776h1K80j76R1k26L71j37J60k15N1l08K48o6k43L19j15Q0lm5L5n1J33P7k4j36
5800A9j17l0o6K86J2J24j27k31K63k01Q4O2j76K68l80m6L17q1P4n10K78L17n1
5823H8J57j99j57K44k18j45J88K34O1l23K79j49k4Q8q7J52l94K33K35k77O0j49
$$ [...]
8191A48
##END NTUPLES=NMR FID
##END=
