##TITLE=1H_CA-8632
 CDCl3, 8 sc, 
 30.7.2019
##JCAMPDX= 6.0         $$ Bruker NMR JCAMP-DX V2.0
##DATA TYPE= NMR FID
##DATA CLASS= NTUPLES
##ORIGIN= UXNMR, Bruker Analytische Messtechnik GmbH
##OWNER= root
$$ XWIN-NMR		Version 3.5
$$ Tue Jul 30 15:17:18 2019 Russian Standard Time (UT+4h)  she@DPX200
##.OBSERVE FREQUENCY= 200.13155
##.OBSERVE NUCLEUS= ^1H
##.DELAY= (6, 6)
##.ACQUISITION MODE= SIMULTANEOUS
##.ACQUISITION SCHEME= undefined
##.AVERAGES= 8
##.DIGITISER RES= 18
##SPECTROMETER/DATA SYSTEM= spect
##.PULSE SEQUENCE= zg30
##.SOLVENT NAME= CDCl3
##.SHIFT REFERENCE= (INTERNAL, CDCl3, 0, 15.7039)
##AUDIT TRAIL= $$ (NUMBER, WHEN, WHO, WHERE, WHAT)
$$ ##TITLE= Audit trail, XWIN-NMR		Version 3.5
$$ ##JCAMPDX= 5.01
$$ ##ORIGIN= Bruker BioSpin GmbH
$$ ##OWNER= she
$$ F:/spectra/data/she/nmr/H-F/1/audita.txt
$$ ##AUDIT TRAIL=  $$ (NUMBER, WHEN, WHO, WHERE, WHAT)
(   1,<2019-07-30 15:16:21.96 +0400>,<she>,<DPX200>,
      <created by zg, POWCHK disabled, PULCHK disabled
       configuration hash MD5:
       00 E9 B6 7A A2 85 ED C7 34 08 36 98 17 FE 4E 26
       data hash MD5: 16K
       E1 7C B6 23 C0 A0 CC C3 F2 9B 8C 06 34 D3 19 F0>)
$$ ##END=
$$ 
$$ hash MD5
$$ E9 65 27 D7 39 5F 6D B4 1D 5A 7A 2D 99 4A 6D A3
##$RELAX= 
##$RELAX= 
##$RELAX= 
##$RELAX= 
##$RELAX= 
##$RELAX= 
$$ Bruker specific parameters
$$ --------------------------
##$DU= <F:/spectra>
##$EXPNO= 1
##$NAME= <H-F>
##$PROCNO= 1
##$TYPE= <nmr>
##$USER= <she>
##$AMP= (0..31)
100 100 100 100 100 100 100 100 100 100 100 100 100 100 100 100 100 100 
100 100 100 100 100 100 100 100 100 100 100 100 100 100 
##$AQSEQ= 0
##$AQ_mod= 1
##$AUNM= <au_zg>
##$AUTOPOS= <>
##$BF1= 200.13
##$BF2= 200.13
##$BF3= 200.13
##$BF4= 200.13
##$BF5= 200.13
##$BF6= 200.13
##$BF7= 200.13
##$BF8= 200.13
##$BYTORDA= 1
##$CFDGTYP= 0
##$CFRGTYP= 5
##$CHEMSTR= <none>
##$CNST= (0..31)
1 1 145 1 1 1 1 1 1 1 1 1 1 1 1 1 1 1 1 1 1 1 1 1 1 1 1 1 1 1 1 1 
##$CPDPRG= <>
##$CPDPRG1= <>
##$CPDPRG2= <>
##$CPDPRG3= <>
##$CPDPRG4= <mlev>
##$CPDPRG5= <mlev>
##$CPDPRG6= <mlev>
##$CPDPRG7= <mlev>
##$CPDPRG8= <mlev>
##$CPDPRGB= <>
##$CPDPRGT= <>
##$D= (0..31)
0 1.2 0 0 0 0 0 0 0 0 0 0.03 0 0 0 0 0 0 0 0 0 0 0 0 0 0 0 0 0 0 0 0 
##$DATE= 1564485381
##$DBL= (0..7)
120 120 120 120 120 120 120 120 
##$DBP= (0..7)
150 150 150 150 150 150 150 150 
##$DBP07= 0
##$DBPNAM0= <>
##$DBPNAM1= <>
##$DBPNAM2= <>
##$DBPNAM3= <>
##$DBPNAM4= <>
##$DBPNAM5= <>
##$DBPNAM6= <>
##$DBPNAM7= <>
##$DBPOAL= (0..7)
0.5 0.5 0.5 0.5 0.5 0.5 0.5 0.5 
##$DBPOFFS= (0..7)
0 0 0 0 0 0 0 0 
##$DE= 6
##$DECBNUC= <off>
##$DECIM= 24
##$DECNUC= <off>
##$DECSTAT= 4
##$DIGMOD= 1
##$DIGTYP= 9
##$DL= (0..7)
0 120 120 120 120 120 120 120 
##$DP= (0..7)
150 150 150 150 150 150 150 150 
##$DP07= 0
##$DPNAME0= <>
##$DPNAME1= <>
##$DPNAME2= <>
##$DPNAME3= <>
##$DPNAME4= <>
##$DPNAME5= <>
##$DPNAME6= <>
##$DPNAME7= <>
##$DPOAL= (0..7)
0.5 0.5 0.5 0.5 0.5 0.5 0.5 0.5 
##$DPOFFS= (0..7)
0 0 0 0 0 0 0 0 
##$DQDMODE= 0
##$DR= 18
##$DS= 0
##$DSLIST= <SSSSSSSSSSSSSSS>
##$DSPFIRM= 0
$$ [...]
##$SUBNAM2= <"">
##$SUBNAM3= <"">
##$SUBNAM4= <"">
##$SUBNAM5= <"">
##$SUBNAM6= <"">
##$SUBNAM7= <"">
##$SUBNAM8= <"">
##$SUBNAM9= <"">
##$SW= 24.9336996594482
##$SWIBOX= (0..15)
0 0 2 0 0 0 0 0 0 0 0 0 0 0 0 0 
##$SW_h= 4990.01996007984
##$TD= 16384
##$TD0= 1
##$TE= 0
##$TE2= 300
##$TE3= 300
##$TEG= 300
##$TL= (0..7)
0 120 120 120 120 120 120 120 
##$TP= (0..7)
150 150 150 150 150 150 150 150 
##$TP07= 0
##$TPNAME0= <>
##$TPNAME1= <>
##$TPNAME2= <>
##$TPNAME3= <>
##$TPNAME4= <>
##$TPNAME5= <>
##$TPNAME6= <>
##$TPNAME7= <>
##$TPOAL= (0..7)
0.5 0.5 0.5 0.5 0.5 0.5 0.5 0.5 
##$TPOFFS= (0..7)
0 0 0 0 0 0 0 0 
##$TUNHIN= 0
##$TUNHOUT= 0
##$TUNXOUT= 0
##$USERA1= <user>
##$USERA2= <user>
##$USERA3= <user>
##$USERA4= <user>
##$USERA5= <user>
##$V9= 5
##$VALIST= <valist>
##$VCLIST= <CCCCCCCCCCCCCCC>
##$VD= 0
##$VDLIST= <DDDDDDDDDDDDDDD>
##$VPLIST= <PPPPPPPPPPPPPPP>
##$VTLIST= <TTTTTTTTTTTTTTT>
##$WBST= 1024
##$WBSW= 4
##$XGAIN= (0..3)
0 0 0 0 
##$XL= 0
##$YL= 0
##$YMAX_a= 135468
##$YMIN_a= -145823
##$ZGOPTNS= <>
##$ZL1= 120
##$ZL2= 120
##$ZL3= 120
##$ZL4= 120
##$ABSF1= 10
##$ABSF2= 0
##$ABSG= 5
##$ABSL= 3
##$ALPHA= 0
##$AQORDER= 0
##$ASSFAC= 0
##$ASSFACI= 0
##$ASSFACX= 0
##$ASSWID= 0
##$AUNMP= <proc_1d>
##$AZFE= 0.1
##$AZFW= 0.1
##$BCFW= 1
##$BC_mod= 2
##$BYTORDP= 1
##$COROFFS= 0
##$CY= 11.3945322036743
##$DATMOD= 1
##$DC= 2
##$DFILT= <>
##$DTYPP= 0
##$F1P= 20.1537800932815
##$F2P= 0.134698688090026
##$FCOR= 0.5
##$FTSIZE= 0
##$FT_mod= 4
##$GAMMA= 1
##$GB= 0.15
##$INTBC= 1
##$INTSCL= 1
##$ISEN= 128
##$LB= 0.24
##$LEV0= 0
##$LPBIN= 0
##$MAXI= 10000
##$MC2= 0
##$MEAN= 0
##$ME_mod= 0
##$MI= 1.114404
##$NCOEF= 0
##$NC_proc= 0
##$NLEV= 6
##$NOISF1= 3.799351
##$NOISF2= 2.8
##$NSP= 1
##$NTH_PI= 0
##$NZP= 0
##$OFFSET= 15.70392
##$PC= 1
##$PHC0= -9221.576
##$PHC1= 17.20097
##$PH_mod= 1
##$PKNL= yes
##$PPARMOD= 0
##$PSCAL= 0
##$PSIGN= 0
##$REVERSE= no
##$SF= 200.130013532006
##$SI= 16384
##$SIGF1= 3
##$SIGF2= 2
##$SINO= 400
##$SIOLD= 16384
##$SREGLST= <1H.CDCl3>
##$SSB= 0
##$STSI= 0
##$STSR= 0
##$SW_p= 3612.71676300578
##$SYMM= 0
##$S_DEV= 0
##$TDeff= 0
##$TDoff= 0
##$TI= <>
##$TILT= no
##$TM1= 0
##$TM2= 0
##$TOPLEV= 0
##$USERP1= <user>
##$USERP2= <user>
##$USERP3= <user>
##$USERP4= <user>
##$USERP5= <user>
##$WDW= 1
##$XDIM= 8192
##$YMAX_p= 0
##$YMIN_p= 0
$$ End of Bruker specific parameters
$$ ---------------------------------
##NTUPLES= NMR FID
##VAR_NAME=  TIME,          FID/REAL,        FID/IMAG
##SYMBOL=    X,             R,               I
##VAR_TYPE=  INDEPENDENT,   DEPENDENT,       DEPENDENT
##VAR_FORM=  AFFN,          ASDF,            ASDF
##VAR_DIM=   8192,          8192,            8192
##UNITS=     SECONDS,       ARBITRARY UNITS, ARBITRARY UNITS
##FACTOR=    0.0002004,     1,               1
##FIRST=     0,             0,               0
##LAST=      1.6414764,     0,               0
##MIN=       0,             -145823,         0
##MAX=       1.6414764,     135468,          0
$$ Real data points
##PAGE= N=1
##DATA TABLE= (X++(R..R)), XYDATA
$$ [...]
1981A29j95k85M64l32k44K77L50k06k96M21P4j66M5J08m95O79J52p01J15J88L32
2002D14l66L76j55k68M43n1j79J59K95m52L1Mj07l02L56j29J45j00J31l76J46
2023A5L22k66K2J67j92k78M17q4k71M3j31k15N91j63m88L60L06n07j09M67k99
2044b93k26J33M54o81N77K03n01J92K7m19L04J80j79L5L26r1l12K87k7j30L42
2065B01k7j00rM97j89j30%qM8p9J94j18K38j42k16J58K3l77M79k45r8K6K50o5
2089C11n91M37j9k7M3o1k7k30L19k53q8L90j61l13N16j78k34L34j06n06L60j53
2111b37K30k91J77l9k56L07L7m69L26m9k81K71m1L04l08K0J51o34O12L9n80M51
2133b60j9l74K57K69m87L71J20m81L94j23K75r5nJ00m68N36q0k39L90K6k26q3
$$ plain form
1981 129 -66 -351 113 -219 -463 -186 164 -42 -338 83 157 -9 36 144 -351 328 480 -221 -106 82 414
2002 414 48 424 269 1 444 393 214 373 668 216 247 251 144 -158 198 69 214 114 245 -131 15
2023 15 337 71 93 260 68 -210 207 123 -148 -105 -236 -451 140 -23 -511 -151 155 -352 -461 6 -293
2044 -293 -519 -386 68 -613 -36 167 -334 -142 -115 -534 -230 -50 -229 -194 132 41 -271 16 -11 -141 201
2065 201 174 74 65 562 373 243 243 235 283 204 398 280 518 376 160 318 341 -36 443 198 100 126 376 311
2089 311 -280 157 138 111 154 93 66 -164 155 -98 -186 204 43 -270 246 68 -166 168 62 -444 -84 -237
2111 -237 -7 -298 -121 -160 -416 -109 -72 -541 -215 -264 -545 -274 -315 -11 -319 -299 -148 -782 -170 -131 -711 -260
2133 -260 -279 -653 -396 -127 -614 -243 -123 -604 -210 -333 -58 -153 -158 -58 -526 10 -70 -309 81 107 -119 -202
2155b02J17j1j86O06j96J49J47j66MJ01J88l57qL26n2k28L36m4j39o4L85n39P4
2178B41P10o58M79m1k19K01J57l11k97O45n53j46M95%n63R5QRk43O82n14j67J54
2201A64Q1l97L51K6o40J65J64k42l11N19p1n11O73r7k27QJ5l14K8On1o6L53j28
2225e02k01L82j84j54J69p2k17L01R5o39K64K15m35L84N35m90l0M19p3l50J50
2246d33M30m77K90K12m23J91Q4Nk38N92j11l19M18m0J19j02J65m02J30L22k67
2267A46j26O50k34j0L35o7k77Q3J77l60J50N21l68J40J38j43j36K34L8l71L25
2288H45n8l71Q9M62k35n1P8k72k09M14j36k66Q8J17k49k53K94j89k04L60j80k78
2310b04K51k86J52k72K39J4l89L80o76J88L51m01j84L82j43m1r6O0l57P38l61
$$ plain form
2155 -202 -85 -96 -282 324 128 277 424 258 262 363 551 194 186 512 460 232 568 524 385 321 706 167 241
2178 241 951 293 772 731 512 713 870 559 262 907 354 208 703 703 140 235 243 252 9 691 177 10 164
2201 164 245 -152 199 225 -415 -250 -86 -328 -639 -120 -191 -702 -29 -126 -353 -345 -330 -644 -616 -610 -661 -727 -374 -502
2225 -502 -703 -321 -505 -659 -490 -562 -779 -478 -383 -1022 -758 -543 -978 -594 -59 -549 -579 -160 -233 -583 -433
2246 -433 -3 -480 -190 22 -401 -210 -126 -121 -359 233 122 -197 221 181 300 198 363 -39 91 413 146
2267 146 20 670 436 426 761 694 417 500 677 317 467 988 620 760 898 755 619 853 891 520 845
2288 845 787 416 505 967 732 681 759 487 278 692 556 290 378 495 246 -7 287 98 -106 254 74 -204
2310 -204 47 -239 -87 -359 -120 -106 -495 -115 -791 -603 -252 -653 -837 -455 -598 -639 -735 -675 -1032 -294 -655
2331f55k9J50N8j78p6o1O7L4J87j39O5J56P6l04J51L92m23N10j80J73j54J63j82
2354a99o5Q3Q5pP2L46n34J35L47l61J30K27J97m83O49k33j32R5J16j03N1K85n10
2377A91k7L21p2N5M35k94J1K4K69k19K9j71j28M65k00p4KJ04l96j37N87k05j06
2400D64N7Q2l14J24O9j34m07O28n77m5M09l1l67m6k6K3l4L21m09j95M35l65m10
2423g48O65l87l47L81K33m50K21l7j55j82N03J17o97L18r7N2L73j32l26L37j15
2444d73o0l20L70P7k92M97R0k77K69K15l46J54J92m50J80J23N5N4J25j5r4K66
2466C40k6k80o5L46j59j9M04l99j6K69R7k37J75j2l46M39J44m37n9L88j89n9N2
2489C51r6M6J77O0m54L98j51j40qK7q2r5M26%j53J31m9n55K57J45n24N06J44N0
$$ plain form
2331 -655 -684 -534 -476 -654 -730 -791 -724 -690 -503 -642 -577 -421 -345 -649 -498 -106 -529 -19 -199 -26 -180 -17 -199
2354 -199 -264 -181 -96 -103 -31 315 -219 -84 263 -98 32 259 456 -27 622 389 257 352 468 365 416 701 191
2377 191 164 485 413 468 903 609 620 644 913 694 723 552 424 889 689 615 617 721 325 188 775 570 464
2400 464 521 603 289 413 482 348 -59 569 -8 -53 356 325 -42 -88 -114 -91 -125 196 -213 -408 27 -338 -748
2423 -748 -83 -470 -817 -436 -203 -653 -432 -469 -624 -806 -303 -186 -883 -565 -662 -610 -237 -369 -695 -358 -473
2444 -473 -533 -853 -483 -406 -698 -201 -111 -388 -119 96 -250 -96 96 -354 -174 -51 4 58 183 168 74 340
2466 340 314 34 -31 315 156 137 541 142 126 395 492 255 430 418 72 511 655 218 159 547 358 299 351
2489 351 255 301 478 538 84 482 331 191 183 210 128 33 459 459 306 437 388 -167 90 235 -289 217 361 411
2513D11m10K57m73R3K73j12m69M55Q6k50L0K52m58p1N27m86K1K73l81k45K78Q0
2535c19j30L94k52k36N57k75k10J62J36l45j82O29n54MK58M90o16K77M04p24N70
2556C8L0O6j98P0N7m44M97J58k09l24O95m42K03K13Jm32M18j94j75J51J82k79
2578H2J41j10J75k70K26k32J02K08k65J08K60k59n34M36J26k67r3J79k04P0K93
2599A72m10OQ2j18o0L11q1k50L04n3l33L59J83j90R9P5l83N6K14K3P3J5l82J42
2623a46J15K21n86O0K94J4k89L21m37j04M43L59j8p6oj77j21M12m61R6M02j85
2645A31l29J06J41m70N82J18m15J68J25n54L16J46J00lk01j31N4K99P6l15K26
2666A70n7j25q6L86j07k36L15o6k45OJ97O2J0r1j80j14M57m24K31K73k10k06N07
$$ plain form
2513 411 1 258 -215 -122 151 39 -430 25 111 -139 -109 143 -315 -386 141 -345 -324 -51 -432 -677 -399 -319
2535 -319 -449 -55 -307 -543 14 -261 -471 -309 -173 -518 -700 -71 -625 -621 -363 127 -489 -212 192 -532 38
2556 38 68 134 -64 6 63 -381 116 274 65 -259 436 -6 197 410 411 -21 397 203 28 179 361 82
2578 82 223 113 288 18 244 12 114 322 57 165 425 166 -368 68 194 -73 -166 13 -191 -121 172
2599 172 -238 -232 -150 -268 -328 -17 -98 -348 -44 -97 -430 -71 112 -78 21 96 -287 -231 -17 6 79 94 -288 -146
2623 -146 -31 190 -396 -336 -42 -28 -317 4 -433 -537 -94 265 247 171 165 -12 -133 279 -182 -86 316 131
2645 131 -198 -92 49 -421 161 279 -136 32 157 -397 -81 65 165 162 -39 -170 -116 183 259 -56 170
2666 170 113 -12 -98 288 181 -55 260 194 -51 -45 152 214 224 133 -47 -161 296 -128 103 376 166 -40 467
2689D67m76p2J5K3J45q9l5l53J31J36m2k21L46Q8j48m24M67j88k5K28m60J33J07
2712b47R4k47J27M4j5P9j08L7r4K47j71n89P02Q2n7kk3r9L40q4q8LM12k45j21
2737b3L13j07l83N61k45j40L96l88L5P5L87k08k5K48l47j00L65r8n3l5r7n6K69
2760C44p7m6K22p8k78J87J58l17J80j32K01l19n8L44m15J47k21K55K46k00L10
2781D53l38M13l90k57m4L9O4J85K35k83l72M63l37R0J13Q0k60J70l66k7K65J0
2803i4j88J30q2J23k69j0M15n77N08l38mJ23J20K9k95j05J40N8K1q2l32L56J54
2826a99m17L75J87l67R0L61k43o4J79J51r6m0O6Q2J63r8m04N10l0k11K09J30J15
2849D49n28M87M9n30L93L33o80M46J40k73J94j46L1k02K55k05Q3Q6L30l59j09
$$ plain form
2689 467 -9 -81 -66 -43 102 13 -22 -375 -244 -108 -150 -371 -25 63 -85 -509 -42 -230 -255 -27 -487 -354 -247
2712 -247 -153 -400 -273 -229 -244 -165 -273 -236 -330 -83 -254 -843 -141 -59 -116 -118 -141 -240 100 16 -72 -69 343 98 -23
2737 -23 290 183 -200 361 116 -24 372 -16 19 94 481 273 248 496 149 49 414 316 263 228 131 75 344
2760 344 267 221 443 365 87 274 432 115 295 163 364 45 -13 331 -84 63 -158 97 343 143 453
2781 453 115 528 138 -119 -163 -124 -60 125 360 77 -295 168 -169 -79 34 114 -146 24 -342 -369 -104 -94
2803 -94 -282 -152 -234 -111 -380 -390 25 -552 -44 -382 -386 -263 -143 -114 -409 -514 -374 -316 -295 -377 -709 -353 -199
2826 -199 -616 -241 -54 -421 -331 30 -213 -277 -98 53 -43 -83 -17 65 228 130 -274 236 206 -5 204 334 449
2849 449 -79 408 457 -73 320 653 -27 419 559 286 480 334 365 163 418 213 296 382 712 353 244
2870B44J90l24NJ3O7J86j92p2oo1K43n76L95Q5k56M75j67j9m09P40m27l31K53
2893E6j27k49O67l82N1l17K17Q0j58J87l24K66J55l47k5L24p5p09N53J11k50O
2915b90k01K60j73N03l05j90m3MP1R4Q0k47R4K48l85K02j10k2L6L70l7k68L63
2938E4L6k96K0nM9o0K83r8j68L92k74K04J01j45O0L39l17J5L0J24l20OR4j66J20
2963G8L64L0n97L94r3j38K97J01j20j76K94k05j84J27Q8l57J63L54n04M66k41
2984A41J47r8j38k08qJ75J48m22M42P9m42J23J30j69q1L35k00r6k89O32n32L24
3006gj30J72k01q5J65j11J70p8j96J32K8k35K77j68K13k7l4j06P1K47o2k50J58
3029e7j83l9J97N2k04J83J58l86L54L6l35k56K93J85l84O36m17J7j2K29k41J67
$$ plain form
2870 244 434 110 115 128 195 381 189 117 111 50 293 -283 112 197 -59 416 249 230 -179 561 134 -197 56
2893 56 -71 -320 347 -35 16 -301 -84 -4 -162 25 -299 -33 122 -225 -250 74 -1 -710 -157 -46 -296 -290
2915 -290 -491 -231 -404 99 -206 -396 -439 -435 -364 -270 -190 -437 -343 -95 -480 -278 -388 -410 -374 -4 -41 -309 54
2938 54 90 -206 -186 -191 -142 -202 81 -17 -185 207 -67 137 238 93 153 492 175 190 220 344 24 30 124 -42 78
2963 78 442 472 -125 269 176 38 335 436 316 140 434 229 45 172 260 -97 66 420 -84 382 141
2984 141 288 190 52 -156 -164 11 159 -263 179 258 -184 -61 69 -100 -181 154 -46 -142 -431 201 -331 -7
3006 -7 -137 35 -166 -251 -86 -197 -27 -105 -301 -169 -141 -376 -99 -267 -54 -81 -115 -221 -150 97 35 -215 -57
3029 -57 -240 -279 -82 -30 -234 -51 107 -279 75 111 -224 -480 -187 -2 -386 250 -167 -150 -162 67 -174 -7
3051gL34k36M3q2q4j18M90l10j63K07K25o7o7O3j10M4J77l39K61J00r1l44K04
3074A30J0K43k08L77n23K56P9q5J10k93Q1j81L56j50j65R6p2j87J70k09j5J82
3096BK12k00r8k0Jq8q5P6j21L22m3j82K56J76n66L45Lk7k28L12k60J48J10K28
3120B73o50L95J93n87N65l53K82l85J82Q3j87j1j81L41J47k42J69J62k22l1r3
3141a50N4L31k97ON9j24P4j26J20O3K6J80k21r9L86n15K10k45K11O6P2k36K40
3164H5K84m22J27n6L7n8J11k05j90J95J66j2J17j28N5j03R2j35J69l4n1j73K38
3187A09k56L1K56k46k8q4L17j30l0J56j21J23r5k14M44j72J94o44M18k81J20J56
3209B3K34l03Ln4p6o6j31L70k69J36L54k50jQ4j03p5J86J14k48J20l1Q3k09L31
$$ plain form
3051 -7 327 91 134 52 -32 -150 340 30 -133 74 299 232 165 228 118 162 339 0 261 361 270 -74 130
3074 130 140 383 175 552 29 285 364 279 389 96 177 -4 352 202 37 133 61 -126 44 -165 -180 2
3096 2 214 14 -84 -104 -103 -191 -276 -200 -321 1 -42 -224 32 208 -358 -13 -10 -37 -265 47 -213 -65 45 273
3120 273 -377 18 211 -376 189 -164 118 -267 -85 -2 -189 -200 -381 -40 107 -135 34 196 -26 -57 -150
3141 -150 -96 235 -62 -56 3 -121 -47 -173 -53 10 36 216 -5 -104 282 -233 -23 -268 -57 9 81 -155 85
3164 85 369 -53 74 18 55 -3 108 -97 -287 -92 74 62 179 51 106 3 95 -40 129 95 44 -129 109
3187 109 -147 -116 140 -106 -134 -218 99 -31 -61 95 -26 97 2 -212 232 60 254 -390 28 -253 -133 23
3209 23 257 -46 -43 -97 -173 -239 -370 0 -269 -133 221 -29 -30 54 -49 -124 62 176 -72 48 17 100 -109 222
3233B22l69lL11J15j48J1mj82J90N4J02l26K41k81M1J85K51l19J46K74o75J32
3255c2J40j60Q2J47j67j27K18r6Q3J11j28KJ9k38R6n3q3J92l7J92l72j28N14j01
3279G4n2q2M7j72J42q4J38j21N0k42J97L00l34m1n2M20n72M25nn2j32P9o1K17
3303H7k3j21k6n3j75J52Q7p3M8l8K87l18J85j56L85l48k24K43j35J50m5O1l0P8
3327bj22J42N3l30K76j10p0R7O41m21OK1k29J16q7K8L18k03%M5k05L77r8j86K05
3352B62Oj09K97k50l62O09k38k25J61j25J70j63J96j79k8J04M7l11M75k00k14
3373g7N4K8q4j19O2J87j10J30j7m36J40L26l66J63O8k05j45L58N0m80M80O5l28
3396b56J13J76l68K99j02K02k96k0L80j35j89M18k21P9P3j74P2j99J97k19L95
$$ plain form
3233 222 -147 -150 161 276 128 139 135 -47 143 197 299 -27 214 -67 -26 159 410 91 237 511 -164 -32
3255 -32 108 -52 30 177 10 -117 101 5 88 199 71 73 92 -146 -50 -103 -186 6 -31 161 -211 -339 175 74
3279 74 22 -60 -13 -185 -43 -127 11 -110 -60 -302 -105 195 -139 -180 -232 188 -384 41 36 -16 -148 -69 -130 87
3303 87 64 -57 -83 -136 -311 -159 -72 -145 -97 -135 152 -166 19 -137 248 -100 -324 -81 -216 -66 -111 -50 -80 -2
3327 -2 -124 18 71 -259 17 -93 -163 -66 575 154 160 181 -48 68 -19 9 327 124 124 169 -36 341 243 57 262
3352 262 268 159 456 206 -156 453 215 -10 151 26 196 33 229 50 22 126 173 -138 337 137 -77
3373 -77 -23 5 -79 -198 -136 51 -59 71 54 -382 -242 84 -282 -119 -51 -256 -401 -43 7 -473 7 72 -256
3396 -256 -143 33 -335 -36 -138 64 -232 -252 128 -7 -196 222 1 80 153 -21 51 -148 49 -170 225
3417B25l22K15j46j02J35K29p1j03K15k63l48N79j98PqJ39k59J29j9L2j71O5O0
3440B0k9M90l38j82R5Lj35M7L21m2l71J24L33k39r3k7lJ06o5r2J15Q0j57M61l78
3465D4p6O5N8l6J66m06Q0L88l73J22j09J22R5l88o0nL75k71J61K58k90j17L66
3488A69l99L3J20k8j66j9jp1L5J29Nj60J23k8K38j1p9j84L11k15L8K73l65K49
3512cJ8p8j13j10M24l75K17j85N02k90L91n20kJ95r7J45Oj00m2N0J70m32L00k19
3536a48L08k43lK19k73L39k9o4k14J01J22l21J20J54m5oK11k89J14K48o89O46
3558B58j26k75Q2L03k99J0j9J7n5J93L04k95k41L69l29J05j6O24o93j1J86k70
3580a78K65J42j0k70Q8o6P7k06K34n36L56K55j89M2m7p3k64K69K15J05l81M96
$$ plain form
3417 225 -97 118 -28 -130 5 234 163 60 275 12 -336 243 45 52 44 183 -76 53 34 66 -105 -40 20
3440 20 -9 481 143 -39 56 59 -76 -29 292 250 -121 3 336 97 4 -23 -26 80 15 -77 38 118 -39 422 44
3465 44 -32 33 91 55 221 -185 -105 283 -90 32 -77 45 140 -248 -308 -313 62 -209 -48 210 -80 -197 169
3488 169 -230 -197 -77 -105 -271 -290 -291 -362 -327 -198 -193 -353 -230 -258 -20 -31 -110 -294 17 -198 -160 113 -252 -3
3512 -3 15 -63 -176 -286 138 -237 -20 -205 297 7 398 -122 -124 71 -26 119 125 25 -17 33 203 -229 71 -148
3536 -148 160 -83 -86 133 -140 199 170 106 -108 -7 115 -206 -86 68 23 17 228 -61 53 301 -388 258
3558 258 132 -143 -61 242 -57 -47 -66 -49 -104 89 393 98 -143 226 -103 2 -14 610 -83 -94 92 -178
3580 -178 87 229 219 -51 37 -29 48 -158 76 -460 -104 151 -38 4 -43 -116 -380 -111 104 209 -172 324
3602C24j22k73Q2k19K33J3Rl00J7KJ36J36l89j6K78J6l81K28P60m63o5N3J64l32
3626a09M6k71L67j67jR8J17j72K16NR4j27n4J55o1l11N2M45j23j76J23l60O15
3649D01l31J7Q5l34L44K13k62q9N2o7r4J70K75k23R3j84P6j71M9Q1j89K62l45
3672a71O1M7J8q1j06J94k35M0L00M6M8j91j21J50j02M13m21Q6j03j6K57k79K34
3695F8l81M57j27Q7M7l07p6K82R8O1k74R6k32K42j97jO8j13M65k03k30L03J33
3718B66l13J69l62K70j27N29o67J70K31j5j89k6K07k08K19q4k38K17P1j64R7M9
3740A02N8k84L68o5m5J09o0q1r9J70l23K02m2m2n6kj6j29NP5j20K80J73k59K90
3765B09r5l5M1j28M7j17K12l64J46p4J62o7j78N60o51K98k59L06K8j84L18l40
$$ plain form
3602 324 202 -71 11 -208 25 38 47 -253 -236 -234 -98 38 -351 -367 -89 -73 -454 -226 534 71 6 59 223 -109
3626 -109 -63 -334 33 -134 -135 -37 80 -92 124 129 223 96 42 197 136 -175 -123 322 199 23 146 -214 401
3649 401 70 87 172 -162 182 395 133 44 96 29 -65 105 380 157 250 66 142 -29 20 101 -88 174 -171
3672 -171 -110 -63 -45 -126 -232 -38 -273 -233 67 113 161 -30 -151 -1 -103 310 -111 -25 -128 -144 113 -166 68
3695 68 -313 144 17 104 151 -156 -232 50 148 209 -65 31 -201 41 -156 -157 -89 -202 263 60 -170 133 266
3718 266 -47 122 -240 30 -97 432 -235 -65 166 151 -38 -64 143 -65 154 70 -168 49 120 -44 53 102
3740 102 160 -124 244 179 134 243 183 102 3 173 -150 52 10 -32 -88 -90 -106 -235 -230 -155 -275 5 178 -81 209
3765 209 114 79 120 -8 39 -78 134 -230 -84 -158 4 -63 -241 319 -332 -34 -293 13 41 -143 175 -165
3787a65J15J17O6k46K00J5q4N15o38K17P1j58p9j12q5J57K12n6R1j35j2J47q1
3810G2j0q5N0j98L85o3j83J82P5k15O8j60L2M22k04j72L20k75J33q6K04k65N8
3833H5J6k51k2L50n6p6j4J24k4P3j25Pk41M94m44J80J40l21j72L31j25L12q3o3
3857I5k00K17j02j98j07L91j16k08R9j2J4q5L34k13k1J6Q2P1j99k4j11Q8P3J27
3881A1p1l15N57j24K90j68m0j01k9P9R3l65L13l35K29K60l87J69r5n8K04J63m13
3904a33J8M4J2K91k0j54j05K52j87J93j84J96M9k35J37k44p2M43k65j32M04k35
3926G3m34L12l4k05L63J35j27j76O9N2R2J45l93L64m80O3J74p3J05r3L40k02k04
3949a34N32k36n59K84l9P6Q3J4K64l82J11k57J10k99M40j44J16L9j72k2Q3J07
$$ plain form
3787 -165 -50 67 133 -113 87 102 18 533 -105 112 183 25 -54 -166 -251 -94 118 62 153 18 6 153 72
3810 72 62 -23 27 -171 214 151 -32 150 225 10 78 -82 -50 372 168 -4 316 41 174 88 292 27 85
3833 85 101 -150 -172 178 122 46 32 156 132 205 80 87 -154 340 -104 76 216 -105 -277 54 -71 241 158 95
3857 95 -105 112 10 -188 -295 96 -20 -228 -129 -141 -127 -212 122 -91 -112 -96 -14 57 -142 -166 -277 -189 -116 11
3881 11 -60 -375 182 58 348 180 140 39 10 89 182 -183 130 -205 24 284 -103 66 -29 -87 117 280 -133
3904 -133 -115 -71 -59 232 212 58 -47 205 18 211 27 223 272 37 174 -70 -142 301 36 -96 308 73
3926 73 -361 -49 -83 -288 75 210 83 -93 -24 28 120 265 -128 236 -244 -181 -7 -80 25 -68 272 70 -134
3949 -134 398 162 -397 -113 -152 -76 7 21 285 -97 14 -243 -133 -432 8 -136 -20 19 -153 -175 -92 15
3971A5j45J89Q2k33K66n00j6K57kl69L19k8M5J73J41m74O1J28Q9J50l34r4J25
3994a55L44M6k62l1M26j42l73O0J40p4L07p5m80K87K17n7k7M9J08j79K00k48j51
4017g0J48O8l29M42J37j66j75J55j36L02J76m99j78K52p9q5L68j84k35K10J37
4038B59k24N9j47q2K01k34r0O9K23j07J57j86%j53J81P5k21P7j69j51K69L34l76
4061b36K13j1k8k1m6J22j10j89L99j57p3K36j16K30j60J75l08r0J94k6L18N3m41
4084g2K55k01k04K6J54Rj34J79o4o6N0q8J8L1J9J20j69J15r6j27K67j08K3p4J62
4109B5Q6k00J92K83l31R2j6k02J73m7L04l39K46j07L32m10j68J25K8m9l01M88
4131B04L15o77L42J24l23j00oM6J28j4k33K34J54k1k87J05M09m75N2l63L23j31
$$ plain form
3971 15 -130 59 141 -92 174 -326 -342 -85 -87 -456 -137 -165 -120 53 194 -280 -219 -91 -2 148 -186 -280 -155
3994 -155 189 235 -27 -58 368 226 -147 -87 53 -21 286 211 -269 18 235 178 151 200 308 129 329 81 -70
4017 -70 78 146 -183 259 396 230 55 210 74 376 552 53 -125 127 48 -37 331 147 -88 122 259
4038 259 35 94 -53 -135 66 -168 -258 -189 34 -73 84 -102 -102 -255 -74 1 -220 -143 -312 -463 -194 140 -236
4061 -236 -23 -34 -62 -83 -129 -7 -117 -306 93 -64 -137 99 -17 213 53 228 -80 -170 24 -2 316 369 -72
4084 -72 183 -18 -222 -196 -42 -33 -167 12 -52 -118 -68 -156 -138 -107 -88 32 -137 -22 -118 -245 22 -86 -63 -137 25
4109 25 111 -89 103 386 55 147 131 -71 102 55 359 20 266 159 491 81 -87 38 66 17 -284 204
4131 204 519 -158 184 308 -15 -115 -121 -75 53 39 -194 40 194 173 -114 -9 400 -75 -23 -386 -63 -194
4153a94Q8m5K8L20m30P3M6K02j19l03L69j60r1P5j84L24O8l58J11K45m43L84r7
4176i1K32L53o28%j11P5J74J13k76K64l46J16l9JN9L70l92M8n2K15m90M36j92
4199a61J13p8r8L78k89j69N82j98k33K69J36l26L38j59pO2l9q8J67l73J87L28
4221C42n4m32L71r2Oj7o4J2J66k43J07j21m0J02j1O8k65J98l3l7j4k59M03Q7j89
4246iQ8l2o2J31j36J50l9J2l0j12J44q2k10L05pLoR0l27J3R5q8j2K25p9j4n7K04
4274A58m23K49Pk21J1J97l9N0j85L36j32k95Q9K33N3J79k67J4J33j22l66L49J67
4297A75P2r6j93M66m87J72k62K4L22j93j55K26j55l07M02J10k03n5M2K26L5J7
4319A83j27o5L1j85M23k53j49O3Q4Q6j46L63k41k27O9K27l43L10j37Q3k30K52
$$ plain form
4153 -194 -106 -151 -123 197 -233 -160 -114 88 -31 -334 35 -125 -216 -141 -325 -1 67 -291 -180 65 -378 6 -91
4176 -91 141 494 -134 -134 -245 -170 4 117 -159 105 -241 -125 -164 -163 -104 266 -126 -78 -130 85 -405 31 -161
4199 -161 -48 -126 -224 154 -135 -304 278 80 -153 116 252 -74 264 105 98 160 121 33 200 -173 14 342
4221 342 288 -144 227 135 141 124 60 72 238 -5 102 -19 -59 43 32 100 -165 33 0 -37 -51 -310 93 180 -9
4246 -9 79 47 -15 116 -20 130 91 103 73 -39 105 23 -187 118 111 114 108 198 -129 -116 -21 -109 -121 104 25 11 -46 158
4274 158 -265 -16 -9 -230 -219 -22 -61 -11 -196 140 8 -287 -198 35 88 267 0 14 147 25 -341 8 175
4297 175 247 151 -42 424 -63 109 -153 -129 193 0 -155 71 -84 -391 11 121 -82 -137 -95 131 166 183
4319 183 56 -9 22 -163 260 7 -142 -79 5 91 -55 308 67 -160 -91 136 -207 103 -34 49 -181 71
4341G1J88k78j11O1R1J43k17q6L03j06j81K77J23k99o8J30J44j28k27J88J4J36
4363A68k98J74J60k52j8K57j71J56Nl5K0r1L0k64J23k62L28J6L7r0n4k94L82K28
4387B55m00j32J34J04lP5o3j88M3L02j22K45k03l31L45K87j68j85L40j47l41K38
4409H5J47j80N2j2j48LL86m44L75Q9m29M73l55K86k75R6Pl47J35L88o06J52K92
4432A70k17J02K2j46k86J63K20k95k1N18r5l14K22j25Q4jl00L84o5P5Q8q4o6k63
4456b30L55j33O8LN3J20j75o7K65m24K60k9j08j2j83J71k33L23k7j23J59k9l39
4479c35K42l12O54k38k8KK03j30k07O6JJ06q0p9j47J85k2K72l52M5K26j25J78
4502A25k3k0j07j10L02k38K76m43L13P7k47M59l02K9j24J40p9K96l13k14K79j43
$$ plain form
4341 71 259 -19 -130 -69 22 165 -52 -138 165 59 -122 155 278 -21 -89 41 185 57 -170 18 32 168
4363 168 -130 44 204 -48 -66 191 20 176 181 146 166 75 105 -159 -36 -298 30 46 83 -7 -61 -355 27 255
4387 255 -145 -277 -143 -39 -42 33 -30 -218 -175 127 5 250 47 -284 61 348 180 -5 335 188 -153 85
4409 85 232 52 104 92 -56 -53 333 -111 264 353 -76 397 42 328 53 149 156 -191 -56 332 -274 -122 170
4432 170 -47 55 77 -69 -355 -192 28 -267 -288 230 135 -179 43 -82 2 1 -299 85 20 95 183 99 33 -230
4456 -230 125 -8 60 63 116 236 61 -6 259 -165 95 66 -42 -54 -237 -66 -299 24 -3 -126 33 4 -335
4479 -335 -93 -405 249 11 -17 -15 188 58 -149 -83 -82 24 -56 -135 -282 -97 -119 153 -199 -154 72 -53 125
4502 125 102 82 -25 -135 167 -71 205 -238 75 152 -95 364 62 91 -33 107 28 324 11 -203 76 -67
4524f7K93k30k4J90k71K57k36J57M6k31M45j55j19l84K68j78j5M39k56O4j38o6
4546b11J67k8K37j19k0L0m6k8J63k55r1Q7k17m5N38m39Q5J98o6l12J52K8J19j6
4570h9N0q4l5J19n0p6J93j38p2n0K90k76K64j87k2L1L33p6r6R2l44R7L54k13J2
4595B7J12K6N8q6J6L0k38K16p1M3j01q4K74l65P6O6k46K16K20l92K18O0j38j35
4619a98M17l63L26J15k93j65K75p8j45K00j08J25j49J73J05q6k51mK08K23n4k30
4641D3M0o8j87K28j04q6%K60j27j72L06j03l12m1K37kj24L46j14j03n3p1j12J80
4665a39J95j62J1j24K37k70k5J99J89j43j66K64m8l50j27K94J60k96J79J76l8
4686A6J8K19l98L71p0j28N62o54M3j50M83j03j96J46k6q0J85j16P7n4PP4k79R2
$$ plain form
4524 -67 226 -4 -28 162 -109 148 -88 69 115 -116 329 174 55 -329 -61 -239 -254 185 -71 -7 -145 -211
4546 -211 -44 -72 165 46 26 56 10 -18 145 -110 -201 -114 -331 -376 162 -277 -192 6 -60 -372 -220 -192 -73 -89
4570 -89 -39 -123 -158 -39 -89 -165 28 -110 -182 -232 58 -218 46 -141 -163 -132 201 125 29 121 -223 -126 228 15 27
4595 27 139 165 223 137 153 183 -55 161 90 133 32 -52 222 -143 -67 -1 -247 -31 189 -203 15 75 -63 -198
4619 -198 219 -144 182 297 4 -161 114 36 -109 91 -17 108 -41 132 237 151 -100 -104 104 327 273 43
4641 43 83 15 -172 56 -48 -134 -134 126 -1 -173 133 30 -282 -323 -86 -88 -212 134 20 -83 -136 -207 -319 -139
4665 -139 56 -106 -95 -219 18 -252 -277 -78 111 -32 -198 66 18 -332 -459 -165 -5 -301 -122 54 16
4686 16 34 253 -145 226 156 28 590 -64 -21 -171 312 209 13 159 133 53 238 122 199 145 152 226 -53 39
4710C9M7J44j81M1m5r4P6k32K80j60J14q0l18L63l1j0N97m22K18l48J08j42K22
4733A86l51R9j85L17j4j97K61k50K83O0l33L00m30N0K88j51J59Lj48K4o7nK57
4756A56k25K07j33k90K25J54j88J72J40m04k1M9L15l96K09nk36PL14l3m2k2K6
4779b1j73L04jnl46K08K23l54M04m08j14L37j46J26k51L13q4j48J91m8J08J08
4801B23l3k42M9J19n7m6p4J49J27k84K26k31L25l43%J61%k6p9j0J77P0j09O9n2
4826A09j33j86Q0L60k22k26L48Nm7p2K6J00m41M35l5q4Q8K5M2j09Q1q8L7n8p6
4851d1j12L01k81J23K72m02J30L7q8J67j98Q5j35M33k11o1J89j97N7k26k0J29
4873d9o5J79j65M67k99k4J18l26J44L1l20K98J56j28J33k86M0N6j72K22l3j80
$$ plain form
4710 39 86 230 49 90 45 -49 27 -205 75 -85 29 -51 -369 -6 -37 -47 550 128 346 -2 106 -36 186
4733 186 -165 -66 -251 66 52 -145 116 -134 149 209 -124 176 -254 -204 84 -67 92 95 -53 -29 -96 -101 156
4756 156 -69 138 5 -285 -60 94 -94 78 218 -186 -207 -158 157 -239 -30 -35 -271 -264 50 17 -25 -47 -21
4779 -21 -194 110 109 104 -242 -34 189 -165 239 -169 -283 54 -92 34 -217 96 12 -136 55 7 115 223
4801 223 190 -52 -3 116 59 13 -61 88 215 -69 157 -74 251 -92 -92 69 69 43 -36 -46 131 201 92 161 109
4826 109 -24 -210 -130 230 8 -218 130 135 88 16 42 142 -299 136 101 17 105 130 172 63 144 56 93 35 -41
4851 -41 -153 148 -133 -10 262 -140 -10 27 -61 106 -92 -7 -142 291 80 19 208 11 68 -158 -178 -49
4873 -49 -114 65 -100 367 68 44 162 -164 -20 11 -309 -11 145 17 150 -136 -96 -40 -212 10 -23 -203
4895b03L47l73K27j28N2P2l43N63j72k4K13l26mk5J87k02j76J32K18P1J9j37J82
4918A70m06N82m06N5j36P8q6m4M19k77J75N0l33J45r6J79q5J65j74K0k6O2J21
4941A52k04O5R7L6k07o3L64k59J60l13L33k81r4P6L2P4J53r7j76J74k82N29j48
4964A21k21k63L42j56J91P6J2K58k83N0o4J60k14j11O4K96j62l7j4L05l85K40
4986B05m17K16O5r2k2J12q9N6k10L6K44rl6j01j0J49j17m41L48N6K38j7j28Jl8
5011aO0k57M58m37K76N3k49K17j42m7J45K01m59K09r5J63j2k05K45j33P6J93l83
5034a24R7j22J72J7J28l37K2j5M42l43k7L0M3N2L4L08k98n4J63Nj05k39K37l92
5058c06M70j69K46LJ89o14M4J08k18J26K70m6k16K97l95O6J36K56k67j65J27K97
$$ plain form
4895 -203 144 -229 -2 -130 -78 -6 -349 214 42 18 231 -95 -99 -124 63 -139 -315 -183 35 106 125 -12 170
4918 170 -236 346 -60 -5 -141 -63 -149 -193 226 -51 124 174 -159 -14 -110 69 -16 149 -25 -5 -31 31 152
4941 152 -52 13 110 146 -61 -124 240 -19 141 -172 161 -120 -214 -138 -106 -32 121 24 -152 22 -260 269 121
4964 121 -100 -363 -21 -177 14 90 102 360 77 127 63 223 9 -102 -38 258 96 59 45 350 -35 205
4986 205 -212 4 69 -23 -45 67 -22 34 -176 -140 104 95 59 -42 -52 97 -20 -461 -113 -57 181 164 36 37 -1
5011 -1 59 -198 260 -177 99 152 -97 120 -22 -69 76 277 -182 27 -68 95 83 -122 123 -10 66 259 -124
5034 -124 -27 -149 23 40 168 -169 -147 -162 280 -63 -90 -60 -17 35 69 377 79 25 188 193 88 -151 86 -306
5058 -306 164 -5 241 244 433 -181 -137 -29 -247 -121 149 103 -113 184 -211 -145 -9 247 -20 -185 -58 239
5080B39l51R8J28k16M5p9P0o5J85j26k60L78J40k20pJ50k76k0K12l2J46j93J26
5103G2j73m2J70L49k21l35J01J99j08L14n03J35J60k63q9J74m0K37k75J75M1k04
5125a26K56k24L31l0k04k38L22J29j16k70L16M2m90L36k3J7j7Q5j2k19K39k71
5147a67K00n5k90K01J96m8j37p8J4J13K64J3n07O30l96l19J51M5Q3J67L5j40M3
5170A8oK0M4l51J63O9m4j23J13J68j18j85K38j43j3J59K86l11J82N6l26O5K33
5193A94k69M7J43M6k02K9k04L00k17K43O6j3k1l94N53lk26p2K17l50M31k5j34
5216A39m5k40J39K64j02j70l6j35K08m0j04L54n57J81J51R4K4R1j81J2o1J36j42
5239b0k19K94O0j04P5n4M1J46k73J03j90L38j03j73J56JP3k12L64k57k66L93m47
$$ plain form
5080 239 -112 -14 114 -102 -57 -136 -66 -131 54 -72 -332 46 186 -34 -41 109 -167 -187 25 -7 139 -54 72
5103 72 -101 -143 27 376 155 -180 -79 120 12 326 -177 -42 118 -145 -234 -60 -100 137 -138 37 78 -126
5125 -126 130 -94 237 207 3 -235 87 216 100 -170 146 188 -302 34 11 28 11 96 84 -135 104 -167
5147 -167 33 -22 -312 -111 85 37 -100 -178 -164 -51 213 226 -281 349 -47 -366 -215 -170 -87 80 115 -25 18
5170 18 12 32 76 -275 -112 -43 -87 -210 -97 71 -47 -232 6 -137 -150 9 295 -16 166 222 -104 -39 194
5193 194 -75 -28 115 161 -41 -12 -216 84 -133 110 176 163 142 -252 301 298 72 0 217 -133 298 273 139
5216 139 94 -146 -7 257 155 -15 -51 -186 22 -18 -122 232 -325 -144 7 101 125 216 35 47 -14 122 -20
5239 -20 -239 55 115 11 86 32 73 219 -54 49 -141 197 94 -79 77 78 151 -61 303 46 -220 173 -274
5262b74K64L9j42O7K9j44K24N8r3M2p7j38J33k46O4m0R9Q2N7M4j76j25j5N25k97
5287d0J3J52p6j66L78l37J12j43o6K46j73j74K67j54n9M29l23K24J9j99J32o7
5309elJ14NR7l59j6J28L72k74j18M8J39L6j1K8q4j79J41J15j82j62J36J13p0j16
5334a07N5n3J00o1Q6k40P1J87j93K20jk57P4K10k90K77P0j85j00Q3j5L24k61j0
5358a6m13J61O75k81l91J86k5r5K37r0J2k16J5K67j74n3L60j54j00RJ38j7n1K8
5382A2M5M0k24L40k98J32k03K38k75r8K16J13j67K00J77m89J46K41k78K52j2k45
5404a37J70k9K5n9K65l85J66J5j84l2J34J22R0j89R6k36J34N8J18j49J22j43P
5427b1K24n4j75k23M80o6J64k25K5j93j85J29J95J5k54J6L08L7k35K47j53m5j00
$$ plain form
5262 -274 -10 29 -113 -46 -17 -161 63 121 28 70 -7 -145 -12 -258 -194 -234 -135 -53 4 48 -128 -253 -268 257 -40
5287 -40 -27 125 49 -117 261 -76 36 -107 -173 73 -100 -274 -7 -161 -220 209 -114 110 129 -70 62 -5
5309 -5 -8 106 111 208 -151 -167 -39 333 59 -59 -11 128 164 153 181 97 -82 59 174 -8 -170 -34 79 9 -107
5334 -107 -52 -105 -5 -66 20 -220 -149 38 -155 65 64 -193 -119 91 -199 78 148 -37 -137 -54 -69 255 -6 -16
5358 -16 -429 -268 407 126 -265 -79 -104 -199 38 -52 -40 -256 -241 26 -148 -201 159 5 -95 -86 52 35 -16 12
5382 12 57 97 -127 213 -85 47 -156 82 -193 -291 -75 38 -129 71 248 -241 -95 146 -132 120 108 -137
5404 -137 33 4 29 -30 235 -150 16 31 -153 -185 -51 71 161 -28 68 -168 -34 24 142 -7 115 -28 -21
5427 -21 203 149 -26 -249 231 165 329 104 129 -64 -249 -120 75 90 -164 -148 160 197 -38 209 56 11 -89
5450h9J52K3o5j48L77m82K19k15M54m67K72l5P3O0k22K7l4p8O4N1J30o1O3J10
5474A79j19L92m09M6k50K11k17J97P2j22K49l21L12j17p3k75K41o0K17l66J35
5495g8L45j40k26L48l20l0m6K24K49n49K93J42q0k31k2K81l64L28Q2l28K89K6
5517A93k76K48j57K29l7j03Q8P3k74R4n8L04m85J29J50j37j40P3K77l51mj6L17
5540A37k55O6j53J98M1j99K51M5j67r4J2J31j77P2L9N1N1n4j17J92j72nL53j99
5564D7J15q6k34r3K54o8K15o3l7K05l08J79J21j62j08JJ45j27L17p4j77l21L52
5587I3O6k14K31k31j4Q7q7j05L38P6l91J52LJ63m04O6k64M64j5j2J57k30K05l22
5611a88K71l05K63k47J8J24oj28o1L67l70K48K3J82l39L67P5m19J34J20Mj04j10
$$ plain form
5450 -89 63 86 21 -127 250 -232 -13 -228 226 -241 31 -4 69 129 -93 -66 -100 -178 -114 -63 67 6 69 179
5474 179 60 452 43 89 -161 50 -167 30 102 -20 229 -92 220 103 30 -245 -4 -64 153 -213 -78
5495 -78 267 127 -99 249 -71 -101 -147 77 326 -223 70 212 132 -99 -121 160 -204 124 206 -122 167 193
5517 193 -83 165 8 237 200 97 185 258 -16 78 20 324 -161 -32 118 -19 -159 -86 191 -160 -164 -180 137
5540 137 -118 -52 -205 -7 34 -165 86 131 -36 -130 -118 13 -164 -92 -53 -2 49 -5 -122 70 -102 -107 246 47
5564 47 162 76 -158 -251 3 -65 150 87 50 255 -53 126 247 85 -23 -22 123 -4 313 239 62 -259 93
5587 93 159 -55 176 -55 -69 18 -69 -174 164 240 -151 1 4 167 -237 -171 -435 29 14 2 159 -71 134 -188
5611 -188 83 -222 41 -206 -188 -64 -70 -198 -259 108 -262 -14 9 191 -148 219 294 -125 9 129 133 29 -81
5634h1J77J0L16k51J38l56Q2mK05m7j89J84p0k35Q0L9K01j06l0l23K77m20M18
5657A5L3j62M31m06J10j2k39K21l3M22l07L3j84j04L57l57J58K57o9k20q3K66
5679A27K5Kp2j48R5J29Q8m36M44l25L61N1m02J37MQr8K10k50K7or3r5q5K50P0
5705A8Qk69M69k71J52l50J61o5M16p6Q9j35m64L41J11j50j3q3R3J41k25L61l33
5728g4l7J45RJ15k65J08j1L38k19k52K87q6k58P1J89m11L37L5K2J4j18K0m0P9
5752bk26QK54K7m42N61l17J07L30m22P4Q6m27N68l67J14l02L27j31K11M8j20k08
5775b49M58l42K65j69j40J46K55j99k87M07k6n2J64k05L4j64J81K9l04M29j82
5796D9J00j34j40m2K33q6L73j98k40J10p5Q7m6n7L80m07J53j27R1kj42k38M97
$$ plain form
5634 -81 96 106 422 171 309 -47 35 31 236 189 0 184 114 -121 -41 -2 199 93 63 -260 17 -403 15
5657 15 48 -114 317 -89 21 9 -230 -9 -42 380 73 106 -78 -182 175 -182 -24 233 164 -56 -139 127
5679 127 152 154 82 -66 29 158 246 -190 254 -71 290 341 -61 76 80 88 -10 200 -50 -23 -29 -122 -217 -302 -52 18
5705 18 26 -243 226 -45 107 -243 -82 -147 269 193 282 147 -317 24 135 -15 -28 -111 -18 123 -102 259 -74
5728 -74 -111 34 43 158 -107 1 -10 328 109 -143 144 58 -200 -129 60 -351 -14 21 43 57 -61 -41 -81 -2
5752 -2 -228 -220 34 61 -381 180 -137 -30 300 -122 -48 38 -389 179 -188 -74 -376 -49 -180 31 79 -41 -249
5775 -249 209 -133 132 -37 -177 -31 224 25 -262 145 119 67 231 26 60 -104 77 106 -198 231 49
5796 49 149 15 -125 -167 66 -20 353 155 -85 25 -50 37 -9 -66 314 -93 60 -67 24 22 -120 -358 139
5819A39j13J49Ql36J63k60M84l76J69P4j26K25j85j47K73j01j8oj52K46m45J08
5841b27K90J37k82K4K36j57J23Q9k17L3k38K48q5K73j49l07R0J87k56N82m98J2
5863i2O5k9K79m5l16K00j14k24K04K0J35j53k30J94k10J26L28k13p1n6K5L97l37
5886a17j24K21O8J09k70l6n5K34j35K17k16J39N5K0m9J8k41M4q6K37L1J52j88
5909B8J95j31k93K47l1K29j87k7j37K99k01M7m5k90K96k12M00k12j13o2J71r0
5931a19P5J00j59N7j14J82L8J38r8J6j7l73rK79k6J34N4k43o5j75M18k03J58k70
5955b22J50m7K09l09m2L71n2Q2l91M42l18J20j55J87M3j37P4J34m9k21k94M55
5977C0m7O0j12j03L17O5k4l97K67J55m46J79J66j87L7q9L45k59m1K73k07j93J
$$ plain form
5819 139 26 175 183 -153 10 -250 234 -142 27 101 -25 200 15 -132 141 40 22 16 -136 110 -335 -227
5841 -227 63 200 -82 -58 178 21 144 233 16 49 -189 59 -26 247 98 -209 -119 68 -188 394 -104 -92
5863 -92 -27 -56 223 178 -138 62 -52 -276 -72 -52 83 -70 -300 -106 -316 -190 138 -75 -146 -202 -177 220 -117
5886 -117 -241 -20 48 157 -113 -149 -204 30 -105 112 -104 35 90 110 61 79 -162 -118 -204 33 64 216 28
5909 28 223 92 -201 46 15 244 57 30 -107 192 -9 38 -7 -297 -1 -213 187 -25 -138 -200 -29 -119
5931 -119 -44 56 -103 -46 -160 22 60 198 100 116 99 -274 -283 -4 -30 104 158 -85 -150 -325 93 -110 48 -222
5955 -222 -72 -119 90 -219 -261 110 58 140 -251 191 -127 -7 -162 25 68 -69 5 139 90 -131 -425 30
5977 30 -17 43 -69 -172 145 210 186 -211 56 211 -235 -56 110 -77 -40 -129 216 -43 -84 189 -18 -211 -210
6000b10K10mq0L9LR2K03o00L38K62k07Q1k42K19P2j15j83J35o2n5J86k92L73P5
6024B38m05L00k97j88J70qL9J23O2J42k20K10l60K7J24L3J87l75J20L45k58q4
6046g5N2j54K6J88k26K56J73m61K09j40K80j79j08K58k33K09m89L69O3oj29k10
6068c27K81K18k40O3k27K37J37j84J65j47j62N2L81k1j43j24J8k17J47p4R8L45
6090B76m56K56k40Q9k21O08r6k70Q3l01K27j49K85m7k25OL76k50r1J46K1J22l43
6113a94M37k80J99l80J90J22l19j11L51P6Q1j29r6n6J35O3k73K16p1j08R9j07
6135a55L08K56n73L53j81j73N07k15l5k42J21k35L51Mk35K33J9l04k2K49J41k52
6157h0M3L2J40l19K19K5K3J04k61J79k14K25J74n52K04N1l17M94k2j73m7R6M7
$$ plain form
6000 -210 0 -4 -84 -45 -42 50 253 -347 -9 253 46 127 -115 104 176 61 -122 13 -49 -104 82 -210 163 238
6024 238 -167 133 -164 -352 -182 -190 -151 -28 34 176 -44 166 -194 -167 -43 -10 177 -198 -78 267 9 -75
6046 -75 -23 -177 -151 37 -189 67 240 -221 -12 -152 128 -51 -159 99 -134 75 -414 -45 18 12 -117 -327
6068 -327 -46 172 -68 -5 -232 5 142 -42 123 -24 -186 -134 247 226 83 -41 -23 -240 -93 -167 -69 276
6090 276 -180 76 -164 -75 -296 312 216 -54 29 -272 -45 -194 91 44 -181 -175 201 -49 -140 6 27 149 -194
6113 -194 243 -37 162 -218 -28 94 -225 -336 15 91 172 43 -53 -109 26 89 -184 32 -39 -147 -48 -155
6135 -155 153 409 -164 189 8 -165 342 127 92 -150 -29 -264 87 91 -144 89 108 -196 -218 31 172 -80
6157 -80 -37 -5 135 -184 35 60 83 187 -74 105 -109 116 290 -262 -58 -7 -324 170 148 -25 -72 24 71
6180G1K9k76k2Q0P6J73j08m57K17m4L43j42J02j77P9J73n5k97K32m1Q3j34J10
6203A5l3M0%q8J7L1j25L45j64k3P2J56k22J85k60k2k0P1N7r8M69m75K99p5k49
6228i7j6K34m11J42J16P3m4l07N19l6m13L5L07J7m19L57J05l22M06l20K82l25
6250a17K35Q6l10N21m56j93J46p9p4M50m3k54L18l18K16m3n8j33j23K98k30N8
6272a03k8J25R0Qj7n1K45l54L2J82l92K44L20k14Q7m1pj54J91j46l61K06R3P2
6296B7M8OJ35j87N8k00J61j3J83l3l47K85n4lj31J65P5j61n5O2J77l19L21n1o9
6321H0rl03L28Q5R1j79J36j93k97J68K39j67J05rL7k34j3K9K67k31K76m53J40
6344a07K04k07QL41k96l4J45j06K39k75J10k11L62J19m15j09N2J63l09J56K95
$$ plain form
6180 71 100 -176 -198 -118 -42 131 23 -434 -217 -261 82 -60 42 -135 -56 117 62 -235 -3 -44 39 -95 15
6203 15 -18 22 22 -66 -49 -18 -143 202 38 15 87 243 21 206 -54 -76 -96 -25 32 -66 403 -72 227 152 -97
6228 -97 -113 121 -290 -148 -32 41 -3 -310 209 173 -240 -205 102 119 -300 57 162 -160 246 -74 208 -117
6250 -117 118 204 -106 415 -41 -234 -88 -167 -241 209 166 -88 230 -88 128 85 27 -106 -229 69 -161 -103
6272 -103 -131 -6 84 92 75 24 269 -85 -53 129 -263 -19 301 87 174 133 126 -28 163 17 -344 -138 -45 27
6296 27 75 81 216 29 87 -113 48 35 218 185 -162 123 69 66 -65 100 175 14 -41 21 198 -121 200 149 80
6321 80 71 -232 96 181 272 93 229 36 -261 -93 146 -21 84 75 112 -122 -135 -106 161 -70 206 -247 -107
6344 -107 97 -110 -102 239 -57 -91 54 -52 187 -88 22 -189 173 292 -123 -232 -180 -17 -326 -170 125
6365A25l22M08l51kQ2K66j16r0K9j43k9j07M02k65p7l1J57j21J66M2j13Kj49j12
6389c49J34K60r9j11K87j30L06k84k61j36L85K76k83J63p0l21J15J33J48m23J56
6410a04J57j03RJ08l22J55K71k83J09p0l8j40M63j80j0Q4J02l33N4K4J59k18L29
6433B23k37J14o7p7O1j61j87L88j36J62j04K55l29rJ18j4K9j18K76k99J35L8Q5
6456A46l23J81K1j22M8J57k74L6J44O8j56k0K22k54M37o81M26n4J35j0j91J37
6478G3j78J62N0j3J2J06k32j41r1J60L2K34o2m60L09J70%j65J20k5J7L3n0O3n5
6503F9N1j20j28K61m12J03J39O4j5J66j62J01J0j36P2j93K46L8j80J23j07j27
6525a37L2R7L28l76P6%J62j45o2j14P2J1K69J82n02j25J18J94R4p3J2m1k32K26
$$ plain form
6365 125 -197 211 -140 -142 -60 206 90 0 29 -114 -143 -250 152 -113 -190 -221 -64 -185 -19 23 -90 -88 -237 -349
6389 -349 -215 45 -54 -165 122 -8 298 14 -247 -383 2 278 -5 158 88 -233 -118 15 163 -260 -104
6410 -104 53 -50 -41 67 -255 -100 171 -112 -3 -73 -111 -251 212 32 22 106 208 -125 -71 -47 112 -106 223
6433 223 -14 100 33 -44 17 -144 -331 57 -79 83 -21 234 -95 -104 14 0 29 -89 187 -112 23 61 146
6456 146 -177 4 25 -97 -49 108 -166 -130 14 82 -74 -94 128 -126 311 -370 56 2 137 127 -64 73
6478 73 -105 57 107 94 106 212 -20 -161 -252 -92 -60 174 112 -348 -39 131 131 -34 86 61 78 111 61 124 69
6503 69 120 0 -128 133 -279 -176 -37 27 12 178 16 117 127 -9 63 -130 116 154 -26 97 -10 -137
6525 -137 -105 -8 320 -56 20 20 182 37 -25 -139 -67 -56 213 395 -107 -232 -114 80 174 101 113 72 -160 66
6549F6k1l0J22j43Q8K12m75J08JK49L2l36P2o4L58k27j71M74j76l63P6J33J22
6572A07q2k5J6K16l08L3J15N8l0k00J32rj12n5N8K23m12NK87j42M1J95j96N8o0
6597h7J37j17K05j95K03km06L59j1J6nq1j17K7p6K64k16k6R1L69j16k00P1j97
6621a10K99k22M3J15k24J01l9J92k34j34K45j07m4K91o7k87M17m9j71k55K91k64
6643b13M09k5j37K24j38j41j13J40J58l06J4J54J55k98m6K81K7k69R1N2K9m7j01
6666a00L6K2R4M3j23J56j43j0J52J97o08LKJ48M11l10j34J15Q4n6j57k6J23J19
6690C8k08K44j80O8j83J36l08K48J42j13J99O1lj73K8J82k47j4K26L6k36o9J07
6713a9j82%L09j27J7K51q8M5j55k03J37J5j46O0J92o1J37j03n0M3q0n9j3K83j27
$$ plain form
6549 66 45 15 137 -6 82 294 -181 -73 -72 177 209 -127 -55 -119 239 12 -159 315 139 -224 -148 -15 107
6572 107 25 0 16 232 -76 -43 72 130 100 -100 32 23 -89 -144 -86 137 -275 -270 17 -125 -84 111 -85 -27 -87
6597 -87 50 -67 138 -57 146 144 -262 97 86 102 97 16 -101 -74 -150 114 -102 -128 -37 332 216 16 87 -110
6621 -110 189 -33 10 125 -99 2 -37 155 -79 -213 32 -75 -119 172 105 -182 235 186 15 -240 51 -213
6643 -213 196 171 34 258 120 -21 -134 6 164 -142 -128 26 181 -117 -163 118 145 -124 -33 19 48 1 -100
6666 -100 -64 -42 52 95 -28 128 -15 -25 127 324 -284 -281 -279 -131 280 -30 -164 -49 35 -21 -178 -204 -81 38
6690 38 -170 74 -106 -38 -221 -85 -393 -145 -3 -116 83 144 141 -32 -4 178 -69 -83 143 179 -57 -126 -19
6713 -19 -201 -201 108 -19 -2 249 161 206 51 -152 -15 0 -146 -86 106 45 182 79 29 72 -8 -67 -80 203 76
6738G6Q4k07j32K08J25m49l2J99P1J94J90o58J72J10j13J53j90O1j79L72k11J32
6760b4J63k51KL74k47J7J60l45J84j89K31P9j74N8P8j93J60R4q6j10K7K15n02
6783b79O7o8O26l60K70l30q9M18m03K76k22L2O8r9O1M9J91j88J38m20N58k44m
6806D8K69Mm76J06K0M7jJ29L6n1o2j06J63J5k65P8K2K89o21J73J72rL30j49k4
6831A37j09O5k33NK29K11j51j72J87o6L9l46K83J72k65j96J29J85k13L44m3j51
6853D1p4P1j25o5L72k79Q1j07K72k24M1j36o0L04n80N95k03qJ5l21K16M22j60
6876H8J67l32J89lj89M17p14L46K04j37J13m09K01J27j75O4J18j2j05P3K0J25
6898A76k71J09j26K29k08R3O1k9j81L50k8l69O5K60J0L5o0j51J44J31l3J01k60
$$ plain form
6738 76 160 -47 -179 29 154 -295 -327 -128 -57 137 327 -331 -159 -49 -162 -9 -199 -138 -317 55 -156 -24
6760 -24 139 -112 -110 264 17 34 194 -151 33 -156 75 154 -20 38 116 -77 83 177 91 -19 8 223 -279
6783 -279 -212 -280 346 -14 256 -74 -163 255 -148 128 -94 -62 6 -93 -32 17 208 20 158 -262 296 52 48
6806 48 317 321 -155 -49 -29 18 17 146 182 131 69 -37 126 141 -124 -46 -24 265 -356 -183 -11 -20 310 161 137
6831 137 28 93 -140 -135 94 305 154 -18 169 103 142 -204 79 251 -14 -210 -81 104 -109 235 192 41
6853 41 -33 38 -87 -152 220 -59 22 -85 187 -37 4 -132 -192 112 -468 127 -76 -84 -69 -390 -174 248 88
6876 88 255 -77 112 109 -80 337 -377 -31 173 36 149 -260 -59 68 -107 -43 75 63 -42 31 51 176
6898 176 -95 14 -112 117 -91 2 63 34 -147 203 175 -194 -129 131 141 176 116 -35 109 240 207 308 48
6921D8k22J74j03Kj16L24j54k55KJ2N6L43j34j38J75M1K58m62J65k45K29j3j93
6944b06q4K81k62K25J37k11M2K19k12L18l78j0J21J47n2K33k71M9k48J82l2P0
6966E8J56k39q3M24m76O3l31J75L21o4j02O2N7k50K37M9j43jK31k85NK13J3j41
6990e1l4J05l44N01j77j07J11r5K13j42J48l06R8l2Q8N8j87L21j05k90J42K49
7012A64r8J25J99k48m51L71j31j1K56l98K81j18K24j82j40j46N26J54l30n3J74
7033A68k03j7J45M6j73J99L9l6k78J47J44l99M8L50k34P6J20m21N06j2j65j15
7055f5n3k8K21m47L29J64j81O1k33K90l0j80J48KJ29r5j71N70m61R4Q3K08o29
7078b74J46L29n9o2l94L52J98k30k25J02J41P6j1O3k94m1K73J6R7k82R9J08m5
$$ plain form
6921 48 -174 0 -103 -101 -217 107 -47 -302 -300 -288 -232 111 -23 -161 14 55 313 -149 16 -229 0 -13 -206
6944 -206 -290 -9 -271 -46 91 -120 -78 141 -71 247 -131 -141 -20 127 75 308 37 86 -162 20 -12 58
6966 58 214 -25 -108 316 -160 -97 -428 -253 68 4 -98 -36 21 -229 8 57 -86 -87 144 -141 -136 77 90 -51
6990 -51 -85 20 -324 177 0 -107 4 -91 122 -20 128 -178 -80 -112 -24 34 -153 168 63 -227 -85 164
7012 164 66 191 390 142 -309 62 -69 -80 176 -222 59 -59 165 -17 -157 -303 223 377 47 -6 168
7033 168 -35 -52 93 139 -34 165 204 168 -110 37 181 -218 -170 180 -54 22 142 -279 227 215 50 -65
7055 -65 -118 -146 75 -372 -43 121 -60 1 -232 58 28 -152 -4 -2 127 32 -139 431 -30 64 147 355 -274
7078 -274 -128 201 142 80 -314 38 236 6 -219 -117 24 100 89 152 -142 -183 90 106 203 -79 20 128 83
7101H3N1l97L01k6K28k84N0m6m3K85Oj74k05M17j06j82q0j04%k99R86m20l71M71
7125A41l29M23mm24K9L07j44J63j59O4n8K22r6l1j41J09R7k20K46j42k06K93j98
7148e8o6L2j37K02K08j03l38L39K57l11k14L72l74K31J58j53m4J95m81L16j01
7169g0J20j63m1L60k08J69o2l66L69j31p9J1J46J87Rj77j7j47P7m1m7Q5NJ06r5
7194@m8M0J61j70j16J38J27L9p9l65N9K76M0l95N03l62j15K58J17O3J9k01QQ6
7218H3l57M79p2K1l44P2Q6j00Q6N0r9P1j60J56K24k32J4K8j88P2J16J36n74P55
7242C23o29K88K57m53K69J2n1Pk99kJ84K39j24j29J5J91n6j57K13m10L62j23M8
7265b5j85L4K35q7J22K4k63L4J8PK84k66j09K23j93J92J16j93J20P5J18k62k20
$$ plain form
7101 83 134 -263 38 12 240 -44 6 -40 -83 202 208 34 -171 246 140 -42 -122 -226 -226 -525 461 41 -330 141
7125 141 -188 235 231 -193 -164 143 -1 162 3 67 9 231 135 104 -37 72 169 -51 195 53 -153 140 -58
7148 -58 -124 -92 -229 -27 181 78 -260 79 336 25 -189 183 -191 40 198 45 1 196 -285 31 -70
7169 -70 50 -113 -154 206 -2 167 105 -261 108 -23 -102 -91 55 242 251 74 57 -90 -13 -54 -101 -16 -11 95 0
7194 0 -48 -8 153 -17 -133 5 132 171 92 -273 -214 62 102 -293 210 -152 -267 -9 108 171 190 -11 -3 83
7218 83 -274 205 133 154 -190 -118 -32 -132 -46 4 -95 -24 -184 -28 196 -36 -22 6 -182 -110 6 142 -432 323
7242 323 -306 -18 239 -214 55 67 16 23 -276 -278 -94 145 21 -108 -93 98 42 -115 98 -312 50 -73 -25
7265 -25 -210 -176 59 -28 94 118 -145 -111 -93 -86 198 -68 -177 46 -147 45 161 -32 88 163 281 19 -201
7288b01K14k56P4J62rL35m39K20j51O4L24m92J87N1j94K3K20j02j11j1K63j29
7310D2Q2k51R6Q2M1J28j99M1k68J87N8oJ35k86j78K28L12j51k1K1j24J53k3m15
7334c16L51m9j38K15j46k03P7l3L67k55M4%J76j50J19o9M6J49r4j80L9n9%rq0
7359a98M7J55R4l41J10J39k66J15J83k23K41J16o3p5n0m6Q6j2j25L0K49m61J07
7382a88J95J76k14k9J65k73J14p1k20L78n5K19p0l06K69J38j80K21l60K2J76q9
7404A8J59j67j83J1K28Q6l10r8M7L31j72p1K51m7R6j14l0MJ03q6nj51k1J7j13
7429b17L24j36r8P6J22l33N63j75j61Oo3J01K07m68L38k34k5L55l86N9J45j69
7451a69M60q7q3k6o8q0J45o3k03P3K61n0q6R4j1l9j72M21l70L22l05p9J08j68
$$ plain form
7288 -201 13 -243 -169 -7 -16 319 -120 100 -51 13 337 -155 32 83 -111 -88 132 30 -81 -92 171 42
7310 42 124 -127 -31 51 92 220 21 62 -206 -19 39 33 168 -118 -296 -68 244 93 72 93 -31 122 99 -316
7334 -316 35 -14 -152 63 -83 -286 -209 -242 125 -130 -86 -86 90 -60 59 -10 36 185 91 -89 -50 -109 -109 -118 -198
7359 -198 -151 4 98 -243 -133 6 -260 -145 38 -185 56 172 109 34 -16 -62 24 12 -113 -83 166 -295 -188
7382 -188 7 183 -31 -60 105 -168 -54 -125 -345 33 -22 197 127 -179 90 228 48 269 -91 -69 107 18
7404 18 177 10 -173 -162 66 152 -158 -256 -209 122 -50 -121 130 83 179 65 35 39 142 56 51 -100 -121 -104 -217
7429 -217 107 -29 -127 -51 71 -262 301 126 -35 -29 -92 9 216 -252 86 -148 -173 182 -204 -145 0 -169
7451 -169 291 204 121 95 27 -53 92 29 -174 -101 160 110 24 118 107 68 -104 317 -53 269 -36 -115 -7 -175
7475a75J89L5j98K8K27j33j02J54J07N8r8k12K61o5K07k63K4j82K65kj37R5K23
7498C06m93M43j60J6m16L92l03L42j59J77q2q1J8N1L23l63M5N7l73L06j70k63
7520c87L11J92j27j55K10j68R4Pj28R2L7J29l75J91J7J4n2R7K10n4m16L52k20
7543a29L18p6k22J04q3j3K36l51M23m74M24k95J43J57r1K09k18N2L17l40J19l23
7565a13o5R2n9Q2J8n4K47p1o1K79m42j79P3K58j90L59N4j96q3L8j34N5K15k44
7589a21L30lj87j40J20j14K74j23k6J44k62O2j32P6j2K11J39p6o45P34j45L40
7611D44m76K43j87j9K7J5j3R6Jk82K70m0o2R8j39J05j45p1J57Oj53J51k9K22k37
7636a8J18p0k46K08K06l74Q4M4L69l32N1J0P8l94L50j28k73L06O4K49k52L3j65
$$ plain form
7475 -175 14 49 -149 -121 106 -27 -129 25 132 190 92 -120 141 76 283 20 44 -138 127 125 -12 83 306
7498 306 -187 256 96 112 -304 88 -215 127 -32 145 63 -18 0 51 374 11 56 113 -260 46 -124 -387
7520 -387 -76 116 -11 -166 44 -124 -30 -23 -151 -59 -22 107 -268 -77 -60 -46 -98 -1 209 155 -261 91 -129
7543 -129 189 113 -109 -5 -88 -101 135 -216 207 -267 157 -138 5 162 71 280 62 114 431 91 210 -113
7565 -113 -178 -86 -145 -63 -45 -99 148 77 16 295 -147 -326 -253 5 -185 174 228 32 -51 -13 -147 -92 123 -121
7589 -121 209 206 19 -121 -1 -115 159 36 10 154 -108 -46 -178 -102 -114 97 236 160 -485 249 104 444
7611 444 -32 211 24 5 32 47 34 130 131 -151 119 79 17 115 -24 81 -64 -135 22 28 -125 26 -3 219 -18
7636 -18 100 30 -216 -8 198 -176 -92 -48 321 -11 40 50 128 -266 84 -44 -317 -11 53 302 50 83 -82
7659h2O3J20K2j98K24K09l00J18k72J85J08j28j71J4K20l48L58j52J70k19o5M6
7681g8k6K07n1r6l23M67j71N3j02l03O01j39m2N2O6K9m39J57O0r4P4M8j66J30
7705h6K12k56J06J81j75j07p5K96r5j01Q3R2J8l15J75K2M3p0j79M68j76j90K5
7728a04J39Q6l4k29J40j4J19n3J38l35q1J10j10K72j8Q5l39K31K10k29KL3K09
7751B28l80n6K74k43K44l34L96j82K76m77Q4N6J31j45K06M5r7jj80M87k02l25
7773a95K43Lr9j50J98j07P1J2j73J76K88l65K63k60M34m42J38j04p3N3J72p8j74
7796a69J83j30Q5O2j04r6J66J49k08j52J20L69m96L97m40L07J25k86J86l0k33
7817a95K39m1j64J81K7j87J19j7j79NM7K44j15k05J63Q8J1j6q9N9OJ3J35l67M22
$$ plain form
7659 -82 -19 101 123 -75 149 358 58 176 -96 89 197 69 -102 -88 132 -216 142 -10 160 -59 -124 -78
7681 -78 -104 103 52 -44 -367 100 -71 -18 -120 -423 178 39 -3 49 115 144 -295 -138 -78 -172 -98 -50 -216 -86
7705 -86 126 -130 -24 157 -18 -125 -200 96 1 -100 -17 75 93 -222 -47 -25 18 -52 -231 237 61 -129 -104
7728 -104 35 121 87 -142 -2 -16 103 50 188 -147 -228 -118 -228 44 26 111 -228 3 213 -16 -14 19 228
7751 228 -152 -208 66 -177 67 -267 129 -53 223 -254 -170 -114 17 -128 78 123 26 25 -155 332 130 -195
7773 -195 48 51 -48 -198 0 -107 -36 -24 -197 -21 267 -98 165 -95 339 -103 35 -69 -142 -89 83 5 -169
7796 -169 14 -116 -31 31 -73 -169 -3 146 -62 -214 -94 275 -221 176 -264 43 168 -118 68 38 -195
7817 -195 44 3 -161 20 47 -140 -21 -38 -217 -212 -165 79 -36 -241 -78 10 21 5 -84 -25 -19 -6 129 -238 184
7842A84j94j52M46j70j05j38P3rK39j4j78j58J33k6J03J21J6j28N2j04R1j97K26
7865A11k20N7m0j5O3m2J10K13k05p3K08l44L40j5l06M04l31j40K63o8K26k46J
7888d9O0Lm0J59j96N3K78n39K90J21k61M38r1k29J42l2k00P3J1n3J70j61J42k45
7912a56J98O9j62J1J6j15j1N4j63K34k36K77J5%J34l38K90l0Q7J3j68j97J60J06
7936H8j78q6J92l25M64j69j2J42j62%k46J34j92K32K57j89l2J82m8K30ql27k9
7959h2j67L84r2k38K3L36p5k58L17R3n30J85J21N0j1k5j6J37l07j20J50K85l0
7982A30l79K39Q6j1j59j04m9K61l4K26j52Q5j1k93J92l65M81l68J67k04K47k23
8004b38M9K27J17j47J18J06k36O8J68l33j70K55n8K8j43M03j27Q2l09K01J27j72
$$ plain form
7842 184 -10 -162 284 114 9 -129 -56 -65 174 160 -18 -176 -43 -69 34 155 171 43 95 -9 82 -115 111
7865 111 -109 -52 -92 -107 -44 -86 24 237 32 -41 167 -177 163 148 -158 246 -85 -225 38 -30 196 -50 -49
7888 -49 11 14 -26 133 -63 -10 268 -271 19 140 -121 317 226 -3 139 107 -93 -20 -9 -62 108 -53 89 -156
7912 -156 42 111 -51 -40 -24 -139 -150 -96 -259 -25 -261 16 31 31 165 -173 117 87 174 187 19 -178 -18 88
7936 88 -90 -176 16 -309 155 -14 -26 116 -46 -46 -292 -158 -350 -118 139 -50 -82 100 52 282 274 -53 -82
7959 -82 -249 135 43 -195 -172 164 89 -169 148 241 -289 -104 17 67 56 31 15 152 -155 -275 -125 160 130
7982 130 -249 -10 76 65 -94 -198 -247 14 -20 206 54 139 128 -165 27 -338 143 -225 -58 -262 -15 -238
8004 -238 -189 38 155 8 126 232 -4 64 232 -101 -271 -16 -74 -46 -189 214 87 169 -140 61 188 16
8026A6q4J99J0r3J20m59M21J12j34l46J72J27pr6mK11l76L96m88M05k68K7n3p0
8050b62J17J68O3J55j93J55q3l17K94k31J05Q2n3J77j6m23J53J39N3k09M1j32
8072b17J95k04L84k20L21l77L17m25J02Q8p1J33K08k21j66J97r9J08j65K05j76
8093h3J51k07J42J53k54J18j5K47k22l4P4n2o7K42j31k55L84k55M3J0k4m2L9P9
8117D1N4Lj58J97j24qj48M21Jn49K60J23L83l71j59l8j94M12m12K87j14O3K16
8140A86m18K68k72J85K8j42M98l28J88j50j07J30R2k32K07ql49L22m1m80M18R4
8162H9l65K39R8k14O6J33Q2K9j59p7R0k5J63M4l01J58j13o4J84J82j99J59l05
8185a06k79K27l6J32J24J41
$$ plain form
8026 16 -68 131 141 48 168 -291 130 242 108 -238 -66 61 54 -42 -46 165 -211 185 -303 102 -166 -139 -192 -262
8050 -262 -145 23 86 241 48 203 120 -197 97 -134 -29 53 0 177 161 -262 -109 30 83 -126 -85 -217
8072 -217 -22 -226 158 -62 259 -118 199 -226 -124 -36 -107 26 234 13 -153 44 -55 53 -112 93 -83
8093 -83 68 -139 3 156 -98 20 5 252 30 -4 70 18 -49 193 62 -193 191 -64 -21 -11 -35 -77 -38 41
8117 41 95 98 -60 137 13 5 -143 278 279 -270 -10 113 496 125 -34 -72 -266 146 -266 21 -93 -30 186
8140 186 -232 36 -236 -51 -23 -165 333 5 193 43 -64 66 158 -74 133 125 -224 98 57 -423 -5 89
8162 89 -276 -37 61 -153 -87 46 128 157 -2 -79 11 -14 149 193 -108 50 -63 -127 57 239 40 199 -106
8185 -106 -385 -158 -194 -62 62 203
8191B03
$$ Imaginary data points
##PAGE= N=2
##DATA TABLE= (X++(I..I)), XYDATA
0@%%%%%%%%%%qJ6j6J6j6K4l2L2m0M8n6O5p3Q8j04J19j34J52j71J94k19K45k75
33a45L07l44L85m29M76n27N84o46P16p94Q79r73J079j199J334j490J671j881K132
52A135k441K826l323L998m972O503r284J5986o2404r3847K6796o290l848J3211
66a15954L3441K1854K8630L724j1382l488n870m0542l0625q934o632J452K0206
79a14120J4105K7438M9190K7338m078J2673J2560k1590k7925j3930j7560p702
91f3601P118J322J2127M1113K7279M105J6342J3734j4046j6552j6177l0649k0166
104c8051l81j0426n454K5257K4547J2669K0260J5511K93L274p494l0750j4006
117d751J557j7900j2312K0838K0187J1026K7529K5757P887J2410P832j6728j4652
$$ plain form
0 0 0 0 0 0 0 0 0 0 0 0 -8 8 -8 8 -8 16 -16 16 -24 24 -32 33 -40 48 -56 63 -71 81 -90 104 -115 130 -145
33 -145 162 -182 203 -226 250 -277 307 -339 377 -417 462 -511 568 -631 703 -787 884 -997 1135
52 1135 -1306 1520 -1803 2195 -2777 3726 -5558 10428 -51976 -145823 -119027 -125317 -129165 -115954
66 -115954 -82513 -60659 -32029 -28305 -39687 -43175 -49045 -89587 -120212 -129146 -135778 -134326 -114120
79 -114120 -100015 -72577 -23387 3951 -127 12546 25106 3516 -24409 -38339 -55899 -63601
91 -63601 -56483 -55161 -43034 -1921 25358 29463 45805 59539 45493 28941 12764 -17885 -38051
104 -38051 -38432 -48858 -54312 -29055 -4508 8161 28421 43932 44225 47499 40005 9255 -4751
117 -4751 -3194 -21094 -33406 -12568 7619 18645 46174 71931 79818 92228 100060 83332 68680
130F8680n984j7395j4926K259Q81O600K3874J3273K361J8853J1013j9568j4969
143G4952n698k5668k6584q847j2877r704J0549P103l89J5225J1527r121n757m852
157I859k2923k0028q080k0001j4725R022N409o21J8159J8504K660P386N360j2035
171b2054q426k774j9400j3217P159l28l061J8744J7846M208J3677J3628o458n636
185f092Q78j5484j6626k618o276o207R544P720L852J7313J2888m839L885O639
199D577j4850j4037M67r928j1524P410O550P93J6562J7828L427R606J1520n058
213B3343m659J968j0899r092O465k64l086J5535J5249K046J1934J4734k973k100
227E8201K832j1756j2603L84p868j0434P287N605k848R776J0373n205q1M192j2843
$$ plain form
130 68680 62696 45301 30375 32634 33515 40115 63989 77262 79623 98476 109489 89921 74952
143 74952 69254 43586 17002 8155 -4722 -14426 -3877 3226 2837 18062 29589 20468 14711 9859
157 9859 -13064 -33092 -41172 -61173 -75898 -66876 -61467 -62088 -43929 -25425 -22765 -15379 -10019 -22054
171 -22054 -30480 -33254 -52654 -65871 -58712 -59040 -62101 -43357 -25511 -21303 -7626 6002 -456 -6092
185 -6092 -5214 -20698 -37324 -39942 -46218 -52425 -42881 -35161 -31309 -13996 -1108 -5947 -2062 4577
199 4577 -10273 -24310 -23843 -33771 -45295 -37885 -31335 -30542 -13980 3848 7275 16881 28401 23343
213 23343 18684 20652 9753 661 7126 6862 3776 19311 34560 36606 48540 63274 60301 58201
227 58201 61033 49277 36674 37058 29190 18756 26043 31648 28800 38576 48949 43744 43663 47855 35012
242C5012j4353j713j1825j4143K26L76n041P555Q672k233N067O968q617p251K032
257G32j1683j3174K295k453p866P548R885j463O756J1565k521k665L320q152r823
272a7699K6o076q864N575M292l140P674J1149k845J464O770o861q930J342o962
287b3085j0626K786K013m880P182R922q34N177J0008l665l708M759n546r242L317
302a6422Q31n873O991R083L59P449J1301n31J014P021m553p062L801k568p941
317B900N565N664k949O093J1017j742J492P374l417o625J610m586r166J264L10
332A4804o402M415O976l475K424P643m235n658K961n429j0686M6j819q861K100
347e196M645m172K384P210k923k492L870m889q281J328l193r526J518L267m997
$$ plain form
242 35012 20659 18946 7121 -7022 -6796 -6420 -11461 -3906 4766 2533 7600 14568 5951 -1300 732
257 732 -10951 -24125 -21830 -24283 -32149 -24601 -14716 -16179 -9423 2142 -379 -3044 276 -7876 -17699
272 -17699 -17673 -23749 -32613 -27038 -22746 -25886 -18212 -7063 -9908 -8444 -1674 -8535 -17465 -16123 -23085
287 -23085 -33711 -30925 -28912 -33792 -26610 -16688 -17522 -12345 -2337 -6002 -9710 -4951 -10497 -19739 -16422
302 -16422 -15591 -21464 -14473 -5390 -5031 2418 13719 13188 14202 21223 16670 9608 13409 10841 2900
317 2900 8465 14129 11180 17273 28290 26548 28040 35414 31997 25372 26982 22396 13230 14494 14804
332 14804 8402 12817 19793 16318 18742 26385 22150 16492 19453 14024 3338 3384 1565 -7296 -5196
347 -5196 -551 -4723 -2339 4871 1948 -544 3326 -1563 -9844 -8516 -11709 -21235 -19717 -16450 -21447
362b1447K642Q336j999L69O554k672n166K924k797p930K299J895n415L229Q028
377a1150j824K249Q851j127l160N438j860o995K295m4n659K713N503k826L139
392d457Q362j800j138O945k353o487L251n77p742J343M235m148K411P471r15o4
408D337O945p07m057M241j196o481K387K687n395K113P736j895J127Q471p26k197
424A7390M909r01o068J959N09o255J045M316l564R4O532k270l190M718k168p424
440I632M64j373q110j472J387n749j504L947l057k614M377k448o033K257j524
455a1820q177J23J329o213n42N443k001p98O392jk344M554L46m523K432J525m639
472a8914J395N541k284Q38P668O09k204O765R12m293K600K089n308P53L166l415
$$ plain form
362 -21447 -18805 -10469 -12468 -12099 -5545 -8217 -13383 -10459 -13256 -21186 -18887 -16992 -22407 -19178 -11150
377 -11150 -12974 -10725 -1874 -3001 -6161 -723 -2583 -9578 -7283 -7327 -12986 -10273 -4770 -7596 -4457
392 -4457 3905 2105 967 7912 5559 -928 2323 1746 -5996 -4653 -418 -4566 -2155 5316 4401 4337
408 4337 11282 10575 6518 10759 9563 3082 5469 8156 2761 4874 12610 10715 11842 20313 19587 17390
424 17390 22299 21398 15330 17289 17798 11543 12588 16904 13340 13434 19966 17696 14506 19224 17056 9632
440 9632 10096 8723 613 -859 528 -5221 -6725 -2778 -5835 -8449 -4072 -6520 -12553 -10296 -11820
455 -11820 -19997 -19874 -18545 -24758 -25300 -19857 -21858 -22656 -16264 -16265 -18609 -14055 -13709 -18232 -15800 -14275 -18914
472 -18914 -17519 -11978 -14262 -13424 -5756 -5147 -7351 -586 326 -3967 -1367 722 -4586 -3833 -667 -4082
488d082j97N780j659r14N828Om356L415Q36n953R31K822m468p4N272j582m98O080
506G187P92k201M944J570m604K796K843m433R97M872j924k90O579K61k063N216
522B2542J294m196J958J399n585l68K016l964j513L682k552l331L860r78n985
537H279J408J01p147j632J068n934k973K482k988l392L558j179l542K297K85n482
553a4791N19J957m890q76L530k405j942N168J96k344M594J623l841K330K082l912
569a3002Q8L163k782j212M686j058k274M458J092l408K510J791m455o9K729l529
585a1272j491L781j400j179M159O09k027L432K289l610J819L565k803k64M873
600D81p07o21N513J599j107M479L062k007K735L365k861P42M111j772j008M543
$$ plain form
488 -4082 -4279 1501 -158 -1072 4756 4762 406 3821 4657 -1296 -365 2457 -2011 -2085 3187 1605 1107 7187
506 7187 7979 5778 10722 12292 7688 10484 13327 8894 9891 14763 12839 12549 19128 19389 17326 22542
522 22542 23836 19640 21598 22997 17412 17044 19060 15096 13583 17265 14713 11382 15242 14264 8279
537 8279 9687 9788 2641 1009 2077 -3857 -6830 -4348 -7336 -10728 -7170 -8349 -11891 -9594 -9309 -14791
553 -14791 -14272 -12315 -17205 -18081 -14551 -16956 -18898 -13730 -13534 -15878 -11284 -9661 -13502 -11172 -9090 -13002
569 -13002 -12914 -9751 -12533 -13745 -9059 -10117 -12391 -7933 -6841 -10249 -7739 -5948 -10403 -10472 -7743 -11272
585 -11272 -12763 -8982 -10382 -11561 -7402 -6793 -8820 -5388 -3099 -6709 -4890 -1325 -4128 -4392 481
600 481 -226 -847 4666 6265 5158 9637 12699 10692 13427 16792 13931 14673 18784 17012 16004 20547
616B0547n04k363L976J484l708J697J371m310j092K183l780k845K167k241l801
631H781K752q09m469J225O12m762o40J603m643k226K002k154k965K627j86l048
647f300K229J343l635R91K533l485r53K952k411k024L666j56k884K824J487l437
663g260J206K376l600n60K264k902k116K189j163k884K380O31l902J762J904l939
679a3614K07K790l462j541L427j689j964L372J290k784K691L272k035J024L583
694e433j208o3L726l00q24L788J555j527L790K882j841K275L546j719K34L658
710A2539j394j617L846j20k366K456J622k600J054K265k877n75K345k268k496
725I814K133j600l004J587M22l316J193J458l339k02K033k818j768K430j728k754
$$ plain form
616 20547 20043 17680 21656 23140 19432 21129 22500 18190 17098 19281 15501 12656 14823 12582 8781
631 8781 11533 10724 6255 7480 8092 3330 2690 4293 -350 -2576 -574 -2728 -5693 -3066 -3252 -6300
647 -6300 -4071 -2728 -6363 -5372 -2839 -6324 -7277 -4325 -6736 -8760 -5094 -5250 -8134 -5310 -3823 -7260
663 -7260 -6054 -3678 -7278 -7838 -5574 -8476 -10592 -8403 -9566 -12450 -10070 -9439 -13341 -11579 -9675 -13614
679 -13614 -13407 -10617 -14079 -15620 -12193 -13882 -15846 -12474 -11184 -13968 -11277 -8005 -10040 -9016 -5433
694 -5433 -6641 -6704 -2978 -3278 -4102 -314 1241 -286 3504 6386 4545 6820 10366 8647 8881 12539
710 12539 11145 9528 13374 13254 10888 13344 14966 12366 13420 15685 12808 12233 14578 12310 9814
725 9814 11947 10347 7343 8930 9352 6036 7229 8687 5348 5146 7179 4361 2593 5023 3295 541
741E41K491l01k777J553J463l195Q63J860k345r86K494j817k268K347o37k734
757c448J446O59k697Q04J786k925p22K552k506k077K058n39l269K010N03k885
773i250J082J798k571j23K336k168j087K597q77j843K333O78k168J651K309k378
789g681J347K687j601n57L215m46j670K873N24j917K471J693k075J551K538j612
805A340l80K860p60j561L132p6k425K090J184k331J105J989j897J69K414j501
821E352j296K690j323k049K517N12k562R63K194k705J3K230j691j344K379p58
837E122k311J639j73k440J001R62k531O30J810k245q85K027j506j798J373j42
853E33k641J183P80k128j28J785j737j113K077j308j290J925p29k027J626P09
$$ plain form
741 541 3032 2731 -46 1507 2970 -225 638 2498 153 -833 1661 -156 -2424 -77 -714 -3448
757 -3448 -2002 -1343 -4040 -3236 -1450 -4375 -5097 -2545 -5051 -7128 -5070 -5609 -8878 -6868 -6365 -9250
773 -9250 -8168 -6370 -8941 -9064 -6728 -8896 -9983 -7386 -8263 -10106 -7773 -7095 -9263 -7612 -5303 -7681
789 -7681 -6334 -3647 -5248 -5805 -2590 -3036 -4706 -1833 -1309 -3226 -755 938 -1137 414 2952 1340
805 1340 960 3820 3060 1499 4631 4555 2130 4220 5404 3073 4178 6167 4270 4439 6853 5352
821 5352 4056 6746 5423 3374 5891 6403 3841 4804 6998 4293 4306 6536 4845 3501 5880 5122
837 5122 2811 4450 4277 1837 2838 3800 1269 1899 3709 1464 579 2606 1100 -698 675 533
853 533 -2108 -925 -145 -2273 -2401 -616 -2353 -3466 -1389 -2697 -3987 -2062 -2791 -4818 -3192 -2483
869b483k402R34J618j775o0K285j264q08K032j57k156K124P76k317J725J320k190
886b798N04K556j407j001K663m51k018K079O58j927P44J615j850M09J778j508
902D6m26K696j491j214K632m96k171J675Q62k293O18K208j834n57K274q65j453
919B11K161n95j909J643M32k118R96J417j934p3K162j774j213K412n74k051J637
936H30Q07k509P10R52j791P4J552j323o65J994q14j743K008O9k406J184J144k304
954b231J72J627j252o73J904r85j147J916n52j866J576Q09j995P05J833j894l90
971b443K466o22j602K250J76j838J330O55j579P89J525j496K38K239r19j147K594
988B616n44j232J932L36j808R56J851k391L84J892j242l56K003q94j239J743j0
$$ plain form
869 -2483 -4885 -3951 -2333 -4108 -4168 -1883 -3147 -3955 -1923 -2080 -4236 -2112 -1336 -3653 -1928 -608 -2798
886 -2798 -2294 262 -1145 -2146 517 66 -1952 127 785 -1142 -398 1217 -633 -224 1554 46
902 46 -380 2316 825 -389 2243 1747 -424 1251 2113 -180 438 2646 812 255 2529 1664 211
919 211 2372 1777 -132 1511 1943 -175 821 2238 304 231 2393 619 -594 1818 1244 -807 830
936 830 1637 -872 -162 790 -1001 -927 625 -698 -1363 631 -183 -1926 82 151 -2255 -1071 73 -2231
954 -2231 -2059 -432 -1684 -2357 -453 -1438 -2585 -669 -1221 -3087 -1511 -702 -2697 -1992 -159 -2053 -2443
971 -2443 23 -599 -2201 49 225 -1613 -283 372 -1207 -418 1107 -389 -151 2088 1169 22 2616
988 2616 2072 840 2772 3108 1300 2256 4107 1716 2100 3992 2750 2394 4397 3503 2264 4007 3997
1005C997j690P93J051j864l4J604j862n54J521j174j057J448m42j867J299M06
1021A575k333M81R33k086N2J334j282j429J981k84k275J193J071k523Q12J151
1037a629j979j01J465j146n23J772m95j487J555K17j829J229Q09j478J88J432
1053b000r88o02J766m22j322J620Q7j305J112R80j874J102J109j441k49K183j240
1070a484m01J562R2j227J271P97j439P18J428j625j5K173r27p22K164m13j045
1087I07J429M65j241Q70J171j241k5J717p18o50J515Oj506J855R3j342R33P08
1105D946j416J94J262j407m20J325p45j291J648l89j703R06N81j583K50O82j653
1122A187l81R49j076r33J006n76j634J264O2j936M56N69j584m75J493j063j297
$$ plain form
1005 3997 2307 3100 4151 2287 2253 3857 1995 1441 2962 1788 731 2179 1737 -130 1169 1575
1021 1575 -758 -277 656 -1430 -1378 -44 -1326 -2755 -774 -1058 -3333 -2140 -1069 -3592 -2780 -1629
1037 -1629 -3608 -3709 -2244 -3390 -3913 -2141 -2636 -4123 -2568 -2351 -4180 -2951 -2142 -3620 -3432 -2000
1053 -2000 -2988 -3590 -1824 -2246 -3568 -1948 -1861 -3166 -2054 -1074 -2948 -1846 -737 -2178 -2427 -244 -1484
1070 -1484 -1885 -323 -231 -1458 -187 610 -829 -111 1317 -308 -323 1850 923 201 2365 1952 907
1087 907 2336 2801 1560 2430 3601 2360 2335 4052 3334 2684 4199 4205 2699 4554 4647 3305 4238 4946
1105 4946 3530 3724 4986 3579 3159 4484 3739 2448 4096 3707 2004 2910 3491 1908 2158 2840 1187
1122 1187 806 1755 679 -254 752 176 -1458 -194 -132 -2068 -1612 -1043 -2627 -3102 -1609 -2672 -3969
1139c969J229l53j125R40J12j425P44R09j550m5J541j238m57J197j93r09J385
1156c207M45j352R69O57q75L54J577j233k50J863q62o94J527O1r10J249J92p47
1174a236M24J395j157Q8J370p17p62J788l64q16J267N61j069L88Q52j080K2J543
1192B497q84m01J527l34j069J246N25j349J021Q47j125J86J429j283jR81p0q65
1210B878J035k08j139J067P6j228J12Q96r63k76J104p37j092R37m60j225O28J09
1228A514j155J3O20j017p84J005j038r75J146l05j570R15K87j535M28Q83j221
1245b789m2O63m48m25Q47m59q37Q76K00p43M40O95j231N38Q03o81j96J071n07
1264b225n81J391L1j255J218M56j067N40Q57p29J11P92m17n12J478k53r44J019
$$ plain form
1139 -3969 -2740 -3093 -4218 -3278 -3166 -4591 -3847 -2938 -4488 -4533 -2992 -4230 -4687 -3490 -3683 -4592 -3207
1156 -3207 -2762 -4114 -3145 -2488 -3363 -3009 -1432 -2665 -2915 -1052 -1914 -2608 -1081 -1020 -1930 -681 -489 -1236
1174 -1236 -812 583 -574 -486 884 167 -595 1193 829 13 1280 1841 772 1160 2012 932 954 2497
1192 2497 1613 1212 2739 2405 1336 2582 3107 1758 2779 3626 2501 2687 4116 2833 2832 3813 3743 2878
1210 2878 3913 3705 2566 3633 3709 2481 2593 3489 2526 2250 3354 2617 1525 2462 2002 777 1405 1514
1228 1514 359 372 992 -25 -809 196 -842 -1817 -671 -976 -2546 -1631 -1344 -2879 -2451 -1568 -2789
1245 -2789 -2831 -2168 -2616 -3041 -2194 -2653 -3490 -2614 -2414 -3157 -2717 -2022 -3253 -2715 -1912 -2593 -2789 -1718 -2225
1264 -2225 -2806 -1415 -1384 -2639 -1421 -965 -2032 -1492 -635 -1364 -1253 -461 -878 -1390 88 -165 -1109 -90
1282i0M89r19N20Q98j055M88Q41l87o69J148k61k88Q79L96j008O27J022j326N04
1301A809P51r15j51R80n23n58Q64P7j018O97K50q69J03P51o53m61P74o04p14J143
1321A733l24j134P83K24q89J25k6k99l07P73p30k91Q42l46q27Q20M13j472P18
1340b14O19j227RQ14q43k52Q25m31p38O37M50j168M11M95q00J63M27n54m13P22
1360a068l41o18J126k64o15L67L62o37K32J080j222O3P87j39q03J280n7m82N81
1379c68M66p56M27N50p63O13O49l63m52Q52ko42N65M53j100Q09J43k98j3O40l65
1400A045k25N87k93j038J066J25j150O62K74j003K45P54j108n3N61q8p20O27m0
1419B28o76M78L98r96K00M91n40j12O96l58m90P58j75o87O09N87q04P1Q29r73
$$ plain form
1282 -90 399 -520 0 898 -157 331 1172 785 116 1264 1003 715 1594 1990 982 1609 2631 1305 1809
1301 1809 2560 1645 1494 2474 1951 1393 2257 2334 1316 2013 2263 1394 1497 2248 1595 1134 1908 1304 590 1733
1321 1733 1409 275 1058 1282 393 518 492 193 -114 659 -71 -362 480 134 -693 127 540 -932 -214
1340 -214 405 -822 -813 1 -842 -1094 -269 -700 -1438 -801 -351 -1519 -1108 -613 -1413 -1250 -823 -1377 -1790 -1068
1360 -1068 -1409 -2027 -901 -1165 -1780 -1413 -1051 -1688 -1456 -376 -1598 -1535 -748 -887 -1690 -410 -467 -949 -368
1379 -368 98 -658 -231 319 -444 169 818 455 3 855 853 211 776 1229 129 938 1081 783 770 1410 1045
1400 1045 820 1407 1114 76 1142 1267 117 779 1053 50 295 1049 -59 -112 449 361 -359 268 228
1419 228 -448 30 428 -568 -368 123 -417 -529 167 -191 -681 77 -98 -785 -176 411 -393 -322 507 -466
1439d66K93L19l10q5P37k06q35Q01P8o85K46N44o76j05P26n60j3M02jo43N74N6
1461A91o29P40j91n78L34K04o69J35O94m00k07N71J96r96Q42K7n91L72N67n09
1481A03k30O47r0k82L42J09n95R09l53l36L99L21n74k84Q56j04j014J043m09l47
1501A11K46k0l02N62K10o33R5K01n11k30M18l85k00K67J40o23M84J23m87M4K90
1522b00q75J58N08n31l22P48j18r36J021K5p03M1P83o61j01P44k39Rk2K44m50
1543h77O85K9j75M0L55o38L98M81l21P5K81j37k50O08k88m23Q02J3k48J50M48
1564A008p66K03L65n51O4M61p8m86Q24l40n91N57K14l75q2M25o06L95K20m56J
1585D06N40k35m12K73J13n46M74K52l67n28N91K84r11P64k44m14K53K39p12j50
$$ plain form
1439 -466 -173 146 -164 -249 488 282 -553 248 326 -359 -113 431 -245 -350 376 -184 -197 205 204 -439 135 191
1461 191 -438 302 111 -467 -133 71 -598 -463 231 -169 -376 195 391 -605 237 264 -327 45 612 103
1481 103 -127 520 430 148 490 599 4 913 560 224 623 944 370 86 942 838 -176 867 458 111
1501 111 357 337 35 597 807 174 269 470 -41 -271 147 -238 -438 -171 -31 -654 -170 -47 -534 -490 -200
1522 -200 -1075 -917 -409 -940 -1262 -514 -632 -1568 -547 -522 -1225 -1184 -401 -1062 -1163 -419 -658 -649 -671 -427 -877
1543 -877 -192 -163 -338 -298 57 -581 -183 298 -23 52 333 196 -54 554 266 -157 645 658 410 560 1008
1564 1008 242 445 810 259 323 784 706 220 1044 704 113 670 884 509 427 852 246 641 861 405 406
1585 406 946 711 299 572 685 139 613 865 498 -30 561 845 -66 698 454 40 293 532 -180 -330
1605c30Q43r7p07M60q8l06K8j96m47P03m87j52oM24o80j36O59j89j35L1k27k98
1627a333N86l02l25M28K12k87k35N86l24l68L93J93l88N52J98n56K96M27m40N
1647f82J22J4K39K16M8n56O27L91n33L30M8j41J72M58n43K29J58k97J87J53J18
1668G58n86N45K08l23J22L74m27R6N69l86n53O53J71m01O5j2k98P5J4p9K81qJ40
1691I98m56N09l23l69J16K06p22M48J42o70j8L32j78r4N5j43l04N91j43l00M5
1712b78n0m22K1M59m14j46N13m85m46P47l62j96M63J16n57nL29p1j70K64l38k
1734a030M06m1j38K61L26n40J41j46o8j6J99K5J07K60j86k32K69p7L2J99K00j42
1756a91M0K18q9j26R0l5J41J68K5P1J08N0r2J60L18m88L48L68l76L1J61K03l99
$$ plain form
1605 -330 513 416 -291 169 81 -225 -197 -393 -840 -137 -624 -776 -782 -358 -1038 -1174 -515 -704 -839 -808 -1035 -1333
1627 -1333 -747 -1049 -1374 -946 -734 -1021 -1256 -670 -994 -1362 -969 -776 -1164 -612 -414 -970 -674 -247 -687 -682
1647 -682 -560 -546 -307 -91 -43 -599 28 419 -114 216 264 123 295 753 210 439 597 300 487 640 758
1668 758 172 717 925 602 724 1098 671 767 1336 950 397 1050 1221 820 885 873 575 650 664 585 866 858 998
1691 998 542 1051 728 359 475 681 -41 407 549 -121 -139 193 15 -79 -24 -167 -471 120 -23 -323 -278
1712 -278 -328 -750 -729 -270 -684 -830 -317 -802 -1248 -501 -863 -1059 -596 -480 -1037 -1042 -713 -784 -954 -690 -1028 -1030
1734 -1030 -624 -665 -803 -542 -216 -756 -615 -761 -829 -845 -646 -621 -514 -254 -440 -672 -403 -480 -448 -249 -49 -191
1756 -191 -151 67 -22 -148 -58 -93 48 216 241 312 420 470 378 538 856 368 716 1084 708 739 900 1103 704
1779G04O68l70r8K55p2k09N1J55m53K60O6l45J49j53L77m61k06L82l87q6L77n18
1801H6k57M49m84r9J24j4j86L84k24j86K4J77l11K4J21k88R8K00m37N9L14n6k46
1824g28l4L73k37J99Rl40L5L06j2l76L59L1n21M45J28m49L56K10k87j04J84n08
1846i61L19M26j32k67J76M37m97N09j08l18L97q4K20n42N19p5l04N42j37k34L75
1867B61J6L2j28M36p97L87N25m97K98Q4L78m41J8K83j23k1Q0l90J77K11k61L37
1889H65j98k83k99N35Q0l26L83k61m06o7N41n05l0P63o29o40L75K47k47J98l68
1910b72J57k22J92l05K16J71l22m5L05k92j66M85J42n94j68K79j80K41L15n49
1930f12J74K39m17RN03Jm61J30K37m18K42L25l05m16O83l05m3J08K41j14J39k01
$$ plain form
1779 704 1372 1002 904 1159 1087 878 929 1084 631 891 957 612 761 608 985 524 318 700 313 227 604 86
1801 86 -171 278 -206 -305 -181 -195 -381 3 -221 -407 -383 -206 -517 -493 -372 -660 -562 -362 -799 -740 -426 -482 -728
1824 -728 -762 -389 -626 -427 -418 -758 -723 -417 -429 -805 -446 -415 -936 -491 -363 -812 -456 -246 -533 -637 -453 -961
1846 -961 -642 -216 -348 -615 -439 -2 -499 10 -98 -416 -19 -103 117 -425 94 19 -285 257 120 -114 261
1867 261 277 309 181 617 -180 207 732 235 533 617 995 554 572 855 732 711 791 401 578 789 528 865
1889 865 667 384 85 620 700 374 757 496 90 23 564 59 29 792 163 -477 -102 145 -102 96 -272
1910 -272 -115 -337 -145 -450 -234 -63 -385 -430 -125 -417 -583 -98 44 -550 -718 -439 -619 -378 -63 -612
1930 -612 -438 -199 -616 -607 -104 -103 -564 -434 -197 -615 -373 -48 -353 -769 -86 -391 -434 -326 -85 -199 -60 -261
1952b61J26P6J28K3j44L91j79j60M86k77m04M44M3j15k21N87m68J43k74J76l58
1973b38P80m48L75j92j55M6J14j4l54K43j25J11Q8J76K4n57M81o8m34N64j4l12
1995I1P3J13l03N0K79k24j43K31l0k85K49j85m6J20K60l56o1L09n16m0M99k49
2017a64o2J75j19k24q6O24n05p4K47o8k73L40j60q7L30O0k66M3J19l39Q9N36j80
2040d4r4K12j95J03P7K8j00LL59k23Q9J41j20j41M32k73l41P26l78J37j00q0k7
2063A91N3K13j80l50M79l84j6K60l2lL04l28k49J13O8k03L4L96l39q3N97p78R2
2086a45K1k39mJ54K48m04J47L66m9n01N43n76m7J78J12J1N9O0m64M82o6J73l20
2109b61J92k1k88J75J04k12K45j16j51M71J35j68k69L47k03l5L84l24l43N94j71
$$ plain form
1952 -261 -135 -59 69 92 -52 339 160 0 486 209 -195 249 292 177 -44 543 75 218 -56 120 -238
1973 -238 542 94 469 277 122 168 282 268 -86 157 32 143 231 407 431 -126 355 287 -147 417 403 91
1995 91 164 277 -26 24 303 79 -64 167 137 -148 101 -84 -130 -10 250 -106 -167 142 -374 -414 85 -164
2017 -164 -226 -51 -170 -394 -480 144 -361 -435 -188 -256 -529 -189 -349 -436 -106 -46 -312 -269 -150 -489 -400 136 -44
2040 -44 -138 74 -121 -18 59 87 -13 -10 349 126 215 356 236 95 527 254 -87 639 261 398 298 218 191
2063 191 244 457 277 -73 406 22 6 266 234 231 535 207 -42 71 139 -64 -30 366 27 -56 541 -237 -145
2086 -145 -124 -363 -367 -213 35 -369 -222 144 95 -406 137 -439 -486 -308 -196 -185 -126 -66 -530 -48 -114 59 -261
2109 -261 -69 -90 -378 -203 -99 -311 -66 -182 -333 138 273 105 -164 183 -20 -55 329 5 -338 256 85
2130H5k64K51j27k8O1j31J85NK78j64l7K14j18q3J89M8k33J20M52o78K22M12m01
2153B58L59n4k20m4K44J78m15K90j48m02N35l2j30J68l1J1j86P4j51j74K63l13
2175H0n1K0K56k87j83K38p2j40J60k77j87L74j21j67L54k87K4k95M0k18k0L28
2197d31k65L65K00k39l62N6J92j23l9M99n08L6M66m55k14M76k52J91M9J36l00
2218e22J35J76o8O0K55Rm20K67K8j70K83J01k96J25K59p4k57Q11o40K02mP7j20
2241B17J40P5j58L5J23r4Q0K61m97K73K57j42j49L51j27k15K67m3j87R6J91j26
2263F28l24O94j12o75M55pm56K14K30l17O9K42l20k13J47j88q7J62j78M9j2m0
2285c9j59M5J77m00K25r8k1l64M24k10k66K12J68n63J70Q7l63K02M51l57k30J68
$$ plain form
2130 85 -179 72 -55 -83 -22 -153 32 37 315 151 114 328 210 127 316 364 131 251 703 25 247 659 258
2153 258 617 563 343 299 543 721 306 596 448 46 581 549 419 587 556 567 381 455 304 130 393 80
2175 80 29 49 305 18 -165 73 1 -139 21 -256 -443 -69 -190 -357 -3 -290 -266 -561 -521 -739 -759 -431
2197 -431 -696 -331 -131 -370 -732 -676 -484 -607 -646 -147 -655 -619 -153 -608 -822 -346 -598 -407 -358 -222 -522
2218 -522 -387 -211 -279 -219 36 45 -375 -108 -80 -250 33 134 -162 -37 222 148 -109 702 62 264 260 337 217
2241 217 357 432 274 309 432 338 418 679 182 455 712 570 421 772 645 430 697 654 467 563 754 628
2263 628 304 998 886 211 666 659 203 417 647 330 399 641 321 108 255 67 -20 142 -36 13 1 -39
2285 -39 -198 -153 24 -376 -151 -249 -270 -634 -210 -420 -686 -474 -306 -869 -699 -612 -975 -773 -322 -679 -909 -741
2307g41J5j27J17K41j52J18j44j12l6M49l22J50K31j21k93L18M6K02J1K8j47L6
2329b33K75j46L0P9J7j3M77o8m46O75j64l12K79k31j98K08N82m29J58K40k87L72
2351H65m98M60m04M4R1QL15j21k78K5L51k01k28M31j90n00J94L03m77ON12l43
2373C65J6L23l78m65P40k19j76J36J13o94PK47k75n2N51j50Q4j49j17j28K96l71
2395b96Rk10M30n57K87R2l37j02M09j05l95N03l58j38K71K64k12q3L27l99j36
2416g36L40m28Q4L65j35l05O37l12j17K69N0Q4l34M04j05Q9J5k1l3N47j92k55
2438h9N33m20l57M37K27k75K24j1J91p4K0N7j45K64L4j95k74K92k8K1L51m35N5
2461D03J05o1k1mQ4l35L05L0j73l51L27J81l76k8L75m80M48k82j96K87J94n09
$$ plain form
2307 -741 -726 -853 -736 -495 -647 -529 -673 -785 -821 -372 -694 -544 -313 -434 -727 -409 -363 -161 -150 -122 -269 -233
2329 -233 42 -104 -74 5 22 9 486 418 -28 647 483 171 450 219 21 229 811 382 540 780 493 865
2351 865 367 827 423 467 558 566 881 760 482 507 858 657 429 860 670 170 364 667 190 196 708 365
2373 365 381 704 326 -139 601 382 206 342 455 -239 -232 15 -260 -312 239 89 173 24 -93 -221 75 -296
2395 -296 -287 -497 -67 -624 -337 -245 -582 -684 -275 -380 -775 -272 -630 -768 -497 -233 -445 -528 -201 -600 -736
2416 -736 -396 -824 -740 -375 -510 -815 -178 -490 -607 -338 -288 -204 -538 -134 -239 -150 -135 -156 -189 358 166 -89
2438 -89 444 24 -333 104 331 56 280 269 460 386 406 463 318 582 616 421 147 439 411 432 783 348 403
2461 403 508 447 426 422 506 171 476 506 333 -18 309 490 114 86 461 -19 429 147 -49 238 432 -77
2483g7J05L03m92L11l1j31p7K2j3J26p3j23K02k81J18j07j73mN1n9L53k2n16L32
2507b56K50k79J04J35l55k91P22j69m58L55q8NK12O9n29J62M55j73k23K09Q0m24
2529d87K61N3k75L25K12l26K8M38k17l15O72j30l86N44m62r8K88J34j74L7J65
2550B87k44l0K30l98M03L08k80j90O61k51l41J90J69j52n1l2j53oK03Q1m95K29
2572A38J82j22j66J41k88LK46o2j80K18j40k05K39N6j92r8M68p07L71Q1k87pK09
2595a02J77k89K45n4k39J31K14l11K26k4j40J56j40K57m99M62J58m53K11q2j59
2616b55K80k72J82j60M73k95k17L46k44J28J47k6m00N92j48p0j17O2m1%J47k06
2638i4q2R5pk14J50M42m19m2L86n93M47L80n25M3K32j39K0K92P3l35o2J80j31
$$ plain form
2483 -77 28 331 -161 150 119 -12 -89 -67 -80 46 -27 -150 52 -229 -111 -218 -391 -395 -344 -403 -50 -72 -588 -256
2507 -256 -6 -285 -181 -46 -401 -692 30 -139 -597 -242 -330 -325 -113 -44 -573 -411 44 -129 -352 -143 -63 -487
2529 -487 -226 -173 -448 -123 89 -237 -209 229 12 -303 369 239 -147 397 -65 -163 125 259 85 122 287
2550 287 43 13 243 -155 248 556 276 86 747 496 155 345 514 362 311 279 126 120 323 404 -91 138
2572 138 320 198 32 173 -115 -112 134 72 -108 110 -30 -235 4 60 -132 -230 238 -469 -98 -17 -304 -311 -102
2595 -102 75 -214 31 -23 -262 -131 83 -228 -2 -26 -166 -10 -150 107 -392 70 228 -225 -14 -96 -255
2616 -255 25 -247 -65 -225 248 -47 -264 82 -162 -34 113 87 -313 279 131 61 -56 6 -35 -35 112 -94
2638 -94 -176 -81 -88 -302 -152 290 -129 -171 215 -378 69 449 -76 -33 199 60 80 372 445 110 48 228 97
2661I7l8K7K30l35N67k57l12K38J91n71R9L06m84K98j00o4j0K70n75J46L13l94
2683c58J98J61k23l1L49k3o22K43L55m53K5L94j61m73M25K44m75L41J88m39N6
2704b79K63m43K55L53l1l44K29l1N7L97m71k8K29j6J62k66J24J26n8J72l15L23
2726D08N1O6l03K58J97r55M73J49k44j90L35k66P7J18P3j99KM47k35M5Jom72N35
2750C65k56r3MK90l53J21j11k89K88K80m42k8L15k32j36J69N0j40N0K41k97J84
2772b0P9k65k20M56l27K6L02m37k84N43J40m96L99o6j67J41K87l78n52R35k36
2793a40m60K11L53l40K11L21m06J36k04M5K98l2j98j00J20J53k97M18j88l22K60
2814a61L04m08J20Q5j40P6L07L8l23L25l18R0M12l04r8Q7M49k51O0K49l26r7J12
$$ plain form
2661 97 59 86 316 -19 548 291 -21 217 408 -163 -64 242 -242 56 -44 -108 -118 152 -423 -277 36 -358
2683 -358 -160 1 -222 -253 96 73 -549 -306 49 -404 -379 15 -146 -619 -194 50 -425 -84 104 -335 -279
2704 -279 -16 -459 -204 149 118 -226 3 -28 29 426 -45 -73 156 140 302 36 160 286 228 400 85 408
2726 408 459 525 222 480 677 -278 195 344 100 -90 245 -21 56 174 247 48 50 497 262 307 308 302 -170 365
2750 365 109 16 20 310 -43 78 -33 -322 -34 246 -196 -224 91 -141 -277 -108 -58 -198 -148 93 -204 -20
2772 -20 59 -206 -426 30 -297 -271 31 -406 -690 -147 -7 -503 -104 -170 -337 -196 91 -287 -839 96 -140
2793 -140 -600 -389 -36 -376 -165 156 -250 -114 -318 -273 25 -7 -205 -305 -185 -32 -329 89 -99 -421 -161
2814 -161 143 -265 -145 -60 -200 -124 183 221 -102 223 -95 -5 407 103 5 92 541 290 350 599 273 176 288
2837B88J7j35O9K72k34pJ68k46j12O66l75j98J74L1j52J46j1j70j13p6L24k50
2859G6L08l56o6J54j4k28J83j65k32P9K88j29Q1l71J99O0j5j07k04L20j06k33
2881d78M44L19o41L40j19j09o6J69lk19Q0Q9o9J60j33k36L36J71k23O8J06q5q
2904a07M6k22j31L37K20k67J84L5k65k24N96j77k18L52m05QL82J00l01K7J39P2
2926A81j08J10M2j98J39J06j03L18j37o0k13J44l60M19J59l65J68J4K3o3L06o0
2948D62k44n4K34K6m76N43j79J22%q4r6j32o2K42P4l34k47K61J57o40N33K24j62
2971A68l4k87J1J84J26m60O0M50m34m32M03m6k09K82K3r2r8O6J72k24OK90k41
2994c16p1M64l64j35K28K59l40r5j01K38K66j69j59K0J71j53m2J09L5p5K48r5
$$ plain form
2837 288 305 170 239 511 277 270 438 192 80 746 371 173 347 378 226 372 361 191 78 2 326 76
2859 76 384 28 -38 116 102 -126 57 -108 -340 -261 27 -102 -21 -392 -193 -133 -148 -255 -459 -139 -245 -478
2881 -478 -34 285 -356 -16 -135 -244 -310 -141 -144 -363 -283 -194 -263 -103 -236 -472 -136 35 -188 -120 -14 -99 -107
2904 -107 -61 -283 -414 -77 143 -124 60 95 -170 -394 202 25 -193 159 -246 -238 144 244 -57 -30 109 181
2926 181 73 183 225 27 166 272 169 487 350 290 77 221 -139 280 439 74 242 256 279 216 522 462
2948 462 218 164 398 424 -52 491 312 434 434 350 254 122 60 302 376 42 -205 56 213 -427 106 330 168
2971 168 134 -153 -142 42 168 -292 -232 218 -216 -648 -245 -291 -500 -218 -195 -287 -385 -319 -147 -371 -365 -75 -316
2994 -316 -387 77 -287 -422 -194 65 -275 -370 -471 -233 33 -136 -295 -275 -104 -257 -299 -190 -155 -230 18 -77
3016g7n3K15j12j77J92n7J13k81K30O8J19j50Q1k57K17Q7m14J66J77j00J04o8
3038B3K17j87l51N71N6oj14j48K89k49k90M24k0j15O3L60j99l10k6K33J1Km7k88
3062a01L47j50R0j7R0k74k41M31L0j55J43q4l7j63M41p14K06Q8l20J89J11M61
3084C71n77J03k4n6j69J21o7k5L57k24j08K72j19k68L64n6l07K85L23l48L65p5
3106A38k51N0o9rk43J69L33m21R3O9N3J21K53P4l62J42M3r9J28k18r6L78l95M3
3130g6P2O9K37n07L27o3k0r9J4j96P6J96m20M44J4J18k13L8j81J0J38Lp3Q2K98
3155B88l60j69K58k84J66M64k33j34qK3n7L64k52k64Q6j47K35l5j18J34J40j97
3177a00K45rJ26k65K50j99k3j72J30M6j05J91k78JK07j1j25k50L76Pj29R1k30
$$ plain form
3016 -77 -130 85 -27 -204 -12 -69 44 -237 -7 61 180 30 111 -146 71 158 -256 -90 87 -13 91 23
3038 23 240 53 -298 273 329 323 209 61 350 101 -189 235 215 100 163 523 324 14 -12 221 232 234 187 -101
3062 -101 246 96 186 169 259 -15 -256 175 205 50 193 109 72 -91 350 -364 -158 -70 -390 -201 -90 371
3084 371 -206 -103 -127 -183 -352 -231 -298 -323 34 -190 -298 -26 -145 -413 -49 -105 -412 -127 196 -152 213 138
3106 138 -113 -63 -132 -141 -384 -215 118 -303 -210 -141 -88 33 286 360 -2 140 183 84 212 -6 -102 276 -119 -76
3130 -76 -4 65 302 -205 122 59 39 -60 -46 -242 -166 30 -390 54 68 186 -27 11 -170 -160 -22 -19 -92 -10 288
3155 288 -72 -241 17 -267 -101 363 130 -4 -12 11 -46 318 66 -198 -112 -259 -24 -59 -177 -43 97 -100
3177 -100 145 136 262 -3 247 48 25 -147 -17 29 -76 115 -163 -162 45 34 -91 -341 35 42 -87 4 -226
3200b26k1K4L51k31l39N83j88j28J61K35l38J79j54lP0J76j69K0J27k52L4K52
3222A63r5k8m0J02k2k8k4l7M0J89j01j90M43L1k65R0j80p8K63k76L16l40J15j93
3246a45j3M33j69j82j15j23K59QM08m57l95N54m47K75O7pQ6j10k08L66j19J78
3268A44k27J4pk72N46p1k6j72j71J55m2J09k41M85m06J25j63K96j09L4J1O4l88
3291c12n0L15L02l47K74o0j04J71j9k09R2k3J52k62J78j30J13j08M44p24M00L00
3313C93m54JL10j32K0J93j35j41n2J63l76K62j42J59j13L71k18O4o0J81n27N64
3335C31pj86J13J69m74J72j18M1l62N82j73k09K79l15Pj38N4K67p2J10j02O5k
3358C2o6r6J78j5j63l1m3K76l86K70j71j35L79j97M5Q6j7k17N95l60j25K11o3
$$ plain form
3200 -226 -247 -223 128 -103 -442 141 -47 -175 -14 221 -117 62 -92 -95 -25 151 -18 2 129 -123 -89 163
3222 163 68 40 0 102 80 52 28 -9 31 220 119 -71 372 403 138 228 48 -30 233 -43 273 -67 48 -145
3246 -145 -158 275 106 -76 -191 -314 -55 -47 361 -96 -491 63 -384 -109 -42 -49 37 -73 -281 85 -34 144
3268 144 -83 -69 -76 -348 198 127 101 -71 -242 -87 -129 -20 -261 224 -182 -57 -220 76 -33 1 12 76 -312
3291 -312 -362 -47 255 -92 182 122 18 189 170 -39 53 30 182 -80 98 -32 81 -27 417 -307 93 393
3313 393 -61 -60 250 118 138 331 196 55 3 166 -210 52 -90 69 -44 327 109 173 113 294 -233 331
3335 331 324 138 251 420 -54 118 0 41 -321 261 88 -121 158 -157 -150 -288 -234 33 -39 71 -31 34 32
3358 32 -34 -130 48 33 -130 -161 -204 72 -314 -44 -215 -350 29 -168 -123 -37 -54 -271 324 -36 -161 50 -13
3381a3l22K23J89k58J40p6J17m5l7l6K35j35m9M55p47O83n54O9K09j36K95L7n5
3404A89q6p2J22j5k46M07j71j32j9L36K1m0k86L3J65o4j33k08J98K53j98N9nj17
3428iK56l58K15r0R0j58L9J22r4J7k39K75J08R1k50pR7JR7k60R1j38k85N02k19
3453a06K7K77k99J48J31J0m12J17P1l3J22l10j35K42M0r3m8P9K35m33L98j04j66
3476b42J33P0j45J94j38n8L7o2L44j07j63m0K54k43J35L55m08N6k5M11J74n40
3498hj15O1K71O9qk23N1k74J37M4m8q3K80j20M24l35J65n8k16M9K01j15j16j60
3522a27N67j59l36J71K4k87M97l90p6j92L85k12J97O1n3O7j01J64k27J0j56j6
3544a89K29K50k78j9j39j07K3J83N2k87rJ86M0rj8j6J3Nl0K20Q8n89K75K48l64
$$ plain form
3381 -13 -335 -112 77 -181 -41 -117 0 -45 -82 -118 117 -18 -67 388 -359 324 -230 -161 48 -88 207 244 189
3404 189 103 31 153 138 -108 299 128 -4 -23 313 334 294 8 41 206 142 9 -199 -1 252 54 113 108 -9
3428 -9 247 -111 104 14 104 -54 -15 107 13 30 -209 66 174 265 15 8 105 106 203 -57 34 -104 -389 113 -106
3453 -106 -79 198 -101 47 178 188 -224 -107 -36 -69 53 -257 -392 -150 -110 -203 -251 -172 63 -370 28 -76 -242
3476 -242 -109 -39 -184 10 -128 -186 -149 -211 133 26 -137 -177 77 -166 -31 324 -84 -28 -53 358 532 -8
3498 -8 -123 -62 209 278 270 47 98 -176 -39 5 -43 -126 154 34 458 123 288 230 14 63 264 149 33 -127
3522 -127 440 281 -55 116 140 -147 350 -40 -116 -308 77 -135 62 123 70 137 36 200 -27 -17 -173 -189
3544 -189 40 290 12 -7 -146 -253 -230 -47 5 -282 -291 -105 -65 -74 -92 -108 -95 -90 -120 100 188 -401 -126 122 -242
3569b42R8J31k50J87J11k36J04j86J17L7p7nj49L27p8P7n5o7Rj14J03J25K78j90
3593E5j18l2J39l9r9J54J23Q9p4l13N55n77O1K20Pj31K71j61K36l02j07N8K74
3616B89j19j77K55k46K97j53J10r2Q0k19K76q3j90L5j33J61R7k44J47l7J6k68
3638a98J58q3o4M08o06L57oK80l17K07J4j40J45k3lk51K27j57N1j28j00J62j44
3661b11q0N2M18j19j57K97k95P6k33L05p5L65m00K0k48K92j06l3J05m46L99K47
3683A73l82L77k38K07k19kQl3K27l54J46R7j04K09j10m7p9K09l7r4M31k84l98
3706b97K13J82j22m5j59N6M86l74J79K42j42n7r0m2R0l49L55O5l33K91j13o7k74
3729c05J02K90Q4q4n3J46K8k00j14J79J86j75J42l15m3n1L64k56j33L33k81P9
$$ plain form
3569 -242 -144 -13 -263 -76 35 -201 -97 -283 -166 -129 -206 -211 -360 -33 -111 -34 -89 -156 -147 -261 -158 -33 245 55
3593 55 -63 -95 44 5 -94 60 183 272 198 -115 440 -137 -76 144 151 20 291 130 366 64 -43 15 289
3616 289 170 -7 248 2 299 146 256 164 244 25 301 218 28 63 -70 91 188 -56 91 54 70 -198
3638 -198 -40 -123 -187 221 -385 -28 -34 246 -71 136 150 10 155 132 129 -122 105 -52 -1 -129 -229 -67 -211
3661 -211 -291 -239 179 60 -97 200 -95 -19 -252 53 -22 343 -57 -37 -285 7 -99 -132 -27 -473 -74 173
3683 173 -209 168 -70 137 -82 -84 -76 -109 118 -236 -90 7 -97 112 2 -45 -124 85 48 -46 385 101 -297
3706 -297 -84 98 -24 -69 -228 -172 314 -60 119 361 219 162 72 30 120 -229 126 191 -142 149 36 -31 -305
3729 -305 -203 87 171 87 34 180 208 8 -106 73 259 84 226 -89 -132 -183 181 -75 -208 125 -156 -77
3751g7J69k37O5K41o6k34Q9J39j93L27k93n4M7o2j54K02P0L5m9r6K95k29L42K1
3775B98n16K37K43p2k19k51L09o7j6P8J21l8j95NJ37J30l1j78n9J98j21n5K09
3798A47lJ6j36j49J88j93O2K45p0l02P0L27l35J08J12j48J02J31Q4l15J1K86n42
3821c04L55Q0m20L24K24k17j24J71j23q2nL51j86K6r3p6Q4j63L22k67J47O0O9
3844A53q2j58M0k57M44k58q7J47l7j89K90j66L7J45j02J49j70O0m3k90M02J21
3866A49m29Q1rJ37Q7J87k40J72K0k44L5L00l40j48L51J26k20r4J99j50l04L17
3888a7N0R6j10J14k10L16k5r4j7J35j52j90qK25J30o0p4j73K07m1k3N8j12J24
3912A49l42l2L1l6L62j20k35L33j27o8R6p0K21k63k97M28j09J37l57J60J40k45
$$ plain form
3751 -77 92 -145 -80 161 95 -139 -50 89 -104 223 -70 -124 -77 -139 -293 -91 -21 14 -35 -131 164 -65 277 298
3775 298 -218 19 262 190 -29 -280 29 -38 -54 24 145 107 -88 -83 54 184 153 -25 -84 114 -7 -62 147
3798 147 144 160 24 -125 63 -130 -68 177 107 -195 -125 202 -133 -25 87 -61 41 172 256 -59 -48 238 -304
3821 -304 51 131 -289 35 259 42 -82 89 -34 -116 -121 230 44 70 -23 -99 -15 -178 144 -123 24 84 153
3844 153 71 -87 -47 -304 140 -118 -205 -58 -95 -284 6 -160 -123 22 -80 69 -101 -41 -84 -374 28 149
3866 149 -280 -199 -208 -71 16 203 -37 135 155 -89 -54 246 -94 -242 109 235 15 -79 120 -30 -334 -17
3888 -17 33 129 19 133 -77 239 214 120 103 238 86 -104 -112 113 243 183 109 -64 143 102 79 137 25 149
3912 149 -193 -225 -194 -230 132 12 -223 110 -17 -85 11 -59 162 -101 -398 30 -79 58 -299 -139 1 -244
3934b44J06j06M33m94N7L19k39K16J45j42O2j25j40j51K81l8k30j4K59np4P1J21
3957F8j92N9k5k03l1M74j35q2L8j10n2J03M8q4L40k99J24j60K92j00L94n67M8
3980e2kj0N6m1P9K83l46J90k37J38j58Pj50N91j14L1n9j69j82R0M6QK37k08j52
4005a24J83J26q6M5L10k72m16M13p8J54k33K05j88j61K75J99m48P8K55k88r3J07
4027c7O2l61K35k2J10k11K31j11P4j47j00q4K88Ll86P7M1K78N4K46m19J54M1J87
4051B03k26Q1p0M2Q6q4j45J03m6r8j15K62j25O3J21o4k0L84j1k25n8j48j33M71
4075B48k35p1J72k80L00O1j85l76N49j97r5p0R6j06N23k52J00j56r5L39j83J33
4097B20l64K87R0k9k57L40p8k51J37K15k96j2K45ll32J54K53j34J14P0j31m19
$$ plain form
3934 -244 -138 -244 189 -305 -248 71 -168 48 193 51 113 -12 -152 -303 -22 -60 -290 -304 -45 -50 -124 -53 68
3957 68 -124 -65 -90 -293 -324 150 15 -67 -29 -139 -191 -88 -40 -124 216 -83 41 -119 173 73 467 -100 -52
3980 -52 -54 -64 -8 -49 30 313 -33 157 -80 58 -100 -93 -243 348 234 265 206 37 -145 -55 -9 -1 236 28 -124
4005 -124 59 185 99 144 454 182 -234 179 101 255 22 227 39 -122 153 352 -96 -18 237 -51 -144 -37
4027 -37 25 -336 -101 -123 -13 -224 7 -104 -30 -177 -277 -361 -73 -70 -456 -379 -338 -60 -6 240 -179 -25 16 203
4051 203 -23 58 -12 30 116 32 -113 -10 -56 -154 -269 -7 -132 -69 52 -12 -32 352 341 116 58 -90 -223 248
4075 248 13 -58 114 -166 134 195 10 -366 183 -14 -109 -179 -83 -189 334 82 182 26 -69 270 87 220
4097 220 -144 143 233 204 -53 287 209 -42 95 310 14 2 247 244 -88 66 319 185 299 369 238 -181
4119a81L44K2l77J95K55k47j21J04Q5j70L08p8k96PP4jl04L06K10j42L3K83m36
4142a27l72M66lj12J46q4J40O2k79N2J09N8k33q0J51l12M84j10L1r3P9J22j1K10
4166B94l29J08k10M3R0j7J18j38p2L28l01K79O0j76j42K70k28r4K23j34k93N65
4188B44n8l79L77o1k23K18k04J55J15K5q4j78K95j64K8J69j51j45K47J6N0l62
4210g0j0P5j30L57n93M10j11O2m3M88m17K78J0j85J33k90QN2l43J07K37l5K77
4233B67r0k27j17q9K96j80L03n7j31J59j8j50j69L21j81L3L05m90J96k48L64j57
4255f0k13L23j65L14r4l63K55R5j40n4j36L04n41L62K19m57K82k15K56J06o6M5
4277E7j64J57K75k50j43J05j55K73L18m47k19K56j5j26lK36k23LJ75L49m76n2
$$ plain form
4119 -181 163 185 -192 3 258 11 -110 -6 79 -91 217 139 -157 -150 -76 -77 -381 -75 135 -7 26 309 -127
4142 -127 -499 -33 -36 -148 -2 -86 54 116 -163 -111 -2 56 -177 -257 -106 -418 66 -44 -13 -106 -27 95 84 294
4166 294 -35 73 -137 -94 -4 -21 97 -41 -113 215 -86 193 253 77 -65 205 -23 -117 106 -28 -321 244
4188 244 186 -193 184 123 -100 118 -86 69 184 209 125 -53 242 78 106 275 124 -21 226 242 292 -70
4210 -70 -80 -5 -135 222 -371 39 -72 -10 -53 435 18 296 306 121 254 -36 -28 24 -319 -212 25 -10 267
4233 267 177 -50 -167 -256 40 -140 163 106 -25 134 116 -34 -203 118 -63 -30 275 -215 -19 -267 97 -60
4255 -60 -273 50 -115 199 105 -258 -3 92 -48 -102 -238 66 -475 -113 106 -351 -69 -284 -28 78 12 57
4277 57 -107 50 325 75 -68 37 -118 155 473 26 -193 63 48 -78 -81 155 -68 -65 110 459 -17 -69
4299f9J83k42K96j59K40j66j66R6q8MJ92j15j90j43K97M88m06j84O3j29L57k02
4321d3oj91O2K71j77Q9J0J45l83L19J15l49P3nJ76j84J52l38K59K86l34l60M28
4344A5J20m06L80j71j36J71p7r1K43q0j21O4j9O7L03l75p4r8J67J05q8N7m9j4
4368a07j28K80k90K55r3j07pM21l71q0L31n3l19L3J26J1L54J8J10j35k8n50R7
4391b32N66m11k3r5K48k15j9L66n82K74J00Oo3K01m0j06J15j09p6j1L39j87k7
4414A9J58j64j23r3J76l50M72p1j86n8L10l1k42K22k07J98p5l9K03l21J98P2j78
4437a10K00l13K22J66k14K22j45n4j29R5l5r1K02J32J62j64l9j60j64L98j84o4
4459f7J97K06n51K44j62N1k01L66p4O2j72Q6q0K97n7j71j23J29j38M3K72j64n7
$$ plain form
4299 -69 114 -128 168 9 249 83 -83 13 -75 -71 121 6 -184 -327 -30 458 52 -132 -69 -198 159 -43
4321 -43 -49 -240 -178 93 -84 5 15 160 -223 96 211 -138 -65 -70 106 -78 74 -264 -5 281 -53 -413 15
4344 15 135 -271 109 -62 -198 -27 -104 -195 48 -32 -153 -89 -108 -41 262 -113 -187 -285 -118 -13 -101 -44 -93 -107
4368 -107 -235 45 -245 10 -83 -190 -197 224 -147 -227 104 51 -268 -235 -109 -98 256 274 384 249 221 -329 -232
4391 -232 334 -77 -100 -195 53 -162 -181 185 -397 -123 -23 -17 -80 121 81 -25 90 -19 -95 -106 233 46 19
4414 19 177 13 -110 -203 -27 -377 95 24 -162 -220 90 59 -183 39 -168 30 -45 -84 119 -202 -4 68 -110
4437 -110 90 -223 -1 165 -49 173 28 -26 -155 -60 -95 -186 16 148 310 146 107 -53 -217 181 -3 -67
4459 -67 130 336 -215 29 -133 -82 -283 83 9 71 -101 -15 -95 202 145 -26 -149 -20 -158 -115 157 -7 -64
4482f4L02l36O9J00j71j16M71l3r1q7J49k3n0P5o9n3p6R2j5P2Q5l22K47m0L6l72
4508b20L63k86J04j69J29r2L16k92K44l50L72j54k25L37o7Q4j47%Q1k57K27J87
4530A85j63j67J63O5k12O2N9j69j02O01l33n2K92q1j98J65k67K2QQ8K22j79j68
4553a59J60J04j13M3Q1j92N2K37l29K14q3K00j77p4n1J92k0m94M10J79j37l5N2
4576F0L37j04pl67n3K15O3L1k11J53n0N3L6m5o3K18q1l40J31J7O6j25QO7qKL69
4603C72m29j47L13M2k16R4j40j66L46M9n1J4K1L0P7j0l38L17k34J83k03Q7K7K05
4627B43k42k21K10N0K97q1j36l02K60J08m3l66K94M5Qk78j84K75p5J99Nk20m9
4650b03J54j26j33K18j23J37j8J9J02l07K27j59J71j05K12j70J44k46K85l9P8
$$ plain form
4482 -64 238 -98 -29 71 -100 -216 255 222 131 44 193 170 120 195 126 73 -3 89 74 146 231 -91 156 116 152 -220
4508 -220 143 -143 -39 -208 -79 -171 145 -147 97 -253 119 -35 -260 77 10 94 -53 -53 28 -229 -2 185
4530 185 22 -145 18 83 -129 -67 -8 -177 -279 322 -11 -63 229 148 -50 115 -152 -130 -122 -34 188 9 -159
4553 -159 1 105 -8 35 116 -76 -24 213 -116 98 15 215 38 -36 -87 105 85 -409 1 180 43 8 60
4576 60 397 293 286 -81 -134 81 144 175 -36 117 67 120 156 111 48 266 185 -155 -24 -7 59 -66 -58 9 1 3 372
4603 372 -57 -204 109 151 -65 29 -111 -277 69 118 67 81 102 132 209 199 -139 178 -56 127 -76 11 38 243
4627 243 1 -220 -10 40 337 256 120 -182 78 186 143 -223 71 116 124 -154 -338 -63 -138 61 66 -154 -203
4650 -203 -49 -175 -308 -90 -213 -76 -94 -75 27 -280 -53 -212 -41 -146 66 -104 40 -206 79 40 118
4671A18j06J11M1k19J80J65l80J24J91j37J20l97L87k58M9K9k39M31j05k44J60
4692B1J05o6L2rJ8j74K57j41p3n6J59r2J84l4j74Q9k1k13M92o13J50k0J62J57
4716A40j27k7K63j89k41j92L59N3J25l91M53k93L7n4J61j25j22k33N52r2j23J18
4738E2J10j97K09j67l05K93l0J3k37K63N7j14j45l1L60k84P5j64o1K69j63L56
4760A59j69rK0J61k07k79J96J42j17R9J02k52J19k12L42K8j2ok80K58j44J57l8
4783E8J60L0j10k3r8j38M91k84l03L35j78L75k32m3o4P7K8O0m06L55o8J84j31
4806G5M3j37k7L47l19j24K91k13J12j6M0j8o2%j96L25L4n8k32r3l6J47J76J47
4830B06l52J55j31J41L34j37k72j30M4%J10j47R6K92k24j72K9K85r4k71L50P1
$$ plain form
4671 118 12 123 164 -55 125 290 -90 34 225 88 208 -189 198 -60 -11 18 -221 210 105 -139 21
4692 21 126 60 92 83 101 -73 184 43 -30 -86 73 -19 165 131 -43 46 25 -188 304 -309 -159 -179 -17 140
4716 140 13 -14 249 60 -181 -373 -14 39 164 -227 226 -67 -30 -84 77 -48 -170 -403 149 57 -66 52
4738 52 162 -35 174 7 -298 -5 -35 -22 -259 4 61 -53 -198 -229 131 -153 -78 -242 -303 -34 -197 159
4760 159 -10 -19 1 162 -45 -324 -128 14 -103 -4 98 -154 -35 -247 95 123 111 105 -175 83 -61 96 58
4783 58 218 248 138 115 17 -121 370 86 -217 118 -60 315 83 40 -24 53 81 141 -265 90 22 206 75
4806 75 118 -19 -46 301 -18 -142 149 -64 48 32 72 54 -8 -8 -204 121 155 97 -135 -228 -264 -117 59 206
4830 206 -146 9 -122 19 353 216 -56 -186 -142 -142 -32 -179 -83 209 -15 -187 -158 127 33 -238 112 183
4852A83k59J83k49P0J11L4k3j41p3m8K32k40M09r5l14N43q3j56L1l15N85l60R0
4875A15l58J90K7n5L6J44k70J26j81J10K12j15l6J06j72N17k88l86J86K68j09
4896F7K39k67O0J40l23N35l02p6j03J50j08k47L36j83J83j01J3P0m9P7j09k13
4918b11K64Q9j47m62P34j94o2J64l64K14K0MkN8k09K37j55K05m25L24J1o8j03
4941g8K9j8j97M22K6j68l97K93M1o8J83m5N1j20K23j5K7k64Q6R4Oj95N2o6J85
4966H7l4k12J92K6l7K55p1J79l61K02k86M14k28p8R1l48K22L3k7N3o2o5m8l9P5
4991f7J50j81J76Lk79J91q1J62Q6l01J68K59n87P18m06M0j84K40j09L9Q2l32J11
5014a02J44K6n2j99r4J67N2K93j68ro8J29J07k40J58j16RJ0K7k14Q1L8j87n8J60
$$ plain form
4852 183 -76 107 -142 -72 39 73 50 -91 -164 -212 20 -220 189 94 -220 323 240 84 115 -200 385 25 115
4875 115 -243 -53 -26 -81 -45 99 -171 -45 -226 -116 96 -19 -55 51 -121 396 108 -278 -92 176 67
4896 67 306 39 99 239 -84 451 149 73 -30 120 12 -235 101 -82 101 0 13 83 34 111 2 -211
4918 -211 53 142 -5 -467 267 73 11 175 -189 25 45 49 47 105 -104 133 -22 183 -242 82 93 25 -78
4941 -78 -49 -67 -264 158 184 16 -381 -88 -47 -115 68 23 74 -46 177 162 189 -75 11 105 111 -84 -32 -98 87
4966 87 53 -159 33 59 22 277 206 385 24 226 -60 354 126 48 139 -209 13 46 19 72 10 -55 -103 -142 -67
4991 -67 83 -98 78 81 -198 -7 -88 74 160 -141 27 286 -301 417 11 51 -133 107 -2 37 119 -213 -102
5014 -102 42 68 16 -183 -277 -110 -58 235 67 58 -10 119 226 -14 144 28 37 47 74 -140 -59 -21 -208 -266 -106
5039a06o9k45L23J08p1Mk8L7k18L35j93k9J28j00l5M32l01p5J69j50Q5N8J39k60
5063f2M9K25kK3j03J6Q6j97r1J70k31K30R5m5L2l84J08R7J16j68M9QL4j89L17
5088A83m80J57K7J98N0l92N31j73k28K19J03k08l50M02j65R9j78J03K83j8R8n63
5110c02M44n0j14j01J51j08N9j1j07L61k76j73R9K99n42L44o3K69n5r3m2j8K87
5133B58k9m39Q5M37m18m9k1N7j47R5j5J39j24J58J63r6M3m3J75k52j69K55q3J05
5157H5j58j32M99l14L85n50K84n6k73M98j87N9j81l6J16J6o4K67J86k94k43J45
5179E2J9k2J33l27M52m01K95k57K67K2n59K82L65m05O02q11J24L87qk06j2J0j60
5202a58J54J11k53Q7J30j71j01j22L67l25K83k1J27m25M49j37j62K16k10M60l35
$$ plain form
5039 -106 -175 -420 -97 11 -60 -56 -84 -47 -265 70 -123 -152 -24 -124 -159 273 -28 -103 66 -84 1 59 198 -62
5063 -62 -13 212 210 233 130 146 232 35 -56 114 -117 113 208 163 195 -189 -81 16 132 -36 13 21 55 -134 183
5088 183 -297 -140 -113 85 135 -257 274 101 -127 92 195 -13 -363 39 -126 -27 -205 -102 181 163 261 -302
5110 -302 142 92 -22 -123 28 -80 -21 -32 -139 222 -54 -227 -128 171 -371 -27 -90 179 124 31 -11 -29 258
5133 258 229 -210 -125 312 -106 -155 -176 -119 -266 -171 -186 -47 -171 -13 150 54 97 54 229 -23 -192 63 -20 85
5157 85 -73 -205 294 -20 365 -185 99 43 -230 268 81 140 -41 -77 39 55 -9 258 444 150 -93 52
5179 52 71 49 182 -145 307 -94 201 -56 211 233 -326 -44 321 -84 518 -293 -169 218 210 4 -8 2 -158
5202 -158 -4 107 -146 -59 71 -100 -201 -323 44 -281 2 -19 108 -317 132 -5 -167 49 -161 299 -36
5223c6r6K77j44K7n9J31l45L16j61K6J13J3J01l48L87j03J13l03J69k86M01j97
5245dj80K51k78M07O7m27J81K3l3Q9J74k34J6j30m7P3j3J03j01pm4Q3Q6P1l50
5270b24K37j61P3J70q5O2p6N5L2Rq2J17p5L9j17J09j79J74jo5Q7o9k8K6J40k04
5296c6J6J07N1j64R1o9J24l4K7j97O8J15q7J5j00j39L03P8k05K04kp1j70Nj3o8
5322a51J50p9K63J20l47o6J11q6J04j06J69K7j70J49R3j53J27j11J3k30L8L4J71
5345G0j08k95J82R6K11k5L1j35J01O5M7j65k5j26N58n19l1L19k52J17k27K69p2
5368H6J73J04m82L47k48K08k82K40l25p6K55J71m2k2j84r2j21K63j52J13j5o3
5390a44q5J27J06j05K65n0k97k6K65k85K29j29J30k22K83o2j84K49L9N6M6n1k27
$$ plain form
5223 -36 -132 145 1 28 -31 100 -245 71 -90 -64 49 62 163 -185 202 99 212 -91 78 -208 193 -4
5245 -4 -184 67 -211 196 263 -164 17 40 7 96 270 36 52 -78 -125 -52 -65 38 -63 -70 -114 -31 55 126 -224
5270 -224 13 -148 -75 95 10 72 -4 51 83 92 10 127 52 91 -26 83 -96 78 77 12 99 30 2 28 168 -36
5296 -36 -20 87 138 -26 65 -4 120 86 113 -84 -16 99 12 27 -73 -212 91 169 -36 168 166 95 -75 -70 -83 -151
5322 -151 -1 -80 183 303 -44 -110 1 -85 19 -87 82 109 -61 88 181 28 155 44 57 -173 -135 -101 70
5345 70 -38 -333 -151 -55 156 131 162 27 128 193 240 75 50 -76 482 -37 -68 251 -1 116 -111 158 86
5368 86 259 363 -119 228 -20 188 -94 146 -179 -255 0 171 129 107 -77 -169 -290 -27 -179 -66 -81 -144
5390 -144 -229 -102 4 -101 164 114 -183 -209 56 -229 0 -129 1 -221 62 0 -184 65 104 160 206 155 -72
5413g2j82O3K0O4l5J20j52K10J00j37nj06J31j55k23K68%Q1k46K95O2j31p3q9
5437a92K43Nj04m0l4K32l9J09m8q9m9k66L84r1k57M23J59q4k91L24j95m1r0J0
5461b1J22p1k56N08j79L6j17R6k23M73m98k14M00j46J27Q6K1k62M5K02k32L36
5483B33n4j64J00l53L00J2j83K69k13J65N2l86M07k63k6k6J52k80R7K2J70j48
5505a17J31k89J36qK47K4j72J49k7Q3J4k56O3r0O9j28oL2K28o5j6L3M8k06J8K86
5531A81j9k71K13p3J03m42M40m23K40k04J47K7K7Q0qM0K1j45L65l96j56N21l19
5554e1J67k7K4k18K27q0K30l31N1N2l2K19O2m77K0K61k34J44n0j8K4O5K14j83
5578E9n1j83L41j00q1Q8p5J0K5k19N60j49l60Q3N05n68R2k1j98J21K25j59K9J55
$$ plain form
5413 -72 -254 -191 -171 -107 -142 -22 -174 36 136 -1 -6 -112 19 -136 -359 -91 -91 -10 -256 39 101 -30 -103 -192
5437 -192 51 56 -48 -88 -122 110 71 180 132 43 -6 -272 112 21 -236 187 346 262 -29 295 100 59 -31 -21
5461 -21 101 30 -226 282 103 139 22 118 -105 368 -130 -344 56 -90 37 123 144 -118 -73 129 -103 233
5483 233 179 15 115 -238 62 74 -109 160 -53 112 164 -222 185 -78 -104 -130 22 -258 -161 -139 31 -117
5505 -117 14 -275 -139 -147 100 124 -48 101 74 157 171 -85 -22 -112 -43 -171 -177 -145 83 18 2 35 83 -123 -105 181
5531 181 162 -109 104 31 134 -308 132 -291 -51 -255 -108 -81 -54 26 18 58 79 -66 299 -97 -253 268 -51
5554 -51 116 89 113 -105 122 42 272 -59 -8 44 12 231 293 -184 -164 97 -137 7 -43 -61 -37 28 242 59
5578 59 8 -175 166 66 -15 73 -2 8 33 -186 374 225 -135 -52 453 -115 -23 -44 -242 -121 104 -55 -26 129
5602A29j40Kk9j30m7oK51J14l61M42l60N01m68j50J55K69J38m80K54Lj16r5R1
5625c3j23J48O8l07L8M32k57L09l18l18N09k15J71r1k68K47k6Mm2l4J70J07l81
5648b10M7J87J22m7l29J20R1L9j60K26p5j88Q3Q5P3j94R7Pj34M78r2r3k29m8J22
5673b2J76j32N0o5M7l0l10K6J84J16j55J90j23J55o9m9K3m1J69k48K34m3o8j73
5697a58K36j44J37j39N9J02l07J98m9K77j79k65J00NL86o57L54L4J55j36J91j12
5719H8n9m9J20j08j23K97j16j82K73j18j97M25k06L56k86J55l16N4nj58j41L20
5741B4L2L4K3k49N6N4J27p9kJ88j09K35j88k07J76k07K54n3o5r0J56j36J48j19
5765CK6j37k27K79J57J49m34P0M12o9m93K96J09l05m9K78L4j03m6p6K52k26K0
$$ plain form
5602 129 -11 -9 -38 -168 -215 -221 30 144 -217 225 -135 366 -102 -252 -97 172 310 -170 84 87 -29 -124 -33
5625 -33 -156 -8 60 -247 -209 223 -34 275 -43 -361 148 -67 104 13 -255 -8 -34 -30 -72 -106 64 171 -210
5648 -210 -163 24 146 99 -230 -110 -19 20 -140 86 11 -177 -94 -9 64 -130 -33 -26 -160 318 226 133 -96 -144 -22
5673 -22 154 22 72 7 54 24 -286 -260 -76 40 -115 75 -48 107 38 -11 12 -29 140 -108 126 83 15 -158
5697 -158 78 -66 71 -68 -9 93 -214 -16 -65 212 33 -232 -132 -127 259 -398 -44 -10 145 9 200 88
5719 88 29 -20 100 -8 -131 166 50 -132 141 23 -174 251 45 401 115 270 -46 8 3 -155 -296 24
5741 24 56 90 113 -136 -80 -26 101 22 20 208 99 334 146 -61 115 -92 162 109 44 -46 110 -26 122 3
5765 3 29 -108 -335 -56 101 250 -184 -114 298 229 -264 32 141 -164 -213 65 99 -4 -50 -126 126 -100 -80
5788h0N3j65q5J17K37l10J91j8lJ30r8J12k9l8j52J15J6j17j6J53j59J64kj29
5812a13M37l62K97m19L00j54j09J47m00L05M2O5k99L24k24K22j84K34j25k44N79
5833C19j62r9m3j6q8j06K02K1j39K4L72j68j31j21M03R5l96K80j83K59k93Q2J68
$$ plain form
5788 -80 -27 -192 -277 -160 77 -233 -42 -60 -63 67 -31 81 52 14 -138 -23 -7 -124 -140 13 -146 18 16 -113
5812 -113 324 -38 259 -160 140 -14 -123 24 -376 -71 -29 36 -263 61 -163 59 -125 109 -16 -260 319
5833 319 157 58 15 -1 -89 -195 7 28 -111 -87 285 117 -14 -135 268 363 -33 247 64 323 30 112 280
$$ [...]
8191C42
##END NTUPLES=NMR FID
##END=
