##TITLE=1H_CA-8631-1
 DMSO, 8 sc, 
 26.7.2019
##JCAMPDX= 6.0         $$ Bruker NMR JCAMP-DX V2.0
##DATA TYPE= NMR FID
##DATA CLASS= NTUPLES
##ORIGIN= UXNMR, Bruker Analytische Messtechnik GmbH
##OWNER= root
$$ XWIN-NMR		Version 3.5
$$ Fri Jul 26 14:53:49 2019 Russian Standard Time (UT+4h)  she@DPX200
##.OBSERVE FREQUENCY= 200.13155
##.OBSERVE NUCLEUS= ^1H
##.DELAY= (6, 6)
##.ACQUISITION MODE= SIMULTANEOUS
##.ACQUISITION SCHEME= undefined
##.AVERAGES= 8
##.DIGITISER RES= 18
##SPECTROMETER/DATA SYSTEM= spect
##.PULSE SEQUENCE= zg30
##.SOLVENT NAME= DMSO
##.SHIFT REFERENCE= (INTERNAL, DMSO, 0, 15.7039)
##AUDIT TRAIL= $$ (NUMBER, WHEN, WHO, WHERE, WHAT)
$$ ##TITLE= Audit trail, XWIN-NMR		Version 3.5
$$ ##JCAMPDX= 5.01
$$ ##ORIGIN= Bruker BioSpin GmbH
$$ ##OWNER= she
$$ F:/spectra/data/she/nmr/H-F/1/audita.txt
$$ ##AUDIT TRAIL=  $$ (NUMBER, WHEN, WHO, WHERE, WHAT)
(   1,<2019-07-26 14:52:47.85 +0400>,<she>,<DPX200>,
      <created by zg, POWCHK disabled, PULCHK disabled
       configuration hash MD5:
       00 E9 B6 7A A2 85 ED C7 34 08 36 98 17 FE 4E 26
       data hash MD5: 16K
       4F AD 92 7A 49 E8 83 11 D7 7A E5 7E 55 57 90 F5>)
$$ ##END=
$$ 
$$ hash MD5
$$ 5C B1 43 F0 F4 55 81 86 4E 70 34 DA 8A 7A 42 28
##$RELAX= 
##$RELAX= 
##$RELAX= 
##$RELAX= 
##$RELAX= 
##$RELAX= 
$$ Bruker specific parameters
$$ --------------------------
##$DU= <F:/spectra>
##$EXPNO= 1
##$NAME= <H-F>
##$PROCNO= 1
##$TYPE= <nmr>
##$USER= <she>
##$AMP= (0..31)
100 100 100 100 100 100 100 100 100 100 100 100 100 100 100 100 100 100 
100 100 100 100 100 100 100 100 100 100 100 100 100 100 
##$AQSEQ= 0
##$AQ_mod= 1
##$AUNM= <au_zg>
##$AUTOPOS= <>
##$BF1= 200.13
##$BF2= 200.13
##$BF3= 200.13
##$BF4= 200.13
##$BF5= 200.13
##$BF6= 200.13
##$BF7= 200.13
##$BF8= 200.13
##$BYTORDA= 1
##$CFDGTYP= 0
##$CFRGTYP= 5
##$CHEMSTR= <none>
##$CNST= (0..31)
1 1 145 1 1 1 1 1 1 1 1 1 1 1 1 1 1 1 1 1 1 1 1 1 1 1 1 1 1 1 1 1 
##$CPDPRG= <>
##$CPDPRG1= <>
##$CPDPRG2= <>
##$CPDPRG3= <>
##$CPDPRG4= <mlev>
##$CPDPRG5= <mlev>
##$CPDPRG6= <mlev>
##$CPDPRG7= <mlev>
##$CPDPRG8= <mlev>
##$CPDPRGB= <>
##$CPDPRGT= <>
##$D= (0..31)
0 1.2 0 0 0 0 0 0 0 0 0 0.03 0 0 0 0 0 0 0 0 0 0 0 0 0 0 0 0 0 0 0 0 
##$DATE= 1564138367
##$DBL= (0..7)
120 120 120 120 120 120 120 120 
##$DBP= (0..7)
150 150 150 150 150 150 150 150 
##$DBP07= 0
##$DBPNAM0= <>
##$DBPNAM1= <>
##$DBPNAM2= <>
##$DBPNAM3= <>
##$DBPNAM4= <>
##$DBPNAM5= <>
##$DBPNAM6= <>
##$DBPNAM7= <>
##$DBPOAL= (0..7)
0.5 0.5 0.5 0.5 0.5 0.5 0.5 0.5 
##$DBPOFFS= (0..7)
0 0 0 0 0 0 0 0 
##$DE= 6
##$DECBNUC= <off>
##$DECIM= 24
##$DECNUC= <off>
##$DECSTAT= 4
##$DIGMOD= 1
##$DIGTYP= 9
##$DL= (0..7)
0 120 120 120 120 120 120 120 
##$DP= (0..7)
150 150 150 150 150 150 150 150 
##$DP07= 0
##$DPNAME0= <>
##$DPNAME1= <>
##$DPNAME2= <>
##$DPNAME3= <>
##$DPNAME4= <>
##$DPNAME5= <>
##$DPNAME6= <>
##$DPNAME7= <>
##$DPOAL= (0..7)
0.5 0.5 0.5 0.5 0.5 0.5 0.5 0.5 
##$DPOFFS= (0..7)
0 0 0 0 0 0 0 0 
##$DQDMODE= 0
##$DR= 18
##$DS= 0
##$DSLIST= <SSSSSSSSSSSSSSS>
##$DSPFIRM= 0
$$ [...]
##$SUBNAM2= <"">
##$SUBNAM3= <"">
##$SUBNAM4= <"">
##$SUBNAM5= <"">
##$SUBNAM6= <"">
##$SUBNAM7= <"">
##$SUBNAM8= <"">
##$SUBNAM9= <"">
##$SW= 24.9336996594482
##$SWIBOX= (0..15)
0 0 2 0 0 0 0 0 0 0 0 0 0 0 0 0 
##$SW_h= 4990.01996007984
##$TD= 16384
##$TD0= 1
##$TE= 0
##$TE2= 300
##$TE3= 300
##$TEG= 300
##$TL= (0..7)
0 120 120 120 120 120 120 120 
##$TP= (0..7)
150 150 150 150 150 150 150 150 
##$TP07= 0
##$TPNAME0= <>
##$TPNAME1= <>
##$TPNAME2= <>
##$TPNAME3= <>
##$TPNAME4= <>
##$TPNAME5= <>
##$TPNAME6= <>
##$TPNAME7= <>
##$TPOAL= (0..7)
0.5 0.5 0.5 0.5 0.5 0.5 0.5 0.5 
##$TPOFFS= (0..7)
0 0 0 0 0 0 0 0 
##$TUNHIN= 0
##$TUNHOUT= 0
##$TUNXOUT= 0
##$USERA1= <user>
##$USERA2= <user>
##$USERA3= <user>
##$USERA4= <user>
##$USERA5= <user>
##$V9= 5
##$VALIST= <valist>
##$VCLIST= <CCCCCCCCCCCCCCC>
##$VD= 0
##$VDLIST= <DDDDDDDDDDDDDDD>
##$VPLIST= <PPPPPPPPPPPPPPP>
##$VTLIST= <TTTTTTTTTTTTTTT>
##$WBST= 1024
##$WBSW= 4
##$XGAIN= (0..3)
0 0 0 0 
##$XL= 0
##$YL= 0
##$YMAX_a= 151757
##$YMIN_a= -173935
##$ZGOPTNS= <>
##$ZL1= 120
##$ZL2= 120
##$ZL3= 120
##$ZL4= 120
##$ABSF1= 10
##$ABSF2= 0
##$ABSG= 5
##$ABSL= 3
##$ALPHA= 0
##$AQORDER= 0
##$ASSFAC= 0
##$ASSFACI= 0
##$ASSFACX= 0
##$ASSWID= 0
##$AUNMP= <proc_1d>
##$AZFE= 0.1
##$AZFW= 0.1
##$BCFW= 1
##$BC_mod= 2
##$BYTORDP= 1
##$COROFFS= 0
##$CY= 11.3945322036743
##$DATMOD= 1
##$DC= 2
##$DFILT= <>
##$DTYPP= 0
##$F1P= 20.1537800932815
##$F2P= 0.134698688090026
##$FCOR= 0.5
##$FTSIZE= 0
##$FT_mod= 4
##$GAMMA= 1
##$GB= 0.15
##$INTBC= 1
##$INTSCL= 1
##$ISEN= 128
##$LB= 0.24
##$LEV0= 0
##$LPBIN= 0
##$MAXI= 10000
##$MC2= 0
##$MEAN= 0
##$ME_mod= 0
##$MI= 1.114404
##$NCOEF= 0
##$NC_proc= 0
##$NLEV= 6
##$NOISF1= 3.799351
##$NOISF2= 2.8
##$NSP= 1
##$NTH_PI= 0
##$NZP= 0
##$OFFSET= 15.70392
##$PC= 1
##$PHC0= -9223.388
##$PHC1= 13.80097
##$PH_mod= 1
##$PKNL= yes
##$PPARMOD= 0
##$PSCAL= 0
##$PSIGN= 0
##$REVERSE= no
##$SF= 200.130013532006
##$SI= 16384
##$SIGF1= 3
##$SIGF2= 2
##$SINO= 400
##$SIOLD= 16384
##$SREGLST= <1H.CDCl3>
##$SSB= 0
##$STSI= 0
##$STSR= 0
##$SW_p= 3612.71676300578
##$SYMM= 0
##$S_DEV= 0
##$TDeff= 0
##$TDoff= 0
##$TI= <>
##$TILT= no
##$TM1= 0
##$TM2= 0
##$TOPLEV= 0
##$USERP1= <user>
##$USERP2= <user>
##$USERP3= <user>
##$USERP4= <user>
##$USERP5= <user>
##$WDW= 1
##$XDIM= 8192
##$YMAX_p= 0
##$YMIN_p= 0
$$ End of Bruker specific parameters
$$ ---------------------------------
##NTUPLES= NMR FID
##VAR_NAME=  TIME,          FID/REAL,        FID/IMAG
##SYMBOL=    X,             R,               I
##VAR_TYPE=  INDEPENDENT,   DEPENDENT,       DEPENDENT
##VAR_FORM=  AFFN,          ASDF,            ASDF
##VAR_DIM=   8192,          8192,            8192
##UNITS=     SECONDS,       ARBITRARY UNITS, ARBITRARY UNITS
##FACTOR=    0.0002004,     1,               1
##FIRST=     0,             0,               0
##LAST=      1.6414764,     0,               0
##MIN=       0,             -173935,         0
##MAX=       1.6414764,     151757,          0
$$ Real data points
##PAGE= N=1
##DATA TABLE= (X++(R..R)), XYDATA
$$ [...]
$$ plain form
2108 4027 2763 -1243 -2994 -1465 10 1091 2170 981 18 1273 718 -1875 -1771 -843 1277 4012
2124 4012 3807 -418 -3360 -2771 -661 2464 4554 2754 -1040 -2188 -1655 -775 1769 2432 714 783 1472
2141 1472 171 -849 -1029 -1104 1018 4384 3990 260 -2461 -2629 -888 3160 5167 2799 -104 -1236
2157 -1236 -1808 -244 2274 2374 1640 1906 1382 337 131 -392 -995 1480 4426 3597 1120 -1606 -3436
2174 -3436 -1597 3204 4491 2945 652 -1546 -2436 124 1817 1240 1473 1696 373 -39 -65 -1415 -1288
2191 -1288 1230 3123 2692 1503 -1802 -4057 -2077 2128 3547 3125 669 -2704 -2857 -337 866 759
2207 759 1320 975 -57 -26 -487 -2314 -1407 937 2034 2564 1699 -2154 -4189 -2382 555 2658 3314
2224 3314 501 -3212 -3141 -1065 -146 686 913 -458 -599 -77 -1348 -3016 -1822 -340 847 2377 667
$$ packed form
2108D027j264m006j751J529J475J081J079j189r63J255n55k593J04R28K120K735
2124D012k05m225k942N89K110L125K090j800l794j148N33Q80K544O63j718O9O89
2141A472j301j020j80p5K122L366l94l730k721j68J741M048K007k368k903j132
2157a236n72J564K518J00p34K66n24j045k06n23o03K475K946q29k477k726j830
2174c436J839M801J287j546k293k198q90K560J693n77K33K23j323m12k6j350J27
2191a288K518J893m31j189l305k255J980M205J419m22k456l373j53K520J203j07
2207G59N61l45j032L1m61j827R07K344J097N30q65l853k035J807K937K103O56
2224C314k813l713P1K076R19Q32K27j371j41N22j271j668J194J482J187J530j710
$$ plain form
2241 667 -2968 -3942 -2973 -1073 1729 2759 -84 -3322 -3469 -2588 -1049 1117 422 -1363 -848 -394 -2049
2258 -2049 -2806 -2407 -1782 871 2613 356 -2942 -3888 -3474 -1542 1893 2222 -334 -2263 -3312 -3482 -1210
2275 -1210 1360 323 -718 -575 -1203 -1722 -1844 -2360 -2117 893 2352 537 -2078 -3619 -3866 -782 2576
2292 2576 2037 89 -1623 -3073 -3053 -434 790 550 506 150 -1136 -731 -691 -1790 -1403 1232 2258 1392
2310 1392 -149 -3053 -3651 -200 3036 2949 1640 -427 -2473 -1691 391 784 1454 1800 896 -355 123
2327 123 -451 -1167 280 1700 2123 2305 1059 -2360 -3052 -123 2768 3708 3044 -283 -2245 -817 951
2344 951 1161 1861 1818 908 579 817 -845 -770 1108 1822 2484 3005 1135 -1573 -1862 -410 2006 4574
2362 4574 3762 84 -1884 -678 762 1911 2854 1502 801 1565 763 -690 -128 896 1788 3220 3080
$$ packed form
2241F67l635r74R69J900K802J030k843l238j47Q81J539K166o95j785N15M54j655
2258b049p57L99O25K653J742k257l298r46M14J932L435L29k556j929j049j70K272
2275a210K570j037j041J43o28n19j22n16K43L010J459j815k615j541k47L084L358
2292B576n39j948j712j450K0K619J224k40m4l56j286M05M0j099L87K635J026q66
2310A392j541k904n98L451L236q7j309k067k046P82K082L93O70L46r04j251M78
2327A23n74p16J447J420M23J82j246l419o92K929K891R40o64l327j962J428J768
2344I51K10P00m3r10l29K38j662P5J878P14O62N21j870k708k89J452K416K568
2362D574q12l678j968J206J440J149R43j352p01P64q02j453N62J024Q92J432j40
$$ plain form
2379 3080 632 -860 -1206 -737 1403 4283 3313 415 -1170 -1590 -396 2155 2882 1108 626 1033 441
2396 441 -661 -596 -602 923 3237 2711 22 -1212 -1475 -1205 1362 2997 2175 776 -885 -2682 -1600
2413 -1600 1507 2141 978 424 -67 -644 -78 -686 -1571 51 2461 1889 490 -1599 -3126 -2072 1258
2430 1258 2267 1262 399 -1398 -2986 -1826 203 662 1166 521 -1196 -1295 -347 -1293 -1708 -453 965
2447 965 1136 629 -1859 -3912 -2642 636 1372 1533 157 -2068 -2850 -1479 -696 90 1062 375 -1158
2464 -1158 -1376 -1116 -1710 -887 -256 77 897 1159 -1453 -3757 -2505 -388 1599 2484 315 -2481 -2737
2481 -2737 -1147 -588 322 798 121 -723 -686 -2026 -1886 -735 -21 90 1269 1076 -1411 -2564 -2524 -1176
2499 -1176 1345 3108 789 -2078 -2460 -1991 -553 1319 664 -369 163 -10 -1536 -1846 -596 -136 959
$$ packed form
2379C080k448j492l46M69K140K880r70k898j585m20J194K551P27j774m82M07n92
2396D41j102O5oJ525K314n26k689j234k63K70K567J635q22j399j661j797J082
2413a600L107O34j163n54m91n77N66o08q85J622K410n72j399k089j527J054L330
2430A258J009j005q63j797j588J160K029M59N04o45j717r9R48r46m15J255J418
2447I65J71n07k488k053J270L278P36J61j376k225p82J371P83P86R72o87j533
2464a158k18K60n94Q23O31L33Q20K62k612k304J252K117J987Q85k169k796k56
2481b737J590N59R10M76o77q44L7j340J40J151P14J11J179j93k487j153M0J348
2499a176K521J763k319k867l82M69J438J872o55j033N32j73j526l10J250M60J095
$$ plain form
2516 959 1898 538 -1006 -1494 -2104 -1224 1498 2673 1366 -505 -2239 -2458 160 2000 1089 -29 84
2533 84 -114 -574 -613 -1057 -617 1600 2326 617 -681 -1523 -1948 -492 1624 2058 1495 461 -1950 -2677
2551 -2677 -92 1660 1514 916 157 -1032 -205 155 -1080 -721 1403 2090 1162 -53 -2054 -2156 54
2568 54 1903 1631 1686 377 -1549 -1809 -523 736 1835 1866 217 -1038 -132 25 -774 -244 727 1297
2586 1297 1953 788 -2365 -2681 -133 1205 2101 1827 -118 -1566 -1430 -832 31 1672 1955 269 -699
2603 -699 -653 -728 -528 463 88 608 1694 752 -1563 -2256 -1309 776 2671 2021 -578 -1922 -1101 -818 144
2622 144 1629 1225 494 186 -486 -1323 -363 698 141 906 1523 565 -707 -1502 -1654 114 2978 2704
2640 2704 52 -1348 -1546 -773 930 1501 569 615 733 -610 -1239 -385 102 675 1847 1442 -25 -285
$$ packed form
2516I59R39j360j544m88o10Q80K722J175j307j871j734k19K618J840r11j118J13
2533H4j98m60l9m44M40K217P26j709j298q42m25J456K116M34n63j034k411p27
2551b677K585J752j46n98p59j189Q27L60j235L59K124O87r28j215k001j02K210
2568E4J849k72N5j309j926k60J286J259J099L1j649j255R06J57p99N30R71N70
2586A297O56j165l153l16K548J338Q96k74j945j448J36N98Q63J641K83j686r68
2603f99M6p5K00R91l75N20J086r42k315o93R47K085J895o50k599j344Q21K83R62
2622A44J485m04p31l08o72q37R60J061n57P65O17r58j272p95j52J768K864k74
2640B704k652j400j98P73J703N71r32M6J18j343o29Q54M87N73J172m05j467k60
$$ plain form
2658 -285 -862 -1776 82 2410 2436 940 -901 -2476 -1283 1501 1809 790 672 302 -542 -221 -457 -623
2676 -623 580 2124 1318 339 -144 -1079 -1042 509 1401 1945 1676 -212 -2252 -1355 815 1737 1733 1053 -346
2695 -346 -206 351 -92 -687 524 1740 1550 1158 -405 -1947 -852 938 1200 1708 1463 -353 -1717
2712 -1717 -1027 -401 1228 2287 1230 -853 -706 54 -448 -281 192 501 1222 1470 -820 -2508 -1179
2729 -1179 200 1392 1857 641 -1124 -1447 -1242 -1290 418 1785 843 -498 -813 -1083 -934 119 -148
2746 -148 -268 941 1044 -800 -2039 -1746 -788 1195 2332 516 -1472 -1276 -1444 -962 321 839 173
2763 173 11 -872 -2142 -986 -140 -390 -115 671 212 -863 -1308 -2298 -1907 597 1657 399 -1109 -1974
2781 -1974 -2353 -902 427 -131 -185 13 -1142 -1934 -1325 -1155 -592 283 542 -599 -725 -1045 -2067 -1739
$$ packed form
2658b85n77r14J858K328K6j496j841j575J193K784L08j019j18l70q44L21k36j66
2676f23J203J544q06r79m83r35L7J551Q92N44k69j888k040Q97K170R22mo80j399
2695c46J40N57m43n95J211J216j90l92j563j542J095J790K62N08k45j816j364
2712a717O90O26J629J059j057k083J47P60n02J67M73L09P21K48k290j688J329
2729a179J379J192M65j216j765l23K05m8J708J367r42j341l15k70J49J053k67
2746a48j20J209J03j844j239K93R58J983J137j816j988J96j68M82J283N18o66
2763A73j62q83j270J156Q46k50K75P86m59j075m45r90L91K504J060j258j508q65
2781a974l79J451J329n58n4J98j155p92O09J70N63Q75K59j141j26l20j022L28
$$ plain form
2799 -1739 293 1243 844 -184 -2301 -2717 -724 823 559 233 28 -996 -969 -811 -1324 -515 965 775
2817 775 -37 -213 -1273 -1834 -832 156 563 1373 465 -1868 -2427 -671 393 1187 1223 -270 -1013 -350
2835 -350 -312 -1027 -307 811 927 958 351 -1502 -1398 -182 386 1134 1771 749 -889 -1292 -816 62 2031
2854 2031 2078 303 -348 139 -133 143 600 390 1271 2148 971 -1146 -1137 62 687 1984 2063 543 -254
2873 -254 -233 -872 240 2107 1813 1007 304 -382 -564 810 1105 395 1108 1785 947 -143 -635 -856 764
2892 764 2696 2061 556 57 -310 -328 768 1721 1300 1459 980 -428 -595 655 961 991 1239 1213 577
2911 577 331 -545 -1491 373 2169 1796 964 -90 -1312 -689 924 1053 755 1150 488 -649 -464 -151
2929 -151 119 872 1211 348 93 148 -840 -1460 -58 1149 1384 1339 -423 -2046 -1191 390 752 907 647
$$ packed form
2799a739K032R50l99j028k117m16J993J547k64l26k05j024K7J58n13Q09J480j90
2817G75q12j76j060n61J002R88M07Q10r08k333n59J756J064P94L6j493p43O63
2835c50L8p15P20J118J16L1o07j853J04J216N68P48O37j022j638m03M76Q78J969
2854B031M7j775o51M87k72K76M57k10Q81Q77j177k117RJ199O25J297P9j520p97
2873b54K1o39J112J867k94q06p03o86j82J374K95p10P13O77q38j090m92k21J620
2892G64J932o35j505m99l67j8J096R53m21J59m79j408j67J250L06L0K48k6o36
2911E77k46q76r46J864J796l73q32j054j222O23J613J29k98L95o62j137J85L13
2929a51K70P53L39q63k55N5r88o20J402J207K35m5j762j623Q55J581L62J55k60
$$ plain form
2948 647 -613 -543 -421 -1168 -730 656 765 161 228 -526 -1244 -978 -188 225 1067 1044 -637 -2171 -1564 -506
2968 -506 406 1276 267 -834 -870 -478 -1128 -641 -118 -106 487 349 -991 -1680 -798 -470 -231 754 780 -923
2988 -923 -1511 -1677 -1477 342 1293 154 -883 -939 -1005 -887 -201 -354 -333 687 460 -1012 -1579 -1104 -842
3007 -842 241 1396 237 -573 -865 -1736 -1416 269 1170 396 13 -808 -1484 -592 155 -428 22 723 52
3026 52 -504 -791 -1397 -1178 963 1503 328 -124 -849 -1471 -906 373 486 633 478 -790 -1416 -419 -1
3045 -1 -33 692 706 125 262 -236 -1457 -1017 809 1181 1048 280 -944 -1416 -285 744 720 923 892 -380
3065 -380 -828 -227 -382 587 1323 690 189 535 -277 -1007 -609 391 1062 1566 750 -1186 -1419 -208 518
3084 518 912 1311 435 -368 -236 -360 -705 424 842 645 556 316 -747 -722 -91 -104 624 1812 690 -876
$$ packed form
2948F47j260P0J22p47M38J386J09o04O7p54p18K66P90M13Q42k3j681j534O07J058
2968e06R12Q70j009j101l6L92o50M87N23J2N93j38j340o89Q82L28K39R85K6j703
2988i23n88j66K00J819R51j139j037n6o6J18O86j53K1J020k27j472n67M75K62
3007h42J083J155j159q10k92q71L20J685R01p74l83q21o76Q92P47n83M50P01o71
3026E2n56k87o06K19K141N40j175m52p25o22N65J279J13J47j55j268o26R97M18
3045al2P25J4n81J37m98j221M40J826L72j33p68j224m72J131J029k4K03l1j272
3065c80m48O01j55R69P36o33n01L46q12p30L98J000O71N04q16j936k33J211P26
3084E18L94L99q76q03J32j24l45J129M18j97q9k40j063K5O31j3P28J188j122j566
$$ plain form
3104 -876 -982 -547 -56 1319 1399 221 -159 73 -428 -308 546 466 523 1179 347 -735 -666 -78 -115 870 1414
3125 1414 644 -369 -729 -1151 -263 1302 1284 242 9 -478 -787 33 130 142 638 1005 -91 -586 -630 -885
3145 -885 46 1136 1175 76 -121 -1070 -1349 -307 1101 815 650 108 -901 -821 87 90 174 697 669 -23
3165 -23 -283 -791 -1337 194 1010 795 494 -60 -952 -1014 -48 508 556 1054 59 -874 -444 68 -188 584 1053
3186 1053 263 142 211 -663 -877 273 902 971 963 -77 -1406 -736 139 262 942 1035 -5 -614 -387 -485
3206 -485 -159 852 673 286 586 -92 -746 -839 -148 256 1002 1228 -217 -1517 -734 -208 443 1103 791
3225 791 -175 -233 -466 -975 -13 665 567 439 417 -433 -728 -338 -296 153 1011 995 -109 -768 -951 -551 641
3246 641 1303 488 -96 -135 -749 -751 77 134 297 676 379 -577 -680 -469 -689 108 1088 573 -235 -622 -1297
$$ packed form
3104h76j06M35M91J375Q0j178l80K32n01J20Q54q0N7O56q32j082O9N88l7R85N44
3125A414p70j013l60m22Q88J565j8j042k33m87l09Q20R7J2M96L67j096m95m4k55
3145h85R31J090L9j099j97r49k79J042J408k86j65n42j009Q0R08LQ4N23k8o92
3165b3k60n08n46J531Q16k15l01n54q92o2R66N56M8M98r95r33M30N12k56P72M69
3186A053p90j21O9q74k14J150O29O9qj040j329O70Q75J23O80R3j040o09K27r8
3206d85L26J011j79l87L00o78o54r3O91M04P46K26j445j300P83N26O51O60l12
3225G91r66n8k33n09R62O78r8j28k2q50k95L90M2M49Q58j6j104o59j83M00J192
3246F41O62q15n84l9o14kQ28N7J63L79k97r56j03K11k20P97R80n15q08l87o75
$$ plain form
3267 -1297 -1110 363 1038 212 201 -203 -887 -678 21 -345 48 338 -104 -492 -573 -837 -713 501 921 169
3287 169 139 -465 -1313 -789 9 503 610 241 -869 -1229 -427 -101 -350 264 483 -19 -311 -627 -1106 -675
3307 -675 336 321 345 183 -755 -1356 -694 -210 36 573 418 -882 -951 -523 -498 48 468 100 -272 0 -777
3328 -777 -1299 -702 -11 435 543 396 -1119 -994 -534 -299 196 1000 226 -781 -595 -841 -651 332 672
3347 672 16 320 132 -464 -775 -91 -38 357 1146 551 -509 -547 -602 -242 850 1135 381 -144 -205 -648 -332
3368 -332 647 498 297 719 147 -397 -337 111 14 694 1210 712 -31 -456 -901 42 1129 1102 447 430 -188
3389 -188 -391 225 462 502 907 950 225 -182 150 -165 231 1094 1106 584 405 -536 -697 262 1067 914 770
3410 770 640 -534 -340 372 172 331 886 821 -150 90 -327 -537 216 1035 898 830 280 -741 -814 133
$$ packed form
3267a297J87J473O75q26j1m04o84K09O99l66L93K90m42l88q1k64J24J214M20p52
3287A69l0o04q48N24P98M94J07l69j110l60Q02L26k49O14K19n02k92l16m79M31
3307f75J011j5K4j62r38o01O62M84K46N37j55j300o9M28K5N46M20l68l72K72p77
3328g77n22N97O91M46J08j47j515J25M60K35M95Q04p74j007J86k46J90R83L40
3347F72o56L04j88n96l11O84N3L95P89n95j060l8n5L60J092K85p54n25o1m43L16
3368c32R79j49k01M22n72n44O0M48r7O80N16m98p43m25m45R43J087k7o55j7o18
3389a88k03O16K37M0M05M3p25m07L32l15L96Q63J2n22j79r41j61R59Q05j53j44
3410G70j30j174J94P12k00J59N55o5r71K40m17k10P53Q19j37o8n50j021p3R47
$$ plain form
3430 133 501 732 980 279 -437 -74 122 -8 625 937 319 -34 189 -453 -607 283 733 608 944 343
3450 343 -728 -650 -20 224 820 1056 35 -392 -266 -436 -67 467 416 221 472 -251 -695 -645 0 -86 430
3471 430 773 -317 -863 -649 -561 -157 842 603 -300 -586 -765 -928 -160 431 -5 184 131 -500 -943 -523
3491 -523 -358 -373 555 398 -448 -611 -865 -946 -40 591 150 -145 -474 -917 -1020 -115 -6 -155 153 -29 -511
3512 -511 -599 -533 -675 -108 571 124 -260 -558 -1088 -1059 33 293 342 223 -599 -1050 -786 -193 -272 3 267
3533 267 -149 -533 -396 -725 -734 149 460 260 61 -328 -1102 -781 -3 186 390 478 -536 -787 -354 -190 -62
3554 -62 614 402 -225 -121 -90 -652 -464 278 466 487 478 -445 -916 -373 -3 423 906 545 -332 -417 -287 -199
3576 -199 239 836 290 24 230 -362 -834 -150 337 315 733 446 -575 -771 -200 -143 373 1045 254 -134
$$ packed form
3430A33L68K31K48p01p16L63J96j30O33L12o18l53K23o42j54Q90M50j25L36o01
3450C43j071P8O30K44N96K36j021m27J26j70L69N34n1j95K51p23m44N0O45q6N16
3471D30L43j090n46K14Q8M04R99k39r03k86j79j63P68N91m36J89n3o31m43M20
3491e23J65j5R28j57q46j63k54q1R06O31m41k95l29m43j03R05J09j49L08j82m82
3512e11q8O6j42N67O79m47l84k98n30K9J092K60M9j19q22m51K64N93p9K75K64
3533B67m16l84J37l29rQ83L11k00j99l89p74L21P78J89K04Q8j014k51M33J64J28
3554f2O76k12o27J04L1n62J88P42J88K1rr23m71N43L70M26M83l61q77q5J30Q8
3576a99M38N97n46k66K06n92m72O84M87k2M18k87j021j96N71N7N16O72p91l88
$$ plain form
3596 -134 -235 -300 -502 394 507 264 327 97 -447 -534 -161 264 312 793 385 -372 -342 -271 -159 760 930 399
3618 399 191 -270 -474 -289 563 427 451 522 241 -397 -92 -119 6 604 984 325 -134 -82 -381 -218 718
3639 718 713 496 174 -190 -545 -132 327 235 584 620 -47 -172 13 -425 -29 681 725 212 67 -338 -709 -17
3661 -17 524 436 509 329 -518 -664 -248 -68 -24 696 233 -192 -164 -323 -589 89 479 408 451 230 -576 -823
3683 -823 -60 11 483 513 139 -425 -459 -393 -118 202 708 234 -219 -61 -393 -555 99 387 311 702 80 -774
3705 -774 -457 -234 -267 396 837 258 -436 -353 -413 -157 448 611 3 101 2 -689 -306 -47 47 553 521 -112
3727 -112 -568 -546 -214 -136 685 454 -10 -205 -600 -801 102 500 288 359 317 -204 -691 -235 -294 -15 547 504
3749 504 -73 -502 -480 -458 -28 803 471 73 -25 -567 -588 82 402 99 567 384 -434 -390 -261 -438 184 678
$$ packed form
3596a34j01o5k02Q96J13k43O3k30n44q7L73M25M8M81m08p57L0P1J12R19J70n31
3618C99k08m61k04J85Q52j36K4P1k81o38L05k7J25N98L80o59m59N2k99J63R36
3639G18nk17l22l64l55M13M59r2L49L6o67j25J85m38L96P10M4n13j45m05l71O92
3661a7N41q8P3j80q47j46M16J80M4P20m63m25K8j59k66O78L90p1M3k21q06k47
3683h23P63P1M72L0l74n64l4O6K75L20N06m74m53J58l32j62O54K88p6L91o22q54
3705g74L17K23l3O63M41n79o94Q3o0K56O05J63o08R8r9o91L83K59R4N06l2o33
3727a12m56K2L32P8Q21k31m64j95l95k01R03L98k12P1m2n21m87M56n9K79N62m3
3749E04n77m29K2K2M30Q31l32l98r8n42k1O70L20l03M68j83q18M4J29j77O22M94
$$ plain form
3771 678 487 -120 -51 -632 -496 323 454 163 355 83 -634 -675 -70 -246 156 384 -109 -499 -59 -392 -399
3792 -399 173 485 183 52 -37 -798 -478 171 311 355 449 -239 -819 -375 -150 -67 565 347 -45 -231 -97
3813 -97 -680 -249 93 71 364 630 -332 -712 -419 12 179 395 444 -338 -468 -260 -366 131 362 93 -236
3834 -236 -57 -251 -658 -98 197 -77 261 199 -407 -758 -385 -331 61 571 334 -311 -508 -690 -432 228 357
3855 357 132 69 -59 -761 -647 -3 -132 260 453 124 -391 -597 -397 -508 153 557 345 -211 -188 -450 -245
3876 -245 473 315 445 469 91 -507 -330 -136 -48 502 735 95 -33 -157 -565 -343 453 572 262 451 -348
3897 -348 -560 -232 213 230 505 488 -22 -15 49 1 -35 490 445 162 156 -203 -561 46 493 370 437 500 -108 -339
3921 -339 268 32 515 888 359 113 24 90 -235 295 436 394 566 246 -170 -518 102 329 299 635 260
$$ packed form
3771F78j91o07O9n81J36Q19J31k91J92k72p17m1O05j76M02K28m93l90M40l33p
3792c99N72L12l02j31q9p61L20O49J40M4R4o88n80M44K25Q3O32k18l92j86J34
3813i7n83M31L42k2K93K66r62l80K93M31J67K16M9p82j30K08j06M97K31k69l29
3834b36J79j94m07N60K95k74L38o2o06l51L73N4L92N10k37o45j97j82K58O60J29
3855C57k25o3j28p02J14O44j29L92J93l29n15k06K00j11O61M04k12n56K3k62K05
3876b45P18j58J30K4l78n98J77J94Q8N50K33o40j28j24m08K22P96J19l10J89p99
3897c48k12L28M45J7K75j7n10PO4m8l6N25m5k83ol59l58O07M47j23O7O3o08k31
3921c39O07k36M83L73n29k46q9O6l25N30J41m2J72l20m16l48O20K27l0L36l75
$$ plain form
3942 260 -331 -353 -127 -61 511 551 396 150 -3 -118 -404 -55 135 116 465 80 -714 -385 -288 -250 219 716
3964 716 -15 -133 -151 -741 -206 197 453 -65 154 -68 -507 -213 -42 117 323 415 -129 -249 -285 -412 -127
3985 -127 426 770 46 -89 -132 -478 -70 549 362 234 528 -132 -237 -71 -99 -112 369 495 -73 -90 -205
4006 -205 -655 -238 601 241 189 -127 -459 -856 -198 -13 -183 318 -58 -604 -363 -321 -339 -187 254 152 -78
4027 -78 -325 -568 -746 -148 122 33 -38 -375 -772 -614 -229 -151 15 340 -161 -596 -214 -417 -613 70 196
4048 196 -123 179 -328 -690 -283 85 124 206 305 -103 -427 -265 -348 -116 454 443 49 -93 -116 -341 -48 283
4070 283 412 197 331 -255 -576 -207 -92 64 537 364 -250 -274 -98 -291 -76 454 247 171 111 -222 -240
4091 -240 24 267 46 321 352 -354 -409 -170 -288 112 621 164 8 -137 -354 -150 163 369 353 186 11
$$ packed form
3942B60n91k2K26O6N72M0j55k46j53j15k86L49J90j9L49l85p94L29R7L8M69M97
3964G16p31j18j8n90N35M03K56n18K19k22m39K94J71J59K06R2n44j20l6j27K85
3985a27N53L44p24j35m3l46M08O19j87j28K94o60j05J66k8j3M81J26n68j7j15
4006b05m50M17Q39l60n2l16l32l97O58J85j70N01l76n46K41M2j8J52M41j02k30
4027g8k47k43j78N98K70q9p1l37l97J58L85P8J66L25n01m35L82k03j96O83J26
4048A96l19L02n07l62M07L68L9Q2R9m08l24J62q3K32N70j1l94j42k3k25K93L31
4070B83J29k15J34n86l21L69J15J56M73j73o14k4J76j93K15N30k07p6o0l33j8
4091b40K64K43k21K75L1p06n5K39j18M00N09m57j56j45k17K04L13K06j6j67j75
$$ plain form
4112 11 -300 -329 -126 -206 179 443 228 -150 -55 -224 -342 394 628 136 203 -112 -407 -327 420 344 175 377
4134 377 -65 -156 55 -61 43 458 466 299 -28 -202 -207 -215 502 500 335 446 -1 -543 62 184 122 451 536 -102
4158 -102 -268 -65 -135 -3 341 260 126 81 104 -389 -86 299 341 331 305 -249 -285 13 -33 81 541 340 -23
4181 -23 -12 -36 -539 65 318 187 201 273 -381 -461 12 -32 135 546 263 -467 -283 -302 -260 103 346 38 -78
4204 -78 -30 -255 -311 11 165 -214 212 107 -474 -468 -244 -315 67 646 87 -298 -324 -406 -435 216 238 75 79 -151
4228 -151 -391 -180 172 -195 82 673 -69 -193 -132 -276 32 502 418 234 3 -198 -336 -24 309 320 332
4249 332 231 63 -159 49 -37 75 505 320 -26 -207 -108 -395 -124 388 244 195 57 -461 -480 -28 -11 20
4271 20 461 113 -320 -220 -98 -164 -13 252 132 3 -203 -361 -415 -196 230 205 489 -35 -480 -428 109 81
$$ packed form
4112A1l11k9K03q0L85K64k15l78R5j69j18P36K34m92O7l15k95Q0P47p6j69K02
4134C77m42r1K11j16J04M15Qj67l27j74nqP17kj65J11m47n42O05J22o2L29Q5o38
4158a02j66K03p0J32L44q1j34m5K3m93L03L85M2j0k6n54l6K98m6J14M60k01l63
4181b3J1k4n03O04K53j31J4P2o54q0M73m4J67M11k83p30J84j9M2L63K43l08j16
4204g8M8k25n6L22J54l79M26j05n81OK24p1L82N79n59l85k6q2k9O51K2j63Mk30
4228a51k40K11L52l67K77N91p42j24O1j44L08M70q4j84k31k01j38L12L33J1J2
4249C32j01j68k22K08q6J12M30j85l46j81R9k87K71N12j44m9j38n18j9M52J7L1
4271B0M41l48m33J00J22o6J51K65j20j29k06j58n4K19M26k5K84n24m45N2N37k8
$$ plain form
4293 81 -14 586 90 -283 47 -167 -294 122 640 135 260 -62 -489 -163 6 -53 227 441 -32 -225 -212
4314 -212 -131 -303 295 354 -108 104 -218 -309 -177 135 238 112 69 -62 -387 -100 -163 99 281 347 -200 -186
4336 -186 -172 -525 -260 319 202 -86 78 -228 -193 -71 207 95 253 170 -148 -257 -148 -136 -62 334 152 -41
4358 -41 22 -331 -298 97 335 345 167 21 -446 -204 112 29 224 385 338 -22 -145 -151 -126 134 303 336 78
4381 78 158 -321 -414 104 188 161 252 -198 -424 -239 -194 -222 57 465 -227 -132 -178 -506 -283 -60 153 -9 192
4404 192 -145 -530 -298 -71 -127 37 193 17 -302 -49 -164 -256 282 137 -22 45 -215 -224 2 231 149 458
4426 458 535 -66 -449 2 177 279 455 345 -94 -52 55 -42 209 391 330 99 339 -216 -179 113 188 155
4448 155 612 186 -337 -92 -192 -139 61 316 350 182 37 -303 -383 321 253 59 343 -90 -375 -222 61
$$ packed form
4293H1r5O00m96l73L30k14j27M16N18n05J25l22m27L26J69n9K80K14m73j93J3
4314b12Q1j72N98N9m62K12l22r1J32L12J03j26m3j31l25K87o3K62J82O6n47J4
4336a86J4l53K65N79j17k88J64l06L5J22K78j12J58q3l18j09J09J2P4L96j82j93
4358d1O3l53L3L95K38J0j78j46m67K42L16q3J95J61m7l60j23oK5K60J69L3k58
4381G8Q0m79r3N18Q4k7R1m50k26J85M5k8K79M08o92R5m6l28K23K23K13j62K01
4404A92l37l85K32K27n6J64J56j76l19K53j15r2N38j45j59O7k60rK26K29q2L09
4426D58P7o01l83M51J75J02J76j10m39M2J07r7K51J82o1k31K40n55L7K92P5l3
4448A55M57m26n23K45j00N3K00K55L4j68j45l40q0P04o8j94K84m33k85J53K83
$$ plain form
4469 61 -46 221 357 50 -342 -229 -196 -184 -62 293 248 198 -9 -300 -105 19 79 136 392 12 -176 -206 -239
4492 -239 -308 207 197 -110 -43 -286 -467 -148 210 142 -21 223 -255 -294 -233 -84 -91 224 186 -131 -82 -415 -346 -174
4516 -174 332 122 148 73 -84 -466 -15 0 151 391 232 -206 -145 73 -332 142 371 241 137 59 -465 -277
4538 -277 -154 53 77 290 122 -367 -230 -72 9 109 353 -10 -371 -186 -204 -256 57 159 -125 -172 -224 -489
4560 -489 -285 -115 1 -60 74 -119 -372 -152 -164 -377 169 279 -248 -278 -344 -320 -280 -225 -229 -101 159 -33 -544
4583 -544 -300 -324 64 143 305 -91 -186 -254 -254 7 177 169 25 37 -201 -412 -16 96 27 170 246 -185 -107 -47
4607 -47 -52 135 360 164 75 -25 -41 -95 147 187 202 170 25 -192 -12 23 191 103 371 220 -241 173 -24 -68
4631 -68 313 231 84 -253 81 -292 -249 104 3 104 384 106 -293 -260 -101 -69 253 265 -82 45 -138 -220
$$ packed form
4469F1j07K67J36l07l92J13L3J2J22L55m5n0k07k91J95J24O0N7K56l80j88l0l3
4492b39o9N15j0l07O7k43j81L19L58o8j63K44m78l9O1J49pL15l8l17M9l33O9J72
4516a74N06k10K6p5j57l82M51J5J51K40j59m38O1K18m05M74K29j30j04p8n24J88
4538b77J23K07K4K13j68m89J37J58Q1J00K44l63l61J85j8n2L13J02k84m7n2k65
4560d89K04J70J16o1J34j93k53K20j2k13N46J10n27l0o6K4M0N5mJ28K60j92n11
4583e44K44k4L88P9J62l96r5o8%K61J70qj44J2k38k11L96J12o9J43P6m31P8O0
4607d7nJ87K25j96q9j00j6n4K42M0J5l2j45k17J80L5J68q8K68j51m61M14j97m4
4631f8L81q2j47l37L34l73M3L53j01J01K80k78l99L3J59L2L22J2l47J27j83q2
$$ plain form
4653 -220 -222 -72 21 99 106 -222 -112 -79 204 -114 262 320 -12 -27 -334 -133 178 351 134 253 261 12 -345 158
4677 158 124 100 252 218 -245 -248 77 -110 56 361 348 -40 -150 45 -399 15 467 165 216 96 -106 -385
4699 -385 136 78 -141 284 130 -245 -68 -43 -374 50 206 -82 115 -122 -210 -180 182 251 -40 136 139 -283
4721 -283 -11 -124 -160 152 77 145 -203 -117 -311 -248 88 128 -12 64 -60 -374 -202 -103 -22 170 299 -115 -219
4744 -219 37 -177 -95 234 254 -129 51 59 -311 -130 284 244 2 71 -73 -218 -163 -138 -316 376 314 -150 -154 -2
4768 -2 -214 -108 478 201 106 26 -323 -381 156 55 -91 302 6 -210 -247 80 -276 171 380 89 52 -54
4790 -54 -324 -178 97 61 167 100 133 11 -149 37 -225 171 341 -7 -149 165 -100 -286 116 247 174 240
4812 240 84 -198 -123 -13 76 255 133 -16 -196 -93 -99 -262 -19 158 -15 -42 -51 -441 127 222 148 -72 284
$$ packed form
4653b20kJ50R3P8Pl28J10L3K83l18L76N8l32j5l07K01L11J73k17J19Qk49l57N03
4677A58l4k4J52l4m63lL25j87J66L05j3l88j10J95m44M14M52l02N1j20k02k79
4699c85N21n8k19M25j54l75J77K5l31M24J56k88J97k37q8L0L62O9k91J76Lm22
4721b83K72j13l6L12p5O8l48Q6j94O3L36M0j40P6j24l14J72R9Q1J92J29m14j04
4744b19K56k14Q2L29K0l83J80Ql70J81M14m0k42O9j44j45N5K5j78O92o2m64mJ52
4768bk12J06N86k77r5q0l49n8N37j01j46L93k96k16l7L27l56M47K09k91l7j06
4790e4k70J46K75l6J06o7L3j22j60J86k62L96J70l48j42L14k65j86M02J31p3O6
4812B40j56k82P5J10Q9J79j22j49j80J03oj63K43J77j73k7rl90N68R5p4k20L56
$$ plain form
4835 284 -345 -340 63 80 -62 228 139 -131 -31 8 -341 -221 297 180 54 310 -75 -262 23 -65 160 57
4857 57 238 -240 -300 -31 -108 24 160 98 44 79 -414 -365 58 299 -150 238 34 -275 -282 70 -131 173 311
4880 311 58 -125 -189 -305 -15 60 128 177 91 100 -170 -211 -8 101 187 59 6 -255 -121 37 -281 32 192
4903 192 147 -87 -156 11 -161 191 159 107 227 -174 -331 -408 -11 -5 286 325 -139 -122 -46 -131 -200 240 141 28
4927 28 84 -34 -527 -182 -64 -76 334 109 -292 -342 226 -123 5 229 124 -22 65 -42 -214 90 223 201
4949 201 141 339 -245 -233 -128 13 -7 292 40 -112 -75 -56 -39 206 306 121 56 9 -228 -111 110 15 34
4972 34 157 39 -146 -97 -40 -55 241 142 -33 48 73 -66 -219 274 109 85 140 291 -194 68 155 -179 -314
4995 -314 468 -9 -266 -179 -67 28 265 351 -7 131 99 -73 -153 10 329 143 60 73 -176 71 31 -53 136
$$ packed form
4835B84o29NM03J7j42K90q9k70J00L9l49J20N18j17j26K56l85j87K85q8K25j03
4857E7J81m78o0K69p7J32J36o2n4L5m93M9M23K41m49L88k04l09pL52k01L04J38
4880C11k53j83o4j16K90P5O8M9q6Rk70m1K03J09Q6j28n3k61J34J58l18L13J60
4903A92m5k34o9J67j72L52l2n2J20m01j57p7L97OK91L9m64J7P6q5o9M40r9j13
4927B8N6j18m93L45J18j2M10k25m01n0N68l49J28K24j05j46Q7j07j72L04J33k2
4949B01o0J98n84J2J05J41k0K99k52j52L7J9J7K45J00j85o5m7k37J17K21r5J9
4972C4J23j18j85M9N7j5K96r9j75Q1K5j39j53M93j65k4N5J51m85K62Q7l34j35
4995c14P82m77k57Q7J12R5K37Q6l58J38l2j72q0J63L19j86q3J3k49K47m0q4J89
$$ plain form
5018 136 58 -67 62 91 134 -22 299 218 -17 367 -92 -424 85 188 33 232 166 -168 -209 -2 -98 8
5040 8 168 76 -97 94 -162 -292 -9 -39 65 65 27 -186 -379 -121 -80 97 213 59 -97 -84 -156 -117 -75 24
5064 24 190 267 -113 -397 -191 -118 -97 29 156 -112 -63 90 -39 -155 116 128 14 56 -40 62 -54 161 -96
5087 -96 146 437 -114 -39 125 -99 106 175 153 14 -87 10 15 -207 161 -9 124 12 -185 -68 -177 151
5109 151 86 62 203 -110 -46 -153 -279 45 317 63 -93 -8 -142 -126 144 317 9 19 66 -223 -306 -21 62
5132 62 72 167 -20 -72 -124 -131 -59 -16 318 123 247 38 -308 -76 67 143 148 77 -120 -109 -29 6 -151 214 281 -3
5158 -3 -105 69 -182 -37 -19 286 55 184 31 -48 40 122 -24 211 199 -264 23 235 14 -73 171 133 175
5181 175 201 73 -72 12 251 111 80 216 -18 100 -37 -340 -87 219 165 187 63 -154 -31 -97 127 183
$$ packed form
5018A36p8j25J29K9M3j56L21q1k35L84m59l32N09J03j55J99o6l34m1K07r6J06
5040HJ60r2j73J91k56j30K83l0J04%l8k13j93K58M1J77J16j54j56J3p2L9M2R9
5064B4J66P7l80k84K06P3K1J26J27k68M9J53j29j16K71J2j14M2r6J02j16K15k57
5087i6K42K91n51P5J64k24K05O9k2j39j01R7Nk22L68j70J33j12j97J17j09L28
5109A51o5k4J41l13O4j07j26L24K72k54j56Q5j34J6K70J73l08J0M7k89q3K85Q3
5132F2J0R5j87n2n2pP2M3L34j95J24k09l46K32J43P6Np1j97J1Q0L5j57L65O7k84
5158cj02J74k51J45J8L05k31J29j53p9Q8Q2j46K35j2m63K87K12k21q7K44l8M2
5181A75K6j28j45Q4K39j40l1J36k34J18j37l03K53L06n4K2j24k17J23o6K24N6
$$ plain form
5203 183 189 142 -415 -183 -223 72 158 372 190 75 43 -112 -219 26 322 83 -35 34 -261 -197 -85 119 -32
5226 -32 103 30 -254 -116 -93 -33 -21 185 -126 11 34 -103 -32 21 5 54 39 81 -162 -138 -29 247 10 203
5250 203 72 -158 -73 -199 -73 171 126 -65 67 124 -233 -47 -40 34 153 231 -57 -159 105 22 36 181 -57
5273 -57 -79 60 -164 -117 -86 109 63 129 279 -36 -198 -65 -80 -92 119 127 -133 71 -51 -196 126 -37 -120 -66
5297 -66 -158 -24 -145 122 108 -149 -93 36 -226 -187 -18 -62 25 141 134 -13 30 -128 -30 68 325 -110 16 114
5321 114 -241 -38 -66 63 -101 143 219 76 16 13 114 191 247 -230 -42 -222 -173 -184 -2 35 -24 122 -148 -99
5345 -99 145 -22 17 171 206 -101 17 -18 -274 -200 161 21 24 63 -242 -148 -85 160 -13 -5 259 14 -83 13 -262
5370 -262 -11 236 209 -21 69 -74 -140 -113 66 35 267 114 -403 -93 49 9 -169 121 1 -61 -61 -103 -44 -8
$$ packed form
5203A83Om7n57K32m0K95Q6K14j82j15l2j55j07K45K96k39j18O9k95O4J12K04j51
5226c2J35p3k84J38K3O0J2K06l11J37K3j37P1N3j6M9j5M2k43K4J09K76k37J93
5250B03j31k30Q5j26J26K44m5j91J32N7l57J86PP4J19P8k88j02K64q3J4J45k38
5273e7k2J39k24M7L1J95m6O6J50l15j62J33j5j2K11Qk60K04j22j45L22j63q3N4
5297f6r2J34j21K67j4k57N6J29k62L9J69m4Q7J16pj47M3j58R8R8K57m35J26R8
5321A14l55K03k8J29j64K44P6j43o0lJ01P7N6m77J88j80M9j1J82L7n9J46k70M9
5345i9K44j67L9J54L5l07J18l5k56P4L61j40LL9l05R4O3K45j73QK64k45r7R6k75
5370b62K51K47k7k30R0j43o6K7J79l1K32j53n17L10J42m0j78K90j20o2%m2N9L6
$$ plain form
5394 -8 163 16 -10 -13 -134 -260 -24 -33 -63 213 -37 -63 -262 -55 58 172 213 -52 -88 94 -134 -52 11 99 162
5419 162 173 131 -71 -14 71 184 125 61 -67 -126 91 -234 -233 71 -32 -101 -90 -212 -138 32 -39 144 -1 -27 -163
5444 -163 -177 -249 32 32 77 21 -121 -12 -77 -26 -13 19 -18 70 -84 -126 -167 -285 -45 -21 132 90 -125 110 98 -80
5470 -80 -18 200 45 -96 -46 6 4 68 79 151 219 59 -63 -48 -10 -216 -8 184 23 -36 -201 -339 -264 91 230
5495 230 226 85 -69 -90 -89 20 -139 151 409 40 35 -2 -154 -195 -38 -33 75 22 73 -97 -157 -204 156 149 141 -207
5521 -207 -52 -47 -66 67 64 -52 -183 58 -4 -200 -45 179 -65 320 112 -50 -149 157 40 -14 346 42 1
5544 1 54 57 -248 61 292 36 76 126 17 94 82 117 79 136 1 -115 -58 -27 -10 36 160 35 63 88 -48 -206
5570 -206 -36 274 -147 11 -94 -100 -63 32 120 -113 122 -155 -165 -72 52 113 136 109 -84 19 23 -144 -115 -216
$$ packed form
5394hJ71j47k6lj21j26K36rl0K76k50k6j99K07J13J14M1k65l6J82k28Q2O3Q8O3
5419A62J1m2k02N7Q5J13n9o4j28n9K17l25JL04j03o9J1j22P4J70p1J83j45k6j36
5444a63j4p2K81%M5n6j42J09o5N1J3L2l7Q8j54m2m1j18K40K4J53m2k15K35j2j78
5470h0O2K18j55j41N0N2kO4J1P2O8j60j22J5L8k06K08J92j61n9j65j38P5L55J39
5495B30mj41j54k1JJ09j59K90K58l69nl7j52m1J57NJ08n3N1j70o0m7L60pql48
5521b07J55Nj9J33lj16j31K41o2j96J55K24k44L85k08j62r9L06j17n4L60l04m1
5544AN3Ll05L09K31k56M0N0j09P7j2L5l8N7j35j16N7L1J7M6J24j25K8K5j36j58
5570b06J70L10m21J58j05oL7R5Q8k33K35k77j0R3J24O1K3k7j93J03Mj67K9j01
$$ plain form
5594 -216 -253 16 55 -203 -127 19 -85 -130 -53 161 20 48 -132 -123 -48 313 46 -44 94 -114 -6 -201 102
5617 102 169 122 130 201 -151 100 -67 80 204 22 8 309 94 -136 134 102 54 -21 -206 214 -274 60 -79
5640 -79 -47 172 -1 77 21 -54 -32 25 81 -65 -29 131 -12 -1 -117 -192 -50 116 99 -182 -72 -81 -161 28 177
5665 177 -35 70 -91 -151 47 16 56 84 -37 -221 -227 -48 -93 -107 139 -5 -194 -3 -139 -87 -27 -6 -94 13
5689 13 117 -134 -196 -14 17 -26 108 22 -37 18 -51 -138 143 27 267 46 146 -25 11 -50 138 21 128 51
5713 51 -32 -81 23 108 -86 189 156 67 158 -70 93 120 -34 163 -160 -85 -81 -22 214 184 -92 141 -59 -202
5737 -202 -117 -42 -4 -27 -91 -189 -54 -206 -101 84 125 24 -193 -96 -186 -242 -84 112 -84 76 -116 -16 -45 43
5761 43 69 -81 64 89 -130 135 136 -256 -100 24 122 89 1 -230 -97 -195 -135 -35 18 121 137 149 -198 -79
$$ packed form
5594b16l7K69L9k58P6J46j04m5P7K14j41K8j80RP5L61k67r0J38k08J08j95L03
5617A02O7m7QP1l52K51j67J47J24j82j4L01k15k30K70l2m8p5j85M20m88L34j39
5640g9L2K19j73P8n6p5K2N7N6j46L6J60j43J1j16p5J42J66j7k81J10rq0J89J49
5665A77k12J05j61o0J98l1M0K8j21j84oJ79m5j4K46j44j89J91j36N2O0K1q8J07
5689A3J04k51o2J82L1m3J34q6n9N5o9q7K81j16K40k21J00j71L6o1J88j17J07p7
5713E1q3m9J04Q5j94K75l3q9R1k28J63K7j54J97l23P5MN9K36l0k76K33k00j43
5737b02Q5P5L8k3o4r8J35j52J05J85M1j01k17R7r0n6J58J96j96J60j92J00k9Q8
5761D3K6j50J45K5k19K65Jl92J56J24R8l3q8k31J33r8O0J00N3J03J6J2l47J19
$$ plain form
5785 -79 37 302 1 -3 -83 -120 -209 48 -53 126 -33 101 3 -81 86 141 -59 199 37 112 147 -85 -66 84
5809 84 108 -142 58 75 -56 -184 14 -124 -76 32 -94 -97 58 -64 -292 19 27 -84 -84 108 -338 12 56 -126
5833 -126 99 252 -54 129 105 90 56 85 6 24 -34 79 -63 -11 -160 120 -132 115 -65 -100 -25 36 -68 151
5857 151 214 0 60 -5 39 51 100 77 116 166 19 18 92 6 21 99 121 -98 -70 158 -8 -115 119 104 -97 33
5883 33 12 -54 145 15 101 14 54 -71 60 74 -25 49 47 -102 -99 -122 100 -106 50 114 -111 176 110 -29 -38 -146
5909 -146 -71 -59 -35 55 -27 -48 -155 -50 -88 34 -108 -90 -139 -228 -17 115 -141 52 44 -5 -78 -21 34 -191 56
5934 56 122 -155 -4 -75 -156 156 40 -81 161 106 -97 -280 -164 -128 73 85 189 -87 -205 43 -64 -132 162
5957 162 211 6 -55 -36 -117 73 107 5 -141 60 -191 -82 44 -19 102 166 12 -101 173 -97 -233 -65
$$ packed form
5785g9J16K65l01mq0l7q9K57j01J79j59J34r8q4J67N5k00K58j62P5L5k32J9J50
5809H4K4k50K00J7j31j28J98j38M8J08j26lJ55j22k28L11Qj11%J92m46L50M4j82
5833a26K25J53l06J83k4j5l4K9p9J8n8J13j42N2j49K80k52K47j80l5P5O1j04K19
5857A51O3k14O0o5M4J2M9k3L9N0j47jP4q6J5P8K2k19K8K28j66j07K34j5k01J30
5883C3k1o6J99j30Q6q7M0j25J31J4r9P4kj49Lk3K22k06J56O4k25K87o6j39rj08
5909a46P5J2K4R0q2k1j07J05l8J22j42J8m9q9K11J32k56J93qm9p3N7N5k25K47
5934E6O6k77J51p1q1L12j16j21K42n5k03j83J16L6K01J2J04k76j18K48j07o8K94
5957A62M9k05o1J9q1J90L4j02j46K01k51J09J26o3J21O4j54j13K74k70j36J68
$$ plain form
5979 -65 124 52 24 107 -125 -90 17 78 41 -46 -122 -138 63 -96 47 -10 257 107 32 23 -64 -213 34 -198 -149
6004 -149 204 -31 -36 176 -87 -178 34 46 -4 63 -81 -223 -52 41 38 14 115 5 -49 76 -11 -35 133 153 -18
6029 -18 47 119 -37 80 55 18 241 -188 -95 -223 98 61 -9 -175 13 43 -2 -125 169 -123 85 55 -278 -180
6053 -180 6 104 3 243 23 197 212 124 -143 -177 173 36 197 117 -167 20 24 49 -48 123 -48 -63 96
6076 96 9 -15 -131 -80 224 200 14 157 58 -9 -69 161 319 -54 -103 -70 51 55 220 190 33 179 129 -65 -149
6101 -149 15 -1 -3 67 49 -137 191 9 105 -113 121 -101 -19 -175 -120 -215 -144 -179 23 307 -96 -176 -89 70
6125 70 128 173 38 -29 -274 -16 -153 55 108 53 19 -74 13 -11 46 61 108 89 -51 17 -175 13 -27 297 125
6150 125 -42 17 67 -28 -48 -20 29 122 70 -18 -60 9 41 65 24 95 86 -105 29 -244 -27 207 83 -58 -128 92
$$ packed form
5979f5J89p2k8Q3k32L5J07O1l7q7p6j6K01j59J43n7K67j50p5rq7j49K47k32M9
6004a49L53k35nK12k63r1K12J2n0O7j44j42J71R3lk4J01j10n4J25q7k4J68K0j71
6029a8O5P2j56J17k5l7K23m29R3j28L21l7p0j66J88L0m5j23K94k92K08l0l33R8
6053a80J86R8j01K40k20J74J5q8k67l4L50j37J61q0k84J87MK5r7J71j71j5J59
6076I6q7k4j16N1L04k4j86J43r9o7o0K30J58l73m9L3J21MJ65l0j57J46n0j94q4
6101a49J64j6kP0j8j86L28j82R6k18K34k22Q2j56N5r5P1l5K02K84m03q0Q7J59
6125G0N8M5j35o7k45K58j37K08N3n5l4r3Q7k4N7J5M7j9j40O8j92J88m0L24j72
6150A25j67N9N0r5k0K8M9R3n2q8m2O9L2K4m1P1rj91J34k73K17K34j24j41p0K20
$$ plain form
6176 92 -60 100 68 -79 -119 184 37 -23 -8 36 -162 -25 94 -80 -182 -3 20 70 190 43 170 32 -170
6199 -170 -109 -132 75 73 -261 51 -105 -193 102 -53 -28 113 -22 16 -111 -30 -107 -137 -35 -47 -73 -155 32 -163
6223 -163 -24 -5 37 -22 -99 -114 133 -19 -103 187 83 17 33 -113 -16 -27 178 136 -102 104 123 -70 -24 202
6247 202 -167 -8 92 -11 -82 -18 -181 -81 172 -55 30 127 287 -91 -39 -135 61 42 38 105 -191 -101 -247 49
6271 49 206 7 -16 46 -114 131 -180 4 151 66 -15 80 -107 131 -68 -105 213 -64 -8 -56 -3 -50 -29 -79
6295 -79 -56 113 186 13 -134 192 89 -64 29 77 53 -242 228 92 19 72 147 16 -106 82 57 107 126 -134
6319 -134 3 25 78 -19 -88 49 148 70 -69 52 51 9 -67 -94 -33 -93 130 -101 -174 -54 164 203 10 9 1 67 19
6346 19 56 -146 253 147 21 111 -152 -121 5 128 -31 -133 212 -142 -311 -79 -189 26 91 32 -123 -92
$$ packed form
6176I2j52J60l2j47m0L03j47o0J5M4j98J37J19j74j02J79K3N0J20j47J27j38k02
6199a70O1k3K07kl34L12j56q8K95j55K5J41j35L8j27Q1p7l0J02j2k6q2J87j95
6223a63J39J9M2n9p7j5K47j52q4K90j04o6J6j46R7j1K05m2k38K06J9j93M6K26
6247B02l69J59J00j03p1O4j63J00K53k27Q5R7J60l78N2r6J96j9mO7k96R0j46K96
6271D9J57j99k3O2j60K45l11J84J47q5q1R5j87K38j99l7L18k77N6m8N3m7K1n0
6295g9K3J69P3j73j47L26j03j53R3M8k4k95M70j36p3N3P5j31j22J88k5N0J9k60
6319a34J37K2N3r7o9J37R9p8j39J21jm2p6k7O1o0K23k31p3J20K18L9j93jqO6m8
6346A9L7k02L99j06j26R0k63L1J26J23j59j02L45l54j69K32j10K15O5n9j55L1
$$ plain form
6368 -92 127 -150 45 33 -98 -224 -43 -121 -252 20 4 -212 81 214 -154 -47 88 32 -179 215 -26 -22
6390 -22 157 -23 -34 56 92 12 187 41 -73 -125 -65 -62 -40 -83 84 54 97 -16 -206 42 98 106 3 177 -79
6415 -79 101 -14 -2 -49 80 20 -53 -162 -19 -77 2 89 -132 -77 -21 120 -37 62 13 -108 145 -154 -52 214
6439 214 -24 62 -115 39 78 -52 137 -116 -13 84 18 200 140 -136 -187 -9 159 -114 -150 -20 -84 -152 1
6462 1 -127 -221 56 -40 -9 -83 206 -215 -3 -237 -213 110 15 -105 -54 14 82 67 37 -41 -142 110 59 64 149 133
6488 133 -135 10 147 45 -352 125 15 42 136 158 -113 19 88 -43 177 103 -3 -187 136 26 25 1 124
6511 124 -86 119 -66 82 -149 125 49 4 240 58 67 -9 -26 -7 22 151 -13 -7 39 -203 8 -87 11 16 101
6536 101 -88 -131 -176 72 -23 27 50 36 -144 1 -41 2 104 -138 77 -60 32 -236 -12 -57 4 93 78 136 -129
$$ packed form
6368i2K19k77J95j2j31j26J81p8j31K72j6k16K93J33l68J07J35n6k11L94k41M
6390b2J79j80j1R0L6q0J75j46j14n2O0LK2m3J67l0M3j13j90K48N6Qj03J74k56
6415g9J80j15J2m7J29o0p3j09J43n8P9Q7k21N5N6J41j57R9m9j21K53k99J02K66
6439B14k38Q6j77J54L9j30J89k53J03R7o6J82o0k76n1J78J68k73l6J30o4o8J53
6462Aj28r4K77r6L1p4K89m21K12k34K4L23r5j20N1O8O8j5l0p8j01K52n1NQ5j6
6488A33k68J45J37j02l97M77j10K7R4K2k71J32O9j31K20p4j06j84L23j10jk4J23
6511A24k10K05j85J48k31K74p6m5K36j82Rp6j7J9K9J29j64OM6k42K11r5R8NQ5
6536A01j89m3m5K48r5N0K3j4j80J45m2M3J02k42K15j37R2k68K24m5O1Q9j5N8k65
$$ plain form
6561 -129 -119 -218 -54 100 -75 -65 -199 0 -116 -222 -159 -182 318 96 104 12 139 -44 -116 191 3 111 -58
6584 -58 50 -169 -68 -134 6 191 131 -111 15 -65 89 27 98 -77 42 59 -101 -42 -25 -62 -120 -92 105 -252
6608 -252 28 -65 1 -115 26 -30 -25 96 -5 248 87 -4 -78 -13 32 70 -68 118 115 -114 -160 -82 -39 139 24
6633 24 -93 -8 -136 -104 -87 -35 -40 -109 66 -184 74 83 12 -61 76 35 109 -69 98 -112 -113 119 -29 -25 32 252
6659 252 -6 4 -58 -124 -276 -12 17 -50 133 38 -4 -46 59 -45 108 191 -86 88 -140 -41 -188 220 91
6682 91 -101 -23 172 -138 -1 -3 -2 75 -39 12 -28 161 68 13 171 -22 -27 37 19 18 -62 62 126 228 33 149
6708 149 -119 -99 -102 34 182 -118 21 -123 -131 41 224 -12 121 -229 -62 -218 -33 -237 66 65 -47 39 85
6731 85 99 -80 -134 -205 29 -134 125 -26 65 -56 106 -89 80 48 -139 37 63 -55 -23 27 -198 -171 -170 -20
$$ packed form
6561a29J0r9J64J54j75J0j34J99j16j06O3k3N00k22Qr2J27j83p2L07j88J08j69
6584e8J08k19J01o6J40J85o0k42J26q0J54o2P1j75J19J7j60N9J7l7n8K8J97l57
6608b52K80r3O6j16J41n6NJ21j01K53j61r1p4O5M5L8j38J86lk29m6P8M3J78j15
6633B4j17Q5j28L2J7N2no9J75k50K58Rp1p3J37m1P4j78J67k10jK32j48MN7K20
6659B52k58J0o2o6j52K64K9o7J83r5m2m2J05j04J53Q3k77J74k28R9j47M08j29
6682I1j92P8J95l10J37kJP7j14N1m0J89r3n5J58j93nO4j8jq0J24O4J02j95J16
6708A49k68K0lJ36J48l00J39j44qJ72J83k36J33l50J67j56J85k04L03jj12Q6M6
6731H5J4j79n4p1K34j63K59j51R1j21J62j95J69l2j87J76K6j18L2N0k25K7JJ50
$$ plain form
6755 -20 -75 73 -52 163 -59 -66 207 -125 52 192 -34 -8 -35 -14 5 -73 -82 72 165 -130 79 86 -86 -138 -49
6780 -49 4 -157 38 -148 60 96 93 -184 4 179 44 5 8 145 -135 154 282 135 -32 -60 -73 10 115 -60
6804 -60 27 99 -40 -123 4 -75 -67 23 84 69 -67 -26 -78 19 56 33 44 87 -35 -19 38 103 40 184 4 -184 147
6831 147 -133 -40 -8 100 96 146 79 -114 -113 136 177 -61 110 9 137 -133 215 105 70 -39 -25 179 -63 124
6855 124 -81 75 5 -35 45 -39 62 11 -118 2 -13 127 120 -102 11 112 -38 92 -30 60 -44 98 -57
6878 -57 13 45 93 66 -124 31 -194 24 18 103 -110 -19 4 -13 60 42 -27 113 -162 187 -110 43 24 64 70 -38
6904 -38 -141 18 155 -24 -50 33 -20 53 -2 -139 28 -57 25 66 137 -208 -13 93 -53 21 -172 -13 102 72
6928 72 -109 34 93 33 103 -134 55 -68 131 23 -23 -89 61 113 -94 44 80 -176 107 -53 -4 18 39 100
$$ packed form
6755b0n5J48j25K15k22pK73l32J77J40k26K6k7K1J9p8rJ54R3k95K09Pj72n2Q9
6780d9N3j61J95j86K08L6lk77J88J75j35l9LJ37k80K89J28j47j67k8j3Q3J05j75
6804f0Q7P2j39q3J27p9QR0O1j5j36M1n2R7L7k3J1M3j22J6N7O5o3J44j80j88L31
6831A47k80R3L2J08mN0o7j93JK49M1k38J71j01J28k70L48j10l5j09J4K04k42J87
6855A24k05J56p0m0Q0q4J01n1j29J20j5J40pk22J13J01j50J30j22R0j04J42j55
6878e7P0L2M8k7j90J55k25K18oQ5k13R1K3j7P3j8o9J40k75L49k97J53j9M0Oj08
6904c8j03J59J37j79k6Q3n3P3n5j37J67q5Q2M1P1l45J95J06j46P4j93J59J15l0
6928G2j81J43N9o0P0k37J89j23J99j08m6o6J50N2k07J38L6k56K83j60M9K2K1O1
$$ plain form
6952 100 -93 -112 -54 -81 137 48 -46 -98 36 -80 -30 -181 -61 37 -22 73 -101 -56 104 31 -52 -94 70 -58 -104
6977 -104 -34 41 310 -20 146 8 -119 -68 5 -95 -128 32 93 -1 117 126 -54 77 53 -87 -11 89 -71 -101
7001 -101 197 24 21 41 98 166 -46 169 -26 -192 17 -85 -45 122 -38 -1 -68 -197 144 51 -112 61 -34
7024 -34 -30 -135 -53 95 -16 -238 21 -62 -79 38 -59 -289 18 -80 -144 14 81 64 -101 154 -71 25 -49 -17 -155
7049 -155 222 -37 73 248 -233 87 -29 -80 -98 160 -11 -188 -104 -224 5 39 -68 120 -183 -146 -220 73
7071 73 192 77 238 48 -14 74 -22 25 137 -50 147 -136 -109 -90 37 -72 -48 -84 150 -251 116 9 -298
7094 -298 -129 -33 -70 49 40 -216 33 27 66 -48 205 -248 -172 94 -170 -19 29 -37 -20 -4 -39 -132 20 19 -46 149
7120 149 97 -65 115 119 94 113 2 19 194 -98 -21 -41 43 94 -45 -81 147 90 116 -232 -106 106 -15 -53 108
$$ packed form
6952A00j93j9N8k7K18q9r4n2J34j16N0j51J20R8n9R5j74M5J60p3q3m2J64j28m6
6977a04P0P5K69l30J66j38j27N1P3j00l3J60O1r4J18Rj80J31k4j40P6J00j60l0
7001a01K98j73lK0N7O8k12K15j95j66K09j02M0J67j60L7o7j29L41r3j63J73r5
7024c4Mj05Q2J48j11k22K59q3j7J17r7k30L07r8o4J58O7j7j65K55k25R6p4L2j38
7049a55L77k59J10J75m81L20j16n1j8K58j71j77Q4j20K29L4j07J88l03L7p4K93
7071G3J19j15J61j90o2Q8r6M7J12j87J97k83K7J9J27j09K4l6K34m01L67j07l07
7094b98J69R6l7J19rk56K49oL9j14K53m53P6K66k64J51M8o6J7J6l5r3J52jo5J95
7120A49n2j62J80Mk5J9j11J7J75k92P7k0Q4N1j39l6K28n7K6l48J26K12j21l8J61
$$ plain form
7145 108 -45 -169 -157 -255 -111 -70 -53 191 2 -12 55 -49 -107 -47 -37 -51 -326 -120 -99 -58 56 37 27 48 63
7170 63 -29 -48 -88 66 -10 18 25 -117 31 169 109 128 51 43 -199 168 115 288 25 -104 146 -58 -42 70 85
7195 85 -234 81 0 -28 -118 -15 14 134 -97 -61 -52 4 190 122 56 46 -219 122 77 55 23 -41 -48 48 -68 -168
7221 -168 -80 37 2 -27 -36 3 11 131 38 26 39 -127 -183 -234 -156 -48 218 -75 -32 14 -75 -59 -20 106 41 -13 -96
7248 -96 111 19 13 -19 -92 -46 -76 143 77 32 18 31 -54 -44 85 -141 -224 75 -50 -132 -61 -48 19 5 -103 -89 38
7275 38 -124 128 -225 -107 19 147 71 -82 -109 256 15 17 54 -26 64 -71 35 -165 10 123 -135 26 40
7298 40 4 -81 104 111 -252 46 -64 -122 136 -135 -221 125 47 -150 -4 123 -77 -81 27 -45 -76 71 145 102 -139
7323 -139 41 50 -33 26 62 69 -18 135 -53 -38 -2 -100 72 156 78 -19 -57 -24 -77 172 43 57 -45 -134 -1 -54 123
$$ packed form
7145A08j53j24J2r8J44M1J7K44j89j4O7j04n8O0J0j4k75K06K1M1J14j9j0K1J5
7170F3r2j9m0J54p6K8Pj42J48J38o0J9p7qk42L67n3J73k63j29K50k04J6J12J5
7195H5l19L15q1k8r0J03K9J20k31L6RN6J86o8o6j0k65L41m5k2l2o4pR6j16j00
7221a68Q8J17l5k9rL9QJ20r3j2J3j66n6n1P8J08K66k93M3M6q9J6L9J26o5n4q3
7248i6K07r2ol2p3M6l0K19o6m5j4J3q5J0J29k26q3K99j25q2P1J3O7j4j08J4J27
7275C8j62K52l53J18J26J28p6j53k7L65k41KL7q0R0j35J06k00J75J13k58J61J4
7298D0l6q5J85Pl63K98j10n8K58k71q6L46p8j97J46J27k00mJ08p2l1J47P4m3k41
7323a39J80Rq3N9L6Pq7J53j88J5L6r8J72Q4p8r7l8L3n3K49j29J4j02q9J33n3J77
$$ plain form
7350 123 139 24 78 47 24 1 26 -58 132 -70 19 -134 14 85 200 -75 -36 48 148 9 4 127 -29 -50 94
7375 94 243 -126 171 -39 112 200 2 73 73 -156 64 30 61 -119 -101 219 -70 63 -76 168 59 -46 -13
7398 -13 -128 -25 188 -21 -54 41 -241 -103 168 -45 59 -117 -246 -153 -82 -133 155 49 17 -46 -52 167 36
7421 36 -29 86 -145 3 66 65 -64 80 -53 -99 -363 34 -71 -271 115 26 -138 -89 -34 9 -77 71 -78 -57
7445 -57 192 -201 -13 -149 -88 -3 -92 -91 11 -44 -179 41 67 -158 -94 32 -4 66 19 -47 62 111 -63 -88 -23
7470 -23 99 -46 111 73 75 14 -50 -76 174 -63 52 193 52 24 -48 21 25 54 -17 -172 -7 34 48 -58 -34 62
7496 62 -54 161 81 -138 -81 -35 41 69 -21 -22 81 141 -45 -9 17 51 169 -52 0 -19 106 40 116 139 -36 97
7522 97 220 150 -143 116 -96 -71 -45 -117 -35 165 109 16 23 16 67 -89 146 -83 -102 173 90 113 83 -43 69 -149
$$ packed form
7350A23J6j15N4l1k3k3K5q4J90k02Q9j53J48P1J15k75L9Q4J00j39nJ23j56k1J44
7375I4J49l69K97k10J51Q8j98P1%k29K20l4L1j80J8L20k89J33j39K44j09j05L3
7398a3j15J03K13k09l3R5k82J38K71k13J04j76j29R3P1n1K88j06l2o3oK19j31
7421C6o5J15k31J48O3jj29J44j33m6k64L97j05k00L86q9j64M9N5M3q6J48j49K1
7445e7K49l93J88j36O1Q5q9JJ02n5j35K20K6k25O4J26l6P0m7o6J09M9j74k5O5
7470b3J22j45J57l8Ko1o4k6K50k37J15J41j41k8p2O9MK9p1j55J65M1J4j06K4R6
7496F2j16K15q0k19N7M6P6K8r0jJ03O0j86L6K6L4J18k21N2j9J25o6P6K3j75J33
7522I7J23p0k93K59k12K5K6p2Q2K00n6r3PpN1j56K35k29j9K75q3K3l0j26J12k18
$$ plain form
7548 -149 -13 15 -61 126 -134 248 -73 46 88 22 -33 -14 29 -103 177 -33 146 121 20 51 89 33 54 27
7572 27 -118 190 -73 -41 33 -175 -26 -43 129 -116 -75 -21 -75 -91 24 -4 -15 144 -96 -27 -53 -74 110 -121
7596 -121 30 104 179 -58 -72 -35 -38 185 -45 263 62 -87 52 119 -8 78 -16 -30 137 104 -22 -66 113 179
7620 179 40 84 -27 140 160 -209 -255 13 161 139 -197 -50 120 14 68 158 -42 86 -108 209 177 225 68
7643 68 -161 -50 -4 242 81 -102 -26 74 -131 38 69 -167 -166 -110 68 35 -32 -95 21 -38 50 -109 -78 -47 79
7668 79 80 -129 36 -50 162 127 -174 -23 -61 93 -46 -145 115 -75 -103 -49 78 4 61 -91 53 -48 -37 -4
7692 -4 -19 -5 -181 135 25 -26 73 -99 -51 37 197 -35 -275 31 144 -265 158 -21 -96 -13 84 -63 13 85
7716 85 40 -282 192 89 6 -10 93 -124 110 190 35 227 -18 -70 -41 48 -195 92 52 120 -72 -49 -177 66
$$ packed form
7548a49J36K8p6J87k60L82l21J19M2o6n5J9M3j32K80k10J79k5j01L1L8n6K1k7
7572B7j45L08k63L2P4k08J49j7J72k45M1N4n4j6J15k8j1J59k40O9k6k1J84k31
7596a21J51P4P5k37j4L7lK23k30L08k01j49J39O7j27Q6r4j4J67l3j26m4J79O6
7620A79j39M4j11J67K0l69m6K68J48k2l36J47J70j06N4R0k00J28j94L17l2M8j57
7643F8k29J11M6K46j61j83P6J00k05J69L1k36JN6J78l3o7o3J16n9Q8j59L1L1J26
7668G9Jk09J65q6K12l5l01J51l8J54j39r9K60j90k8N4J27p4N7j52J44j01J1L3
7692dj5J4j76L16j10n1R9j72M8Q8J60k32k40L06J13m09M23j79p5Q3R7j47P6P2
7716H5m5l22M74j03q3j6J03k17K34Q0j55J92k45n2K9Q9k43K87m0O8j92K3j28K43
$$ plain form
7740 66 16 7 127 75 89 124 -220 -69 118 75 46 126 98 -135 25 -132 -44 -6 260 -121 130 -40 97 -113
7764 -113 -133 77 47 160 92 73 12 -5 -139 83 -52 161 189 -6 51 213 147 168 13 -103 6 233 159 -115
7788 -115 -84 80 132 -122 28 -44 128 -112 -106 83 53 90 -102 -47 -158 -158 42 114 27 66 10 -145 -73 -105 -82 -67
7814 -67 104 -3 -5 -84 -50 124 165 -23 65 37 188 19 -77 77 -179 -186 116 68 -95 41 50 -44 50 -128 -159 150
7840 150 74 15 6 88 -62 -136 -54 -16 -25 105 -31 214 -32 78 -33 -146 79 121 34 102 226 -14 -108 -56 -67
7865 -67 84 -3 245 -14 -174 32 11 45 55 -78 15 -149 -203 -8 -59 82 -107 150 145 -80 -129 -155 48 -42
7889 -42 -126 88 209 91 76 49 -30 -111 139 -73 5 10 171 -73 92 -87 146 43 88 222 -16 129 54 12
7913 12 -1 97 73 214 -103 151 -153 101 187 -122 141 -79 -171 -146 21 105 33 60 2 -197 219 92 83 71 7
$$ packed form
7740F6n0rJ20n2J4L5l44J51J87m3k9Q0k8k33J60j57Q8L8K66l81K51j70J37k10
7764a13k0K10l0J13o8j9o1j7j34K22j35K13K8j95N7J62o6K1j55j16J09K27p4k74
7788a15L1J64N2k54J50p2J72k40OJ89l0L7j92N5j11%K00P2q7L9n6j55P2l2K3J5
7814f7J71j07kp9L4J74M1j88Q8k8J51j69r6J54k56pL02m8j63J36Rr4R4j78l1L09
7840A50p6n9rQ2j50p4Q2L8rJ30j36K45k46J10j11j13K25M2q7O8J24k40r4N2j1
7865f7J51q7K48k59j60K06k1L4J0j33R3j64n4J95n1J41j89K57nk25m9k6K03r0
7889d2q4K14J21j18j5k7p9q1K50k12P8NJ61k44J65j79K33j03M5J34k38J45p5m2
7913A2j3R8k4J41l17K54l04K54Q6l09K63k20r2K5J67Q4p2K7n8j99M16j27rj2o4
$$ plain form
7938 7 53 -109 -44 -17 -33 99 -188 -162 33 67 157 153 65 -192 45 9 -182 -37 -69 32 -128 114 283 -203 17
7963 17 288 -91 92 198 107 -45 -40 -112 148 39 182 -165 36 58 -88 -2 94 -10 7 -83 -109 -70 195 76
7987 76 3 140 -60 134 -84 -89 -234 -103 -86 -40 68 271 71 37 -34 -6 182 -88 -50 -7 44 -87 -23 184
8011 184 85 55 99 83 -41 -2 -64 -20 -34 39 -4 92 145 28 72 -15 -47 -34 142 66 -38 73 -15 -32 135 147 -64
8038 -64 33 28 -125 -30 140 -15 -151 66 19 84 -79 30 146 64 24 38 -32 -28 -180 -153 125 85 8 -60 47 -33
8064 -33 70 264 143 -50 199 -20 -12 33 86 -149 34 -84 -74 -40 -98 116 115 67 189 7 75 136 16 -32 -2
8089 -2 -190 55 -25 -40 3 124 113 66 296 -21 -115 -76 -143 -70 -96 45 37 -45 -29 62 -124 -152 -71 28 107 244 52
8116 52 -2 6 -122 116 195 26 49 21 4 58 147 15 -79 -19 6 9 -164 -13 56 234 68 -5 74 -4 376 -15
$$ packed form
7938GM6j62O5K7j6J32k87K6J95L4R0mq8k57K37l6j91J45l2J01j60K42J69m86K20
7963A7K71l79J83J06r1j52Np2K60j09J43l47K01K2j46Q6R6j04J7r0k6L9K65j19
7987G6p3J37k00J94k18nj45J31J7M6J08K03k00l4p1K8J88k70L8M3N1j31O4K07
8011A84r9l0M4j6j24L9o2M4j4P3m3R6N3j17M4q7l2J3J76p6j04J11q8j7J67J2k11
8038f4R7nj53R5J70j55j36K17m7O5j63J09J16q2m0J4p0Mj52K7K78m0p7o8J07q0
8064c3J03J94j21j93K49k19QM5N3k35J83j18J0L4n8K14jm8J22j82O8O1j20m8L0
8089bj88K45q0j5M3J21j1m7K30l17r4L9o7P3k6J41qq2J6R1j86k8Q1R9P9J37j92
8116E2n4Qj28K38P9j69K3k8j7N4Q9j32r4O0K5Lj73J51O9J78j66p3P9p8L80l91
$$ plain form
8142 -15 72 -73 -112 11 -19 92 -44 -43 161 -119 154 -5 -17 -35 34 -235 25 103 -139 -62 -86 -48 -115 -90 41
8167 41 -42 206 -26 -112 -5 69 58 -89 59 85 137 141 -295 -40 105 -39 75 117 58 -60 -4 103 93 84
$$ packed form
8142a5Q7j45l9J23l0J11j36JK04k80K73j59j2j8O9k69K60P8k42P7k4L8o7K5J31
8167D1q3K48k32q6J07P4j1j47J48K6N2Mm36K55J45j44J14M2n9j18N6J07j0r
8191H4
$$ Imaginary data points
##PAGE= N=2
##DATA TABLE= (X++(I..I)), XYDATA
$$ plain form
0 0 0 0 0 0 0 0 0 0 0 8 -8 8 -8 8 -16 16 -17 24 -25 32 -35 41 -49 56 -65 75 -84 95 -111 121 -137 155 -172
33 -172 194 -218 241 -268 297 -330 365 -405 449 -498 550 -611 676 -753 839 -936 1055 -1192
51 -1192 1356 -1561 1820 -2162 2637 -3339 4496 -6735 12709 -62819 -173935 -71903 33170
64 33170 80463 26443 -57070 -100837 -52661 10896 32930 2401 -43459 -62556 -10001 56530
76 56530 51762 -27830 -95515 -79768 29860 128023 93111 -46774 -129540 -76057 50480 125088
88 125088 74966 -40165 -81488 -19825 50804 59066 15108 -33459 -28804 28727 67519 45114
100 45114 -9939 -58291 -55095 22815 106405 98032 711 -93267 -92692 14614 125025 110084
112 110084 -7407 -84407 -49549 42494 89793 40976 -39255 -39521 35848 84879 58969 -7724
$$ packed form
0@%%%%%%%%%Qj6J6j6J6k4L2l3M1m9N7o7P6r0J05j21J40j59J79k06K32k58K92l27
33a72L66m12M59n09N65o27O95p70Q54r47J048j161J287j429J592j775J991k247
51a192K548k917L381l982M799n976P835j1231J9444p5528j11116J02032J05073
64C3170M7293n4020q3513m3767M8176O3557K2034l0529m5860j9097N2555O6531
76E6530m768p9592o7685J5747J09628R8163l4912j39885q2766N3483J26537P4608
88A25088n0122j15131m1323O1663P0629Q262m3958m8567M655N7531L8792k2405
100D5114n5053m8352L196P7910Q3590q373r7321r3978N75J07306J10411j4941
112A10084j17491p7000L4858R2043M7299m8817q0231k66P5369M9031k5910o6693
$$ plain form
124 -7724 -55054 -32041 46395 99800 82839 18951 -48723 -63444 8415 100322 112788 38423
136 38423 -45666 -58195 18563 95045 70466 -18218 -50090 7790 81742 85759 2109 -79917
148 -79917 -58764 38365 98129 71501 -6932 -74197 -70632 -2184 58710 64862 20737 -45479
160 -45479 -76344 -31275 36324 43294 -11098 -61471 -50089 20457 63779 8073 -84449 -95693
172 -95693 -13169 74928 79381 -9804 -98777 -88483 -2713 60610 57678 8854 -43058 -48511 -6992
185 -6992 29805 33571 11288 -19752 -21759 24410 63659 37156 -28393 -60473 -16385 75105 115230
198 115230 44103 -61178 -82371 -8197 80232 99661 33226 -42762 -44848 8058 43650 37660
210 37660 5328 -23197 -13671 22938 37573 12676 -28887 -56636 -35556 31853 70650 26705
$$ packed form
124g724m7330K3013P8436N3405j6961o3888o7674j4721P1859R1907J2466p4365
136C8423q4089j2529P6758P6482k4579q8684l1872N7880P3952M017q3650q2026
148g9917K1153R7129N9764k6628p8433o7265L565O8448O0894O152m4125o6216
160d5479l0865M5069O7599O970n4392n0373J1382P0546M3322n5706r2522j1244
172i5693Q2524Q8097M453q9185q8973J0294Q5770O3323k932m8824n1912n453M1519
185f992L6797L766k2283l1040k007M6169L9249k6503o5549l2080M4088R1490M0125
198A15230p1127j05281k1193P4174Q8429J9429o6435p5988k086N2906L5592n990
210C7660l2332k8525R526L6609J4635k4897m1563k7749K1080O7409L8797m3945
$$ plain form
222 26705 -56349 -98793 -60297 27678 72077 18784 -64743 -84624 -38103 15600 22958 -22697
234 -22697 -62823 -42740 5359 20644 -6810 -51440 -74336 -41588 22570 50952 18925 -43303
246 -43303 -86046 -62557 17577 70186 40691 -28768 -67682 -41840 22308 52131 13572 -33808
258 -33808 -27168 16890 47268 31036 -22224 -53095 -17976 44304 68898 40732 -17946 -60093
270 -60093 -38256 28101 68942 50876 -3843 -49154 -39085 17032 48263 20235 -23413 -33102
282 -33102 -1618 38922 33506 -23514 -63186 -37779 21366 57082 36902 -29099 -76592 -54228
294 -54228 8270 49281 40748 -9976 -57421 -50118 -382 30060 16759 -17402 -36934 -14100
306 -14100 28704 31628 -13522 -49365 -36751 13867 59561 49379 -13872 -60143 -43885 10870
$$ packed form
222B6705q3054m2444L8496Q7975M4399n3293q3527j9881M6521N3703P358m5655
234b2697m0126K0083M8099J5285k7454m4630k2896L2748O4158K8382l2027o2228
246d3303m2743K3489Q0134N2609k9495o9459l8914K5842O4148K9823l8559m7380
258c3808O640M4058L0378j6232n3260l0871L5119O2280K4594k8166n8678m2147
270f0093K1837O6357M0841j8066n4719m5311J0069N6117L1231k8028m3648r689
282c3102L1484M0540n416n7020l9672K5407N9145L5716k0180o6001m7493K2364
294e4228O2498M1011q533n0724m7445P303M9736L0442j3301l4161j9532K2834
306a4100M2804K924m5150l5843J2614N0618M5694j0182o3251m6271J6258N4755
$$ plain form
318 10870 56716 56576 7314 -38939 -32862 7816 37400 33906 558 -25245 -5709 35338 40358
331 40358 2666 -36418 -37700 10007 62628 55329 -6834 -55784 -50641 -1461 49618 51423 2404
344 2404 -40806 -40709 -11195 19808 24741 -5261 -32523 -21183 9786 21184 408 -38267 -52316
357 -52316 -11593 42776 45865 -3970 -56207 -63862 -14342 44444 48447 1413 -38388 -39627 -9606
370 -9606 23905 26306 -1993 -19483 -7898 14223 26810 14419 -20644 -35764 -2998 43839
382 43839 57228 24125 -31919 -55369 -12606 50756 64986 25362 -23817 -38603 -6614 34499
394 34499 35148 4380 -13346 -5292 15135 27797 11804 -20904 -30181 -4940 28050 43323 21543
407 21543 -29144 -56183 -26329 26659 51258 27135 -25408 -53079 -24021 21844 28941 724
$$ packed form
318A0870M5846j40m9262m6253O077M0678K9584l494l3348k5803J9536M1047N020
331D0358l7692l9084j282M7707N2621p299o2163m8950N143M9180N1079J805m9019
344B404m3210R7K9514L1003M933l0002k7262J1340L0969J1398k0776l8675j4049
357e2316M0723N4369L089m9835n2237p655M9520N8786M003m7034l9801j239L0021
370i606L3511K401k8299j7490J1585K2121J2587j2391l5063j5120L2766M6837
382D3839J3389l3103n6044k3450M2763O3362J4230l9624m9179j4786L1989M1113
394C4499O49l0768j7726Q054K0427J2662j5993l2708r277K5241L2990J5273k1780
407B1543n0687k7039K9854N2988K4599k4123n2543k7671K9058M5865P097k8217
$$ plain form
419 724 -25424 -22546 7535 28024 7213 -28996 -36120 -10478 24453 41258 18896 -26214 -46424
432 -46424 -24898 17174 48103 38947 -8044 -41672 -25276 14927 36868 23312 -10438 -21862
444 -21862 7586 35940 22873 -12469 -29596 -10576 31682 53464 25480 -20974 -37738 -17992
456 -17992 19841 47482 36409 -2958 -28686 -21444 5126 29632 26193 -4833 -21731 -2738
468 -2738 23028 23242 -3425 -32508 -26462 18509 49845 28988 -18387 -46571 -32380 13250 45870
481 45870 31353 -6885 -29095 -24521 -476 23273 20425 -3034 -14943 -5217 11153 18670 3272
494 3272 -24767 -25777 9701 40437 33823 -4849 -42947 -39308 7793 45192 34944 -2981 -31241
507 -31241 -29306 241 23604 14988 -7194 -14987 -7991 6267 12900 -3733 -28527 -27791 -1855
$$ packed form
419G24k6148K878L0081K0489k0811l6209p124K5642L4931J6805k2362m5110k0210
432d6424K1526M2072L0929r156m6991l3628J6396M0203K1941j3556l3750j1424
444b1862K9448K8354j3067l5342j7127J9020M2258K1782k7984m6454j6764J9746
456a7992L7833K7641j1073l9367k5728P242K6570K4506l439l1026j6898J8993
468b738K5766K14k6667k9083O046M4971L1336k0857m7375k8184J4191M5630L2620
481D5870j4517l8238k2210M574K4045K3749k848k3459j1909R726J6370P517j5398
494C272k8039j010L5478L0736o614l8672l8098L639M7101L7399j0248l7925k8260
507c1241J935K9547K3363q616k2182p793O996J4258O633j6633k4794P36K5936
$$ plain form
520 -1855 24073 26665 -4390 -45749 -50369 -11151 27874 30618 -1668 -40551 -46453 -14064 13639
533 13639 8716 -12337 -25381 -19950 -204 7297 -11711 -32107 -29198 -7680 16680 22514 -4433
546 -4433 -39679 -43520 -13711 20989 34245 9998 -30021 -39665 -11863 16766 21046 3144 -17531
559 -17531 -14392 10577 20963 3041 -18323 -21128 -935 28655 35632 6583 -26617 -31988 -9274
572 -9274 25062 41666 19710 -17999 -30705 -13528 12259 24930 10589 -14196 -15878 4024
584 4024 14633 4293 -15991 -27065 -10798 20961 28412 2048 -29468 -40018 -21065 15158
596 15158 32082 11059 -21529 -34915 -23317 2745 18421 5183 -16978 -18953 -3514 9338
608 9338 6768 -12778 -27758 -12299 19136 30121 12107 -18189 -35770 -18388 20099 38958
$$ packed form
520a855K5928K592l1055m1359m620L9218L9025K744l2286l8883n902L2389K7703
533A3639m923k1053j3044N431J9746P501j9008k0396K909K1518K4360N834k6947
546d433l5246l841K9809L4700J3256k4247m0019r644K7802K8629M280j7902k0675
559a7531L139K4969J0386j7922k1364k805K0193K9590O977k9049l3200n371K2714
572i274L4336J6604k1956l7709j2706J7177K5787J2671j4341k4785j682J9902
584D024J0609j0340k0284j1074J6267L1759P451k6364l1516j0550J8953L6223
596A5158J6924k1023l2588j3386J1598K6062J5676j3238k2161j975J5439J2852
608I338k570j9546j4980J5459L1435J0985j8014l0296j7581J7382L8487J8859
$$ plain form
620 38958 23348 -5338 -23040 -15914 11818 29866 18917 480 -4711 4544 18852 20932 2090
633 2090 -13497 -934 25042 38342 26118 -5149 -27058 -11940 23842 42189 31039 2796
645 2796 -20057 -14162 12913 28044 19785 3786 -5931 -81 16085 18477 -516 -15056 -7465
658 -7465 13767 31590 25379 -7031 -31203 -19993 11574 33858 29807 1015 -25455 -20416 4560
671 4560 20160 17746 3243 -9602 -4522 11569 13620 -734 -12411 -10195 7481 28064 24808
684 24808 -4659 -27434 -21542 5085 31678 32207 2660 -24291 -21225 261 17646 18925 1870
697 1870 -12440 -5987 8845 9671 -1092 -13563 -15782 1784 22742 19610 -5373 -27148 -28901
710 -28901 -6212 24203 28841 2034 -24841 -28715 -11532 11460 16752 -1063 -16550 -11094 1554
$$ packed form
620C8958j5610k8686j7702P126K7732J8048j0949j8437n191R255J4308K080j8842
633B090j5587J2563K5976J3300j2224l1267k1909J5118L5782J8347j1150k8243
645B796k2853N895K7075J5131q259j5999r717N850J6166K392j8993j4540P591
658g465K1232J7823o211l2410k4172J1210L1567K2284m051k8792k6470N039K4976
671D560J5600k414j4503j2845N080J6091K051j4354j1677K216J7676K0583l256
684B4808k9467k2775N892K6627K6593N29k9547k6951L066K1486J7385J279j7055
697A870j4310O453J4832Q26j0763j2471k219J7566K0958l132k4983k1775j753
710b8901K2689L0415M638k6807k6875l874J7183K2992N292j7815j5487N456J2648
$$ plain form
723 1554 5825 -1805 -16120 -19383 -638 18878 15864 -3794 -24698 -29736 -7989 21045 25984
736 25984 5631 -18072 -27625 -13764 11496 18832 2533 -12488 -11647 -748 9292 4312 -14269
749 -14269 -19471 -1609 16939 18557 1380 -23643 -31703 -10093 17298 23459 8413 -15828 -29841
762 -29841 -17624 6104 13865 3405 -10213 -15900 -7920 4626 1423 -15233 -20018 -7836 9380
775 9380 16952 2208 -25093 -33801 -13448 11761 21844 10060 -15936 -30154 -17064 4290 12679
788 12679 6813 -6352 -14788 -5933 7083 4127 -8611 -14130 -7518 10023 22599 10300 -16166
801 -16166 -26437 -12263 12310 28717 19280 -8518 -23583 -13341 5933 17645 14569 -1245
813 -1245 -9510 -797 8822 6600 -2183 -9205 -5819 11078 23141 11453 -10625 -22052 -14247 9425
$$ packed form
723A554M271p630j4315l263J8745J9516l014j9658k0904n038K1747K9034M939
736B5984k0353k3703r553J3861K5260P336j6299j5021Q41J0899J0040m980j8581
749a4269n202J7862J8548J618j7177k5023q060K1610K7391O161j5046k4241j4013
762b9841J2217K3728P761j0460j3618n687P980J2546l203j6656m785J2182J7216
775I380P572j4744k7301q708K0353K5209J0083j1784k5996j4218J3090K1354Q389
788A2679n866j3165q436Q855J3016k956j2738n519O612J7541J2576j2299k6466
801a6166j0271J4174K4573J6407r437k7798j5065J0242J9274J1712l076j5814
813a245q265Q713R619k222q783p022L386J6897J2063j1688k2078j1427P805K3672
$$ plain form
827 9425 29141 20630 -6035 -21764 -16398 1374 17587 15069 -2517 -10743 -3153 5641 6567 -1178
841 -1178 -11780 -9096 9107 19838 10754 -7846 -22020 -18091 5987 26337 20553 -1436 -18128
854 -18128 -19215 -2004 16891 16131 1011 -7591 -4541 3781 9230 2086 -10210 -7496 8904 18849
868 18849 13672 -3018 -20341 -17502 6402 24769 21567 3372 -15519 -19334 -1959 16129 15588
881 15588 3229 -6084 -6893 2066 10151 2434 -9520 -7849 4664 15581 15615 -1312 -21360 -19615
895 -19615 1679 19383 21412 5565 -16749 -21705 -5107 11573 13715 5237 -6331 -10015 115
908 115 7010 744 -7732 -7504 923 13682 16022 -715 -19388 -18333 -1429 16844 23242 7803
922 7803 -15215 -19932 -5608 10031 16123 8732 -5656 -8879 1535 7436 2873 -4179 -7658 -293
$$ packed form
827I425J9716q511k6665j5729N366J7772J6213k518j7586q226P590Q794R26p745
841a178j0602K684J8203J0731r084j8600j4174L929K4078K0350n784k1989j6692
854a8128j087J7211J8895p60j5120q602L050Q322N449p144j2296K714J6400R945
868A8849n177j6690j7323K839K3904J8367l202j8195j8891l815J7375J8088n41
881A5588j2359r313q09Q959Q085p717j1954J671J2513J0917L4j6927k0048J745
895a9615K1294J7704K029j5847k2314m956J6598J6680K142q478j1568l684J0130
908A15O895o266q476K28Q427J2759K340j6737j8673J055J6904J8273O398j5439
922G803k3018m717J4324J5639O092p391j4388l223J0414N901m563p052l479P365
$$ plain form
936 -293 14356 17335 2058 -14536 -17036 -4711 15738 24742 10068 -11354 -17900 -8931 7320
949 7320 17588 10475 -4456 -7531 106 5104 4448 -2377 -8616 -1690 13419 15753 3037 -11730
963 -11730 -17586 -6785 14928 23704 10166 -8709 -17646 -11628 5814 17405 10330 -2916 -6617
976 -6617 -2427 4036 6662 -1278 -8680 -1927 10988 14475 5903 -8934 -18794 -8597 13017 22084
990 22084 12665 -4414 -17362 -13944 4630 15636 10019 -193 -6092 -4894 3353 6587 -1702 -7766
1004 -7766 -2056 7644 12492 7557 -8346 -19400 -9922 9339 19147 13921 -3437 -18786 -15202 2117
1018 2117 12726 9841 487 -8816 -7762 2052 4853 -2826 -7778 -4664 3118 11055 7403 -9302
1032 -9302 -19708 -12548 3289 15483 14355 -3207 -19864 -17157 -2674 8251 10150 697 -10831
$$ packed form
936b93J4649K979j5277j6594k500J2325K0449R004j4674k1422o546Q969J6251
949G320J0268p113j4931l075P637M998o56o825o239O926J5109K334j2716j4767
963a1730n856J0801K1713Q776j3538j8875q937O018J7442J1591p075j3246l701
976f617M190O463K626p940p402O753J2915L487q572j4837r860J0197K1614R067
990B2084r419j7079j2948L418J8574J1006n617j0212n899J198Q247L234q289o064
1004g766N710R700M848m935j5903j1054R478J9261R808n226j7358j5349L584J7319
1018B117J0609k885r354r303J054R814K801p679m952L114P782P937l652j6705
1032i302j0406P160J5837J2194j128j7562j6657K707J4483J0925J899r453j1528
$$ plain form
1045 -10831 -9863 -823 1137 -3488 -7448 -7544 130 9835 5868 -9680 -18805 -14464 -772 13901 13822
1060 13822 -3829 -18833 -17630 -6231 6759 11092 447 -10794 -9561 -2562 205 -1286 -7016
1073 -7016 -9580 -907 9278 5512 -7066 -16562 -16576 -3039 13745 13854 -2156 -15816 -18430 -9227
1087 -9227 6228 11133 1248 -8279 -8834 -5037 -178 272 -6437 -8966 -122 7701 5569 -3409 -14566
1102 -14566 -16864 -2660 13696 14090 1455 -12476 -18337 -8600 7778 12203 3614 -4652 -7508 -4058
1116 -4058 3165 3221 -3977 -5647 1495 7790 8840 1521 -11381 -14288 -895 13628 16512 8109 -7297
1131 -7297 -16002 -6414 8796 13601 8640 212 -5876 -1906 6018 5465 -874 -1485 3069 8721 12263
1146 12263 4729 -8807 -10655 420 13095 18857 11947 -5004 -13375 -4788 8295 14764 12305
$$ packed form
1045a0831R68R040J960m625l960r6P674R705l967j5548r125M341J3692J4673p9
1060A3822j7651j5004J203J1399J2990M333j0645j1241J233O999K767j491n730
1073g016k564Q673J0185l766j2578r496j4J3537J6784J09j6010j3660k614R203
1087i227J5455M905r885r527n55L797M859M50o709k529Q844P823k132q978j1157
1102a4566k298J4204J6356L94j2635j3931n861R737J6378M425q589q266k856L450
1116d058P223N6p198j670P142O295J050p319j2902k907J3393J4523K884q403j5406
1131g297q705R588J5210M805m961q428o088L970P924n53o339o11M554N652L542
1146A2263p534j3536j848J1075J2675N762o910j6951q371Q587J3083O469k459
$$ plain form
1159 12305 2250 -5488 -634 6627 5936 2228 181 1440 8811 13741 5604 -6942 -9222 -2004
1173 -2004 10558 19549 12886 -3893 -11925 -6111 4738 13946 13306 1955 -5182 -1404 3502 4693
1187 4693 3149 -833 -459 8099 12218 4998 -5161 -9564 -4838 8837 18541 11711 -2988 -10923
1201 -10923 -8502 2300 13851 12917 1873 -4276 -2718 1304 5093 3871 -2041 -1451 7005 10253
1215 10253 5187 -3050 -10175 -7282 7022 16346 10900 -1275 -10903 -11923 -447 11485 10436 1583
1229 1583 -4324 -6065 -2419 3110 1220 -4591 -3128 2761 5296 3270 -4845 -13747 -10634 2981 11149
1244 11149 8059 -2199 -14474 -16133 -4022 6941 6829 617 -6830 -10237 -4757 934 -1684 -5730
1258 -5730 -4835 -1640 2761 3085 -5443 -14670 -11323 -358 8426 9200 -596 -14323 -15733 -4921 4528
$$ packed form
1159A2305j0055p738M854P261o91l708k047J259P371M930q137j2546k280P218
1173b004J2562Q991o663j6779q032N814J0849R208o40j1351p137L778M906J191
1187D693j544l982L74Q558M119p220j0159m403M726J3675R704o830j4699p935
1201a0923K421J0802J1551r34j1044o149J558M022L789j222n912N90Q456L248
1215A0253n066q237p125K893J4304R324n446j2175r628j020J1476J1932j049q853
1229A583n907j741L646N529j890n811J463N889K535k026q115q902L113J3615Q168
1244A1149l090j0258j2275j659J2111J0963j12o212p447l407N480N691k618m046
1258e730Q95L195M401L24q528r227L347J0965Q784P74r796j3727j410J0812R449
$$ plain form
1273 4528 7067 2713 -6276 -9990 -4089 134 -1535 -3693 -3846 -1935 3408 3851 -5103 -12806 -10417
1288 -10417 -1970 7740 10983 431 -12940 -14641 -6199 3121 8638 4066 -6520 -9345 -4099 -807
1302 -807 -285 -1663 -4423 -2112 4184 4139 -3840 -9811 -9839 -3258 7918 11857 2199 -9364 -12189 -7125
1318 -7125 3535 10857 5756 -3780 -6066 -3451 -142 2682 681 -2931 30 6226 5300 -667 -6226
1333 -6226 -9063 -2466 9680 12674 4175 -5838 -10907 -7389 4236 11711 6860 -1261 -5143 -4910
1347 -4910 128 4124 673 -2892 590 4709 4705 1459 -5301 -9676 -2626 8480 11108 5597 -3696
1362 -3696 -11293 -8027 3845 10080 7607 1792 -4098 -5252 916 4517 1299 -517 1525 3948 6195
1377 6195 4330 -3965 -8077 -888 8475 12200 9213 -1446 -10129 -6208 4200 10141 9768 4052 -3572
$$ packed form
1273D528K539m354q989l714N901M223j669k158j53J911N343M43q954p703K389
1288a0417Q447R710L243j0552j3371j701Q442R320N517m572j0586k825N246L292
1302h07N22j378k760K311O296m5p979n971k8O581J1176L939r658j1563k825N064
1318g125J0660P322n101r536k286K615L309K824k001l612K961O196r26n967n559
1333f226k837O597J2146K994q499j0013n069L518J1625P475m851q121l882K33
1347d910N038L996l451l565L482M119ml246o760m375P050J1106K628n511r293
1362c696p597L266J1872O235k473n815n890j154O168L601l218j816K042K423K247
1377F195j865q295m112P189R363L725k987j0659q683L921J0408N941l73n716p624
$$ plain form
1392 -3572 -4091 2088 4203 2457 1434 1022 2598 6667 4469 -4089 -7320 -2393 4997 11117 9603
1407 9603 -2013 -10661 -7519 631 7129 8994 2633 -5336 -5161 -564 856 1291 321 -1858 1048
1422 1048 5114 1924 -5046 -7391 -5036 2109 10326 8577 -2549 -10086 -8713 -2082 6728 9449 1983
1437 1983 -4937 -4753 -1988 1019 2661 532 -1635 1971 4958 2050 -2577 -5965 -5688 1930 10366
1452 10366 8536 -159 -7060 -8814 -2941 7387 9830 3144 -2809 -4605 -3245 1308 3366 -197
1466 -197 -1200 2507 3734 2125 -1430 -6473 -6746 1772 8776 7344 767 -6845 -10450 -3786 6262
1481 6262 8309 3637 -1976 -6216 -4741 1345 2694 -548 -965 1270 2412 2912 -365 -6820 -6345 1586
1497 1586 7543 7812 2988 -6001 -9967 -3227 5268 7944 5872 96 -5618 -3431 1667 2614 866
$$ packed form
1392c572n19O179K115j746j023m12J576M069k198q558l231M927P390O120j514
1407I603j1616q648L142Q150O498J865o361p969J75M597J420M35r70k179K906
1422A048M066l190o970k345K355P145Q217j749j1126p537J373O631Q810K721p466
1437A983o920J84K765L007J642k129k167L606K987k908m627l388K77P618Q436
1452A0366j830q695o901j754N873J0328K443o686n953j796J360M553K058l563
1466a97j003L707J227j609l555n043k73Q518P004j432o577p612l605O664J0048
1481F262K047m672n613m240J475O086J349l242m17K235J142N00l277o455M75P931
1497A586N957K69m824q989l966O740Q495K676k072n776n714K187N098R47j748
$$ plain form
1512 866 853 603 2594 4524 319 -6027 -5103 593 6378 8865 3739 -6260 -9769 -3998 2873 7297
1528 7297 6316 -1068 -6523 -4077 -341 801 1000 -477 -2046 1056 2854 -1410 -6160 -5800 -2547 3777
1544 3777 8218 2814 -6702 -9837 -6351 103 6397 5728 -1906 -6166 -4795 -2322 155 1606 -1032
1559 -1032 -2045 1567 2226 -1825 -4880 -6077 -3695 4052 8491 3019 -4945 -8614 -7360 -164 7360
1574 7360 6004 -1157 -4772 -4951 -3082 1309 1781 -1476 -1346 1501 1008 -1058 -3535 -6758 -4482 3450
1590 3450 6743 3055 -2978 -8559 -8978 -1011 6095 4761 -260 -4512 -6743 -3972 895 434 -1803
1605 -1803 -822 322 325 -159 -3858 -7725 -4426 2627 5595 3768 -1960 -8826 -8938 -771 5133 5541 1897
1622 1897 -4001 -6996 -2946 1279 812 -5 53 -107 1299 1716 -2662 -5980 -2552 2225 5716 6098 -32
$$ packed form
1512H66j3k50J991J930m205o346R24N696N785K487n126r999l509N771O871M424
1528G297r81p384n455K446L736J142J99j477j569L102J798m264m750L60L253O324
1544C777M441n404r516l135L486O454O294o69p634m260J371K473K477J451k638
1559a032j013L612O59m051l055j197K382P747M439n472p964l669J254P196P524
1574G360j356p161l615j79J869M391M72l257J30K847m93k066k477l223K276P932
1590C450L293l688o033n581m19P967P106j334n021m252k231K771M867m61k237
1605a803R81J144Lm84l699l867L299P053K968j827n728o866j12Q167N904M08l644
1622A897n898k995M050M225m67q17N8j60J406M17m378l318L428M777L491L82o130
$$ plain form
1639 -32 -7347 -7138 -502 4588 7234 4561 -2576 -5212 -1534 1280 2107 2157 856 437 3316 3104 -1526
1656 -1526 -3679 -1471 2320 7249 8157 1310 -5722 -5201 -555 5092 9193 5829 -1210 -2976 -705
1671 -705 1549 4034 4221 1622 1841 4242 3348 58 -1512 -1205 2342 8546 8791 2472 -3184 -4073 -1369
1688 -1369 5706 10168 6312 329 -1434 -1261 1442 4945 4287 1798 2629 4107 2625 820 -1262 -2374
1704 -2374 1848 8072 7775 2651 -2230 -5406 -2754 4860 8540 5093 613 -2680 -3664 461 3875
1719 3875 2341 715 1601 1647 1075 272 -2782 -4210 317 5301 5805 2674 -2778 -7365 -4267 2962
1735 2962 6281 4552 862 -4023 -4981 -420 2161 1170 1100 785 128 1233 605 -3730 -4150 44 3616
1752 3616 5212 3262 -2782 -7699 -4413 1916 5057 5275 947 -5199 -5426 -1425 695 1086 940 -887
$$ packed form
1639c2p315K09O636N090K646k673p137k636L678K814Q27N0j301m19K879k12m630
1656a526k153K208L791M929R08o847p032N21M646N647M101l364p039j766K271
1671g05K254K485J87k599K19K401q94l290j570L07L547O204K45o319n656q89K704
1688a369P075M462l856n983j763J73K703L503o58k489Q31J478j482j805k082j112
1704b374M222O224k97n124m881l176K652P614L680l447m480l293r84M125L414
1719C875j534j626Q86M6n72q03l054j428M527M984N04l131n452m587L098P229
1735B962L319j729l690m885r58M561K581r91p0l15o57J105o28m335m20M194L572
1752C616J596j950o044m917L286O329L141K18m328o146k27M001K120L91j46j827
$$ plain form
1768 -887 -947 780 -985 -4553 -4701 -2075 768 4090 2188 -4759 -8491 -6294 -1792 2825 4201 -1082
1784 -1082 -6484 -6298 -4080 -2304 -279 -1115 -3318 -2417 -699 -3172 -5471 -5385 -4334 -607 3565 1365
1800 1365 -5042 -7908 -7395 -3511 2942 4351 -655 -5285 -5588 -4464 -1333 1269 -62 -1893 -612
1815 -612 -230 -2009 -2663 -3971 -3516 1215 5036 2591 -2015 -5535 -6467 -2343 4324 5195 823 -2472
1831 -2472 -4452 -4098 139 2333 349 -324 392 -318 -660 -1351 -3707 -3056 2097 4698 3286 -272 -4688
1848 -4688 -6593 -1572 4272 5046 2649 -1240 -4729 -3448 1070 2510 1578 1324 703 77 1008 -132
1864 -132 -2958 -1625 2408 4424 4696 1917 -3865 -5152 -548 4323 5786 4556 100 -3980 -2045
1879 -2045 1263 2595 3013 2589 846 1114 2156 24 -2168 -729 2055 4467 5756 2499 -3350 -4395
$$ packed form
1768h87o0J727j765l568j48K626K843L322j902o947l732K197M502M617J376n283
1784a082n402J86K218J776K025q36k203R01J718k473k299Q6J051L727M172k200
1800A365o407k866N13L884O453J409n006m630l03J124L131K602j331j831J281
1815f12L82j779o54j308M55M731L821k445m606l520r32M124O667Q71m372l295
1831b472j980L54M237K194j984o73P16p10l42o91k356O51N153K601j412l558m416
1848d688j905N021N844P74k397l889l489J281M518J440r32k54o21o26R31j140
1864a32k826J333M033K016K72k779n782j287M604M871J463j230m456m080J935
1879b045L308J332M18m24j743K68J042k132k192J439K784K412J289l257n849j045
$$ plain form
1895 -4395 -805 3352 6431 5540 -125 -3360 -1782 444 2243 3727 2390 580 1624 2076 -432
1910 -432 -1244 -365 1016 4259 6098 2015 -2774 -3596 -1638 2612 6675 5771 187 -2208 -2088 -535
1926 -535 2445 3756 1473 863 1822 1058 -163 -657 -1315 251 4322 5529 1554 -2260 -4068 -3402 1645
1943 1645 6114 4611 204 -2320 -3582 -1621 2058 2917 607 426 465 -421 -917 -1346 -2598 -796 3319
1960 3319 3581 1150 -1851 -4916 -4498 682 4679 3399 750 -2852 -4652 -2315 1524 1641 899 393
1976 393 -315 -881 -266 -1939 -3253 -801 2554 3058 2241 -1310 -5490 -4572 603 3793 3758 1857 -2541
1993 -2541 -5003 -2009 895 1348 1828 799 -799 -572 -100 -1881 -2354 -278 1531 2984 3055 -1285 -5229
2010 -5229 -3704 -66 2925 4390 2102 -3149 -4184 -1991 -156 1440 2200 384 -762 128 -401 -2258
$$ packed form
1895d395L590M157L079q91n665l235J578K226J799J484j337j810J044M52k508
1910d32q12Q79J381L243J839m083m789q22J958M250M063r04n584k395J20J553
1926e35K980J311k283o10R59p64j221m94o58J566M071J207l975l814j808O66N047
1943A645M469j503m407k524j262J961L679Q59k310j81L9q86m96m29j252J802M115
1960C319K62k431l001l065M18N180L997j280k649l602j800K337L839J17p42n06
1976C93p08n66O15j673j314K452L355N04q17l551m180R18N175L190l5j901m398
1993b541k462K994K904M53M80j029j598K27M72j781m73K076J809J453P1m340l944
2010e229J525L638K991J465k288n251j035K193J835J596P60j816j146Q90n29j857
$$ plain form
2026 -2258 -2054 -778 746 3106 3052 -1288 -4564 -3869 -1092 2687 5225 1917 -2600 -3540 -2642 -577
2042 -577 2154 2319 -149 -177 304 -1181 -1664 -1132 -1120 588 3438 2881 -1087 -3334 -3896 -2127 2713 5030
2060 5030 2031 -1551 -3142 -3379 -609 2460 1822 1 98 -164 -1338 -836 -1509 -1826 877 3187 2152
2077 2152 -589 -2895 -4743 -2666 2558 4035 2094 -583 -3631 -4203 -745 2045 1255 365 69 -1513
2093 -1513 -1254 -728 -2066 -2267 844 2379 1934 260 -3062 -5036 -2366 1857 3241 2404 -111 -3916
2109 -3916 -4051 -852 1177 1239 1170 -357 -1555 -666 -718 -2316 -1873 426 1673 2370 1126 -3150 -4974
2126 -4974 -2060 1241 2886 3103 -145 -3871 -3368 -1162 454 2182 1897 -471 -1496 -542 -1150 -1919
2142 -1919 -791 98 1389 2972 1357 -2794 -4150 -2154 664 3287 3726 -182 -2924 -2652 -1533 430
$$ packed form
2026b258K04J276J524K360n4m340l276O95K777L779K538l308m517r40Q98K065
2042e77K731J65k468k8M81j485m83N32J2J708K850n57l968k247n62J769M840K317
2060E030k999l582j591k37K770L069o38j821R7k62j174N02o73l17K703K310j035
2077B152k741k306j848K077N224J477j941k677l048n72L458K790p90q90k96j582
2093a513K59N26j338k01L111J535m45j674l322j974K670M223J384q37k515l805
2109c916j35L199K029O2o9j527j198Q89n2j598M43K299J247O97j244m276j824
2126d974K914L301J645K17l248l726N03K206J616J728k85k368j025R54o08p69
2142a919J128Q89J291J583j615m151j356J996K818K623M39l908k742K72J119J963
$$ plain form
2158 430 2474 2003 -79 -94 -20 -1096 -998 -355 -403 1514 3478 1377 -1748 -3011 -2350 468 4267 4630
2176 4630 449 -1962 -2567 -1600 959 3012 1893 960 996 182 -550 356 171 418 2606 3595 1673 -240
2194 -240 -1846 -2372 697 5081 4623 1874 -654 -2546 -1503 2193 3326 2018 1507 1187 -43 184
2210 184 378 -387 780 3366 3266 1872 385 -2014 -2473 766 3949 4039 2704 -340 -2927 -1658 1814
2227 1814 2762 2389 1662 338 -199 568 52 -890 806 2682 2737 2305 299 -2598 -2344 525 2616 3533
2245 3533 2933 -616 -3182 -1664 624 2036 2703 1382 -700 -506 416 -769 -1186 -87 1048 2153
2261 2153 2512 -310 -3498 -2551 -378 1549 2985 2230 -1634 -3445 -2584 -1260 1120 2359 741 -1483
2277 -1483 -1294 -1219 -1696 -1007 -935 -566 1514 1903 -1052 -3562 -3309 -2079 834 3138 1142 -2024 -3113
$$ packed form
2158D30K044m71k082j5P4j076R8O43m8J917J964k101l125j263O61K818L799L63
2176D630m181k411o05R67K559K053j119r33L6q14p32R06j85K47K188R89j922j913
2194b40j606n26L069M384m58k749k528j892J043L696J133j308n11l20j230K27
2210A84J94p65J167K586j00j394j487k399m59L239L183R0j335l044k587J269L472
2227A814R48l73p27j324n37P67n16r42J696J876N5m32k006k897K54K869K091R17
2245C533o00l549k566J518K288J412O67j321k082J94R22j185m17J099J135J105
2261B153L59k822l188R47K173J927J436p55l864j811Q61J324K380J239j618k224
2277a483J89P5m77O89P2L69K080L89k955k510K53J230K913K304j996l166j089
$$ plain form
2294 -3113 -3135 -2000 508 1603 139 -897 -1275 -2172 -1928 -996 -1471 -997 1180 1094 -1056 -2794 -3736 -2963
2312 -2963 804 2857 943 -1720 -3217 -3697 -2010 603 535 -282 -410 -1703 -2733 -1740 -1348 -1685 -471
2329 -471 726 290 -659 -2162 -4141 -3211 631 2506 1558 -509 -3322 -4149 -1463 733 587 346 -116
2346 -116 -1112 -1525 -1111 -1455 -1118 679 1357 710 285 -1315 -3242 -2215 840 2334 2763 1102 -2621
2363 -2621 -3476 -784 1245 1752 1763 150 -1114 -327 -210 -1283 -368 1473 1511 1823 1157 -1446 -2445 -1028
2381 -1028 770 2198 3220 1490 -1821 -2349 -895 1046 2598 2715 377 -614 364 56 -446 268 1089
2398 1089 1809 3315 1885 -1046 -1704 -484 1012 3067 3886 1305 -741 -1350 -1053 868 3267 3010
2414 3010 957 170 16 49 622 909 203 1593 3150 1925 -456 -1288 -1299 741 3403 3496 1019 -592
$$ packed form
2294c113k2J135K508J095j464j036l78q97K44R32m75M74K177q6k150j738r42P73
2312b963L767K053j914k663j497m80J687K613o8q17j28j293j030R93L92l37J214
2329d71J197m36r49j503j979R30L842J875r48k067k813q27K686K196j46k41m62
2346a16r96m13M14l44L37J797O78o47m25j600j927J027L055J494M29j661l723
2363b621q55K692K029N07J1j613j264P87J17j073R15J841L8L12o66k603r99J417
2381a028J798J428J022j730l311n28J454J941J552J17k338r91R78l08n02P14Q21
2398A089P20J506j430k931o58J220J496K055Q19k581k046o09K97J921K399k57
2414C010k053p87j54L3N73K87p06J390J557j225k381q32j1K040K662R3k477j611
$$ plain form
2432 -592 -998 -1332 603 2541 2479 1679 598 -820 -662 539 502 46 1304 2438 1333 304 -1344
2449 -1344 -2468 156 3181 3197 1272 -628 -2109 -1613 761 1697 1480 1550 588 -1134 -975 53 113 309
2467 309 1412 988 596 391 -1666 -2884 -477 2197 2878 1701 -791 -3092 -2180 492 857 876 822 -181
2485 -181 -1172 -934 -1051 -1024 318 1041 308 419 -110 -2099 -2453 -1151 470 2126 2355 -787 -3567 -2348
2503 -2348 -289 1005 1429 476 -1179 -1134 -510 -1582 -1405 57 830 785 677 -840 -2313 -1799 -1132 -153
2521 -153 1835 2090 -625 -2660 -2757 -1651 758 2283 485 -1263 -889 -816 -1230 -822 -647 -112 1284 1298
2539 1298 -884 -2196 -1906 -1329 163 2052 1395 -402 -1564 -2600 -2032 787 2360 1035 -344 -929
2555 -929 -1512 -712 117 -705 -333 1515 1423 -272 -1568 -2000 -1360 1112 2561 1055 -263 -1142 -2329 -1734
$$ packed form
2432e92m06l34J935J938o2q00j081j418J58J201l7m56J258J134j105j029j648
2449a344j124K624L025J6j925j900j481M96K374R36k17P0r62j722J59J028O0J96
2467C09J103m24l92k05k057j218K407K674O81j177k492k301R12K672L65J9n4j003
2485a81r91K38j17K7J342P23p33J11n29j989l54J302J621J656K29l142k780J219
2503b348K059J294M24r53j655M5O24j072J77J462P73m5j08j517j473N14O67R79
2521a53J988K55k715k035r7J106K409J525j798j748L74P3m14M08J75N35J396J4
2539A298k182j312K90N77J492J889o57j797j162j036N68K819J573j325j379n85
2555i29n83Q00Q29q22L72J848r2j695j296m32O40K472J449j506j318q79j187N95
$$ plain form
2573 -1734 615 1591 1489 970 -1057 -2114 -340 239 -404 -108 977 799 604 -613 -2509 -1824 1280
2590 1280 2478 1472 82 -1385 -2449 -969 452 700 1345 1279 -875 -1774 -693 -334 -28 1002 375
2607 375 111 688 -557 -2294 -1678 417 1845 2297 1102 -1940 -2520 -693 320 738 1439 506 -581
2624 -581 -856 -1066 -1243 114 1147 664 173 528 -596 -1764 -1359 -433 1124 2540 1544 -1624 -2580 -1147
2642 -1147 17 1527 1735 -91 -648 -312 -1010 -1319 48 705 663 986 271 -1291 -1258 -950 -859 680 2276
2661 2276 1232 -1065 -2061 -2034 -433 2147 1833 -33 -605 -586 -851 -559 -122 -42 936 1860 342 -1218
2679 -1218 -1100 -817 -437 1255 1940 1011 182 -1189 -2222 -355 2133 2015 828 -47 -1096 -595 252
2696 252 92 -256 1100 1821 576 -283 -1033 -1298 135 2051 1579 1003 575 -953 -1912 -216 1177 1957
$$ packed form
2573a734K349R76j02n19k027j057J774N79o43K96J085j78j95j217j896O85L104
2590A280J198j006j390j467j064J480J421K48O45o6k154q99J081L59L06J030o27
2607C75k64N77j245j737O16K095J428M52j195l042n80J827J013M18P01r33j087
2624e81k75k10j77J357J033m83m91L55j124j168M05R26J557J416r96l168r56J433
2642a147J164J510K08j826n57L36o98l09J367O57m2L23p15j562L3L08R1J539J596
2661B276j044k297r96K7J601K580l14j866n72J9k65K92M37Q0R78R24j518j560
2679a218J18K83L80J692O85r29q29j371j033J867K488j18j187q75j049N01Q47
2696B52j60l48J356P21j245q59p50k65J433J916m72n76m28j528r59J696J393P80
$$ plain form
2714 1957 2220 666 -1334 -717 616 317 699 1048 1118 1092 894 -745 -1834 253 2220 2328 1683 110
2732 110 -1305 -1103 385 710 1672 2350 842 -750 -539 -226 444 1591 1055 328 1118 1017 -695 -1401
2750 -1401 -185 943 2365 2555 -89 -1873 -1154 85 443 1591 1741 385 -30 -332 -924 64 1283
2767 1283 991 522 772 276 -944 -936 -687 -36 1790 2488 9 -1677 -1511 -752 735 1665 791 -212
2785 -212 90 -672 -1348 -437 316 591 952 744 -789 -1100 -765 -1184 -513 1270 1638 98 -1350 -2232 -1907
2804 -1907 593 1948 514 -629 -659 -1274 -1237 -581 -647 -299 933 176 -1068 -1174 -1517 -1527 -255 666 457
2823 457 93 -1114 -2649 -2211 -99 905 778 -71 -1350 -2046 -848 -581 -999 -470 557 -57 -457 -1233
2841 -1233 -2150 -1721 162 503 341 81 -946 -2245 -1825 -547 392 1121 667 -1569 -2124 -745 -545 -601
$$ packed form
2714A957K63j554k000O17J333k99L82L49P0k6j98j639j089K087J967J08o45j573
2732A10j415K02J488L25R62O78j508j592K11L13O70J147n36p27P90j01j712p06
2750a401J216J128J422J90k644j784P19J239L58J148J50j356m15l02n92R88J219
2767A283k92m69K50m96j220QK49O51J826O98k479j686J66P59J487R30q74j003
2785b12L02p62o76R11P53K75L61k08j533l11L35m19O71J783L68j540j448q82L25
2804a907K500J355j434j143l0o15L7O56o6L48J232p57j244j06l43j0J272R21k09
2823D57l64j207j535M38K112J004j27q49j279o96J198K67m18N29J027o14m00p76
2841a233r17M29J883L41j62k60j027j299M20J278R39P29m54k236n55J379K00n6
$$ plain form
2859 -601 -97 165 -123 212 -725 -2081 -1550 104 724 958 251 -1494 -1911 -927 -689 65 1392 848 -758
2878 -758 -1386 -1037 -742 241 699 -51 0 742 -356 -1593 -1226 -287 933 2091 985 -1125 -1368 -768
2896 -768 -208 892 1600 547 179 -418 -878 -632 625 1143 361 685 575 -106 -296 -490 -477 1042 2490
2915 2490 1213 -373 -921 -1014 73 1536 1765 652 566 75 -965 -253 698 1000 1395 1340 341 -262 262
2934 262 -312 -328 1298 2070 1419 662 -532 -1506 105 1951 1905 1052 616 -309 -335 312 442 397 1527 1738
2954 1738 493 -69 2 -572 124 1247 1269 1289 939 -565 -1673 -186 1339 1551 1645 367 -773 -578
2972 -578 261 25 109 1039 962 310 292 -947 -1090 102 819 1062 1193 566 -1047 -1295 -559 151 1351 2012
2992 2012 330 -1293 -727 -371 -289 471 425 94 522 258 -1228 -1407 -209 426 1017 1235 -108 -1253
$$ packed form
2859f01N04K62k88L35r37j356N31J654O20K34p07j745m17R84K38P54J327n44j606
2878g58o28L49K95R83M58p50N1P42j098j237L67R39J220J158j106k110k43O00
2896g68N60J100P08j053l68n97m60K46J257N18p82L24j10o81j90j94J3J519J448
2915B490j277j586n48r3J087J463K29j113q6m91j040P12R51L02L95n5r99o03N24
2934B62n74j6J626P72o51p57j194r74J611J846m6q53m36r25k6O47J30m5J130K11
2954A738j245n62P1n74O96J123K2K0l50j504j108J487J525K12R4j278j140J95
2972e78Q39k36Q4R30p7o52j8j239j43J192P17K43J31o27j613k48P36P10J200O61
2992B012j682j623N66L56Q2P60m6l31M28k64j486j79J198O35N91K18j343j145
$$ plain form
3010 -1253 -969 -905 -367 1086 1302 -7 -793 -1280 -1132 -312 724 18 -177 185 -67 -1159 -1372 -880 -498
3029 -498 1231 1143 -379 -1353 -1065 -1416 -237 806 590 -146 -436 -1166 -1514 -517 617 325 26 214 -457
3048 -457 -795 -722 -1336 -548 1086 1157 -65 -1044 -1546 -1424 81 900 280 164 -250 -1228 -1416 -300 162
3067 162 453 560 71 -740 -560 -685 -1178 -328 877 867 445 -282 -1912 -1305 392 1001 791 389 -513
3086 -513 -1251 -484 -380 -379 723 1168 185 -339 -248 -867 -904 -51 737 667 912 -190 -1429 -946 169 853
3106 853 1426 791 -775 -1080 -316 -296 -222 822 838 367 321 -137 -1036 -466 529 282 1024 943 -349 -1292 -760
3127 -760 -520 453 1586 1045 -559 -679 -565 -487 378 557 173 339 567 -496 -1000 -416 50 612 1303
3146 1303 752 -459 -772 -699 -613 455 1553 727 -276 -431 -838 -559 820 717 135 607 354 -538 -533
$$ packed form
3010a253K84O4N38J453K16j309p86m87J48Q20J036p06j95L62k52j092k13M92L82
3029d98J729q8j522r74K88l51J179J043k16p36k90p30l48R97J134k92k99J88o71
3048d57l38P3o14P88J634P1j222r79n02J22J505Q19o20j16m14r78j88J116M62
3067A62K91J07m89q11J80j25m93Q50J205j0m22p27j630O07J697O09k10m02r02
3086e13p38P67J04JJ102M45r83n24R1o19l7Q53P88p0K45j102j239M83J115O84
3106H53N73o35j566l05P64K0P4J044J6m71m6m58q99N70R95k47P42q1j292r43N32
3127g60K40R73J133n41j604j20J14P8Q65J79l84J66K28j063n04N84M66N62O91
3146A303n51j211l13P3Q6J068J098q26j003j55m07K79J379j03n82M72k53q92N
$$ plain form
3165 -533 -510 -428 717 1418 690 -521 -416 -1053 -655 764 1110 743 355 -335 -1216 -569 416 394 295 557
3185 557 -127 -565 -414 -552 -689 567 1375 713 171 -573 -1332 -337 847 564 724 535 -454 -1246 -469
3204 -469 40 362 964 604 -166 -7 -51 -510 -377 534 893 810 462 -737 -1269 -155 674 1010 964 452
3224 452 -786 -856 -247 -360 479 1065 593 -120 244 -413 -821 41 502 503 1002 764 -600 -1194 -102 169
3244 169 870 1381 313 -826 -401 -494 -207 755 900 443 539 72 -842 -470 157 254 664 1196 369 -694
3264 -694 -682 -382 -195 1320 1557 220 -269 -496 -631 -35 594 596 394 588 109 -560 -513 -114 137 1050 1018
3285 1018 135 -497 -459 -756 0 1185 1163 561 62 -601 -946 32 528 223 517 318 -313 -391 -253 -522
3305 -522 -124 1003 885 1 -348 -987 -1150 -100 749 450 489 -145 -1111 -953 -173 117 107 485 -70 -637
$$ packed form
3165e33K3Q2J145P01p28j211J05o37L98J419L46l67l88o90q81O47R85k2r9K62
3185E57o84m38J51j38j37J256Q08o62n42p44p59R95J184k83J60j89r89p92P77
3204d69N09L22O02l60p70J59m4m59J33R11L59q3l48j199n32J114Q29L36m6n12
3224D52j238p0O09j13Q39N86m72p13L64o57m08Q62M61JM99k38j364n94J092K71
3244A69P01N11j068j139M25r3K87R62J45m57R6m67r14L72O27R7M10N32q27j063
3264f94J2L00J87J515K37j337m89k27j35N96O29Kk02J94m79o69M7L99K51R13l2
3285A018q83o32L8k97P56J185k2o02m99o63l45R78M96l05K94j99o31p8J38k69
3305e22L98J127j18q84l49o39j63J050Q49k99L9o34r66J58P80K90j0L78n55n67
$$ plain form
3325 -637 -225 -603 -928 -89 681 385 298 -395 -941 -1149 8 276 356 678 -392 -1228 -965 -417 -380 280
3345 280 548 -189 -553 -533 -1063 -953 -150 53 480 347 -187 -1417 -1021 -331 32 599 550 -515 -1208 -941
3365 -941 -863 -294 327 349 -322 -34 -423 -1107 -614 130 -158 215 534 -581 -1189 -745 -606 -13 995 544
3385 544 -450 -513 -788 -992 -92 563 100 123 -35 -616 -759 -255 -32 -45 913 582 -326 -478 -781 -691 172
3406 172 1084 699 -80 -320 -811 -465 380 439 395 522 233 -492 -411 -137 54 609 1087 431 75 -107 -717
3427 -717 -761 589 1010 810 585 -110 -760 -206 474 546 657 833 272 27 107 -28 21 857 1136 705 569
3448 569 -197 -637 -337 941 857 931 722 -150 -869 221 335 787 907 767 -74 -52 106 -459 96 724
3468 724 821 851 679 -386 -793 113 482 649 1058 632 -363 -398 -305 131 489 994 455 163 154 -326 -477 53
$$ packed form
3325f37M12l78l25Q39P70k96q7o93n46k08J157K68Q0L22j070q36K63N48L7O60
3345B80K68p37l64K0n30J10Q03K03M27j33n34j230L96O90L63N67m9j065o93K67
3365i41P8N69O21K2o71K88l89o84M93P44k88L73L19j115o08M44J39N93J008m51
3385E44r94o3k75k04R00O55m63K3j58n81j43N04K23j3R58l31r08j52l03R0Q63
3406A72R12l85p79k40m91L46Q45N9m4J27k89p25Q1K74J91N55M78o56l56j82o10
3427g17m4J350M21k00k25o95o50N54O80P2J11J76n61k45Q0j35M9Q36K79m31j36
3448E69p66m40L00J278q4P4k09q72p19J090J14M52J20j40q41K2J58n65N55O28
3468G24R7L0j72j065m07R06L69J67M09m26r95l5R3M36L58N05n39k92rm80j51N30
$$ plain form
3490 53 538 578 610 583 -528 -756 -203 131 704 1123 328 -531 -292 -236 -433 625 627 205 42 -145 -465 -454
3512 -454 49 -120 170 851 226 -540 -567 -503 -216 598 1018 -52 -212 -391 -691 -459 390 454 236 218 -189
3533 -189 -692 -288 -369 -48 221 572 -94 -506 -696 -932 -294 618 464 51 -243 -820 -1083 -472 120 133 186
3554 186 13 -597 -716 -423 -554 -337 495 190 -251 -340 -827 -1241 -572 439 288 215 -120 -1050 -1032 -195 -70
3575 -70 -104 470 -10 -485 -405 -458 -589 -127 235 95 -29 -177 -914 -793 -214 -76 532 486 -186 -872 -566 -272
3597 -272 -99 334 541 -119 -268 -548 -638 -557 248 300 226 537 -12 -819 -426 -182 52 595 631 -75 -666 -413
3619 -413 -623 -176 637 485 -81 70 -329 -843 -351 300 206 331 679 -101 -594 -473 -264 206 964 851
3639 851 -59 -241 -444 -632 268 756 487 346 307 -240 -547 -53 118 196 798 349 -272 -491 -269 -424 347
$$ packed form
3490E3M85M0L2k7j111k28N53L34N73M19p95q59K39N6j97J058Km22j63j87l20J1
3512d54N03j69K90O81o25p66k7O4K87Q14M20j070j60j79l00K32Q49O4k18j8m07
3533a89n03M04q1L21K69L51o66m12j90k36O38R12j54m13k94n77k63O11N92J3N3
3554A86j73o10j19K93j31K17Q32l05m41q9m87m14O69J011j51p3l35r30J8Q37J25
3575g0l4N74m80m75Q0n3j31M62L62j40j24j48p37J21N79J38O08m6o72o86L06K94
3597b72J73M33K07o60j49k80r0Q1Q05N2p4L11n49q07L93K44K34N43L6p06n91K53
3619d13k10M47Q13j52n66J51l99n14M92O51r4J25L48p80m93J21K09M70P58j13
3639H51r10j82k03j88R00M88k69j41l9n47l07M94J71P8O02m49o21k19K22j55P71
$$ plain form
3660 347 884 557 162 -157 -679 -493 494 515 365 413 144 -268 -239 -86 -129 328 617 438 -212 -93 -536
3681 -536 -455 246 523 608 337 15 -823 -259 350 202 399 636 101 -326 -148 -329 -220 552 596 183 206
3702 206 -45 -504 -366 329 258 476 692 -95 -576 -96 102 288 553 511 -54 -107 -70 -399 -122 348 481
3723 481 342 324 -273 -622 -147 -11 302 601 373 -413 -609 -277 -390 195 622 351 -174 -85 -382 -711 -50
3744 -50 277 180 443 374 -394 -570 -133 -325 383 864 266 -207 -376 -415 -273 364 673 89 159 26 -469 -443
3766 -443 50 42 358 599 219 -427 -222 -156 -138 528 731 260 -240 -197 -424 -394 472 316 303 340 -213 -561 -103
3789 -103 -127 5 356 704 114 -96 -55 -702 -209 402 463 456 4 -478 -685 -133 240 120 155 286 -226 -200
3811 -200 -176 -315 29 670 398 -116 192 -408 -569 -61 382 346 423 273 -757 -577 -74 26 389 501 47
$$ packed form
3660C47N37l27l95l19n22J86R87K1j50M8k69m12K9J53m3M57K89j79o50J19m43
3681e36Q1P01K77Q5k71l22q38N64O09j48J97K37n35m27J78j81J09P72M4m13K3
3702B06k51m59J38O95p1K18K16p87m81M80J98J86K65m2n65n3L7l29K77M70J33
3723D81j39j8n97l49M75J36L13K99k28p86j96L32j13N85M27k71n25Q9k97l29O61
3744e0L27r7K63o9p68j76M37j92P08M81n98m73j69l9J42O37L09n84P0j33m95K6
3766d43M93qL16K41l80o46K05O6J8O66K03m71n00M3k27L0Q66j56j3L7n53l48M58
3789a03k4J32L51L48n90k10M1o47M93O11O1pm52m82k07N52L73j20L5J31n12K6
3811b00K4j39L44O41k72n14L08o00j61N08M43l6P7j50j030J80N03J00L63J12m54
$$ plain form
3832 47 -547 -157 -225 -532 33 386 47 154 159 -478 -699 -126 244 187 385 123 -710 -603 -331 -300 271 480
3854 480 -205 -383 -360 -756 -457 171 107 -183 200 -306 -728 -687 -459 -248 232 664 -304 -407 -599 -585 -193
3875 -193 487 287 -114 88 -315 -613 -143 145 88 238 489 -146 -523 -273 -293 15 613 443 29 -265 -378
3896 -378 -435 -3 422 279 181 412 -271 -451 -111 -182 -65 442 408 -258 -318 -465 -546 -17 519 164 23 -130
3918 -130 -552 -562 44 296 17 518 -65 -302 -336 -217 -208 110 470 251 -10 -178 -555 -517 124 469 235 380
3940 380 125 -460 -371 76 367 476 566 -20 -349 16 -200 -75 430 387 277 237 168 -539 -309 264 371 518
3962 518 545 -89 -364 -79 148 240 614 735 116 245 261 44 41 546 299 325 421 -38 -433 -85 118 172 688
3985 688 537 42 -214 -259 -82 231 810 410 8 74 -183 -326 220 483 217 377 233 -241 -370 -205 -249
$$ packed form
3832D7n94L90o8l07N65L53l39J07No37k21N73L70n7J98k62q33J07K72L1N71K09
3854D80o85j78K3l96K99O28o4k90L83n06m22M1K28K11M80M32r68j03j92J4L92
3875a93O80k00m01K02m03k98M70K88n7J50K51o35l77K50k0L08N98j70m14k94j13
3896c78n7M32M25j43r8K31o83j80L40p1J17N07l4o66o0j47q1N29N36l55j41j53
3918a30m22j0O06K52k79N01n83k37l4J19RL18L60k19k61j68l77L8O41L45k34J45
3940C80k55n85Q9M47K91J09R0n86l29L65k16J25N05m3j10m0o9p07K30N73J07J47
3962E18K7o34k75K85K27R2L74J21o19J29J6k17lN05k47K6R6m59l95L48K03N4N16
3985F88j51m95k56m5J77L13N79m00m02O6k57j43N46K63k66J60j44m74j29J65m4
$$ plain form
4006 -249 231 709 396 -182 -44 -262 -192 201 604 80 161 -87 -410 -179 28 224 152 488 100 -381 -246
4027 -246 -395 -334 280 622 207 193 -210 -565 -383 82 273 314 356 -123 -568 -175 -86 -175 169 373 82 -308
4049 -308 -188 -601 -415 201 451 19 202 -355 -874 -171 142 148 436 339 -412 -352 -133 -427 55 338 324 -60
4071 -60 -185 -323 -411 23 331 140 120 299 -482 -604 -412 -170 -38 399 15 -358 -478 -265 -447 -94 268
4092 268 -294 -314 -89 -575 -729 -359 -70 -54 382 91 -666 -694 -490 -377 135 330 -111 -345 -470 -627 -414
4113 -414 150 167 46 345 -1 -531 -395 -186 -137 315 611 -17 -309 -92 -371 -226 452 626 114 151 -43
4134 -43 -316 113 152 231 431 474 68 -277 228 40 15 522 671 22 212 -241 -410 70 371 343 319 131
4156 131 -201 -324 -209 128 38 330 201 -183 -291 -284 -376 -79 399 214 48 48 -367 -366 116 233 25 185 125
$$ packed form
4006b49M80M78l13n78J38k18P0L93M03n24Q1k48l23K31K07J96p2L36l88m81J35
4027b46j49O1O14L42m15j4m03l55J82M65J91M1M2m79m45L93Q9q9L44K04k91l90
4049c08J20m13J86O16K50m32J83n57n19P03L13OK88r7p51O0K19k94M82K83j4l84
4071f0j25j38q8M34L08j91k0J79p81j22J92K42J32M37l84l73j20K13j82L53L62
4092B68n62k0K25m86j54L70K89J6M36k91p57k8K04J13N12J95m41k34j25j57K13
4113d14N64J7j21K99l46n30J36K09M9M52K96o28k92K17k79J45O78J74n12L7j94
4134d3k73M29L9P9K00M3m06l45N05j88k5N07J49o49J90m53j69M80L01k8k4j88
4156A31l32j23J15L37r0K92j29l84j08Pr2K97M78j85j66%m15JM82J17k08J60o0
$$ plain form
4179 125 -427 -82 -16 -118 245 311 164 -67 62 -297 -379 317 470 428 215 135 -387 -414 127 259 388 571
4201 571 22 -89 -40 -152 -48 179 382 298 232 -75 -219 -213 253 225 471 481 -123 -275 -121 -127 58 312 400
4224 400 -43 -154 -183 -313 -8 252 142 114 67 -293 -390 -246 -60 278 463 125 -275 -159 -128 -253 26 528
4246 528 343 -43 225 -279 -249 77 151 153 199 268 -279 -354 -119 -336 284 576 274 -106 -10 -196 -336 285 484
4269 484 154 46 4 -416 -11 252 -81 182 441 229 -323 -332 -423 -170 139 351 189 131 14 -471 -265 240
4291 240 125 51 202 -125 -430 -181 -106 -172 305 559 27 -34 -88 -369 -198 295 249 97 88 -67 -580 -60 131
4314 131 166 369 431 -271 -479 -89 -391 -34 288 227 117 115 -81 -319 2 371 170 276 212 -275 -431 43
4336 43 33 127 401 17 -20 -5 -117 -78 9 230 -44 83 97 -237 -106 119 -41 5 265 104 -326 -348 -214
$$ packed form
4179A25n52L45O6j02L63O6j47k31J29l59q2O96J53m2k13q0n22k7N41J32J29J83
4201E71n49j11M9j12J04K27K03q4o6l07j44OM66k8K46J0o04j52J54oJ85K54Q8
4224D00m43j11k9j30L05K60j10k8m7l60r7J44J86L38J85l38m00J16L1j25K79N02
4246E28j85l86K68n04L0L26P4KM6O9n47p5K35k17O20K92l02l80R6j86j40O21J99
4269D84l30j08m2m20M05K63l33K63K59k12n52rr1K53L09K12j62n8j17m85K06N05
4291B40j15p4J51l27l05K49P5o6M77K54n32o1n4k81J71M93m6j52rj55n13N20J91
4314A31L5K03O2p02k08L90l02L57L22o1j10kj96k38L21L69k01J06o4m87j56M74
4336D3j0R4K74l84l7J5j12L9Q7K21k74J27J4l34J31K25j60M6K60j61m30k2J34
$$ plain form
4359 -214 -327 143 285 -181 -174 -282 -422 -302 140 143 60 198 -55 -370 -172 -62 -104 98 461 -127 -400 -188
4381 -188 -402 -223 194 388 -114 -26 -300 -350 -35 39 9 271 256 -351 -145 -131 -125 -239 310 197 -64 -63 -262
4404 -262 -401 -141 95 145 76 179 -372 -397 -21 -239 118 289 42 -283 -68 -183 -326 -25 346 75 253
4425 253 95 -387 -298 -23 125 247 411 137 -311 -173 -79 107 186 330 312 -70 123 -316 -355 273 203 214
4447 214 209 272 -219 -294 55 -39 186 351 148 -43 -120 -19 -212 13 169 72 11 -124 -494 -291 -31 170 142
4470 142 277 116 -449 -149 -191 23 408 283 7 -85 -206 -267 169 250 105 342 197 81 -206 136 186 241
4492 241 491 398 -168 14 -95 -107 156 547 317 131 258 -180 30 155 428 427 550 195 -239 8 73 92
4514 92 344 496 295 46 160 -15 -239 204 365 179 98 113 -282 -338 97 169 154 140 7 -278 -215 -38 -249
$$ packed form
4359b14j13M70J42m66Pj08j40J20M42Lq3J38k53l15J98J10m2K02L63n88k73K12
4381a88k14J79M17J94n02Q8k74n0L15P4l0K62j5o07K06J4Oj14N49j13k61Jj99
4404b62j39K60K36N0o9J03n51k5L76k18L57J71k47l25K15j15j43L01L71k71J78
4425B53j58m82Q9K75J48J22J64k74m48J38R4J86P9J44j8l82J93m39l9O28p0J1
4447B14nO3m91p5L49r4K25J65k03j91p7J01j93K25J56r7o1j35l70K03K60K01k8
4470A42J35j61n65L00m2K14L85j25k76r2j21o1M36Q1j45K37j45j16k87L42N0N5
4492B41K50r3n66J82j09j2K63L91k30j86J27m38K10J25K73jJ23l55m34K47O5J9
4514I2K52J52k01k49J14j75k24M43J61j86q1J5l95n6M35P2j5j4j33k85O3J77k11
$$ plain form
4537 -249 138 321 -132 76 7 -428 -440 -7 -117 56 119 -47 -503 -199 -214 -170 242 308 -133 -113 33 -293
4559 -293 -194 357 286 50 164 -284 -362 49 92 108 195 306 -82 -294 -106 -172 25 425 56 -37 20 -114 -298
4582 -298 -163 138 115 45 -18 -312 -403 -173 -92 110 150 81 -325 -117 -26 -309 -140 125 -204 -17 -46 -30 -240
4605 -240 46 -33 83 161 148 -424 -133 -170 -300 44 207 -29 -36 -81 -450 -239 37 178 123 216 -64 -267 -148
4628 -148 -2 -99 176 222 -4 -173 -32 -493 -156 38 61 63 52 -146 -361 -215 39 -181 111 88 -117 -204 -128
4651 -128 33 -318 289 -35 -104 64 -257 -306 -12 142 163 174 186 -150 -111 141 -27 171 267 267 -159 -24 -81
4674 -81 -207 143 482 -32 80 104 -445 -377 103 260 65 184 222 -246 -100 79 0 219 376 63 -28 -8
4696 -8 -81 -263 -86 227 6 243 -75 -274 -111 300 -32 75 151 -45 -194 -175 -154 -91 166 260 -149 70 -140
$$ packed form
4537b49L87J83m53K08o9m35j2M33j10J73O3j66m56L04j5M4M12O6m41K0J46l26
4559b93R9N51p1k36J14m48p8M11M3J6Q7J11l88k12J88o6J97M00l69r3N7j34j84
4582b98J35L01k3p0o3k94r1K30Q1K02M0o9m06K08R1k83J69K65l29J87k9J6k10
4605b40K86p9J16P8j3n72K91l7j30L44J63k36pm5l69K11K76J41n5R3k80k03J19
4628a48J46r7K75M6k26j69J41m61L37J94K3Kj1j98k15J46K54k20K92k3k05q7P6
4651a28J61l51O07l24o9J68l21m9K94J54K1J1J2l36L9K52j68J98R6%m26J35n7
4674h1j26L50L39n14J12K4n49O8M80J57j95J19L8m68J46J79p9K19J57l13r1K0
4696hp3j82J77L13k21K37l18j99J63M11l32J07P6j96j49J9K1O3K57R4m09K19k10
$$ plain form
4719 -140 -246 -148 -36 197 177 115 -91 -379 -97 -102 -33 432 244 123 -4 105 -122 -28 376 123 141 307 2
4742 2 -229 -15 147 48 113 258 61 -180 12 -202 -51 499 159 -152 256 -53 -259 -6 43 62 130 -34
4764 -34 -178 -246 33 -185 -40 256 100 -179 -61 -228 -386 28 287 -12 -14 -170 -483 -102 -105 54 47 317 175
4787 175 -187 -237 -212 -52 214 269 -77 54 -155 -265 -275 35 18 151 249 -21 -343 -232 -71 -60 105 247
4809 247 67 41 -46 -260 -119 175 93 4 58 -6 -105 -50 208 -173 215 161 -107 -108 137 -136 149 144 -23 -76 4
4834 4 -134 -187 -188 -38 -49 73 227 9 -282 -61 -63 -88 225 161 15 30 -130 -194 8 272 100 -7 97 -282
4858 -282 -176 -39 -34 -157 203 228 -195 -386 33 42 160 433 263 94 97 -149 9 -70 69 46 208 -5 -352
4881 -352 -1 -80 -139 244 245 -23 -216 -109 -192 -280 295 -49 38 158 111 -242 -38 19 -118 216 313 50 -152
$$ packed form
4719a40j06R8J12K33k0o2k06k88K82nO9M65j88j21j27J09k27R4M04k53J8J66l05
4742Bk31K14J62r9O5J45j97k41J92k14J51N50l40l11M08l09k06K53M9J9O8j64
4764c4j44o8K79k18J45K96j56k79J18j67j58M14K59k99kj56l13L81lJ59pK70j42
4787A75l62n0K5J60K66N5l46J31k09j10j0L10j7J33R8k70l22J11J61J1J65J42
4809B47j80k6q7k14J41K94q2q9N4o4r9N5K58l81L88n4k68jK45k73K85nj67n3Q0
4834Dj38n3jJ50j1J22J54k18k91K21kk5L13o4j46J5j60o4K02K64j72j07J04l79
4858b82J06J37Nj23L60K5m23j91M19RJ18K73j70j69Lk46J58p9J39k3J62k13l47
4881c52L51p9n9L83Jk68j93J07q3q8N75l44Q7J20m7l53K04N7j37L34R7k63k02
$$ plain form
4904 -152 -89 20 -118 153 232 28 -55 -70 -326 -12 125 174 266 144 -234 -242 126 -60 -37 301 88 -246 19
4927 19 -101 -172 6 358 110 -51 89 -350 -118 48 -30 134 118 238 -102 -199 -113 -2 162 430 -7 -144
$$ packed form
4904a52O3J09j38K71P9k04q3j5k56L14J37M9R2j22l78qL68j86K3L38k13l34K65
4927A9j20p1J78L52k48j61J40m39K32J66p8J64j6J20l40r7Q6J11J64K68m37j37
$$ [...]
8191A33
##END NTUPLES=NMR FID
##END=
