##TITLE=1H_CA-8630-1
 CDCl3, 8 sc, 
 26.7.2019
##JCAMPDX= 6.0         $$ Bruker NMR JCAMP-DX V2.0
##DATA TYPE= NMR FID
##DATA CLASS= NTUPLES
##ORIGIN= UXNMR, Bruker Analytische Messtechnik GmbH
##OWNER= root
$$ XWIN-NMR		Version 3.5
$$ Fri Jul 26 16:00:50 2019 Russian Standard Time (UT+4h)  she@DPX200
##.OBSERVE FREQUENCY= 200.13155
##.OBSERVE NUCLEUS= ^1H
##.DELAY= (6, 6)
##.ACQUISITION MODE= SIMULTANEOUS
##.ACQUISITION SCHEME= undefined
##.AVERAGES= 8
##.DIGITISER RES= 18
##SPECTROMETER/DATA SYSTEM= spect
##.PULSE SEQUENCE= zg30
##.SOLVENT NAME= CDCl3
##.SHIFT REFERENCE= (INTERNAL, CDCl3, 0, 15.7039)
##AUDIT TRAIL= $$ (NUMBER, WHEN, WHO, WHERE, WHAT)
$$ ##TITLE= Audit trail, XWIN-NMR		Version 3.5
$$ ##JCAMPDX= 5.01
$$ ##ORIGIN= Bruker BioSpin GmbH
$$ ##OWNER= she
$$ F:/spectra/data/she/nmr/H-F/1/audita.txt
$$ ##AUDIT TRAIL=  $$ (NUMBER, WHEN, WHO, WHERE, WHAT)
(   1,<2019-07-26 15:59:41.75 +0400>,<she>,<DPX200>,
      <created by zg, POWCHK disabled, PULCHK disabled
       configuration hash MD5:
       00 E9 B6 7A A2 85 ED C7 34 08 36 98 17 FE 4E 26
       data hash MD5: 16K
       6D E3 98 18 8C 1D BF 21 38 44 D6 7E 96 88 F0 C2>)
$$ ##END=
$$ 
$$ hash MD5
$$ 32 FC 2E 2D 94 2A 6A 93 75 28 03 C1 96 5D 2F B7
##$RELAX= 
##$RELAX= 
##$RELAX= 
##$RELAX= 
##$RELAX= 
##$RELAX= 
$$ Bruker specific parameters
$$ --------------------------
##$DU= <F:/spectra>
##$EXPNO= 1
##$NAME= <H-F>
##$PROCNO= 1
##$TYPE= <nmr>
##$USER= <she>
##$AMP= (0..31)
100 100 100 100 100 100 100 100 100 100 100 100 100 100 100 100 100 100 
100 100 100 100 100 100 100 100 100 100 100 100 100 100 
##$AQSEQ= 0
##$AQ_mod= 1
##$AUNM= <au_zg>
##$AUTOPOS= <>
##$BF1= 200.13
##$BF2= 200.13
##$BF3= 200.13
##$BF4= 200.13
##$BF5= 200.13
##$BF6= 200.13
##$BF7= 200.13
##$BF8= 200.13
##$BYTORDA= 1
##$CFDGTYP= 0
##$CFRGTYP= 5
##$CHEMSTR= <none>
##$CNST= (0..31)
1 1 145 1 1 1 1 1 1 1 1 1 1 1 1 1 1 1 1 1 1 1 1 1 1 1 1 1 1 1 1 1 
##$CPDPRG= <>
##$CPDPRG1= <>
##$CPDPRG2= <>
##$CPDPRG3= <>
##$CPDPRG4= <mlev>
##$CPDPRG5= <mlev>
##$CPDPRG6= <mlev>
##$CPDPRG7= <mlev>
##$CPDPRG8= <mlev>
##$CPDPRGB= <>
##$CPDPRGT= <>
##$D= (0..31)
0 1.2 0 0 0 0 0 0 0 0 0 0.03 0 0 0 0 0 0 0 0 0 0 0 0 0 0 0 0 0 0 0 0 
##$DATE= 1564142381
##$DBL= (0..7)
120 120 120 120 120 120 120 120 
##$DBP= (0..7)
150 150 150 150 150 150 150 150 
##$DBP07= 0
##$DBPNAM0= <>
##$DBPNAM1= <>
##$DBPNAM2= <>
##$DBPNAM3= <>
##$DBPNAM4= <>
##$DBPNAM5= <>
##$DBPNAM6= <>
##$DBPNAM7= <>
##$DBPOAL= (0..7)
0.5 0.5 0.5 0.5 0.5 0.5 0.5 0.5 
##$DBPOFFS= (0..7)
0 0 0 0 0 0 0 0 
##$DE= 6
##$DECBNUC= <off>
##$DECIM= 24
##$DECNUC= <off>
##$DECSTAT= 4
##$DIGMOD= 1
##$DIGTYP= 9
##$DL= (0..7)
0 120 120 120 120 120 120 120 
##$DP= (0..7)
150 150 150 150 150 150 150 150 
##$DP07= 0
##$DPNAME0= <>
##$DPNAME1= <>
##$DPNAME2= <>
##$DPNAME3= <>
##$DPNAME4= <>
##$DPNAME5= <>
##$DPNAME6= <>
##$DPNAME7= <>
##$DPOAL= (0..7)
0.5 0.5 0.5 0.5 0.5 0.5 0.5 0.5 
##$DPOFFS= (0..7)
0 0 0 0 0 0 0 0 
##$DQDMODE= 0
##$DR= 18
##$DS= 0
##$DSLIST= <SSSSSSSSSSSSSSS>
##$DSPFIRM= 0
$$ [...]
##$SUBNAM2= <"">
##$SUBNAM3= <"">
##$SUBNAM4= <"">
##$SUBNAM5= <"">
##$SUBNAM6= <"">
##$SUBNAM7= <"">
##$SUBNAM8= <"">
##$SUBNAM9= <"">
##$SW= 24.9336996594482
##$SWIBOX= (0..15)
0 0 2 0 0 0 0 0 0 0 0 0 0 0 0 0 
##$SW_h= 4990.01996007984
##$TD= 16384
##$TD0= 1
##$TE= 0
##$TE2= 300
##$TE3= 300
##$TEG= 300
##$TL= (0..7)
0 120 120 120 120 120 120 120 
##$TP= (0..7)
150 150 150 150 150 150 150 150 
##$TP07= 0
##$TPNAME0= <>
##$TPNAME1= <>
##$TPNAME2= <>
##$TPNAME3= <>
##$TPNAME4= <>
##$TPNAME5= <>
##$TPNAME6= <>
##$TPNAME7= <>
##$TPOAL= (0..7)
0.5 0.5 0.5 0.5 0.5 0.5 0.5 0.5 
##$TPOFFS= (0..7)
0 0 0 0 0 0 0 0 
##$TUNHIN= 0
##$TUNHOUT= 0
##$TUNXOUT= 0
##$USERA1= <user>
##$USERA2= <user>
##$USERA3= <user>
##$USERA4= <user>
##$USERA5= <user>
##$V9= 5
##$VALIST= <valist>
##$VCLIST= <CCCCCCCCCCCCCCC>
##$VD= 0
##$VDLIST= <DDDDDDDDDDDDDDD>
##$VPLIST= <PPPPPPPPPPPPPPP>
##$VTLIST= <TTTTTTTTTTTTTTT>
##$WBST= 1024
##$WBSW= 4
##$XGAIN= (0..3)
0 0 0 0 
##$XL= 0
##$YL= 0
##$YMAX_a= 122155
##$YMIN_a= -281391
##$ZGOPTNS= <>
##$ZL1= 120
##$ZL2= 120
##$ZL3= 120
##$ZL4= 120
##$ABSF1= 10
##$ABSF2= 0
##$ABSG= 5
##$ABSL= 3
##$ALPHA= 0
##$AQORDER= 0
##$ASSFAC= 0
##$ASSFACI= 0
##$ASSFACX= 0
##$ASSWID= 0
##$AUNMP= <proc_1d>
##$AZFE= 0.1
##$AZFW= 0.1
##$BCFW= 1
##$BC_mod= 2
##$BYTORDP= 1
##$COROFFS= 0
##$CY= 11.3945322036743
##$DATMOD= 1
##$DC= 2
##$DFILT= <>
##$DTYPP= 0
##$F1P= 20.1537800932815
##$F2P= 0.134698688090026
##$FCOR= 0.5
##$FTSIZE= 0
##$FT_mod= 4
##$GAMMA= 1
##$GB= 0.15
##$INTBC= 1
##$INTSCL= 1
##$ISEN= 128
##$LB= 0.24
##$LEV0= 0
##$LPBIN= 0
##$MAXI= 10000
##$MC2= 0
##$MEAN= 0
##$ME_mod= 0
##$MI= 1.114404
##$NCOEF= 0
##$NC_proc= 0
##$NLEV= 6
##$NOISF1= 3.799351
##$NOISF2= 2.8
##$NSP= 1
##$NTH_PI= 0
##$NZP= 0
##$OFFSET= 15.70392
##$PC= 1
##$PHC0= -9234.288
##$PHC1= 32.00097
##$PH_mod= 1
##$PKNL= yes
##$PPARMOD= 0
##$PSCAL= 0
##$PSIGN= 0
##$REVERSE= no
##$SF= 200.130013532006
##$SI= 16384
##$SIGF1= 3
##$SIGF2= 2
##$SINO= 400
##$SIOLD= 16384
##$SREGLST= <1H.CDCl3>
##$SSB= 0
##$STSI= 0
##$STSR= 0
##$SW_p= 3612.71676300578
##$SYMM= 0
##$S_DEV= 0
##$TDeff= 0
##$TDoff= 0
##$TI= <>
##$TILT= no
##$TM1= 0
##$TM2= 0
##$TOPLEV= 0
##$USERP1= <user>
##$USERP2= <user>
##$USERP3= <user>
##$USERP4= <user>
##$USERP5= <user>
##$WDW= 1
##$XDIM= 8192
##$YMAX_p= 0
##$YMIN_p= 0
$$ End of Bruker specific parameters
$$ ---------------------------------
##NTUPLES= NMR FID
##VAR_NAME=  TIME,          FID/REAL,        FID/IMAG
##SYMBOL=    X,             R,               I
##VAR_TYPE=  INDEPENDENT,   DEPENDENT,       DEPENDENT
##VAR_FORM=  AFFN,          ASDF,            ASDF
##VAR_DIM=   8192,          8192,            8192
##UNITS=     SECONDS,       ARBITRARY UNITS, ARBITRARY UNITS
##FACTOR=    0.0002004,     1,               1
##FIRST=     0,             0,               0
##LAST=      1.6414764,     0,               0
##MIN=       0,             -281391,         0
##MAX=       1.6414764,     122155,          0
$$ Real data points
##PAGE= N=1
##DATA TABLE= (X++(R..R)), XYDATA
0 0 0 0 0 0 0 0 7 -8 8 -8 16 -16 24 -24 32 -39 45 -55 64 -73 89 -103 118 -136 157 -181 205 -232 263 -300
30 -300 335 -378 423 -475 530 -589 658 -729 809 -897 994 -1098 1217 -1348 1493 -1653 1840
47 1840 -2048 2288 -2567 2893 -3287 3768 -4375 5164 -6241 7803 -10293 14908 -26400 119601
61 119601 122155 -80867 -9405 74337 109491 58683 48013 62245 85855 33727 -31973 -54795
73 -54795 -18491 18931 51263 26453 -38033 -80908 -69384 -47959 -9040 18279 -12813 -71064
85 -71064 -67801 -33757 -25939 -34961 -32277 -17419 11039 9949 -42025 -81420 -50507 14450 62281
98 62281 56007 -7902 -51204 -11622 28376 -709 -20702 25216 63238 33934 -27742 -53615
110 -53615 -18381 23253 12155 -8295 11179 16295 -29297 -64624 -53571 -20942 15902 19882
122 19882 -32124 -74566 -57978 -39140 -46710 -36281 -7258 -3108 -25395 -52954 -64909 -51810
134 -51810 -39150 -34283 -2263 28944 -5545 -66627 -72214 -35067 2920 32650 25932 -19159 -34673
147 -34673 -5467 5126 -19919 -32904 -1157 58700 75663 3463 -73735 -51347 25268 57476
159 57476 40894 11247 -9054 -797 12368 -3581 -14388 15637 42621 35500 16172 -5914
171 -5914 -26304 -22186 5899 39147 58467 26732 -43902 -60586 -2659 35446 17262 1774
183 1774 8324 12169 4928 -19172 -44243 -26294 25786 51735 27668 -22647 -59380 -41912 8571
196 8571 23455 7507 9240 7752 -20535 -36513 -22895 -7652 8717 25234 17512 -2071 -10985
209 -10985 -23538 -33665 -9897 30191 46124 25394 -21403 -50298 -19615 24203 17115 -1638
221 -1638 15043 27267 4425 -20157 -24702 -10185 19336 35250 21131 3093 -12434 -29068
233 -29068 -21825 10737 28825 24893 11829 -16647 -35786 -14757 8682 -78 -3154 17170 22252
246 22252 -864 -32387 -48482 -25676 22483 37218 8703 -20618 -33143 -28624 -8239 -1218
258 -1218 -11040 200 18994 -2746 -37944 -34751 -12514 -2170 4993 10411 5958 -6431 -27711
271 -27711 -38850 -11223 26173 26366 5428 -6130 -13766 -10942 4525 6340 1286 19949 35621
284 35621 14091 -13991 -15729 -1725 17594 32998 28986 15833 2050 -15917 -17688 13509 34934
297 34934 21895 6750 74 -10043 -11016 -5262 -12890 -8965 23640 37106 1786 -43189 -53208
310 -53208 -18677 27968 32054 -3453 -18579 -5879 -6509 -17415 -15383 -6417 9713 30909 23731
323 23731 -11667 -28381 -15774 3322 25976 39086 22759 -4137 -13649 -4102 18314 31202
335 31202 13530 -642 21354 32953 -155 -28842 -16393 18323 44265 37020 -7649 -39882
347 -39882 -23094 6971 12475 2366 -4264 1948 11025 -7689 -42516 -38462 1241 19573 8821
360 8821 -5422 -21615 -32682 -23307 -10214 -4454 4237 7656 -7285 -20043 -20440 -17891 -6760 8520
374 8520 9688 3845 -2603 -21887 -32490 -4741 25297 17656 1097 159 -455 -8728 -15302 -13760
388 -13760 8859 38575 33513 -1453 -21822 -15718 3773 23426 20462 1970 8241 27956 14245
401 14245 -17908 -18337 7464 29871 34389 13594 -13688 -14806 1868 11474 14118 10099 -1848
414 -1848 -1998 5826 -4052 -17377 -10098 3292 10201 16224 3781 -30922 -42133 -12722 18152 18470
428 18470 -4847 -25541 -17066 4237 -3303 -26429 -19212 10694 26234 16809 -13338 -40000 -22937
441 -22937 20390 31776 9977 -2926 -588 2416 1503 -5466 -6373 12570 27767 19460 4327 -8216
455 -8216 -18842 -9338 17471 24095 8637 -1819 -8118 -13542 -6706 1075 -4394 -5057 3737 2572
469 2572 -12127 -27546 -30997 -8020 19704 10974 -21613 -29828 -17802 -13070 -10672 -6766 -5483 2077
483 2077 7087 -13806 -38376 -31042 -3557 15358 14527 -2521 -16661 -11325 -5350 -11474 -5632 12232
497 12232 14938 7701 2743 -7523 -16883 -3415 16270 21459 16695 5827 -8466 -7796 4331 11126
511 11126 13526 14177 7858 5089 7602 -3891 -16637 652 26583 23423 2591 -12336 -16577 -6613
525 -6613 7021 3216 -5002 -179 4298 -3142 -14219 -22452 -16938 6347 16237 -2148 -16831 -12204
539 -12204 -9813 -10556 -1096 5900 5148 5647 2214 -6137 -5627 1896 8082 17404 22602 12548 3002 4284
555 4284 4714 11582 27176 28916 14295 10756 15655 9840 5797 12575 22248 27981 23359 3738 -9800
570 -9800 -2229 8328 11891 14337 9905 -460 -1732 -4487 -17252 -15817 5121 13065 2098 -8559
584 -8559 -15221 -17854 -12392 -6886 -3257 3598 2323 -11043 -16740 -11338 -9989 -4432 6209 5767 -1775
599 -1775 -1854 -5373 -14059 -6329 12092 18279 10910 530 -7258 -4704 3094 3469 5129 14164 12884
614 12884 628 -3179 -3086 -4069 5304 16332 11079 1843 -628 -6529 -10058 260 11598 11731 3695
629 3695 -8600 -13775 -4117 1445 -6816 -5588 7899 8434 -4963 -15857 -21649 -14911 5843 14709
643 14709 185 -12488 -12146 -8486 -6125 -7019 -10020 -2797 7111 931 -11472 -12114 -10493 -7779 5192
658 5192 12922 531 -10670 -9310 -5309 574 7378 5027 538 3277 4119 -1499 -4692 -4313 2834
673 2834 18726 19725 -1397 -13919 -4255 4920 5877 7202 5459 2499 4446 179 -10684 -9700 2085
688 2085 9072 8448 653 -11136 -11424 -2084 -3011 -6669 886 5233 -3103 -8844 -9986 -12281 -6180 5196
704 5196 6227 -406 -5960 -10570 -7431 2429 3809 -895 2795 6869 2870 -168 -2834 -7902 1612
719 1612 20985 19983 -108 -10212 -3329 10342 18634 11168 -443 5129 16979 13562 2136
732 2136 -4816 -1802 15993 30465 15934 -9948 -11185 4811 14500 15503 8529 -1256 834 10502
746 10502 7992 -2090 -6091 -949 12249 21308 6980 -16892 -17167 213 11523 11896 1664 -13347
760 -13347 -11660 3892 5997 -7588 -12845 -4397 8158 10862 -4990 -22606 -15221 5230 12070
773 12070 6163 -2977 -11625 -7807 5023 5264 -4898 -2177 8654 10181 4957 -2380 -7611 -846
787 -846 11120 13088 9052 4892 -1321 -2063 6526 7095 309 3652 9049 3669 -3033 -2980 -3332 210
803 210 6448 2817 -6120 -7884 -5957 -5372 -3974 -6581 -7769 24 2327 -12302 -21369 -11289 -957
818 -957 2324 1286 -9057 -16341 -7959 213 -4968 -10317 -7719 960 8797 5216 -11726 -17225 -2336
833 -2336 9939 9809 4428 -5083 -9325 1434 12238 3957 -6618 -3857 4710 11531 7742 -7348
847 -7348 -13979 -919 13031 12629 2107 -11061 -14351 2059 15281 4098 -10357 -7156 2837
860 2837 5647 513 -11029 -15552 -2653 10504 6783 -6374 -15774 -15119 -1260 8527 299 -9985
874 -9985 -6353 -1852 -2502 -1669 -5306 -11213 -4233 6900 4752 -4347 -9039 -8317 646 9816 6406 -2316
890 -2316 -2221 -281 1381 6774 7563 1592 3957 11204 7375 1694 2578 4065 5822 10532 11081 6663
906 6663 3431 374 -1291 6051 11556 6308 1405 1839 -517 -959 3855 586 -6687 -2939 4043 716
922 716 -5770 -9311 -9528 -2524 3902 -1262 -9142 -10758 -9423 -4850 2459 -698 -10306 -8250 52 -700
938 -700 -4242 -4989 -6772 -2747 7118 6804 -3100 -8613 -6004 1863 10436 7300 -3916 -3430 4531 5576
954 5576 3456 2283 -1694 -740 8460 9720 171 -4629 -2127 2347 7827 7174 -1480 -5348 -2443 -11
970 -11 2607 3977 -3358 -8747 -769 5003 -1303 -6426 -6471 -5041 607 5288 -1406 -10651 -10366 -4029
986 -4029 1393 3149 -4656 -12263 -5308 2193 -84 -3335 -5413 -7948 -2442 8112 4891 -7499 -8922
1001 -8922 -989 6898 10178 3062 -7412 -4843 6400 10703 7059 671 -4990 2076 14827 11552
1015 11552 -2615 -4802 4064 11308 13170 6170 -5267 -5633 6287 10396 5258 -2023 -6526 -2090
1029 -2090 8022 5247 -6955 -9546 -3211 899 3323 365 -10151 -12479 -1335 4326 -1278 -7207
1043 -7207 -9426 -5757 2187 2476 -5505 -6887 -1661 355 1663 1780 -4002 -4688 4559 7013 1608 812
1059 812 3664 2775 3783 5491 3959 4478 6160 3344 2210 5987 5687 3420 4661 3367 413 5513
1075 5513 8875 1705 -3438 376 3540 4339 3720 -2741 -6268 31 5319 2737 -2699 -7681 -7750 2159
1091 2159 7493 -3535 -12971 -7632 -27 2919 554 -9243 -14993 -4687 6627 2973 -8120 -13909
1105 -13909 -8612 4337 8852 -4308 -15337 -8442 2611 6428 3263 -6834 -12663 -934 12053
1118 12053 6188 -6840 -9189 -1598 9281 12477 1298 -9127 -4255 6922 10724 6425 -3813
1131 -3813 -9333 1593 12811 6286 -7152 -8308 -1794 5136 7218 -2437 -12190 -7584 2589 4071
1145 4071 -1682 -9185 -11816 -4116 2787 -3651 -11465 -8550 -4186 -3690 -2820 -6163 -11829 -8029 -689
1160 -689 -1190 -4665 -5268 -5092 -3583 -365 -1972 -3289 1174 2279 -1130 244 1843 -314 1614 5504
1176 5504 1907 145 4696 5924 2452 1522 2498 4814 8975 6504 -2002 -2581 3430 5900 6508 3720
1192 3720 -3385 -3405 6158 6651 -2838 -6671 -1654 3784 6456 1655 -8922 -9779 167 5896 3293 -2840
1208 -2840 -9110 -5772 5024 5660 -4566 -8024 -1332 3835 6601 2845 -6630 -8599 3089 11107
1222 11107 7659 -44 -5501 -1396 9624 11504 1796 -2208 3512 8391 10218 7774 -1138 -2658
1236 -2658 8863 15481 8874 1199 -648 2375 9473 11560 4593 776 3763 5261 5605 5669 20
1251 20 -1853 5485 9156 2671 -1809 -2458 -2807 700 5177 1931 -3392 -3006 -2414 -1740 -138 -2318 -4587
1268 -4587 111 2732 -2380 -3895 -2336 -3953 -2340 3148 2574 -1484 -1227 -1593 -2422 1185 4726 3077
1284 3077 2076 1950 233 2397 4922 1288 684 6974 8498 3570 980 -372 -772 4374 8895 4614
1300 4614 -414 -423 -651 481 2498 118 -1485 1984 1694 -2971 -2511 -2806 -5421 -2099 3487 -335 -6645
1317 -6645 -6910 -5781 -3557 805 -382 -5128 -5029 -4096 -4312 -3772 -2932 -4546 -1447 2901 -1781 -7102 -4940
1334 -4940 -2848 -2716 2019 3737 -985 -3828 -3048 -2569 439 3291 1079 -883 1981 1420 -739 -60
1350 -60 -905 -1202 5522 9011 1393 -4467 -2363 734 3950 6231 2471 -1905 -64 1251 -477 -529
1366 -529 -1738 -2265 2099 5203 -1706 -7936 -6146 -3217 292 4023 -592 -8905 -7573 -1126 -136 -2604
1382 -2604 -5306 -6421 -1272 2527 -4173 -9695 -6069 390 3627 4622 -1452 -8252 -3866 4549 3549
1397 3549 143 1505 3206 4509 4988 238 -3484 1665 6928 7778 6991 2384 -3525 -556 6111 4785
1413 4785 2225 3499 3595 1905 2323 -807 -4421 -97 5809 4082 -464 -5182 -7105 -1769 3427 -693
1429 -693 -4709 -1457 77 -3666 -5342 -5734 -4426 2288 5484 -2003 -8908 -6857 -2589 1068 2351
1444 2351 -1375 -2639 1513 1082 -4674 -4900 -565 2089 6531 7207 -871 -6856 -1799 3701 5203 4826
1460 4826 2262 468 3811 5184 173 -1871 1321 4993 8942 7203 -3406 -7705 1101 8413 5977
1475 5977 1087 -1842 -2303 1778 2351 -3532 -5101 1064 5502 3076 -3115 -10188 -9519 776 4977
1490 4977 -1152 -4287 -3864 -4723 -3769 -2695 -5736 -5582 941 3489 -683 -4880 -7403 -4904 3840 6361
1506 6361 -32 -3263 -1581 -587 1839 3309 77 -720 6645 7785 194 -4042 -1367 5048 10849
1521 10849 9290 470 -2100 1963 3672 2140 2337 1643 3433 7672 3678 -6519 -7390 126 4831
1536 4831 5222 2677 -3258 -5742 -2380 -1113 -2351 -1301 110 642 2347 -1525 -9381 -8300 -497
1551 -497 3806 3582 449 -5439 -6898 -126 3546 -99 -1438 608 3135 4146 8 -6013 -1988
1566 -1988 7747 9018 2784 -1831 -3186 -1291 5760 7256 2376 2206 5604 3002 -643 -1810 -861
1581 -861 3987 9041 6166 492 -1071 -2256 -3382 1394 4709 1792 116 569 -2921 -5201 -3107
1596 -3107 -2134 -1448 1891 703 -5869 -7915 -6824 -3881 -94 241 -4833 -5404 -2996 -6287 -9450 -5133
1612 -5133 252 1683 995 -3958 -9660 -7049 -214 650 -104 1154 1029 253 -914 -4410 -3770 3743
1628 3743 7687 4087 1887 -108 -3662 -1275 4162 5196 3169 2584 -47 -1811 -276 66 -1280
1643 -1280 1709 4359 2126 -1402 -5511 -8938 -3995 4636 3255 -3621 -5196 -4909 -5645 -4831 -4467 -4769
1659 -4769 -1063 1589 -3109 -7439 -7832 -6551 -2750 2432 1541 -2321 -2838 -4294 -6104 -1430 4088 2144
1675 2144 -954 -377 -312 -399 67 -998 928 7491 8098 1269 -3130 -2810 434 6720 9273 3489 -469
1692 -469 1776 1256 -1305 179 2655 3520 4832 3662 -856 -3323 -3250 -2521 2600 7194 3335 -3957
1708 -3957 -5113 -3390 -1714 2432 1096 -2700 -1042 2039 -2257 -7687 -6256 -400 5270 6285 -1585
1723 -1585 -7591 -5244 -1134 143 2672 4052 1526 710 328 -3621 -3710 2607 6010 5899 5745 3205
1739 3205 -1903 -2071 784 3873 7966 8108 2218 -254 1971 1919 1271 5043 6379 4221 2660 -214
1755 -214 -3107 -66 4466 3843 1768 1096 -1061 -3392 -3172 -3621 117 6662 4129 -5432 -8940 -5161
1771 -5161 -1582 731 1372 -1476 -1296 1544 -1655 -7690 -7676 -1751 4459 7112 2049 -6487 -7128 -1674
1787 -1674 1323 3013 4309 1417 -467 2623 2635 -2272 -2454 1361 5952 8834 5095 -4817 -7914 341
1803 341 7269 8113 3516 -3539 -3578 3603 4311 -2933 -4398 1583 6759 5815 -474 -8566 -7620 1515 6145
1820 6145 3239 -1370 -4736 -4988 -1388 -167 -3480 -2782 1151 851 -1295 -2751 -6766 -7584 -764 4910
1836 4910 3120 -2210 -6612 -7365 -1829 2237 -139 -1055 1428 1751 -763 -3335 -5031 -2186 6468 8976
1852 8976 1815 -2658 -1330 -342 964 2959 4260 6025 6344 -162 -5726 -2238 3806 6385 5873 2158
1868 2158 -1772 -1549 369 -2715 -2821 3180 6247 3125 -1290 -6276 -7944 -3013 2006 2428 1272 -1684
1884 -1684 -6529 -5911 -1126 -954 -3098 -1990 -102 721 152 -4245 -8525 -3003 6777 7869 493 -6547
1900 -6547 -7210 805 7923 4266 -1641 613 4926 4264 178 -3717 -3410 5246 12439 8665 -458 -3736
1916 -3736 -2474 1677 6249 6325 2609 1776 2274 1184 788 130 -2489 787 7297 6134 -2028 -6993
1932 -6993 -5651 99 6799 4816 -3102 -5753 -1578 421 -1016 -2848 -2439 1507 4620 -706 -7354
1947 -7354 -6216 -1052 951 2555 2853 -526 -3153 -2995 -3577 -725 4696 5055 1489 -400 -226 -1221
1963 -1221 207 826 1639 5993 8062 1703 -4106 -2376 1788 4006 6007 5112 2040 999 -796 -2927
1979 -2927 492 4509 3954 1976 488 -1390 -2182 -2588 -2995 -1591 4527 4951 -3261 -9146 -7022 -1472
1995 -1472 2625 1896 -3154 -5067 -1892 -2125 -5379 -4621 -1950 873 2781 -78 -6018 -6363 -2650 -379
2011 -379 1739 4389 1760 -3300 -4260 -1753 1516 3469 2136 -415 2300 4306 218 -3680 -1732
2026 -1732 3204 8185 7801 395 -5916 -2502 2898 3534 2552 2496 2046 1102 -180 -2991 -2632 947 2420
2043 2420 1406 2872 359 -4995 -6447 -2808 1618 4782 2770 -4861 -8043 -2921 927 -522 -2195
2058 -2195 -1624 1027 2554 -1644 -8411 -6207 2082 5898 3774 121 -3870 -4434 -89 2099 1190 2455
2074 2455 2999 918 318 810 -368 -31 3001 4899 5976 4018 -1872 -4942 1178 7495 6330 2313
2090 2313 -692 -1263 840 2480 -655 -1674 2974 5345 1636 -2781 -5844 -4460 1183 3773 460
2105 460 -940 -964 -4280 -5895 -3092 -692 496 641 -1522 -4038 -3693 -3302 -4079 -1939 1672 2278 -370
2122 -370 -3126 -5373 -3705 1428 2592 1272 1650 1004 -2183 -2994 -260 2095 3239 3050 570 109
2138 109 2107 835 -1942 404 4361 5600 3428 -2412 -6345 -1426 5684 5436 288 -2074 -1157 -188
2154 -188 -750 -3212 -3994 928 5099 2257 -3292 -6991 -7761 -3088 2791 2963 -583 -2317 -4269 -4754
2170 -4754 -1867 -493 -2670 -1921 2330 2452 -934 -5529 -7008 -1550 6902 5608 -1693 -5341 -2699
2185 -2699 1689 4577 2452 -1207 713 5526 3333 -1850 -2647 1029 5439 7937 3689 -1973 -2107
2200 -2107 163 1339 3671 4780 2443 1028 1205 -512 -1783 12 999 1774 3795 2639 -2288 -5038
2216 -5038 -2711 466 2326 1557 -1765 -2924 -523 -1775 -4482 -2302 2029 2425 327 -2821 -5648
2231 -5648 -2820 1733 1139 -930 912 2321 163 -3059 -4643 -1367 4858 7123 1619 -1748 -1062
2246 -1062 -175 926 2645 2514 2431 4666 3389 -736 -1624 -204 1229 4124 5368 2415 -1285 -2453
2262 -2453 -1768 1206 4364 1725 -2308 -1414 1308 -110 -3295 -3863 -1851 3005 3897 -2502 -8088 -5495
2278 -5495 -162 2629 1122 -2778 -4771 -2150 -639 -3545 -4237 -618 1462 1156 -381 -3860 -5644
2293 -5644 -3077 1183 3164 3475 1112 -3264 -3639 -709 991 1510 1851 1786 1774 2571 -1467 -5110 -1450
2310 -1450 4696 5338 2497 -1155 -2621 -813 1577 484 -358 1898 2137 -496 -2523 -3419 -2317 977
2326 977 2105 -990 -2538 -1645 -3284 -4849 -2461 -95 730 -45 -3079 -5598 -4110 -2055 -2316 -1523
2342 -1523 57 -417 -2291 -3370 -4481 -3161 723 1553 -331 -200 -171 -1979 -2636 -828 1647 3992
2358 3992 3493 -537 -2447 119 1624 814 1589 2633 2580 2124 199 -2609 -1139 3539 4571 2481
2374 2481 525 -847 -1523 -103 -112 368 2341 2167 -949 -2310 -1638 -1465 -1145 684 1110 225 -211 -2840
2392 -2840 -5172 -2461 1547 1929 451 -1218 -2467 -1978 -632 -1076 -656 2276 3092 61 -1660 -1470
2408 -1470 -1307 1241 4280 3339 2421 1732 -646 -1458 1866 3958 4132 3861 2593 884 1628 1834 -314
2425 -314 1556 5709 5676 2033 -562 -1506 -51 3192 3670 673 749 1449 87 -1112 -937 -683 1068
2442 1068 3198 -70 -3295 -2707 -1757 -1583 608 1191 -468 -1668 -1957 -2944 -2112 150 338 328 1558
2459 1558 224 -2597 -2372 -1508 242 3266 3010 -418 -1371 657 1000 -13 1005 1945 2907 2816 29
2476 29 -2399 -109 3896 4181 3237 1295 -564 -239 1702 142 -381 2540 3723 1465 -1108 -2724
2492 -2724 -3246 -764 2221 1789 584 -836 -2638 -3341 -1562 -1013 -1799 -80 729 -680 -1582 -3139 -4302
2509 -4302 -2333 1853 1471 -2161 -3615 -2601 -731 1068 -84 -2530 -100 2163 374 -2126 -1935
2524 -1935 -249 2817 4363 1257 -2433 -1137 1458 1332 1785 2097 1683 2553 1810 -731 -1415 693 1928
2541 1928 2777 3329 1088 -1968 -1715 -205 64 1010 1473 -346 -636 99 -1451 -3119 -1619 468 1332
2558 1332 535 -2768 -4810 -2342 678 -451 -1223 -1409 -979 -1020 -1223 -3248 -2980 1192 3075 421 -1901
2575 -1901 -3014 -2046 885 2201 941 312 1404 1135 -359 -111 -202 265 3121 4575 2156 -782 -894
2592 -894 -437 2470 4039 1832 -313 480 1291 750 263 -589 -347 2777 3885 -559 -4112 -2500 293
2609 293 2298 1687 -1425 -3340 -1563 -373 -1887 -2512 -1425 -238 474 -26 -3164 -4384 -1903 27
2625 27 553 1350 -387 -2615 -2124 -214 -61 110 304 110 864 1538 -813 -2072 -219 2087 2742 2462
2643 2462 214 -1525 422 2637 1468 901 1722 1837 1206 48 -690 -412 1863 2557 678 -142 22
2660 22 -1134 -759 61 -195 129 1422 -581 -3098 -2220 -1013 -714 350 250 -1616 -1914 -1652 -2333 -1791
2678 -1791 -431 -408 -633 333 -772 -2925 -2407 -668 612 1727 1703 -1097 -1939 291 1240 900 1140 1243
2696 1243 1279 2594 1607 -1506 -429 2016 3137 2703 1732 -191 -498 2025 2884 1499 1595 1418 515 1116
2714 1116 1009 -476 -66 1244 1744 1084 427 -2082 -2754 -96 1586 758 -450 -1274 -2363 -1296 295
2731 295 -901 -1571 -147 374 -88 -993 -2336 -2796 635 1980 1114 332 -827 -1498 -646 1624 1293 491
2749 491 1202 1219 592 1336 1004 -121 1170 3200 2656 1638 507 -949 589 3416 2847 501 593 1082
2767 1082 774 1033 969 -380 282 1716 1200 -498 -1254 -1470 -930 831 962 -1176 -1350 -1571 -2084 -1349
2785 -1349 -126 -1152 -1665 -549 -914 -1534 -2082 -2216 -2003 119 589 -1157 -1787 -1717 -1653 -421 996 -227
2803 -227 -882 0 -339 -1229 -135 769 363 856 1065 131 308 664 -115 243 2234 1778 100 -120 -1030
2822 -1030 -1098 1219 1746 -236 -726 -93 -321 -532 -646 -1587 -1229 635 510 -1598 -2445 -2741 -2777 -58 697
2841 697 -1752 -2966 -2299 -1812 -1393 -630 -2412 -3185 -1178 415 -1024 -2545 -3008 -1872 953 2412 -679
2858 -679 -2723 -1206 302 952 1316 -311 -1430 980 2443 665 -1098 -620 596 2305 3200 723
2874 723 -1656 -130 1375 1950 2154 491 -963 418 2027 590 -1004 -734 47 890 1622 -113 -2485
2891 -2485 -1432 376 770 20 -1127 -1769 -874 163 -1075 -1843 -483 -530 -855 -526 -1080 -1793 -1010 393
2909 393 7 -167 187 -423 -843 94 296 812 1960 1137 -52 903 1077 715 1242 2437 1338 1192 2130
2928 2130 1641 689 948 1084 1401 2860 2417 -10 -55 1071 1377 1750 1118 -818 -688 1546 1415 -1012
2946 -1012 -1396 -586 412 1501 227 -2832 -2697 -24 704 242 -980 -2440 -2193 355 317 -1757 -1950
2963 -1950 -851 -277 693 586 -2197 -2426 194 1711 1415 40 -1533 -1073 1536 2445 289 -1053 563
2980 563 1319 2127 1927 -759 -1161 1679 2688 1472 38 -454 -469 1203 2072 331 -781 148 348 592
2998 592 563 -1216 -1847 107 767 -451 -1219 -1185 -1939 -800 400 -1041 -1946 -1579 -1483 -1175 -647 -1390 -2239
3017 -2239 -1080 -184 -1436 -1308 -617 -1346 -815 333 -331 -670 159 -254 -1061 215 760 195 539 599 -204
3036 -204 877 1706 228 138 1374 1479 794 1525 586 -281 881 1804 953 39 101 -187 729 945 474
3055 474 -721 -94 -29 -233 233 -402 -2011 -849 1056 27 -1048 -1017 -1364 -1123 602 -405 -1869 -1290
3073 -1290 -668 -218 68 -903 -2093 -1138 867 515 -383 -253 -346 -153 1717 1404 -437 -281 1279 1436
3091 1436 1625 1298 235 2 1784 2086 1129 1135 666 138 1856 2146 690 -398 741 1058 1249 1236 -134
3110 -134 -984 986 1152 324 -446 -709 -1131 132 671 -723 -1315 -748 -976 -771 308 -912 -1984 -1048
3128 -1048 70 -633 -652 -716 -1618 -625 582 -122 -1337 -449 -45 -89 807 -95 -1071 -44 1059 569 379
3147 379 798 35 606 1654 1079 383 706 690 689 1320 1217 228 652 1274 417 286 735 36 -307 537 902
3168 902 66 -2 -363 -694 -496 265 -481 -892 -348 -1168 -1205 -450 -885 -1593 -1083 -693 -936 -227 -577 -1479 -1123
3189 -1123 -194 -36 -707 -747 -1060 -638 892 888 -732 -1053 318 379 729 793 -177 -288 1864 2150 791 339
3209 339 102 240 1787 1965 234 398 772 1025 1318 1068 -318 -707 1368 1479 184 -490 -739 -679 1004
3228 1004 937 -929 -1555 -870 -62 35 -207 -1502 -1384 161 93 -1530 -1601 -829 -556 398 412 -1230 -1834 3
3248 3 390 -278 261 -300 -655 645 1113 -212 -154 305 454 1345 1471 137 -601 1017 1570 624 1006 749
3268 749 681 1002 1071 -272 699 1462 1034 420 635 64 -291 879 621 -770 -162 308 -546 -538 -676 -1179
3288 -1179 -709 329 -432 -1379 -1135 -1012 -995 -47 -244 -1627 -1073 -280 -736 -1363 -910 -1191 -801 1031 109
3307 109 -1079 -826 -116 190 1082 263 -376 -356 1366 879 99 472 431 1012 1813 844 -528 -409 1083
3326 1083 1421 1359 672 -197 171 1227 894 25 -183 1 55 816 313 -1505 -1315 -143 88 -235 -236 -1378
3346 -1378 -1859 -286 -308 -1178 -886 -967 -841 -412 -1085 -1963 -1260 249 277 -682 -300 -1005 -1088 0 463 -617
3366 -617 -169 1031 169 144 190 -11 160 1455 1093 532 672 295 228 1164 1293 858 930 1728 827 99 771
3387 771 452 358 1405 987 73 107 83 -546 125 440 -319 -239 688 -677 -1497 -789 -384 -35 -1 -490 -1395
3408 -1395 -1066 -241 -830 -841 -60 -738 -465 -222 -607 -1280 -68 580 114 405 162 -659 -292 1168 855
3427 855 1114 1019 367 196 1068 787 358 1419 1921 1399 944 744 -198 167 1510 1542 553 431 374 31
3447 31 223 -42 -335 214 663 -69 -386 -302 -847 -736 127 -61 -619 -759 -908 -1687 -913 -112 -696 -860 -170
3468 -170 -1208 -1127 -855 -1238 -894 189 232 -721 -769 -261 -936 300 864 -74 -45 497 -2 -458 209 555
3488 555 622 1139 793 -190 147 242 282 427 1289 442 186 233 -382 -662 36 755 -105 56 221 -901 -1174
3509 -1174 -608 -625 -596 -231 -1066 -1254 -948 -866 -1968 -1069 -127 -418 -849 -1051 -1649 -1522 -286 -422 -773 -600
3529 -600 -695 -705 -553 -544 -1302 -257 886 262 -685 -62 -726 -377 1305 908 282 444 517 30 733 789 124
3550 124 612 1424 984 38 -324 -473 419 1708 1617 -327 -524 115 211 339 -8 -396 -148 503 -145 -1336
3570 -1336 -1137 -491 -383 457 163 -1490 -1467 -514 -776 -309 242 -159 -650 17 -426 -1091 -393 173 522 833
3590 833 688 -463 -416 256 505 777 1199 849 241 1049 920 -33 646 1402 1199 843 947 3 390 1153
3610 1153 1015 574 1226 1007 -149 442 203 45 661 1069 312 -435 -479 -525 -643 180 257 -397 -119 -193 -1034
3631 -1034 -1122 -809 -833 -4 772 42 -1433 -970 -795 -489 406 400 -537 -51 228 -95 -711 -420 -32 1052
3651 1052 1771 144 -874 -37 764 808 1236 1068 121 416 1139 510 529 942 882 810 1067 368 -829 -151
3671 -151 644 879 1022 404 -900 -956 -98 -161 -446 -134 -21 -758 -267 -872 -1649 -883 208 280 -59 -830
3691 -830 -1306 -1555 -858 -305 -592 -122 91 -631 -396 -397 -896 -433 601 454 84 72 35 -410 521 972 611
3712 611 963 551 -256 121 721 569 449 1426 1044 328 237 93 27 833 1092 685 429 271 -656 -412 325
3733 325 267 183 481 -108 -1069 -933 -239 -1034 -585 -293 -776 -287 -854 -1314 -1309 -293 98 169 -445 -865 -1213
3754 -1213 -300 355 -146 165 331 -54 -282 -70 -214 -294 702 1477 760 582 -37 -924 510 1644 1140
3773 1140 665 745 198 413 696 581 -61 797 1689 958 -36 -585 -727 395 897 439 -442 -493 -649 -742
3793 -742 -52 -11 -787 -21 21 -764 -970 -724 -977 -785 128 -121 -999 -1204 -1295 -1014 176 207 -830 -671 -157
3814 -157 -428 -715 -166 -101 332 1155 535 -569 -331 188 192 878 1174 621 445 532 -101 143 793 810 501
3835 501 1277 991 -131 -77 82 -223 592 962 182 -392 -640 -294 -512 56 85 -544 -283 -462 -1566 -843
3855 -843 -21 -517 -546 -462 -490 -909 -811 -967 -763 313 700 -708 -1003 -1001 -331 132 767 107 -19 577 293
3876 293 -586 -223 491 588 1564 1207 344 -95 217 425 840 1591 1167 558 429 339 119 655 605 20 1397
3897 1397 1488 -142 -774 -175 289 903 628 150 -943 -567 -357 -525 -495 -218 -430 -49 243 -1004 -1040 -769
3917 -769 390 79 385 219 -1061 -1043 120 308 594 298 -175 155 666 110 -346 283 978 691 1419
3936 1419 527 -421 250 1428 1141 854 726 770 338 373 445 276 848 1165 569 350 134 -410 -690 483
3956 483 646 528 386 -399 -1373 -665 -125 -453 46 149 -669 -751 -1105 -1365 -923 114 20 -449 -414 -529 -1141
3977 -1141 -1195 -447 -52 291 405 -228 -787 -278 191 -45 419 40 7 377 599 -355 -185 867 742 421
3997 421 557 -112 -195 745 1032 839 654 449 -612 -130 248 300 330 513 243 -201 -29 -899 -1410 -155
4017 -155 434 380 -329 -501 -1486 -1123 -172 -726 -748 43 -4 -463 -314 -1485 -1467 -447 526 -255 -980 -370 -1017
4038 -1017 -717 60 197 -248 139 -10 -317 -470 237 -237 477 947 481 283 -145 -515 -72 1172 1125 357
4058 357 63 16 -173 295 346 224 372 914 610 -411 -357 -386 14 746 227 -204 -255 -331 -1348 -548 -95
4079 -95 -133 -265 -419 -790 -1427 -927 -737 -518 179 230 -420 -859 -680 -740 -233 557 263 -387 -261 -607 -728
4100 -728 256 806 274 718 570 -91 284 436 360 458 1426 1334 429 337 136 100 1286 1593 479 141 513
4121 513 157 -133 105 305 189 576 411 -584 -372 -127 -557 -196 606 -171 -814 -886 -977 -752 61 -273 -581
4142 -581 -98 79 -596 -1059 -882 -645 471 605 -493 -1391 -469 -15 47 438 186 -1 787 551 -387 -160
4162 -160 491 987 751 822 331 -74 -68 307 503 1039 1454 150 -17 279 131 97 534 235 237 857 189 -784
4184 -784 -573 129 37 -378 -61 -949 -842 -526 -789 -643 64 -73 -872 -687 -923 -1074 -555 13 -361 -481
4204 -481 -80 -637 -1010 -586 -310 96 501 233 -258 -171 -90 -584 197 882 771 435 374 395 8 423 357 577
4226 577 1038 1022 284 -330 280 227 972 1001 8 -567 212 331 -339 -69 354 21 40 -137 -1345 -924 -172
4247 -172 72 -6 -416 -678 -1083 -317 -404 -543 15 -191 -657 -344 -282 -579 -1088 -344 446 286 276 -298 -950
4268 -950 41 669 166 280 553 406 486 220 -165 -183 885 1035 532 408 269 -317 456 589 543 752 1178
4289 1178 -210 -424 621 314 236 432 419 -224 -62 -526 -1094 -521 722 54 -170 -399 -1036 -808 -400
4308 -400 -358 -838 -230 -103 -723 -1007 -392 -547 -562 102 158 -186 -96 -258 -624 -201 399 654 359 -161 -275
4329 -275 155 563 786 317 586 773 -53 95 369 -169 980 1076 962 457 141 -118 -198 551 417 332 757
4350 757 55 -576 -213 -4 -516 -54 270 -293 -543 -439 -951 -1091 52 225 -330 -382 -547 -911 -295 -252
4370 -252 -687 -187 247 -216 -687 -281 -285 -201 84 537 -18 -179 43 -541 -90 987 868 354 397 167 241
4391 241 431 550 520 1012 1119 176 -73 -30 110 449 922 576 327 15 -23 -306 77 512 98 207 -48
4412 -48 -424 -673 -387 -576 -506 289 -146 -916 -793 -668 -718 -210 155 -360 -769 -128 -538 -568 -372 -59 -74 358
4434 358 7 -660 145 406 126 185 716 347 199 324 89 20 878 748 383 274 271 148 54 599 345 443
4456 443 992 452 -189 -226 -9 -41 336 376 -272 -295 -136 -685 -381 357 -247 -340 -75 -452 -764 -848 -737 -404
4478 -404 298 299 -558 -820 -534 -195 -254 -146 -128 -435 315 -144 -888 -216 -120 56 358 527 -118 -546 313 521
4500 521 152 631 271 -109 274 631 319 299 315 190 634 665 -49 -542 365 657 501 423 95 -306 119
4521 119 368 -203 -57 211 18 -203 9 -993 -1009 -140 270 -31 -244 -134 -1112 -712 -34 -502 -193 108
4541 108 -269 -641 -393 -447 -592 43 352 -245 210 -204 -614 -314 205 526 81 543 545 -43 217 104 303
4562 303 920 923 264 118 642 494 229 327 479 483 424 223 -521 -171 379 -155 146 93 -414 -174 -86 -288 -361
4585 -361 -29 -28 -154 -471 -576 -781 -940 -1 -179 327 -206 -456 -801 -480 121 -279 -23 114 -368 135 -283
4606 -283 -427 -67 553 1044 275 256 -70 262 591 710 196 365 844 269 277 670 430 524 791 701 297 458
4628 458 401 139 671 679 -65 75 111 -327 -130 124 64 -486 -49 -289 -715 -489 -658 -513 -448 213 -252 -460
4650 -460 -286 -555 -701 -385 65 -185 -221 51 -582 -268 193 86 400 318 -40 -168 140 -85 200 624 812
4671 812 275 295 477 331 407 530 240 321 637 435 90 352 173 -338 566 475 -232 -90 -303 -603 -85
4692 -85 12 -180 -294 -352 -301 -1023 -370 -296 -476 -285 -205 -669 -957 -540 -445 -555 -165 -751 -602 -400 -300 -460
4714 -460 -283 313 19 -43 174 97 -321 123 104 372 577 660 -94 -57 177 -75 -164 1012 307 313 193 411
4736 411 -151 477 217 378 345 270 -100 15 -221 -305 -170 396 -19 -350 -150 -46 -74 -242 -15 -413 -318 164
4758 164 -558 -632 -306 -328 -87 100 -235 -812 -254 -71 -123 186 90 -157 -77 167 -303 -410 318 457 351 444
4780 444 259 -136 254 439 366 393 611 346 320 474 380 149 346 91 196 469 582 -83 -13 353 291 32
4802 32 108 -135 -382 -109 -286 -610 101 1 -297 -382 -153 -384 -410 -213 -296 -619 -48 -324 -712 -454 -481 -238
4824 -238 -10 -22 -514 -304 -66 -435 4 371 -49 -64 200 206 -29 101 140 490 415 269 36 94 531 455 260
4847 260 606 55 177 610 406 -101 237 347 224 72 157 -206 -184 290 177 -268 -75 -116 -306 -118 -138
4868 -138 -742 -779 254 -149 -605 -360 -609 -575 -87 -196 -273 -344 -141 -336 143 -199 -100 -71 451 435 -93 167
4890 167 -147 285 447 667 49 -60 488 416 301 866 319 399 495 282 150 156 379 -77 345 413 159 -22
4912 -22 453 -22 -74 379 111 -158 248 -201 -284 -100 -260 -205 -16 -85 -367 -475 -263 -298 -413 -392 -207 -264 -374
4935 -374 -51 -427 -102 186 -25 104 93 -314 -318 152 88 -4 42 311 -119 -77 568 128 -53 501 207 45
4957 45 458 299 238 248 438 -123 290 287 76 -210 257 18 72 46 -146 -154 -164 -290 -492 110 42 -365 2 -272
4981 -272 -611 -557 -215 -225 -164 86 -536 -572 -386 -8 -493 -211 -1 -635 -375 58 -351 -423 49 -25 143 175
5003 175 -117 65 631 473 289 311 258 366 224 274 279 272 458 424 80 231 237 290 309 308 79 -46 108 162 -45
5028 -45 35 89 -209 112 -41 -341 -255 -256 -118 -534 34 -559 -491 -317 -249 -222 -228 -378 -187 -11 -13 -672 -303 -171
5052 -171 -38 -487 -227 -190 -242 -94 -234 92 68 185 446 262 348 255 133 391 360 121 428 774 439 385
5074 385 200 -81 122 598 -30 107 172 37 298 208 394 -101 59 108 63 7 39 -347 -83 222 -468 -494
5096 -494 -254 -327 -166 -36 -154 -359 -128 165 -17 -376 58 -359 7 193 334 -57 193 -229 122 182 273
5117 273 72 158 263 268 294 435 482 -22 710 199 96 286 423 561 130 209 29 45 263 4 -61 420 275
5140 275 -230 -78 172 -190 -232 -28 -48 37 -333 -366 -365 -98 -329 -198 -209 -163 -309 -371 -286 -356 -426 -419 -62 -503 281
5165 281 141 -445 50 271 169 -10 297 -17 419 184 315 318 44 -222 -51 217 101 428 163 242 428
5186 428 553 344 167 168 679 490 398 13 28 -262 230 47 -157 -139 -471 -445 65 -79 -378 -258 -342 -97
5208 -97 -332 -116 -508 -244 -338 -107 -238 -601 -446 -438 -299 16 -121 -445 184 80 -316 -141 258 211 115 253
5230 253 -83 281 394 98 183 93 83 270 259 355 16 111 145 153 382 294 -56 163 328 289 182 70 115 -152
5254 -152 -56 -39 -269 158 390 -303 -142 -282 -202 -490 -90 -244 -491 -94 -73 -554 -405 -509 -473 -373 -143 -256
5276 -256 -647 -87 -148 -200 171 -278 -77 252 502 -175 -207 76 111 92 681 163 147 444 294 244 53 372
5298 372 97 318 208 186 162 312 223 -48 553 34 -136 -79 60 -200 -216 -41 -2 -49 -235 52 -574 -331
5320 -331 -90 -350 -170 -348 -544 -251 -38 -346 -146 142 36 -330 -136 98 196 -35 98 -325 -94 335
5340 335 -15 99 111 33 -148 343 259 412 229 251 395 299 542 -34 -73 468 414 482 484 183 -182 443 63
5363 63 -186 11 -133 -229 61 -178 -267 -14 -50 269 -425 -424 -702 -109 274 -149 -757 -287 1 -254 -115 -234
5385 -234 -350 -107 155 234 -308 -111 55 -159 194 268 -495 -115 221 209 44 93 -146 113 466 461 2 36
5407 36 163 273 336 323 124 65 315 112 148 160 -19 50 355 393 -350 238 348 -377 -69 -80 32 -588 24
5430 24 -399 -370 -134 64 -279 -180 -379 -371 -241 -371 -242 55 282 -71 -251 -17 -156 -570 28 556 -73 -286
5452 -286 -59 -291 -247 162 3 -125 357 317 288 373 103 294 410 323 203 120 -39 145 507 -83 327 -310
5474 -310 285 213 206 40 90 5 234 352 -350 -269 -271 -82 -18 184 -399 -568 -591 -87 -388 -320 -270 -313 -166 -82 -456
5499 -456 -438 -1 49 1 -24 -229 -356 -172 526 -58 -518 256 -168 75 135 272 -296 122 242 119 57 327
5521 327 126 91 306 229 78 258 197 122 269 75 -27 202 614 18 -202 125 -222 -93 -35 -207 -189 97
5543 97 -104 -286 -253 -127 -384 -96 9 -588 -269 203 -145 -365 -215 -345 -120 84 -236 -631 -259 340 124
5564 124 -282 -135 -95 106 361 265 90 33 389 267 524 209 34 26 535 428 125 202 166 112 256 321 46
5587 46 147 114 163 -64 -73 -134 -46 121 134 -151 -74 -437 -377 -27 -172 -566 -148 -159 -349 -297 -422 -302 -453 -68
5611 -68 -160 -353 -325 -171 -410 -68 65 39 48 320 -147 -199 -27 249 152 185 434 -39 285 242 255 185 691 50
5635 50 282 312 129 -75 451 654 169 120 17 152 209 296 -99 -31 24 210 -39 -172 -333 -107 222 152 -69
5658 -69 -230 -455 -509 -351 -89 -471 -266 -114 8 -249 -182 -225 -169 310 -85 -646 -345 314 153 96 334 46
5680 46 -36 61 317 149 -53 317 7 569 578 123 -332 316 239 240 510 200 302 418 483 90 -21 460 -13
5703 -13 63 109 -191 -98 -324 90 -27 -253 -13 -371 -119 69 -334 -312 -74 -388 -467 -324 -323 -379 -155 -100 -267
5726 -267 -7 135 -217 -308 -55 -176 285 432 -62 -113 -3 407 191 102 238 -4 273 216 386 163 29
5747 29 319 375 768 226 27 257 442 287 350 -33 -71 296 -21 45 -227 -87 187 56 163 -183 -674 -160
5769 -160 78 -335 -253 -419 -272 -418 19 -184 -172 -104 -231 -149 -314 -339 -261 -40 256 10 -157 -24 -20 -55 296
5792 296 89 167 285 101 209 37 238 69 178 548 598 284 325 284 -19 174 224 225 444 233 -25 12 -122
5815 -122 94 30 275 133 -317 66 -213 -281 -134 -146 -354 -298 -272 -131 -329 -56 62 -64 16 -166 -393 18
5837 18 -58 -463 -304 -85 221 -198 114 -471 -6 461 423 33 130 157 119 370 71 166 266 410 37 81 -121
5860 -121 -33 231 377 87 131 84 270 -28 120 274 -92 -47 201 131 -105 -432 -429 -64 92 48 -429 -610 -30
5883 -30 -393 -319 -131 -348 -485 34 -356 -673 -24 -421 19 174 370 -241 -127 82 -168 448 78 -137 -294
5904 -294 169 -95 17 148 180 273 228 -32 -102 242 174 180 147 532 116 -256 336 88 187 219 540 -99 7
5927 7 -16 28 114 -174 -110 -59 -26 220 -590 -140 -251 -415 65 -46 -118 -580 102 -458 -414 19 40 -490 -136 120
5951 120 -150 -388 -259 330 75 203 42 -316 6 243 125 138 158 284 296 103 -169 -137 316 415 98 151
5973 151 39 109 105 199 103 410 388 20 229 140 317 -45 88 297 5 -53 -61 -340 -200 138 -388 108 -163
5996 -163 -252 -333 -34 -114 -366 -64 -56 -361 -235 -169 -240 -138 61 -98 -61 10 -148 -330 -46 211 112 90 88 -77
6020 -77 -46 246 -53 251 -23 129 546 58 138 -105 36 445 354 402 251 -169 -14 348 72 -225 -146 474
6042 474 -123 149 -112 -441 -297 225 -484 -516 -76 -458 -144 2 288 -294 -139 -45 -355 -226 -452 -423 82
6063 82 26 189 42 -115 -59 174 470 24 -195 138 407 -107 44 -65 -113 228 560 319 108 -56 -237
6084 -237 476 293 274 27 231 88 17 -195 171 -196 340 -90 -37 12 120 9 219 206 52 24 -315 33
6106 33 -103 -172 10 -118 -417 -1 -331 -212 23 -23 -142 -56 62 33 -220 -101 -266 -99 170 331 79 -123
6128 -123 -168 116 109 232 -371 55 453 -156 189 1 95 158 290 96 -241 72 -97 220 503 223 -214 -77
6150 -77 224 23 137 85 59 144 33 315 -55 -311 12 -206 164 111 -190 -461 -224 -118 -407 -158 -87 -102
6172 -102 20 -118 -405 -237 87 74 27 -114 -339 -354 194 2 -208 242 155 38 -187 26 78 -78 387 412
6194 412 82 332 362 -31 636 294 216 131 119 126 30 215 107 -108 450 216 241 -109 -244 -12 -134 60 -101
6217 -101 -104 345 144 -512 -353 195 -290 -66 -345 -435 -364 -89 -423 -207 -194 -39 -397 250 -28 -185 443 204
6239 204 197 224 9 -405 31 258 327 169 301 -158 202 230 -32 -99 107 371 421 398 -198 -175 172 382 215
6262 215 -223 127 -127 33 342 151 -259 -172 318 -162 -342 -276 -405 -97 -188 -301 -549 22 -453 -466 -149
6283 -149 -277 -282 -331 369 -2 -446 6 -90 -191 123 49 -121 -179 -125 -72 109 335 106 219 293 -169 -141 47
6306 47 129 142 -13 381 -77 201 130 49 170 295 229 34 -40 143 -12 136 -29 -435 476 351 179 177 -118
6329 -118 -274 40 296 -178 -136 -266 -30 -104 -7 -112 -232 -93 272 -28 -124 106 -84 -354 46 65 -314 -138
6351 -138 40 139 12 96 -75 127 207 60 33 372 26 23 632 221 55 128 63 90 60 59 -32 136 354 39
6375 39 -42 52 -56 89 166 -57 -196 -48 72 -133 -245 -248 52 -9 -140 -367 -472 -42 -243 -123 -57 -294 -219
6398 -219 -251 -237 -136 -155 -73 69 -241 -78 -127 -113 320 -188 -14 -216 146 338 54 256 50 401 474 246
6420 246 -31 -80 3 351 293 436 14 -6 195 193 423 423 203 -344 219 -141 35 -41 61 -52 30 190 -350
6443 -350 -53 -129 119 -143 -200 -180 -335 163 -242 -370 -601 45 87 75 -218 -213 -470 110 189 -222 -115 -31 81
6466 81 -325 372 -7 -124 332 155 24 397 42 343 336 239 163 -11 172 27 276 216 122 122 107 239 82
6489 82 46 22 -33 415 241 -89 93 -44 -348 -260 -93 -256 -236 303 -418 -267 -112 128 -25 -170 16 -153
6511 -153 -322 -119 -126 -261 156 153 35 28 256 -187 -285 150 141 75 -161 -94 141 145 42 8 107 41 147 -186 -54
6536 -54 96 395 397 146 47 -365 259 -22 418 375 127 -21 352 12 -13 -84 -99 -21 332 -406 -217 -34 213
6559 213 -148 -182 -68 -334 -116 130 -207 1 -143 -105 43 50 29 -397 176 -24 214 26 -128 -517 238 269
6581 269 -88 151 264 152 10 131 138 -60 221 296 255 416 115 -32 229 135 153 58 310 406 -167 -67 457
6604 457 -186 -8 219 87 -60 31 204 -366 -144 -270 -118 -75 102 -310 -201 -244 -142 19 -84 -95 -150 71
6626 71 25 -299 -105 -68 -452 329 -35 -411 -109 -252 -47 160 13 -75 38 501 408 -6 -317 303 419 405
6648 405 359 87 -330 59 246 37 116 253 -243 159 339 -79 -322 -37 -171 -68 216 5 -284 76 370
6669 370 25 -121 -131 -134 -204 -176 -287 -110 -272 -32 -92 179 -62 -434 -90 33 -72 151 -42 -22 -242 -116
6691 -116 -4 199 -145 159 97 300 205 75 265 103 215 528 514 89 30 67 178 132 185 -96 -271 237
6713 237 325 -38 -61 -211 146 -10 89 -92 -59 457 -66 -20 149 -221 -283 -1 194 -407 -311 -391 -262 94 -167
6736 -167 -425 -419 79 231 -107 -223 -378 -117 63 80 -140 -327 163 10 258 294 250 95 49 52 78 177 81 3
6760 3 150 465 193 85 -37 302 32 302 225 -14 40 207 52 174 -103 234 -17 -103 -117 -63 -62 -73 -176
6783 -176 170 -27 -158 -27 -491 -213 -169 -342 -44 -347 47 -254 -202 -154 -176 -278 180 245 -220 -41 -297 138
6805 138 246 131 110 -187 -92 68 43 434 -92 -162 -120 213 560 -183 34 61 215 330 196 -50 20 8 17
6828 17 23 -162 -8 29 68 -13 -387 -173 43 131 -140 -138 -290 -288 187 94 -429 -228 -413 -260 -154 136 -215 -254
6852 -254 117 -67 -184 -367 -215 -345 -84 79 -65 96 -44 37 248 315 -29 -129 309 290 -47 406 85
6873 85 62 70 54 63 315 352 4 -105 109 41 237 408 123 125 61 71 202 37 -292 -208 53 55 -87 -75 28 243
6899 243 -75 -73 -281 -294 -67 -187 -380 -182 -277 -259 -153 62 -137 -255 -89 110 25 86 -44 -69 26 55 -65
6922 -65 40 69 281 455 331 -119 -73 117 292 136 40 120 105 429 222 69 -263 -17 108 189 217 -178 14
6945 14 54 218 -97 -230 -516 -245 53 -190 -23 -358 -270 -179 -306 22 -53 -82 -249 114 -362 -92 27 -384
6967 -384 -274 133 -236 -59 50 -5 139 275 113 147 49 56 17 -192 -239 160 140 195 531 -122 132 149 -38
6990 -38 373 348 -25 43 150 -3 282 230 25 -344 -31 -13 -103 -383 -196 -206 21 298 -512 5 -171 -163 176
7013 176 -109 72 -172 -157 -22 27 -285 -53 -426 122 64 171 -400 -275 160 -83 156 -10 -91 103 109 -5
7035 -5 -58 217 -32 199 422 -73 -16 202 74 201 332 204 194 267 -82 303 192 92 154 202 124 -1 -107
7058 -107 -168 -144 -62 -156 70 -15 18 -198 -131 -178 86 -141 -266 138 -269 24 -12 -149 -67 -85 321 -181 -510 87
7082 87 -193 1 220 -102 -185 -178 277 -176 -402 192 15 56 205 228 211 109 163 52 170 -36 -49 -116 299
7105 299 35 -105 87 -120 -27 278 97 -405 13 -105 119 -53 -174 -174 -386 118 25 -274 -203 -219 -304 31
7127 31 -162 -300 -73 -326 -170 -231 12 -331 -321 -82 -147 65 -8 -108 -2 7 135 1 82 312 -67 -46 55
7150 55 -118 56 301 124 251 333 37 115 109 187 81 212 9 103 174 150 -23 -230 133 89 -279 -58 55
7173 55 192 -231 -141 -51 -84 144 -70 -199 -36 -156 -310 -165 -32 -299 -48 128 -185 -286 97 -92 230
7194 230 267 -543 -542 195 340 -76 -51 195 227 301 73 357 -158 -84 221 272 81 -113 -119 -113 218 -162 -137 -48 -39
7219 -39 297 124 -159 -57 87 33 -51 -71 -52 -434 -79 81 -196 -331 -419 57 186 4 -339 -225 42 -70
7241 -70 -185 -43 -346 -136 -273 -195 -45 93 -301 41 -253 -203 -386 67 52 203 70 -220 240 46 52 141
7263 141 -61 -182 313 281 227 -86 -11 233 294 378 15 -5 187 40 -216 60 -12 -194 133 -5 189 -97
7285 -97 -264 -383 -84 23 -47 -47 51 40 -238 -210 -15 16 -75 -220 -134 -18 -74 -22 -218 -104 -140 -133 517 -92 -383
7310 -383 -130 46 98 -15 -168 -33 131 176 270 -83 89 187 293 256 -49 73 47 495 105 -44 251 -32
7332 -32 296 268 21 -50 -81 -18 -200 197 -85 159 75 -171 216 -437 -184 -281 -193 -146 -264 -467 -2 -135 -301
7355 -301 14 -138 -236 -87 -126 -149 -84 29 275 -155 267 189 -257 -137 45 115 -46 348 373 -81 158 172 300
7378 300 264 183 -10 58 309 34 158 -24 32 -56 232 316 149 -33 119 52 -160 -154 -110 -384 -87 -305 -173
7401 -173 -227 -239 -153 6 -163 -89 -495 112 -208 -39 69 -247 -388 342 -81 -287 -140 -227 -41 139 197 122
7423 122 263 375 -98 -71 43 -183 211 100 194 48 175 -1 35 40 57 341 18 244 5 228 469 226
7445 226 18 258 285 -95 139 -263 -45 -138 -14 -50 -227 -215 130 57 118 168 -57 164 -126 -348 -349 139 -392
7468 -392 -255 205 -159 -173 33 38 -356 381 217 -262 107 63 -296 -28 92 99 26 -38 308 152 359 43 -178
7491 -178 327 126 93 -75 -50 109 55 262 44 -150 86 361 115 108 1 -47 -26 207 -30 -275 -219 -275 199
7514 199 202 -206 -145 177 58 -9 -336 -164 -233 -182 -123 38 -421 -321 80 -185 42 -235 -348 81 136 -213 -91
7537 -91 -18 47 170 143 169 78 84 230 113 206 410 209 194 73 120 107 187 179 7 -16 -98 -143 190 101 31 26 -199
7564 -199 -92 -2 117 -4 -266 59 102 159 -19 0 -99 115 -67 279 0 -88 -410 -178 -403 -336 -198 -123 -128
7587 -128 -509 235 103 132 -47 44 -34 -272 -69 166 59 -152 14 336 263 378 -148 105 143 20 162 52
7609 52 -86 54 302 65 -66 43 196 -102 -203 215 -300 -210 -23 3 147 -69 19 254 328 -94 -194 -380
7631 -380 -177 56 10 -25 -250 -268 -239 -243 69 -172 -132 -240 -117 169 -144 -169 -267 -71 -170 242 -159 -59 347
7654 347 194 137 -76 -49 -218 -7 239 -150 -128 10 -28 32 225 -242 -275 5 -76 145 -155 77 -42 173
7676 173 -37 32 -43 -118 -35 -24 -228 -179 -214 -199 -100 -154 -94 -111 -288 -268 -109 41 45 82 -107 -14 238 251 -438 -63
7702 -63 -228 87 -29 244 221 -300 47 82 157 -150 24 134 249 397 506 -41 139 15 386 146 79 219
7724 219 326 296 64 -157 -119 167 219 104 91 -25 72 -240 -338 187 44 -60 -364 280 -346 -347 -158 -258 164
7747 164 284 -91 -204 -124 -172 84 37 -32 -142 98 174 -75 266 -62 -306 345 40 47 96 8 -507 30 206
7770 206 181 34 83 -86 85 147 80 -80 25 60 -191 -89 15 -49 -2 87 180 202 -269 -275 -11 -85 67 -141
7794 -141 -225 -227 59 -57 73 -156 -183 -261 -22 44 -148 -364 -176 -58 -52 -8 -434 -13 -79 -210 -245 235 -61 -79
7818 -79 323 97 -346 -251 213 59 249 158 97 98 246 213 33 465 289 -94 -129 116 180 157 355 -198 -9
7841 -9 -2 -102 12 349 -74 -109 7 -224 -342 156 -97 -15 -43 -42 -374 -312 -130 -74 -46 15 -336 -154 166 -74
7865 -74 -198 55 146 32 -51 -25 -35 117 200 118 -27 -9 26 240 193 11 70 108 572 -47 12 182 -7 -122
7889 -122 71 475 301 81 -184 169 227 127 -57 -336 -36 -63 -79 -2 -378 -231 26 188 289 -233 4
7910 4 -233 -110 -174 -514 -374 -7 223 79 -317 -412 -110 -67 -106 -168 -139 90 -219 71 52 107 39 116 244 64
7934 64 -36 311 207 -106 267 -265 183 173 72 172 175 98 38 282 140 -132 66 138 76 90 232 -87 -44
7957 -44 -60 64 -1 103 -96 81 -118 -369 -399 4 218 92 -21 -296 19 48 -90 -188 -193 55 81 159 -199
7980 -199 -164 -347 18 298 107 68 24 198 192 12 8 -121 148 493 45 77 193 62 266 268 473 -166 -62
8003 -62 73 80 68 231 -170 155 49 157 -156 36 -189 195 313 85 107 -195 68 -353 -17 -83 -408 -149
8025 -149 20 212 -275 -10 -15 -22 -24 21 -227 -216 185 -149 -133 230 -16 -16 141 -49 84 34 67 321 134 34
8049 34 -107 352 491 65 -71 335 -58 -6 52 -1 216 133 380 -131 -329 -236 -160 -69 32 63 -34 -248 143
8072 143 -153 4 -128 -131 -33 295 -215 -10 130 -80 26 -583 -354 -222 -39 79 96 152 -179 -27 16 166
8094 166 -269 20 307 145 127 92 -121 -206 289 43 -113 -6 351 96 314 104 -80 43 230 145 19
8115 19 80 125 36 -74 -58 47 23 -143 79 -84 15 -169 70 136 17 -268 323 -39 -241 -145 166 -311 -315 -137
8139 -137 -237 -121 -109 -96 -239 -49 -139 -48 -107 20 -75 -136 176 5 -183 225 -280 156 74 78 62 272 -101 -33
8163 -33 146 78 -96 -2 318 346 240 -83 80 -30 180 -43 162 171 -97 -143 -260 -270 -80 -264 129 -102 -238
8186 -238 -391 -169 -146 -155 96
8191I6
$$ Imaginary data points
##PAGE= N=2
##DATA TABLE= (X++(I..I)), XYDATA
0 0 0 0 0 0 0 0 0 1 -8 8 -8 8 -16 16 -17 24 -25 32 -40 45 -53 60 -70 81 -93 107 -122 139 -156 175 -198 223
32 223 -249 279 -310 346 -384 427 -474 525 -580 644 -712 790 -873 971 -1080 1203 -1346 1513
50 1513 -1711 1948 -2244 2619 -3117 3806 -4836 6537 -9853 18793 -94636 -281391 -136084
63 -136084 -3873 8285 -64115 -83786 -68166 -53106 -97460 -140571 -123449 -57778 -20721 -17201
75 -17201 -55735 -108779 -119150 -68112 -23453 1639 7643 -28828 -75880 -54523 -1911 8546
87 8546 -7008 -4592 7047 18000 6499 -35489 -51910 15 60664 69767 27332 -38364 -63230
100 -63230 -10095 37390 7562 -20427 16519 39394 -6886 -62828 -62552 -11326 27902 6095
112 6095 -29360 -20673 -14753 -52058 -71344 -36627 3190 17206 -728 -52422 -80417 -43345 -5544
125 -5544 -10076 -8528 10974 4794 -24567 -41601 -33576 -6349 16132 19936 31843 42499 3723
138 3723 -45383 -25640 34252 64773 64248 38620 -5684 -12813 25402 42188 19479 13300 45205
151 45205 79491 64435 -11207 -63520 -11689 74007 82468 31927 -7913 -19022 -3907 14406
163 14406 4301 -5977 18946 36328 12754 -16411 -27709 -27889 -8333 23567 39593 29712 -10076
176 -10076 -60854 -51931 20646 54873 17291 -11850 -3675 1429 -7733 -20140 -24983 2518 46404
189 46404 47965 1674 -43600 -51559 -13162 37782 40403 4135 -9118 -9253 -28792 -35255 -9347
202 -9347 10706 14673 14111 -2987 -27103 -29892 -24529 -19539 6125 34945 27471 -9429 -45819 -49934
216 -49934 -6163 37706 22515 -9658 -580 10834 -12515 -30286 -17439 7379 28455 29397 3180
229 3180 -20035 -23241 -21268 -5234 24114 30334 6840 -14962 -32009 -35821 -7188 19057 6258
242 6258 -7033 5864 4933 -21487 -39911 -32124 2511 40352 36537 -6641 -33490 -26378 -5997
255 -5997 16991 23917 10539 11619 24421 5043 -23086 -7481 26246 34046 28194 24303 13026
268 13026 373 -7920 -4646 24462 51564 35603 414 -10204 -5566 1757 16034 17522 6925
281 6925 13094 19906 -6094 -31254 -20237 3204 16386 17595 2347 -18188 -26195 -27888 -18093
294 -18093 11057 25071 1102 -21661 -21384 -19349 -14648 -3164 -2389 -862 18630 19502 -20440 -51607
308 -51607 -34913 12065 46024 31634 -14097 -28309 -5338 3401 -5392 296 14110 21630 26748
321 26748 10563 -22568 -27579 529 23804 31607 27061 2043 -22035 -18471 2960 22205 25415
334 25415 4852 -11110 6246 16986 -12682 -32634 -5773 28661 34283 7936 -34261 -50414
346 -50414 -17116 18214 15381 -4507 -13057 -9248 -4408 -17829 -39336 -24214 18220 26963 -913
359 -913 -21396 -27399 -25764 -8461 8937 9683 7668 4715 -9834 -18687 -9030 2309 12471 21117
373 21117 15257 1904 -3765 -9814 -8958 18852 42096 23032 -3822 -4266 808 -2228 -1819 6487
387 6487 22874 35936 17309 -21325 -31808 -9004 14243 23516 12068 -9522 -8172 8454 -4032
400 -4032 -30692 -20894 11779 25117 12969 -12616 -31800 -21483 4107 12207 5990 -1781 -10495
413 -10495 -9811 -30 -3927 -13369 -1881 14008 13556 7078 -5463 -27352 -24158 13070 37238 22091
427 22091 -8267 -22222 -7622 14504 8214 -12726 -3736 24730 27087 3541 -22307 -30792 -3366
440 -3366 37144 35511 377 -15716 -6438 881 591 -2436 -1144 13012 19783 2193 -17253 -21096
454 -21096 -18026 -3822 18070 15860 -8871 -21130 -17974 -15366 -7274 1370 -4387 -9401 -3937 -6616
468 -6616 -20567 -26845 -18249 3859 20580 2935 -30775 -30669 -5834 4600 3817 6230 6112 7510
482 7510 7473 -7369 -20520 -1684 29709 38005 23325 2225 -7111 4281 16775 14132 16144 29518
496 29518 27012 10999 4907 2231 785 15684 31555 25198 9415 -2540 -10148 -4614 10401
509 10401 14545 8278 3337 -3646 -8199 -5522 -9446 -15754 1112 21220 9056 -17690 -25934 -17186
523 -17186 -1693 10013 4495 -6473 -3209 2431 -4506 -11809 -9970 1414 19311 22267 -578
536 -578 -15118 -2690 7119 7185 12875 16901 10891 5650 2846 -2110 544 10808 15115 15449 13055
551 13055 343 -9105 -3442 2884 6246 13875 9639 -8442 -13337 -4704 -5507 -9046 -1188 5840 3402
566 3402 -6289 -21412 -27029 -11047 3626 2396 -2137 -8068 -17264 -17178 -13115 -17159 -12779 6723 10249
581 10249 -7496 -19334 -17395 -12232 -3052 4268 4824 5249 2007 -9366 -11429 -335 5789 7624
595 7624 13850 9933 -1190 -1671 690 -2181 6131 22438 21130 5635 -4363 -5911 1123 11245
609 11245 11223 7678 10553 6695 -7441 -9671 -3871 -1832 3597 9404 -97 -13333 -13657 -12199 -11510
624 -11510 -1498 6626 -152 -12301 -20055 -19169 -6627 1237 -6724 -8237 2526 405 -14378 -19592
638 -19592 -13525 -1641 15005 17136 -1968 -14527 -7040 2137 5659 5597 4445 8487 14767 6996
652 6996 -5551 -2641 5863 8915 16018 17811 2646 -8311 -1356 7029 10558 12813 7585 452
666 452 1953 3688 -1334 -2796 1982 8238 15650 11445 -9669 -17997 -1218 11551 8476 4845 2158
681 2158 -2108 -1678 -2370 -8388 -4357 8575 11905 4348 -4844 -11783 -8238 3819 4936 -1564 2899
696 2899 6220 -3930 -9939 -5630 -2684 2543 10225 7298 -3765 -7972 -6613 -1000 7923 8694 1615
711 1615 2818 7303 2428 -742 1381 1700 9401 21920 14957 -7332 -12295 2129 14982 16342
725 16342 5508 -5381 122 11248 5505 -6859 -8185 194 12416 16737 -1777 -25216 -18991
738 -18991 3626 10758 2457 -7164 -14328 -10735 -1013 -3497 -13216 -12888 -4017 5136 6829 -8674 -26122
753 -26122 -17643 6091 13649 4796 -6957 -16029 -9868 6971 8072 -6378 -9722 2329 11385 7341
767 7341 -7736 -17985 -4589 17024 17128 2426 -7647 -10145 -3635 8247 6977 -4862 -3623
780 -3623 6269 4761 -4381 -9296 -9745 -1200 8469 5880 -3802 -8649 -10535 -8542 -432 973 -7187
795 -7187 -5784 -111 -5588 -12305 -9087 -5445 -3310 116 -4128 -13433 -12120 -6184 -4335 -3636 -4676
810 -4676 -6058 -1399 -100 -11300 -16358 -2301 9209 6586 -7 -7585 -10226 41 9285 3929
824 3929 -2037 2812 10265 12385 5443 -8336 -8181 9864 20501 12721 2596 -2595 -2625 8283 16822
839 16822 6777 -4346 553 10099 11079 3310 -8703 -10965 4421 15162 6702 -7763 -15383 -11596
853 -11596 4401 13467 -1211 -16354 -9277 3074 2422 -4838 -12246 -11246 2677 12355 2693 -11606
867 -11606 -14470 -6311 6994 13579 2159 -8180 -2355 5523 4440 3283 2438 -471 5776 14382
881 14382 9703 -1698 -3347 2382 10229 14637 7570 -3214 -2048 3608 5206 7100 6441 197 190
896 190 5964 2221 -5025 -2562 1949 1835 3527 2209 -4061 -6820 -5879 -4629 1096 5081 -2000 -8395
912 -8395 -5636 -4461 -4917 -996 -2482 -8084 -3892 3088 -1192 -8065 -8201 -4601 1915 5387 -1133 -9303
928 -9303 -7256 -2050 2358 6365 2512 -6707 -3532 5451 4274 -1005 -691 735 4084 10091 7195
943 7195 -3404 -5710 1309 8844 12714 6889 -4350 -3076 6648 6802 1586 278 -1410 -1145 5640
958 5640 5398 -5093 -8850 -2553 2514 3925 699 -7936 -10624 -4317 -563 -1144 -2134 -7314 -11009 -3119
974 -3119 2805 -4463 -10029 -6073 -2056 1792 3630 -2700 -10259 -5061 4573 8125 6303 -711 -5053
989 -5053 2804 11123 7222 1357 1802 2285 6495 13937 8689 -3358 -2041 8633 13564 10847 2559
1004 2559 -5409 -434 11010 11368 2763 -3499 -5209 1072 10469 4546 -10658 -10147 2253 7148 2715
1019 2715 -5441 -13294 -9690 3160 6083 -3054 -9922 -9872 -3519 4529 502 -11368 -11252 -709 2834
1034 2834 551 -2961 -10057 -9185 2419 7382 -1164 -6983 -5025 235 6117 4090 -3712 -4540 2493
1049 2493 4218 2648 2068 -1936 -2303 5845 8122 247 -1700 2665 2601 2091 3742 1988 1343 2359
1065 2359 507 -1015 2294 2592 -945 -123 -448 -2848 -8 2967 -4490 -9303 -2920 495 -1666 -3967
1081 -3967 -8013 -9616 -2829 1579 -3078 -8965 -10105 -6891 1310 4453 -6562 -13903 -4962 4529 3797
1096 3797 -1479 -7903 -9145 2260 11854 4589 -7128 -7345 2117 12317 12409 -1458 -9438 1549
1110 1549 13312 12128 4466 -3775 -4950 6682 16393 6550 -8062 -6813 4277 11109 8600 -4229
1124 -4229 -12127 -3477 8256 7244 -1226 -9279 -10088 1047 9815 576 -12916 -9886 418 4626
1138 4626 2371 -6176 -12483 -4918 6281 5167 -3535 -7743 -6101 2500 8386 1596 -5851 -1019 5722
1153 5722 4540 3215 741 -2450 1969 9527 7424 1785 1900 3388 5037 7578 5885 3437 7413
1168 7413 8580 4193 4422 7126 5244 5492 8402 5513 1757 6060 7127 2757 1353 3848 4962
1183 4962 6185 3247 -4073 -3295 4125 6129 2517 -1069 -5631 -4986 3753 3824 -6066 -8316 -907 3895
1199 3895 2558 -3677 -10584 -7962 3698 7661 574 -5534 -6942 -1720 7818 7172 -3832 -5536 4304
1214 4304 9083 7123 2658 -3972 -2161 9779 15001 6473 -1650 -2852 3260 11889 10896 -355 -4049
1229 -4049 4085 8325 5925 1192 -4702 -4156 6622 10222 -434 -8491 -6814 -692 3876 3264 -5088
1244 -5088 -8689 -3998 -1419 -3062 -3590 -6290 -6855 -367 2592 -4999 -9210 -5826 -3338 -581 3015
1259 3015 -937 -6783 -5132 -1821 -1190 -477 -1748 -3456 367 2855 -2233 -4279 -558 -265 300 4461
1275 4461 3133 -2363 -2262 -153 -835 2039 4374 1206 -1526 -1007 -2205 -524 1596 -807 -2706 2626
1291 2626 3274 -3509 -5569 -3493 -2381 1381 3548 -1818 -7334 -5802 -3630 -3085 -1844 -3341 -5662
1306 -5662 -2946 -2545 -6687 -6727 -4455 -5000 -3077 1527 -2689 -9099 -7102 -2488 -624 1644 -256 -5085
1322 -5085 -4117 -669 -697 -414 1335 762 2350 4921 903 -4161 -502 4490 4444 6036 6691 1286 -1990
1339 -1990 1244 3678 4799 6756 3722 128 2404 2576 -195 80 1177 605 3956 5065 -3474 -8709
1355 -8709 -3481 2023 2604 1735 -2511 -6829 -4036 -947 -2575 -3155 -2553 -2328 295 1838 -4668 -9454
1371 -9454 -4199 1272 2609 2862 -1124 -7405 -4069 4125 4552 569 -1029 -263 3796 5971 156 -4817
1387 -4817 846 7791 7814 4544 -718 -5120 738 9116 6770 856 1395 4044 3625 2656 -764 -2665
1403 -2665 2750 7506 4889 1227 -2577 -6181 -1677 4926 2894 -2289 -1011 -465 -2735 -2014 -3259
1418 -3259 -4793 -436 4690 268 -5620 -7511 -6323 -506 3819 -1159 -6064 -2432 99 -3683 -4602
1433 -4602 -2023 531 4317 5149 -2678 -7750 -2624 4362 6007 5048 1138 -1002 3198 3129 -1413 -345
1449 -345 5412 7155 7062 4871 -2038 -6084 1006 7546 6108 2957 63 -1622 1152 2372 -2103 -3941
1465 -3941 398 3135 2434 -1296 -9210 -10672 269 6152 234 -6667 -7091 -5572 -1909 -595 -5430
1480 -5430 -5963 641 3446 -1926 -7218 -9386 -5067 5658 7926 -371 -4552 -1910 -476 288 1919
1495 1919 6 805 6041 6295 670 -3098 -1633 2797 9109 9177 1010 -2650 1281 3562 4174 4754
1511 4754 1604 293 5185 5707 -2854 -5689 71 5890 7671 2881 -5908 -7187 -453 2138 -226
1526 -226 -1245 -947 -228 1802 -2024 -10186 -8167 1719 4442 1164 -3776 -8099 -8223 -2641 324 -1602
1542 -1602 -995 9 -692 -485 -2954 -7654 -4935 4983 6878 2365 -1913 -5250 -4350 2980 6732 1532
1558 1532 -1030 1646 3482 2649 -202 -3682 1053 9340 7678 -1339 -4669 -2992 1035 6528 5614
1573 5614 -1204 -2801 651 -1608 -5729 -4326 -1537 2087 3282 -1233 -8119 -7834 -5692 -4757 -874
1588 -874 1250 -3147 -6326 -5132 -6290 -7414 -4003 -1272 -1494 -430 -2083 -6952 -7247 -2391 928 3068
1604 3068 1826 -3184 -3520 137 -499 -2562 2209 7673 5715 1947 -1821 -4646 174 7399 6875 3459
1620 3459 2846 2234 626 345 -876 163 6318 8311 1662 -2933 -2580 -2943 -69 4709 4196 -466
1636 -466 -2101 -3309 -4066 -1189 89 -1341 361 1907 -1797 -5816 -6784 -5780 -181 6935 3340 -4894
1652 -4894 -5952 -2393 -1478 -7 926 803 2597 3934 -961 -5021 -1803 1791 4966 7580 5362 144
1668 144 -222 1168 1360 5554 9875 6301 922 1887 3717 3484 3818 3673 4334 7939 6816 -1452 -4603
1685 -4603 -427 4090 7799 6777 -251 -4811 -1428 297 -2262 -245 2133 1188 521 -1377 -5657
1700 -5657 -6315 -3604 -930 2223 3912 -1235 -8123 -6409 -1772 1378 3089 1680 -2621 -1464 2272
1715 2272 -1261 -4447 -589 5787 8213 5378 -2333 -6497 -611 5771 5810 5393 5050 1436 -239 546
1731 546 -609 246 5946 8245 4566 1465 -1118 -3975 -2392 2465 4686 4958 2898 -3300 -5508 -1168
1747 -1168 42 -1264 1275 1717 -1802 -3770 -4382 -5239 -1681 3132 1050 -3363 -3511 -3866 -4922 -3275
1763 -3275 -1478 798 3938 58 -8783 -9571 -1878 2909 2927 1962 -1087 -2212 712 -1363 -5305 -2483
1779 -2483 4496 8430 6329 -88 -7030 -4630 3424 6399 4726 3574 533 -1462 1349 2152 -1422
1794 -1422 -1283 3944 6155 5199 -239 -7369 -6741 2875 8406 4533 -2493 -7219 -5430 1569 2436 -4698
1810 -4698 -5613 1178 4483 39 -6609 -9997 -6041 4002 6544 -82 -5670 -5862 -4103 186 1410
1825 1410 -1406 -1167 2320 1776 -1715 -2504 -2915 -1505 5339 8875 3718 -2519 -4017 -1641 4588 7890
1841 7890 4225 853 3070 3248 -134 -1097 -95 3602 9173 7937 -1035 -5219 -862 2243 2558 3786
1857 3786 3188 1900 700 -4198 -7284 -1363 5452 4878 902 -2957 -6030 -4144 -653 -1710 -2203 2744
1873 2744 3870 -1369 -6241 -7443 -5355 1093 5348 3734 -349 -2808 -4799 -3021 2555 3071 -29
1888 -29 668 2630 2092 616 -1526 -2777 3189 10723 8051 -1744 -6129 -2388 5711 10883 5085 -2253
1904 -2253 -56 5102 3490 -1265 -2644 207 6569 10172 2766 -7036 -7159 -1851 2732 5320 2715
1919 2715 -2284 -3179 -1755 -2144 -2263 -2458 -3236 -832 3547 529 -7851 -9923 -4514 1679 5144 813
1935 813 -7272 -8082 -1453 1383 -1034 -2063 -790 1983 3435 -1756 -6946 -3043 3981 5016 3494
1950 3494 2057 -1266 -2728 -791 622 2674 6029 4702 -450 -2083 -610 14 988 2012 2138 3680
1966 3680 3259 -3480 -7627 -3305 2279 3305 2192 -445 -4378 -5056 -4431 -4101 -702 2775 658 -3653
1982 -3653 -4254 -4723 -4732 -3063 -1927 -1024 2631 1508 -6735 -9908 -3726 3090 4568 1660 -3699 -4527 -424
1999 -424 593 -1950 -432 2873 4018 3085 97 -4208 -2901 3425 5269 4372 4457 1193 -3059 -2102
2015 -2102 2486 4985 4942 2567 -125 829 2888 -389 -3885 200 5317 6269 2832 -4131 -7976 -2433
2031 -2433 4496 3458 -369 -888 -1455 -2793 -3332 -4115 -2822 1064 2011 -974 -1675 -3099 -6532 -5290
2047 -5290 783 3967 3389 -301 -5875 -6892 149 4691 1930 -1069 558 2031 2228 -1337 -5048
2062 -5048 -1054 7476 8686 2812 -1615 -3287 -1244 3709 5673 3419 2181 2572 -131 -831 470
2077 470 260 572 2634 3147 1753 -1288 -5152 -5685 1491 6402 2430 -3634 -5446 -4157 -1324 354
2093 354 -2324 -3306 381 1682 -3235 -7159 -6493 -2579 2289 3449 -1210 -3909 -3082 -3948 -3819 48
2109 48 2652 1910 701 -1341 -3137 -2072 479 487 2152 4706 2919 -741 -2342 -2331 571 5327 5363
2126 5363 1747 1086 1207 -1477 -1118 2227 4292 3275 2072 -768 -1598 798 479 -1578 619 3912
2142 3912 2951 -1427 -5283 -6267 -163 6197 3430 -3722 -5286 -2440 -1221 -1050 -2604 -2378 1898 4116
2158 4116 -855 -6467 -6935 -3465 1828 5898 3414 -1806 -3358 -2833 -1670 1669 3512 1501 1161 4093
2174 4093 3608 -949 -3049 -1312 4803 10004 6369 -2232 -4205 977 5372 5989 2679 -1112 465
2189 465 4501 2247 -3335 -2232 2945 5281 4475 -809 -5723 -4068 244 1535 1607 1255 -1690 -3417
2205 -3417 -2837 -2829 -3327 -1296 485 27 -154 -1091 -5425 -6043 -1370 2087 2084 38 -3073 -3566 -702 -373
2223 -373 -2372 236 3726 2572 -988 -3197 -3195 450 4386 3090 -74 925 2033 42 -2164 -1711
2239 -1711 2036 6433 5784 -865 -4454 -1777 844 1277 2193 1385 236 835 -330 -3664 -3567 -419 1155
2256 1155 1955 1380 -2508 -5506 -4641 -2064 500 1779 -1033 -5542 -3504 -502 -2118 -4663 -3828 -553
2272 -553 2379 1192 -4798 -8656 -3402 3248 3829 60 -3345 -4226 -259 1844 -590 -1418 2428 3774
2288 3774 1689 -537 -2540 -2447 1638 5701 4939 2708 -121 -3002 -1940 2376 3787 2573 2130 1282
2304 1282 191 128 -2059 -4181 553 5504 3962 -1619 -4432 -4033 -1173 1574 -49 -1519 -53 39
2320 39 -3000 -4171 -3054 -769 1541 1533 -2151 -3547 -1672 -1471 -2372 362 2372 1793 13 -2173 -3340
2337 -3340 -367 2729 2152 1859 2963 1779 -206 -321 276 1794 5029 5078 1861 756 2214 325
2353 325 776 2926 4913 4934 3036 -561 -2100 1641 3773 2178 1605 2463 1403 365 -781 -2012
2369 -2012 -221 3850 3681 -389 -2291 -2200 -1911 200 848 944 1194 696 -2305 -3488 -974 -27 241 1687
2387 1687 1524 -99 -993 -2024 -2395 1034 4592 3410 494 -500 -624 611 2405 1954 1739 4115 3576
2404 3576 398 -981 404 1905 3861 5068 2905 690 15 -804 -536 2500 4009 2857 723 -474
2420 -474 -1350 -874 43 -745 368 3058 1520 -2997 -4719 -3465 -1059 1318 655 -2310 -3130 -1741 -2720
2437 -2720 -2911 -2115 -1058 -89 625 -2381 -4863 -2818 2 382 821 1130 -1023 -2350 -1605 -1251 -56
2454 -56 1808 2127 789 858 43 -2174 -1552 1093 2614 3730 2370 -1051 -2140 946 1913 370 820
2471 820 1937 1145 53 -1636 -3382 -357 3225 1791 -857 -2397 -3255 -1913 -283 -540 -1344 476
2487 476 1038 -2434 -4989 -3894 -2930 -89 1907 548 -2164 -3259 -3675 -3230 -557 352 -407 -217 934
2504 934 -594 -2119 -1670 -1481 911 4089 2310 -1385 -2291 248 2609 2865 1299 -583 1711 3253
2520 3253 1224 -1156 -138 2220 4142 3724 126 -2974 -581 2324 2046 1119 952 230 -76 -591 -2314
2537 -2314 -2134 525 1641 759 178 -1547 -4221 -3379 -237 216 -48 -332 -1985 -2569 -1298 -1865 -2456
2554 -2456 -570 1707 918 -534 -2768 -3124 202 2931 1435 -949 -181 119 358 118 -313 306 3489
2571 3489 4628 928 -1514 -1025 1090 2998 3869 1376 159 1504 1304 -933 56 1004 1385 2630
2587 2630 2880 -601 -2863 -1905 -31 1917 2500 -256 -3221 -1461 88 -718 -1311 -1561 -1059 731 769
2604 769 -3477 -5808 -2270 1256 1652 -103 -2901 -3821 -1163 753 -975 -1213 136 828 578 -423
2620 -423 -2177 -2407 1199 3001 1965 1307 136 -1300 -64 2076 2111 1472 1740 1147 1230 1509 248 -767
2638 -767 1666 3571 2544 1061 -823 -1721 651 2584 1130 -777 319 727 -658 -1456 -1471 -691 982
2655 982 1103 -1584 -2489 -1650 -1679 -1693 -107 -423 -821 -233 -1375 -3474 -1872 376 446 640 407 -1195 -1771
2674 -1771 -369 1 357 1837 1518 679 907 370 -946 255 2544 2943 2536 1796 -436 -932 1761
2691 1761 2995 1795 1091 1172 1265 1842 825 -1384 -241 2861 2604 393 -518 -2083 -1757 1206 1520
2708 1520 -522 -848 -975 -1276 -1346 -876 -1562 -1547 411 10 -1283 -1936 -2969 -2951 290 1751 -353 -2238
2726 -2238 -1971 -2010 -519 862 -135 -1061 483 1011 -96 -564 -867 -520 2300 3376 920 -755 -446
2743 -446 -266 946 2265 2015 308 533 1042 396 317 396 -263 880 2250 1007 -947 -1397 -1718 -359
2761 -359 1620 378 -2176 -2269 -1148 -1599 -1332 -1188 -2055 -1716 -344 -1281 -2846 -3001 -2001 -1611 -117 -501
2779 -501 -2715 -2587 -2119 -1923 -808 414 -820 -1829 -623 -215 -1364 -1086 -283 13 1413 1772 -582
2796 -582 -1171 64 681 1376 1994 603 -270 500 908 -112 458 1768 594 492 795 -365 -454 239
2814 239 -72 99 1396 498 -1406 -1803 -1492 -1124 456 771 -1231 -2490 -895 -596 -1506 -1410 -1517 -1188
2832 -1188 203 89 -1708 -2204 -1614 -777 1212 1333 -915 -2493 -471 1109 1037 1157 74 -773 1634
2849 1634 2803 771 -880 -35 1376 3537 3562 273 -1288 1297 2999 2973 2098 975 -15 1806 3124
2866 3124 858 -811 676 1962 2517 1752 -284 -2313 -412 1965 1558 535 -618 -1623 -353 1255
2882 1255 -335 -2024 -836 190 454 345 -1201 -2684 -984 1148 648 -294 -1158 -1786 -287 1001
2898 1001 174 -826 572 1271 382 368 661 -17 907 2249 1312 528 1128 614 690 1574 1753 1718 1969 1493
2918 1493 -91 387 1308 988 926 1798 521 -281 1012 722 -816 -469 30 154 158 -395 -2145 -2407 -296
2937 -296 119 -650 -1153 -2710 -2256 54 -104 -2513 -2568 -715 -228 112 -806 -3026 -2478 569 1158 -142
2955 -142 -1373 -1822 -964 1277 1435 -902 -1221 735 1410 1286 734 -1127 -1149 1821 3093 1211 -324
2972 -324 -944 9 1992 2277 -410 -1130 701 1377 989 262 -1398 -1349 1187 2123 -512 -2057 -1559 -1069
2990 -1069 488 654 -1394 -1947 -844 -287 -877 -755 -1711 -2333 -253 159 -1083 -1784 -1356 -1509 -222 686
3008 686 -494 -1608 -763 113 204 549 487 -472 538 1658 110 37 989 1152 806 2039 1672 501 989
3027 989 1608 757 1207 2134 1230 741 944 326 1132 1611 553 -135 850 1301 369 334 -239 -895 -115 1124
3047 1124 -54 -1212 -725 -432 -590 341 -483 -1769 -811 -77 -565 -789 -797 -1510 -908 1189 296 -1398 -781
3066 -781 -527 348 1149 703 -639 -230 1151 892 1030 393 92 536 2179 1730 41 303 790 1073 1808
3085 1808 1784 -129 162 1298 1818 1306 1004 207 -552 1257 1259 -215 -306 -453 -637 318 699 -1413 -2018
3104 -2018 -429 -217 -480 -752 -1247 -2062 -132 225 -1097 -1457 -1621 -1482 -522 483 -1021 -2004 -766 -159
3122 -159 -663 -25 -682 -1245 -130 984 187 -414 -402 -135 649 1819 790 -302 496 1213 1050 1375 879
3141 879 -499 492 1869 976 343 464 35 462 1077 652 -668 222 534 -111 152 213 -743 -931 230
3160 230 -504 -1064 -553 -838 -1232 -187 -212 -1469 -1669 -916 -1462 -827 -27 -1067 -1099 -441 -920 -865 3 -71
3180 -71 -883 -350 307 -93 260 678 -125 21 1337 1285 31 243 398 710 1983 1495 139 276 1285
3199 1285 1276 1239 1141 -131 156 1652 1427 -211 -229 -307 409 1095 1145 -1002 -987 87 201 -309 -472 -1455 -1575
3220 -1575 305 635 -1153 -1840 -1533 -638 107 38 -2000 -2258 -421 137 -6 -494 -1058 -1080 768 622 -1138
3239 -1138 -777 484 754 955 677 -157 -847 619 1593 1043 640 238 -31 981 1339 174 194 1012 1233
3258 1233 712 1030 57 -898 523 1378 461 -212 -71 -409 -247 3 -960 -1091 214 42 -865 -847 -1210
3277 -1210 -1139 -98 -361 -1445 -1380 -379 -969 -1480 -1039 -1118 -989 118 -478 -1455 -1405 -473 -258 201 464 -478
3297 -478 -414 1025 385 -260 568 556 479 1652 745 -391 85 1264 1393 1064 852 -208 414 1678 1207
3316 1207 -50 159 810 411 967 180 -1611 -1002 1045 651 -414 -548 -1123 -630 218 -457 -1491 -780
3334 -780 -361 -683 -401 -595 -2077 -1388 146 283 -722 -661 -1226 -986 309 447 -753 -681 48 227 369
3353 369 183 -433 242 1940 1410 257 432 262 283 1333 1940 801 918 1672 1166 543 918 738 812
3372 812 1575 895 188 378 530 25 334 1214 -45 -467 671 -58 -713 -260 193 -362 -247 -555 -1506
3391 -1506 -1156 -500 -905 -277 -45 -806 -1254 -492 -753 -1458 -510 308 173 -240 -304 -757 -338 367 454 139
3411 139 792 475 134 660 377 62 921 1575 651 500 664 -109 251 1713 1543 425 542 364 -95
3430 -95 694 292 -75 516 552 -159 -656 -635 -1191 -593 516 398 -1128 -1274 -1219 -1587 -888 -639 -1027 -1297 -375
3451 -375 -1197 -1901 -1202 -1235 -977 -252 -368 -1565 -1061 -876 -964 -522 590 -61 -357 -64 -203 -777 -41 228
3471 228 153 1115 1123 -302 -243 334 424 722 930 403 27 406 428 -81 284 833 328 359 -228 -886 -670 257
3493 257 -198 -167 382 -382 -1188 -1016 -704 -1165 -608 38 -1005 -1023 -485 -1154 -1253 -181 -212 -576 82 -842 -1218
3514 -1218 -475 -215 -619 175 827 172 -388 -276 -269 205 1488 1117 264 480 958 473 929 933 748 1447 2087
3535 2087 1033 197 407 869 666 1624 1890 207 147 826 188 625 1020 465 397 961 427 -604 -400
3554 -400 -98 146 1280 135 -1233 -1392 -241 98 -202 -7 -488 -486 319 -253 -1363 -487 -73 671 303
3573 303 -8 -1446 -574 420 239 541 979 541 -230 297 592 -11 665 1455 1211 1019 1217 90 -423
3592 -423 1091 1567 1087 1355 685 126 612 852 103 273 1265 857 -94 -180 -569 -334 441 384 -557 -371
3612 -371 -392 -1100 -916 -676 -295 -350 20 -614 -1743 -1106 -692 -413 -181 47 -716 -530 -388 -1113 -478 -74
3632 -74 171 544 985 150 -1105 -482 343 856 1130 331 41 227 1156 528 -223 410 926 1135 1231 146
3652 146 -833 76 1062 629 623 485 -568 -493 273 210 -525 73 49 -364 -7 -996 -1440 -701 867 202 -532
3673 -532 -957 -1831 -1592 -187 -99 -533 -636 -539 -892 -931 -857 -1166 -246 1081 953 -165 -511 -1134 -348 873
3693 873 905 255 391 823 181 307 613 98 552 1340 1315 316 164 287 60 938 1027 543 313 224 -579
3714 -579 84 842 113 239 617 42 -834 -891 -383 -315 -20 310 -560 -941 -1081 -1209 -1201 -141 -155 -151 -575 -925
3736 -925 -1378 -622 -217 -723 -294 107 -45 -429 -213 -134 -84 755 1070 135 -52 -240 -417 814 1414 764
3756 764 500 918 328 173 457 598 433 1198 1333 306 -148 -394 -196 265 1556 546 -433 -262 -315
3775 -315 -585 202 154 -545 194 644 -717 -1276 -1141 -608 47 768 -540 -1000 -1141 -1136 -889 14 -612 -636 -324
3796 -324 -201 -865 -1088 -305 9 85 710 80 -774 -596 61 500 1008 1084 96 -125 621 362 222 686 1175
3817 1175 1115 1386 876 -448 43 803 706 1121 1254 161 -454 -57 -159 -243 339 469 -446 -53 -124 -1119
3837 -1119 -854 -229 -45 -206 413 -812 -1632 -652 -444 -655 -179 -47 -769 -505 -547 -1267 -413 860 322
3856 322 -124 241 248 -220 242 172 329 1115 805 24 -473 643 1245 1381 1453 899 313 847 991 195 461
3877 461 1168 1570 965 706 -119 -584 704 502 537 955 469 -777 -552 -421 -248 -439 -135 -228 10 119
3897 119 -1056 -1508 -950 113 -82 -100 -725 -1699 -664 79 -52 -565 -161 -125 -253 89 -514 -744 489
3916 489 1065 572 391 34 -496 99 1168 963 512 541 225 37 787 476 128 433 993 746 478 -289
3936 -289 -809 -289 968 388 -39 -31 -246 -569 -465 -429 -477 -110 10 -921 -1052 -1081 -1060 -847 -183 -218 -633 -1006
3958 -1006 -1421 -1752 -873 81 49 -377 -310 -445 -838 -493 -532 -240 690 375 -664 -439 -228 -459 225 1153
3978 1153 681 709 518 -196 -551 329 933 556 852 639 246 609 516 -93 -39 763 592 267 -189 -393 -504
3999 -504 311 879 -76 -443 -451 -979 -541 167 58 -429 177 -470 -832 -770 -1111 -1194 -153 482 83 -716 -1188
4020 -1188 -1232 -341 109 -164 -669 -170 377 -187 -103 -321 -231 764 960 285 -245 -205 305 251 1154 851 482
4041 482 165 417 160 48 602 715 714 1180 270 -344 -67 60 341 1363 1098 -359 -666 -299 -191 -355
4061 -355 215 -293 -192 54 -501 -1307 -908 -393 -326 446 67 -1044 -809 -461 -1013 -349 221 444 33 -132
4081 -132 -317 -905 138 250 -23 600 706 218 -333 280 527 666 1344 842 159 45 202 144 852 1509
4101 1509 1178 586 547 291 56 682 380 278 922 655 -414 -355 -266 176 593 605 -622 -946 -490 -532 -710
4122 -710 -323 -36 -344 -138 -603 -1116 -1202 -348 -441 -170 112 -629 -1222 -949 -695 -393 251 433 -610 -79
4142 -79 266 -151 -681 -239 579 1048 809 -384 -700 146 841 773 859 866 109 460 531 -294 -349 811 1031 516
4164 516 268 19 -466 -36 211 133 438 250 -911 -1182 -251 -394 -710 -333 -247 -432 -305 -740 -1526 -862
4184 -862 212 -428 -353 -1007 -906 -692 -157 -259 -482 654 206 -621 -245 41 167 482 1201 266 -37 540
4204 540 -341 -111 337 1151 916 1406 755 -251 132 630 476 680 1231 839 -15 239 130 33 600 305
4224 305 154 296 338 -713 -742 -79 223 165 -149 -678 -1172 -284 -106 -648 -649 -152 -70 -437 -948 -981 -925 -32
4246 -32 504 -186 -270 -620 -773 -489 352 425 114 884 187 -353 453 -100 -55 945 1245 793 365 -111 -295
4267 -295 634 1339 958 432 391 345 -58 202 115 476 1069 1078 -204 -617 -101 -500 -102 526 28 -433 -86
4288 -86 -901 -839 -258 -81 -608 -457 -749 -800 -985 -667 -815 -404 379 -140 -858 -645 -511 -613 276 162 -21
4309 -21 145 67 -506 -601 393 427 336 640 480 41 413 646 47 526 1034 549 107 244 -218 215 1192 649
4331 649 -109 358 349 -186 -287 -83 130 164 700 -233 -913 -575 -416 -481 161 255 -358 -481 -455 -1115 -707 -289
4353 -289 -259 -240 264 -180 -597 -889 -393 -349 286 505 -200 -287 -235 86 66 548 389 -171 773 515 -21 437
4375 437 930 572 784 885 280 114 528 427 801 1043 916 210 279 204 38 321 319 -153 238 279 -590 -648
4397 -648 -314 -45 127 379 -179 -922 -904 -444 -462 -364 108 -85 -638 -401 -747 -974 -416 -125 24 185 -38
4418 -38 -637 -684 -247 -14 144 372 -85 -289 615 260 -48 455 747 471 525 311 -382 204 670 335 319
4439 319 863 256 -86 41 214 233 401 254 82 148 279 -409 -276 135 -42 16 164 -316 -957 -906 -252
4460 -252 -325 70 -165 -719 -770 -394 -868 -470 246 -45 -692 30 -234 -723 -667 136 -15 296 469 -380 -783
4481 -783 -173 442 193 350 442 283 192 674 -382 -84 722 1068 489 526 151 -317 381 731 505 440 620
4502 620 74 -134 787 -194 -143 494 46 286 -184 -315 -808 213 371 87 -639 -773 -922 -515 -321 -442
4522 -442 -465 18 -228 -624 -458 -819 -293 88 581 -184 -118 -131 -398 -242 66 282 -21 -9 221 -269 196
4543 196 405 254 391 956 289 217 490 254 184 794 552 -73 378 568 -229 173 547 340 273 245 -392
4564 -392 -167 152 -289 -342 -183 55 -220 -4 -329 -790 -516 144 -162 -406 -345 -542 -790 -274 -356 -299 272
4585 272 -42 -331 -319 -55 -414 -358 635 292 -189 120 -322 29 441 587 237 331 530 495 310 120 71 254
4607 254 1169 616 182 229 364 377 574 660 -64 1 557 9 -132 155 -111 -205 120 -305 -1143 -368 -302 -695
4629 -695 -618 167 -648 -877 -612 -465 -747 -331 -393 -602 -267 -572 -642 -803 -275 42 34 391 -246 -377 9 -37
4651 -37 33 338 462 125 50 345 105 209 649 442 177 734 293 67 461 180 50 847 502 -235 -330
4672 -330 146 -279 -425 -52 -67 -451 -257 -321 -532 -355 39 -272 8 -228 -582 -1079 -394 -364 -520 -257 -104
4693 -104 -664 -413 -59 -649 -382 -122 -370 51 348 -317 -549 193 171 373 454 87 -37 306 629 24 448
4714 448 796 624 423 443 204 13 760 795 522 670 629 -54 -437 154 422 209 547 -69 -94 280 -257
4735 -257 -376 114 211 -37 -239 8 -404 -765 -540 -405 -342 -25 -284 -352 -194 -83 -372 -200 98 -360 36
4756 36 316 -156 -196 169 248 178 424 137 -43 388 562 481 484 298 334 45 274 188 136 305 835 287 357 280
4780 280 3 209 386 134 209 356 -94 -137 151 -139 -471 6 164 -55 -397 -249 -728 -428 -61 -365 -292
4801 -292 -460 -297 -345 -493 -204 -405 -179 113 -273 -500 -6 138 -274 537 87 -400 -252 181 -117 -197 451
4822 451 402 215 472 54 157 534 261 -48 237 693 -16 323 137 137 355 684 635 289 202 -74 -465 -17
4844 -17 166 -73 110 -177 -242 -51 -42 -481 -217 -38 -261 -515 -282 -546 -369 42 41 -645 -277 -348 -657 -219
4866 -219 -335 -320 -450 210 -83 -181 72 -91 -163 153 -72 42 -73 222 339 419 725 363 113 579 428
4887 428 -160 125 161 338 478 690 -122 175 281 148 1 276 107 203 141 33 -422 80 223 -298 18
4908 18 -210 -389 -547 -45 -252 -861 -191 -427 -396 -336 -295 -476 77 46 -265 -213 -116 -324 -434 -14 259 -554
4930 -554 -89 96 123 154 300 -36 -71 714 354 -111 56 242 239 705 573 140 276 355 210 241 427 137
4952 137 52 407 -4 -339 153 363 -114 196 39 -650 -436 0 -340 -138 100 -233 -735 2 -638 -406
4972 -406 -57 -168 -396 -579 -202 -234 -253 -306 -284 -465 100 -135 36 -3 26 -132 284 189 143 137 380 85 55 622
4996 622 155 37 412 614 172 71 433 193 504 596 -35 187 519 161 107 168 84 -14 252 378 -326 259
5018 259 -103 -464 -244 90 -430 -615 -41 -210 -389 -258 -116 -288 -152 -66 -200 -672 -208 -219 -361 -24 -195
5039 -195 -635 273 163 -96 17 -57 -33 255 104 169 184 220 542 135 498 328 253 243 673 367 478 515 305
5062 305 371 473 295 232 294 368 153 272 292 5 -191 255 -456 -316 111 -251 -694 -487 -331 -624 -148 -56
5084 -56 -540 -270 -133 -314 -498 -143 -420 -231 111 -320 -478 -41 315 -248 127 151 -113 133 567 -251 5
5105 5 220 216 52 450 163 -161 217 583 307 408 374 -12 -41 570 103 -159 -117 194 32 22 187 -355 36
5128 36 150 -119 -431 -608 -317 -330 152 -158 -712 -325 -161 -175 -173 -279 -644 -324 -132 -623 -188 -142 -334 -585
5150 -585 -223 -249 -265 27 -21 -64 -199 169 401 -3 191 157 -255 102 268 88 106 188 118 176 275 14 17 313
5174 313 487 66 271 39 78 323 332 -132 -117 -44 -12 3 -123 -436 -674 267 36 -137 -205 -509 -541 -1 -92
5197 -92 -368 -304 -279 -207 -267 -160 -260 -415 103 -158 -463 -523 97 174 160 226 -77 -137 -34 133 108 415 234 64
5221 64 344 300 -12 -62 89 201 484 344 -48 374 196 143 -48 -104 516 -96 148 216 -126 148 58 15 -267
5244 -267 85 84 -357 -122 -348 -396 -301 -221 -556 -427 -115 -368 -217 -122 -487 -389 -61 -233 1 24 -139 -330 -200
5267 -200 232 203 -276 43 -30 439 573 191 -144 284 529 425 508 202 217 487 640 552 21 -37 249 286
5289 286 339 21 -117 -69 486 82 -241 188 -96 -122 211 -126 -299 -363 -221 -266 -206 -174 -718 -180 18 93 -505
5312 -505 -284 -368 -398 -159 -135 -420 -199 -93 3 -4 -71 -52 65 393 -41 8 403 653 -64 321 133 41 274
5335 274 430 398 -64 622 193 338 317 68 -35 188 46 53 229 317 362 283 -291 15 -106 -21 0 -330 -153
5358 -153 -37 -511 -19 -47 -574 -435 -66 -108 -202 -495 -626 -264 291 148 -406 -457 155 -8 40 33 -321 172
5380 172 322 182 -71 195 139 94 408 353 -99 -10 445 471 330 221 -13 158 268 441 180 310 373 55
5402 55 479 513 -108 -179 53 145 215 182 -212 -112 83 -157 -184 -256 -307 -315 -229 -199 -647 -279 -30 -148 -362 -375 -318
5427 -318 -488 44 -183 -272 174 290 -42 -17 -29 31 -66 -114 24 -145 493 412 9 235 102 311 389 504 237
5450 237 72 431 334 217 87 -39 -2 315 249 -132 -82 200 -82 220 426 -230 -141 382 299 66 -266 -230
5472 -230 -589 -241 -125 -354 -258 -372 -152 -268 -33 -676 -143 -392 -107 6 -238 -5 -551 -26 -94 -96 160
5493 160 141 130 -127 -3 235 -402 299 222 183 191 269 28 162 548 107 100 167 265 48 287 274 -93 395 356
5517 356 10 -84 58 -27 -65 91 -32 -123 277 -22 -502 -228 7 6 -471 -1 -107 -253 -391 -306 -294 -173 59
5540 59 -427 84 -352 -347 -263 205 44 -222 -109 220 -89 423 -4 106 248 366 175 184 115 112 115 571 281 42
5564 42 411 27 -3 416 388 -337 403 536 385 299 65 -437 -107 369 233 -480 -105 -86 -383 123 -112 -432
5586 -432 -123 -149 52 -437 -111 -523 -202 92 -95 -546 -212 -443 -206 168 362 -165 -200 121 -90 -120 -101
5607 -101 -22 -167 156 98 -87 -85 3 48 244 555 93 93 500 -37 169 549 253 175 236 340 -46 260 275 -76
5631 -76 -68 96 112 -163 -264 83 -276 -75 290 -447 -315 -207 -75 -327 -226 -266 -403 -23 35 -464 -445 -78
5653 -78 -77 160 18 -348 -511 -156 -197 241 -49 -57 -211 67 437 92 -36 305 548 550 -29 -232 -50 452 390
5676 390 114 263 401 89 302 556 114 174 358 233 1 283 -158 -126 132 131 -228 242 -16 -290 -28
5697 -28 -174 -693 -164 -83 -201 -6 -140 -305 -408 -178 58 -433 -103 -164 -251 -137 -161 8 240 148 -50 -212
5719 -212 240 -236 -329 187 486 -90 184 451 111 228 497 330 633 363 83 52 210 689 220 82 344
5740 344 5 282 213 159 -76 219 -56 -111 -8 -157 -2 24 69 -58 -527 -277 -371 -245 -109 -416 -506 -359
5762 -359 149 -108 -411 -223 -512 -82 113 16 -249 -192 -43 98 -71 -173 -132 365 447 182 -33 64 5 508
5784 508 651 354 -1 221 248 242 493 435 138 330 271 208 -190 -29 170 53 214 144 -140 -143 11 -150 -73
5807 -73 -58 -195 -154 -261 -233 -320 5 -384 -254 -229 -270 -477 -249 -249 -150 -157 -47 -193 -25 124 -210 -265 4 273
5831 273 -6 -52 -30 -10 179 344 75 -91 298 304 265 -392 94 386 446 479 11 -142 395 205 -10 292 41
5854 41 -32 61 212 -403 -67 155 -324 8 238 -285 -308 -227 -280 -252 133 -293 -382 0 -114 -512 36 148 28
5877 28 122 94 -266 -258 19 -91 6 260 -2 -106 217 189 -276 -63 280 534 289 30 -136 127 347 517
5899 517 41 -142 140 42 658 199 40 160 304 170 -65 33 -11 57 156 280 -133 -36 -88 -335 -35 -128 -61
5922 -61 -169 44 -519 -160 -427 -109 -254 -331 -52 -100 -92 23 -380 -107 -94 -43 262 165 -191 -208 32 -9 -31 61
5946 61 316 88 324 100 -117 -103 153 169 216 200 -46 191 252 442 115 28 424 168 -109 145 -121 265
5968 265 163 288 64 -8 -56 -236 25 69 239 -149 -19 -79 -332 179 -227 -93 25 -49 -330 -240 -242 -525 -377
5991 -377 54 -214 -157 -189 -332 -46 -131 -90 -61 243 90 -112 -54 35 -144 -107 116 -33 -208 427 74 149 195
6014 195 310 78 177 166 -142 -56 416 121 -167 246 94 11 -135 -151 -107 -35 208 -123 -108 -178 -109 -266 -95
6037 -95 -18 -192 -238 -159 104 56 -274 7 -373 -120 -204 -707 -461 -248 -202 118 -36 -283 -116 93 -185 262
6059 262 199 -176 291 369 393 -175 88 -48 211 525 177 99 189 323 149 172 85 134 273 474 381 -42 -106
6082 -106 -72 -12 90 121 -136 -147 213 -108 -441 151 -285 43 -226 -595 -93 110 -3 -378 -292 1 -270 -254
6104 -254 -139 5 -90 -18 -148 -232 -60 75 -192 287 493 175 13 141 -262 -26 497 122 -100 165 537
6125 537 -63 -93 -105 -191 545 458 111 -48 231 149 -191 -82 187 325 329 230 -115 -512 -62 434 3 25 -452
6148 -452 -279 209 -163 -258 -343 -92 -43 -326 -500 -367 -225 98 148 202 -181 -206 -320 -10 243 11 160 56
6170 56 38 157 41 -109 26 135 187 -110 193 -21 40 410 502 -113 248 387 -143 -172 256 224 71 506
6192 506 551 13 73 75 -138 73 60 -107 81 -13 89 -73 -148 -119 -285 -462 251 -386 -471 196 -188 -96 -74 9
6216 9 -256 86 -255 -14 -247 -99 -115 -115 159 -320 192 225 42 -210 190 209 304 -40 34 -84 308 294 191
6239 191 29 197 135 445 408 133 -235 322 292 -160 155 -8 -37 85 318 43 -308 -48 -362 14 131
6260 131 229 -139 -300 -9 -178 -356 -209 -255 262 13 -148 -371 -286 23 -250 280 -304 -139 153 -179 -77
6281 -77 -116 152 97 59 481 45 48 -30 449 195 240 328 -227 43 189 294 60 500 263 8 210 35 -148
6304 -148 72 294 -104 -75 188 -267 -302 -36 -43 -92 177 -168 -350 -110 -277 -432 -15 -347 -417 -142 154 -274
6326 -274 -48 -301 61 -258 247 30 -265 106 16 310 -218 3 -91 29 388 43 -58 169 -144 8 101
6347 101 192 62 104 244 156 394 170 222 109 211 248 79 -17 -193 62 303 19 -105 -35 338 222 55
6369 55 -233 94 -30 190 -297 -404 -431 128 -268 -88 -114 -286 -423 -39 49 -203 80 -175 -157 -203 230 -144
6391 -144 -141 -248 -33 106 -53 -150 96 260 225 136 210 113 155 173 186 91 153 354 -127 -183 194 217 102 149 98
6416 98 -227 163 335 -193 -184 151 273 19 222 -232 -22 125 360 -12 -551 -184 -77 46 29 -203 -257 -252
6438 -252 -133 -311 -265 -463 -244 244 160 -263 -323 -104 -258 -64 158 -59 45 140 136 -30 -32 -308 -321 453 235
6461 235 6 206 305 133 582 397 293 82 200 56 193 -154 339 247 194 10 -29 -22 -169 186 11 -18
6483 -18 -93 -343 106 -114 -239 -105 -119 -14 -69 140 -305 -338 -72 -42 -292 52 -74 -173 -46 -73 -344 93 353
6506 353 142 -163 -240 35 117 331 311 -62 135 269 224 148 -149 -84 652 508 302 -67 -47 310 70 176
6528 176 173 -292 273 225 144 -149 71 -220 66 106 -173 -290 -136 21 -204 26 -109 -130 -308 -232 -109 -383
6550 -383 -120 -181 -41 176 -62 -606 -157 53 -171 -310 25 -457 71 33 -76 -69 -42 123 222 123 244 51
6572 51 -80 266 186 66 111 117 66 467 167 -93 88 264 -2 223 424 -131 191 265 266 -136 261 -71 -2
6595 -2 223 -31 -243 356 68 -307 -129 -42 -2 -78 -116 -270 -208 -228 -153 -433 -205 -50 -12 -252 -162 -204 -289 -94
6619 -94 239 -39 163 -40 -62 274 -65 27 32 214 340 201 293 -65 -122 333 265 89 -75 237 423 106 271
6642 271 4 -59 498 34 9 139 -185 -146 195 8 49 -175 -173 -320 8 -122 -203 -253 -296 -105 -14 -31 -205 -187
6666 -187 -394 -28 -342 -164 -175 57 47 158 -68 217 -94 -42 141 165 339 43 174 -40 311 -96 23
6687 23 223 67 260 600 255 292 144 214 385 169 -33 -115 108 -330 17 -140 -166 -23 102 153 50 -209
6709 -209 21 -287 70 35 108 -214 -395 -76 -3 -296 -168 -257 -159 -304 -238 82 -218 -259 32 83 -28 -257 124
6732 124 136 -12 152 116 83 483 377 82 -182 -115 3 461 456 -165 40 26 568 126 190 145 16 148 448
6755 448 23 -73 168 58 247 183 40 -198 -125 110 -318 -83 -141 -253 -33 -279 -234 -10 -183 -166 -14 -27
6777 -27 -262 53 132 -308 -286 12 53 -117 -258 -58 -73 -315 97 -128 70 80 26 79 377 -46 18 322 245
6800 245 288 -23 133 464 415 376 180 -164 263 318 318 182 5 -51 90 166 88 -300 63 -101 -36 440 -200
6823 -200 -456 -152 41 100 -168 -429 -228 -71 123 -272 -148 -209 63 -68 -205 -102 -141 -60 48 -21 115 -85
6845 -85 47 211 -82 94 58 25 102 77 -39 -151 -129 40 493 294 -75 111 236 268 341 148 -137 -17 364
6868 364 302 -101 2 -282 -164 405 10 -99 6 -71 17 -399 -6 -2 -170 91 -216 -218 -95 183 -236 -91
6890 -91 -166 -185 -144 -108 -338 -138 24 80 -95 48 -41 -160 278 297 122 335 -60 25 -86 232 332 -131 150
6913 150 381 9 -76 -170 -20 227 255 -62 -25 217 175 119 68 10 -188 198 64 -184 -157 63 -141 278 50
6936 50 -374 -488 -208 13 223 -109 -384 -203 -66 363 -203 60 -389 -262 -321 351 7 -540 -119 -239 174
6957 174 4 -177 -432 306 362 285 161 168 -44 26 275 -172 149 203 108 99 125 66 149 158 129 384 -152 150 167
6982 167 -118 177 228 141 101 178 -224 20 -42 -70 -360 -26 -145 -204 81 -42 -173 -117 68 -87 101 -163 -79
7005 -79 -369 -30 -122 -178 97 30 40 25 39 -30 -53 220 103 377 195 56 105 160 331 36 139 187 116 158 115
7030 115 380 115 430 176 156 185 212 -71 -14 -17 13 144 168 -118 86 -442 -374 22 197 -73 -265 -170 -49
7053 -49 -229 -78 -146 -303 -282 -80 -141 70 -3 -398 126 42 46 -21 -246 199 84 -12 81 113 -145 231 97 296
7077 296 163 468 162 -43 107 137 237 48 143 87 220 350 213 7 258 87 426 -83 -438 -135 293
7098 293 30 292 193 -427 -122 197 176 -158 10 -69 -210 197 80 -212 -92 196 -111 -93 -56 -307 -53 169
7120 169 7 -19 -155 -188 -191 82 211 327 -38 341 274 -67 40 -130 91 330 -85 33 117 169 364 35
7142 35 125 137 -94 105 46 76 249 80 100 1 358 -196 -219 250 -106 107 -62 -75 -50 115 76 -353 138 -90
7166 -90 -282 -135 72 -3 114 24 6 -498 -289 47 -161 -107 -57 -58 26 -82 18 259 -7 -60 213 215 84 -22
7190 -22 278 451 -200 87 7 96 -131 275 72 76 340 -162 301 315 140 -101 2 224 26 -23 -90 -405 -60
7213 -60 178 -111 -69 37 37 -175 -178 -284 -387 7 -73 -430 -384 -384 10 18 -73 -304 -383 -42 198 -67 80 54 -140
7238 -140 -31 397 158 -36 -169 32 138 -61 0 175 166 75 -63 173 214 29 121 142 -112 -89 240 253 152
7261 152 -163 116 -58 123 43 -155 84 153 -52 -100 -210 -100 -87 84 5 -261 -200 -84 -431 -110 -53 -63 -109
7284 -109 -304 186 -15 -194 -61 -88 128 35 224 58 -110 -222 142 -63 -42 143 134 10 -68 133 173 91 103
7307 103 19 367 158 279 268 266 -76 290 213 404 152 38 60 12 145 359 80 -31 -81 -187 -28 -207 78
7330 78 124 43 212 154 -241 -141 59 -139 -91 324 -268 29 -19 -189 -22 -196 -40 120 224 66 -363 191
7352 191 76 364 -318 132 89 89 325 431 -57 202 73 -21 251 288 140 101 248 86 312 376 267 -327
7374 -327 236 -1 173 24 158 -124 -322 314 -272 103 162 -124 -235 -274 152 -265 158 -51 -314 -225 -191
7395 -191 -183 14 34 43 -23 153 -108 -97 259 37 -161 -99 55 135 -119 317 -41 -197 118 86 -31 119 29 89
7419 89 178 337 81 -17 188 277 61 95 278 182 160 -30 -64 27 79 -58 -72 163 -103 -132 -7 -147 54 -69
7443 -69 -36 -221 -87 197 -142 -91 -108 -406 113 28 25 -195 -178 -150 -264 -177 -350 -163 -155 -216 56 -195 -173 -101 115
7468 115 -86 102 130 -4 -150 140 138 113 325 -237 97 50 73 297 92 68 325 -4 -140 18 195 50
7490 50 227 263 10 -222 -440 -310 352 -17 -265 -255 -96 -66 -69 -400 -195 -206 -375 228 -169 -124 11 35 -200
7513 -200 102 -16 -303 119 93 52 -69 195 281 -75 45 -31 -161 69 348 73 146 -155 -67 -71 435 40 -16
7536 -16 189 31 56 126 -50 -450 139 362 215 54 66 113 102 226 168 -76 245 23 -211 -36 -122 -279 -137
7559 -137 -202 -141 32 59 -118 -233 327 -99 -389 280 56 -108 22 97 -174 44 51 -137 -227 634 -123 60
7581 60 318 67 477 186 103 -310 -166 150 139 350 -31 -44 319 237 350 -191 136 -44 117 -124 482 -164
7603 -164 -212 141 -47 -44 -41 -209 227 -78 8 -546 -406 -192 -9 83 -84 -353 -60 50 57 -74 -520 -68 -52
7626 -52 -163 -97 -233 -194 -53 61 -123 -203 -136 -90 173 60 53 -22 -135 14 151 114 99 -54 503 317 73 374
7650 374 -251 -45 294 44 106 -258 -36 -229 52 147 -82 140 -128 -36 -31 166 41 -209 341 -94 -277 -48
7672 -48 -187 -129 -144 5 177 -137 16 -100 -242 -54 336 -170 -166 -114 -177 96 261 -204 -320 -111 38 -74
7694 -74 -76 -34 -62 -2 446 281 -99 204 -38 93 281 9 173 312 219 199 228 -168 75 -116 54 155 -2
7717 -2 28 16 146 -11 68 -26 -198 -6 -223 -428 -125 -198 111 55 42 -195 -102 65 -43 48 101 -297 -147 381
7741 381 -94 -162 78 -100 319 386 11 -215 -296 -298 199 109 151 89 26 105 -92 204 243 12 163 157 -9 -2 -4 -160
7767 -160 -194 175 36 -46 -233 43 -27 -441 -20 -168 -319 -240 -28 -191 -314 -64 -70 -92 -198 -162 -503 91 -5
7790 -5 -60 -13 -90 -425 78 115 20 163 219 12 49 -87 -45 -200 -241 115 56 315 148 16 -18 242 35 191
7814 191 355 178 295 288 85 127 87 227 290 -33 191 -226 -127 146 162 3 224 -128 -228 230 68 -98
7836 -98 -65 -93 -379 -14 -44 9 7 1 -38 -27 4 -325 -191 -13 237 -79 36 98 -80 -283 201 -22 -2 174 196
7861 196 171 34 317 -74 59 388 362 312 40 -158 214 390 296 21 178 97 42 216 -199 -386 -87 286
7883 286 221 -15 -33 -353 260 198 39 -185 -200 -203 -56 4 59 53 -220 69 10 -199 25 -211 -457 48 250 -167
7907 -167 -397 -71 51 -23 -18 108 -89 -155 37 -282 20 224 -109 -96 320 14 6 -300 -23 -49 96 -51 95
7930 95 298 -119 -6 143 48 105 251 177 200 41 -211 -16 -48 11 6 -74 -319 -73 -247 -276 -119 -163 -189 -34
7954 -34 -155 -222 -145 -58 59 -134 101 240 -168 -107 -390 6 387 -220 -230 -20 95 144 201 -106 -28 139 313
7977 313 196 -102 214 -122 -65 236 161 -255 160 198 275 23 21 2 211 344 166 -172 -47 -89 64 339 -245
8000 -245 -299 -214 64 -6 58 -263 -111 -125 276 3 -235 -50 81 -61 41 -55 -233 -20 202 -192 -232 -176 -189
8023 -189 -163 -41 -16 89 122 91 456 178 156 -100 103 143 -92 -10 220 315 -197 217 248 -9 279 378 100
8046 100 -116 287 67 -73 98 23 -219 268 34 22 49 -251 -129 -50 122 -179 -112 52 -156 -137 26 -94
8068 -94 -214 53 80 -179 -476 -116 -161 -107 -75 -325 -118 -4 -162 -225 -58 82 -289 6 -63 -306 199 169 -63
8091 -63 289 -5 -229 214 295 452 119 257 102 -18 455 135 7 172 433 -71 -52 87 -215 -202 -157 79
8113 79 -104 73 -152 -170 -240 -147 -358 -84 -37 142 -148 -2 -121 -149 51 144 124 -186 167 -126 -31 65 30 -212
8137 -212 14 -161 41 -45 -15 -228 -1 205 211 -119 225 46 27 255 308 324 87 147 131 336 12 213 86
8160 86 236 117 106 -152 -118 62 17 69 -127 23 -152 -74 42 200 -60 -407 44 183 -319 -198 -254 -169 221
8183 221 21 -205 -78 146 -115 -10 -34 -33
8191c3
##END NTUPLES=NMR FID
##END=
