##TITLE=1H_CA-8623
 DMSO, 8 sc, 
 5.7.2019
##JCAMPDX= 6.0         $$ Bruker NMR JCAMP-DX V2.0
##DATA TYPE= NMR FID
##DATA CLASS= NTUPLES
##ORIGIN= UXNMR, Bruker Analytische Messtechnik GmbH
##OWNER= root
$$ XWIN-NMR		Version 3.5
$$ Fri Jul  5 15:22:32 2019 Russian Standard Time (UT+4h)  she@DPX200
##.OBSERVE FREQUENCY= 200.13155
##.OBSERVE NUCLEUS= ^1H
##.DELAY= (6, 6)
##.ACQUISITION MODE= SIMULTANEOUS
##.ACQUISITION SCHEME= undefined
##.AVERAGES= 8
##.DIGITISER RES= 18
##SPECTROMETER/DATA SYSTEM= spect
##.PULSE SEQUENCE= zg30
##.SOLVENT NAME= CDCl3
##.SHIFT REFERENCE= (INTERNAL, CDCl3, 0, 15.7039)
##AUDIT TRAIL= $$ (NUMBER, WHEN, WHO, WHERE, WHAT)
$$ ##TITLE= Audit trail, XWIN-NMR		Version 3.5
$$ ##JCAMPDX= 5.01
$$ ##ORIGIN= Bruker BioSpin GmbH
$$ ##OWNER= she
$$ F:/spectra/data/she/nmr/H-F/1/audita.txt
$$ ##AUDIT TRAIL=  $$ (NUMBER, WHEN, WHO, WHERE, WHAT)
(   1,<2019-07-05 15:21:28.34 +0400>,<she>,<DPX200>,
      <created by zg, POWCHK disabled, PULCHK disabled
       configuration hash MD5:
       00 E9 B6 7A A2 85 ED C7 34 08 36 98 17 FE 4E 26
       data hash MD5: 16K
       89 92 1A 78 77 37 5B F7 41 58 26 92 45 59 DF 06>)
$$ ##END=
$$ 
$$ hash MD5
$$ E5 6E 70 4D 01 A5 5E E9 0A 54 20 D5 18 EA 21 C2
##$RELAX= 
##$RELAX= 
##$RELAX= 
##$RELAX= 
##$RELAX= 
##$RELAX= 
$$ Bruker specific parameters
$$ --------------------------
##$DU= <F:/spectra>
##$EXPNO= 1
##$NAME= <H-F>
##$PROCNO= 1
##$TYPE= <nmr>
##$USER= <she>
##$AMP= (0..31)
100 100 100 100 100 100 100 100 100 100 100 100 100 100 100 100 100 100 
100 100 100 100 100 100 100 100 100 100 100 100 100 100 
##$AQSEQ= 0
##$AQ_mod= 1
##$AUNM= <au_zg>
##$AUTOPOS= <>
##$BF1= 200.13
##$BF2= 200.13
##$BF3= 200.13
##$BF4= 200.13
##$BF5= 200.13
##$BF6= 200.13
##$BF7= 200.13
##$BF8= 200.13
##$BYTORDA= 1
##$CFDGTYP= 0
##$CFRGTYP= 5
##$CHEMSTR= <none>
##$CNST= (0..31)
1 1 145 1 1 1 1 1 1 1 1 1 1 1 1 1 1 1 1 1 1 1 1 1 1 1 1 1 1 1 1 1 
##$CPDPRG= <>
##$CPDPRG1= <>
##$CPDPRG2= <>
##$CPDPRG3= <>
##$CPDPRG4= <mlev>
##$CPDPRG5= <mlev>
##$CPDPRG6= <mlev>
##$CPDPRG7= <mlev>
##$CPDPRG8= <mlev>
##$CPDPRGB= <>
##$CPDPRGT= <>
##$D= (0..31)
0 1.2 0 0 0 0 0 0 0 0 0 0.03 0 0 0 0 0 0 0 0 0 0 0 0 0 0 0 0 0 0 0 0 
##$DATE= 1562325687
##$DBL= (0..7)
120 120 120 120 120 120 120 120 
##$DBP= (0..7)
150 150 150 150 150 150 150 150 
##$DBP07= 0
##$DBPNAM0= <>
##$DBPNAM1= <>
##$DBPNAM2= <>
##$DBPNAM3= <>
##$DBPNAM4= <>
##$DBPNAM5= <>
##$DBPNAM6= <>
##$DBPNAM7= <>
##$DBPOAL= (0..7)
0.5 0.5 0.5 0.5 0.5 0.5 0.5 0.5 
##$DBPOFFS= (0..7)
0 0 0 0 0 0 0 0 
##$DE= 6
##$DECBNUC= <off>
##$DECIM= 24
##$DECNUC= <off>
##$DECSTAT= 4
##$DIGMOD= 1
##$DIGTYP= 9
##$DL= (0..7)
0 120 120 120 120 120 120 120 
##$DP= (0..7)
150 150 150 150 150 150 150 150 
##$DP07= 0
##$DPNAME0= <>
##$DPNAME1= <>
##$DPNAME2= <>
##$DPNAME3= <>
##$DPNAME4= <>
##$DPNAME5= <>
##$DPNAME6= <>
##$DPNAME7= <>
##$DPOAL= (0..7)
0.5 0.5 0.5 0.5 0.5 0.5 0.5 0.5 
##$DPOFFS= (0..7)
0 0 0 0 0 0 0 0 
##$DQDMODE= 0
##$DR= 18
##$DS= 0
##$DSLIST= <SSSSSSSSSSSSSSS>
##$DSPFIRM= 0
$$ [...]
##$SUBNAM2= <"">
##$SUBNAM3= <"">
##$SUBNAM4= <"">
##$SUBNAM5= <"">
##$SUBNAM6= <"">
##$SUBNAM7= <"">
##$SUBNAM8= <"">
##$SUBNAM9= <"">
##$SW= 24.9336996594482
##$SWIBOX= (0..15)
0 0 2 0 0 0 0 0 0 0 0 0 0 0 0 0 
##$SW_h= 4990.01996007984
##$TD= 16384
##$TD0= 1
##$TE= 0
##$TE2= 300
##$TE3= 300
##$TEG= 300
##$TL= (0..7)
0 120 120 120 120 120 120 120 
##$TP= (0..7)
150 150 150 150 150 150 150 150 
##$TP07= 0
##$TPNAME0= <>
##$TPNAME1= <>
##$TPNAME2= <>
##$TPNAME3= <>
##$TPNAME4= <>
##$TPNAME5= <>
##$TPNAME6= <>
##$TPNAME7= <>
##$TPOAL= (0..7)
0.5 0.5 0.5 0.5 0.5 0.5 0.5 0.5 
##$TPOFFS= (0..7)
0 0 0 0 0 0 0 0 
##$TUNHIN= 0
##$TUNHOUT= 0
##$TUNXOUT= 0
##$USERA1= <user>
##$USERA2= <user>
##$USERA3= <user>
##$USERA4= <user>
##$USERA5= <user>
##$V9= 5
##$VALIST= <valist>
##$VCLIST= <CCCCCCCCCCCCCCC>
##$VD= 0
##$VDLIST= <DDDDDDDDDDDDDDD>
##$VPLIST= <PPPPPPPPPPPPPPP>
##$VTLIST= <TTTTTTTTTTTTTTT>
##$WBST= 1024
##$WBSW= 4
##$XGAIN= (0..3)
0 0 0 0 
##$XL= 0
##$YL= 0
##$YMAX_a= 283452
##$YMIN_a= -444850
##$ZGOPTNS= <>
##$ZL1= 120
##$ZL2= 120
##$ZL3= 120
##$ZL4= 120
##$ABSF1= 10
##$ABSF2= 0
##$ABSG= 5
##$ABSL= 3
##$ALPHA= 0
##$AQORDER= 0
##$ASSFAC= 0
##$ASSFACI= 0
##$ASSFACX= 0
##$ASSWID= 0
##$AUNMP= <proc_1d>
##$AZFE= 0.1
##$AZFW= 0.1
##$BCFW= 1
##$BC_mod= 2
##$BYTORDP= 1
##$COROFFS= 0
##$CY= 11.3945322036743
##$DATMOD= 1
##$DC= 2
##$DFILT= <>
##$DTYPP= 0
##$F1P= 18.9103706918063
##$F2P= -1.10871071338519
##$FCOR= 0.5
##$FTSIZE= 0
##$FT_mod= 4
##$GAMMA= 1
##$GB= 0.15
##$INTBC= 1
##$INTSCL= 1
##$ISEN= 128
##$LB= 0.24
##$LEV0= 0
##$LPBIN= 0
##$MAXI= 10000
##$MC2= 0
##$MEAN= 0
##$ME_mod= 0
##$MI= 1.114404
##$NCOEF= 0
##$NC_proc= 0
##$NLEV= 6
##$NOISF1= 3.799351
##$NOISF2= 2.8
##$NSP= 1
##$NTH_PI= 0
##$NZP= 0
##$OFFSET= 15.70392
##$PC= 1
##$PHC0= -8863.784
##$PHC1= 17.60095
##$PH_mod= 1
##$PKNL= yes
##$PPARMOD= 0
##$PSCAL= 0
##$PSIGN= 0
##$REVERSE= no
##$SF= 200.130013532006
##$SI= 16384
##$SIGF1= 3
##$SIGF2= 2
##$SINO= 400
##$SIOLD= 16384
##$SREGLST= <1H.CDCl3>
##$SSB= 0
##$STSI= 0
##$STSR= 0
##$SW_p= 3612.71676300578
##$SYMM= 0
##$S_DEV= 0
##$TDeff= 0
##$TDoff= 0
##$TI= <>
##$TILT= no
##$TM1= 0
##$TM2= 0
##$TOPLEV= 0
##$USERP1= <user>
##$USERP2= <user>
##$USERP3= <user>
##$USERP4= <user>
##$USERP5= <user>
##$WDW= 1
##$XDIM= 8192
##$YMAX_p= 0
##$YMIN_p= 0
$$ End of Bruker specific parameters
$$ ---------------------------------
##NTUPLES= NMR FID
##VAR_NAME=  TIME,          FID/REAL,        FID/IMAG
##SYMBOL=    X,             R,               I
##VAR_TYPE=  INDEPENDENT,   DEPENDENT,       DEPENDENT
##VAR_FORM=  AFFN,          ASDF,            ASDF
##VAR_DIM=   8192,          8192,            8192
##UNITS=     SECONDS,       ARBITRARY UNITS, ARBITRARY UNITS
##FACTOR=    0.0002004,     1,               1
##FIRST=     0,             0,               0
##LAST=      1.6414764,     0,               0
##MIN=       0,             -444850,         0
##MAX=       1.6414764,     283452,          0
$$ Real data points
##PAGE= N=1
##DATA TABLE= (X++(R..R)), XYDATA
$$ [...]
$$ plain form
2285 625 3325 3557 -561 -4007 -2134 1611 3033 1988 -1289 -3787 -2076 2197 2908 592 -1734 -3485
2301 -3485 -1892 2481 3533 76 -3017 -2850 -844 2676 3591 -687 -4244 -2563 659 2790 2401 -1292
2317 -1292 -4119 -1951 1875 2458 975 -1550 -3770 -1811 2503 2647 -12 -2269 -3221 -1477 2633 3318
2333 3318 -246 -3149 -2549 66 3246 3343 -984 -4019 -1580 1914 2955 1871 -1427 -3648 -946 2827
2349 2827 2907 575 -1533 -3065 -922 2850 2983 126 -2115 -2433 -400 3161 3525 -670 -3161 -1682
2365 -1682 1131 3599 2927 -1429 -3800 -596 2662 3248 1444 -1727 -3323 -432 2966 2666 42 -1947
2381 -1947 -2837 -471 3173 2753 -834 -2599 -2428 149 3253 3031 -1329 -3610 -1456 1450 3275 1848
2397 1848 -2193 -3786 -380 2778 2520 584 -2145 -3237 -15 2793 1930 -532 -2269 -2835 -335 3027
$$ packed form
2285F25K700K32m118l446J873L745J422j045l277k498J711M273P11k316k326j751
2301c485J593M373J052l457l093J67K006L520R15m278l557J681L222K131l89l693
2317a292k827K168L826N83j483k525k220J959M314J44k659k257r52J744M110O85
2333C318l564k903O00K615L180R7m327l035K439L494J041j084l298k221K702L773
2349B827Q0k332k108j532K143L772J33k857k241l18K033L561L64m195k491J479
2365a682K813K468o72m356k371L204L258N86j804l171j596K891L398l00k624j989
2381a947q90K366L644m20l587j765J71K577L104k22m360k281K154K906J825j427
2397A848m041j593L406L158k58j936k729j092L222K808q63k462j737n66K500L362
$$ plain form
2413 3027 2021 -1330 -3009 -2218 365 3112 2245 -2401 -3710 -825 1799 2737 921 -2701 -3583 187
2429 187 2756 1917 -177 -2411 -2700 330 3213 1877 -861 -2215 -1869 419 3411 2221 -1549 -2828
2445 -2828 -1309 1283 3352 1828 -2654 -3409 74 2451 2477 418 -2948 -3049 616 2897 1588 -684
2461 -684 -2234 -2397 889 3186 1674 -1152 -2040 -1579 941 3755 1996 -2016 -2446 -475 2027 3562
2477 3562 1459 -2713 -2794 856 2966 2276 42 -2558 -2482 1157 3141 1123 -1036 -2123 -2009 755
2493 755 3118 1014 -1877 -2307 -1561 925 2974 1241 -3099 -2944 -403 2083 2933 294 -3136 -2681
2509 -2681 1224 2797 1607 -508 -2691 -2100 1405 3014 730 -1145 -1959 -1304 1101 3081 960 -1977
2525 -1977 -2317 -827 1522 3056 579 -3040 -2588 427 2398 1952 -429 -3385 -2413 1523 2790 697
$$ packed form
2413C027j006l351j679P91K583K747q67m646j309K885K624R38j816l622q82L770
2429A87K569q39k094k234k89L030K883j336k738j354L46K288K992j190l770j279
2445b828J519K592K069j524m482p55L483K377K6k059l366j01L665K281j309k272
2461f84j550j63L286K297j512k826q88M61K520K814j759m012m30J971K502J535
2477C562k103m172q1L650K110o90k234k600P6L639J984k018k159j087J14K764
2493G55K363k104k891m30P46K486K049j733m340J55K541K486Q50k639l430M55
2509b681L905J573j190k115k183N91L505J609k284j875q14O55K405J980k121k937
2525a977l40J490K349J534k477l619M52L015J971m46k381k956R72L936J267k093
$$ plain form
2541 697 -1375 -2683 -1747 1586 2678 280 -1687 -1836 -1343 1314 3185 619 -2194 -2246 -104 2007
2557 2007 3153 557 -3171 -2025 1431 2927 1653 -656 -3116 -1542 2207 2767 84 -1599 -2276
2572 -2276 -1058 1787 2472 -128 -2030 -1874 -1177 1572 2674 -82 -2934 -2201 466 2223 2230 -507 -3566
2589 -3566 -1951 1992 2719 1371 -1271 -2724 -700 2766 2434 117 -1447 -1617 -607 2034 2382 -342
2605 -342 -1934 -1492 -162 1807 2623 -490 -2883 -1613 800 2214 1807 -1383 -3717 -1280 2078 2367
2621 2367 274 -2028 -2620 -555 2296 2059 -814 -1830 -1468 -177 2056 2372 -463 -2048 -1367 356
2637 356 2294 2577 -490 -3009 -1214 1892 2652 1404 -1340 -3286 -511 2743 2149 -347 -1967 -2229
2653 -2229 -245 2511 1587 -1215 -1788 -1431 -55 1897 1994 -1101 -2401 -1255 521 2199 1843 -1260
$$ packed form
2541F97k072j308R36L333J092k398j967j49M93K657J871k566k813n2K142K111
2557B007J146k596l728J146L456J496j274k309k460J574L749N60k683j683o77
2572b276J218K845O85k600j902J56O97K749J102k756k852P33K667J757Pk737l059
2589c566J615L943P27j348k642j453K024L466l32k317j564j70J010K641L48k724
2605c42j592M42J330J969Q16l113k393J270K413J414m07l190k334K437L358K89
2621B367k093k302n92K065K851k37k873j016L62J291K233L16k835j585O81J723
2637C56J938K83l067k519J795L106P60j248k744j946K775L254n94k496j620k62
2653b229J984K756r24k802n73L57J376J952R7l095j300J146J776J678l56l103
$$ plain form
2669 -1260 -3216 -616 2149 2319 715 -1908 -2754 102 2807 1688 -819 -1676 -1739 416 2342 1345
2685 1345 -1138 -1897 -1102 255 1929 1812 -1313 -2885 -932 1203 2131 1353 -1858 -3242 -353 2487
2701 2487 1774 -235 -2055 -2494 370 2720 1279 -1224 -1991 -1059 365 2523 1310 -1355 -1740 -779
2717 -779 546 2288 1550 -1306 -2508 -366 1965 2219 898 -2036 -2500 482 2844 1629 -828 -2112
2733 -2112 -1937 793 2502 732 -1506 -1564 -807 511 2055 979 -1807 -1975 -484 790 2004 1136
2749 1136 -1995 -2517 175 2023 2126 337 -2194 -2412 940 2948 1221 -871 -1855 -1190 1104 2694
2765 2694 572 -1746 -1623 -418 767 1946 607 -1802 -1910 -106 1089 1797 734 -2250 -2434 455
2781 455 2382 1392 -517 -2335 -1856 1379 2959 494 -1490 -1676 -768 999 2306 253 -1802 -1447
$$ packed form
2669a260j956K600K765J70j604k623q46K856K705j119k507q57o3K155J926r97
2685A345k483p59P95J357J674j17l125j572J953K135R28p78l211j384K889K840
2701B487p13k009j820m39K864K350j441k503p67R32J424K158j213k665l85R61
2717g79J325J742p38k856j202K142K331K54j321k934m64K982K362j215k457j284
2733b112J75K730J709j770k238n8P57J318J544j076k786j68J491J274J214q68
2749A136l131n22K692J848J03j789k531k18L352K008j727k092r84O65K294J590
2765B694k122k318J23J205J185J179j339k409j08J804J195P08j063k984j84K889
2781D55J927r90j909j818M79L235J580k465j984j86R08J767J307k053k055L55
$$ plain form
2797 -1447 -165 1059 1778 629 -2080 -1810 298 1743 1863 127 -2530 -2155 1164 2281 877 -952
2813 -952 -2230 -1412 1698 2447 -58 -1713 -1400 -419 1402 2135 -3 -1990 -1318 102 958 1847 275
2830 275 -2271 -1785 772 1743 1535 -290 -2451 -1561 1812 2530 342 -1072 -1912 -700 1894 2433 -404
2847 -404 -1861 -1012 -95 1488 1804 -301 -2233 -1117 307 1071 1532 -48 -2500 -1458 1368 1776 1246
2864 1246 -733 -2542 -1190 1878 2382 -110 -1485 -1642 -451 1927 1949 -517 -2013 -799 77 1363
2880 1363 1621 -455 -2097 -919 934 1464 1356 -258 -2493 -1392 1698 1962 543 -1014 -2062 -638
2896 -638 2274 2088 -502 -1798 -1222 31 1815 1632 -861 -1867 -608 466 1277 1347 -693 -2323 -630
2913 -630 988 1563 929 -627 -2445 -801 1766 1842 106 -1451 -2046 -288 2247 1663 -1019 -1689 -816
$$ packed form
2797a447J282J224P19j149k709K70K108J445J20j736k657L75L319J117j404j829
2813i52j278Q18L110P49k505j655L13R81J821P33k138j987O72J420Q56Q89j572
2830B75k546M86K557R71k08j825k161Q90L373P18k188j414q40J212K594N39k837
2847d04j457Q49R17J583L16k105j932J116J424P64M61j580k452J042K826M08n30
2864A246j979j809J352L068N04k492j375j57J191K378K2k466j496J214Q76J286
2880A363K58k076j642J178J853N30j08j614k235J101L090K64j419j557j048J424
2896f38K912j86k590j296N76J253J784j83k493j006J259J074Q11P0k040j630J693
2913f30J618N75o34j556j818J644K567P6j736j557n95J758K535n84k682o70Q73
$$ plain form
2930 -816 176 1788 1368 -1029 -1810 -385 551 1355 1100 -718 -2124 -634 1338 1643 369 -1015 -2238
2947 -2238 -523 2321 1655 -446 -1718 -1543 117 2314 1379 -1371 -1565 -575 676 1576 1147 -1364 -1861
2964 -1861 -189 943 1221 962 -997 -2138 -351 1682 1289 125 -1351 -2155 6 2328 1281 -945
2980 -945 -1665 -1138 578 2110 1126 -1373 -1555 -97 744 1192 950 -1296 -1625 -183 1247 1126 616 -1285
2998 -1285 -2082 100 2022 1220 -135 -1096 -1931 262 2397 1011 -1295 -1399 -685 836 2000 871
3014 871 -1634 -1297 121 935 1317 648 -1479 -1589 336 1422 1123 276 -1335 -1906 398 2232 998
3031 998 -478 -1545 -1438 715 2206 639 -1500 -1454 -278 1156 1990 594 -1816 -1278 345 1059 1050
3048 1050 246 -1712 -1698 472 1461 921 -93 -1470 -1731 403 2248 422 -1228 -1567 -944 1106 2327
$$ packed form
2930h16R92J612m20k397p81J425R36Q04k55j818j406J490J972L05j274j384j223
2947b238J715K844o66k101j272J75J660K197r35k750j94R90J251R00m29k511m97
2964a861J672J132K78k59j959j141J787K033l93j164j476q04K161K322j047k226
2980i45p20N27J716J532r84k499j82J458Q41M48k42k246l29J442J430j21n10j901
2998a285p97K182J922q02j355r61q35K193K135j386k306j04P14J521J164j129
3014H71k505L37J418Q14L82o69k127j10J925J086k99q47j611n71K304J834j234
3031I98j476j067J07K153J491j567k139M6J176J434Q34j396k410N38J623P14r
3048A050q04j958J4K170R89n40j014j377k61K134J845j826j650l39O23K050J221
$$ plain form
3065 2327 247 -1760 -1375 -104 988 1464 204 -1686 -1227 784 950 1041 162 -1595 -1326 880 1765
3082 1765 717 -503 -1518 -1202 1140 2133 208 -1498 -1186 -419 1141 1929 8 -1741 -876 520
3098 520 1168 1394 59 -1871 -1070 828 1250 887 -155 -1657 -1308 1173 1800 402 -774 -1523 -857
3115 -857 1266 1916 -44 -1595 -1048 -112 1216 1490 -355 -1897 -821 709 1000 1165 -160 -1751 -885
3132 -885 1244 1300 674 -424 -1573 -1038 1314 1819 182 -1015 -1290 -738 1428 1887 -387 -1843 -969
3149 -969 494 1410 1312 -433 -1819 -706 938 1166 822 -396 -1623 -737 1229 1285 389 -720 -1347 -727
3167 -727 1293 1675 -155 -1166 -1145 -137 1561 1603 -783 -1667 -667 464 1171 1011 -689 -1801 -535
3184 -535 1001 881 461 -737 -1781 -433 1363 1132 -74 -863 -1360 -597 1629 1576 -580 -1386 -992 232
$$ packed form
3065B327k080k007L85J271J092M76j260j890M59K011J66R1q79j757K69K206Q85
3082A765j048j220j015L16K342R93j925j706L12P67J560P88j921j749Q65J396
3098E20O48K26j335j930Q01J898M22l63j042j502L49K481O27j398j176p49O66
3115h57K123O50j960j551N47R36J328K74j845j542J076J530K91J65j325j591Q66
3132h85K129N6o26j098j149N35K352N05j637j197k75N52K166M59k274j456Q74
3149i69J463R16r8j745j386J113J644K28l44j218j227Q86J966N6q96j109o27O20
3167g27K020L82j830j011K1J008J698M2k386q84J000J131P07j60j700j112J266
3184e35J536j20m20j198j044J348J796k31j206p89m97P63K226n3k156q06L94J224
$$ plain form
3202 232 1446 1476 -972 -1803 -330 668 1251 599 -789 -1775 -297 1244 902 300 -768 -1615 -196 1415
3220 1415 1108 -323 -971 -1151 -32 1841 1113 -792 -1428 -767 231 1458 1080 -1072 -1551 -144 987
3237 987 1109 552 -935 -1435 -2 1406 991 52 -683 -1269 -134 1758 1050 -659 -1099 -776 340 1878
3255 1878 1013 -1018 -1438 -61 633 1380 674 -1182 -1351 150 1249 739 444 -865 -1405 290 1707
3272 1707 590 -213 -868 -1090 354 1869 749 -960 -1005 -654 563 1585 791 -1108 -1295 202 731
3289 731 993 469 -1282 -1401 423 1205 727 181 -1073 -1249 201 1590 435 -464 -888 -1231 516 1523
3307 1523 593 -1182 -1237 -359 481 1407 420 -1556 -1269 319 739 916 175 -1376 -1153 546 1253 489
3325 489 -61 -1082 -1134 578 1589 582 -887 -944 -765 527 1690 274 -1233 -1007 21 865 1153
$$ packed form
3202B32J214L0k448q31J473R98N83o52j388r86J478J541l42o02j068q47J419J611
3220A415l07j431o48j80J119J873p28j905o36O61R98J227l78k152m79J407J131
3237I87J22n57j487n00J433J408m15r39p35n86J135J892p08j709m40L23J116J538
3255A878q65k031m20J377O94P47p06j856j69J501J099n10k95j309n40J695J417
3272A707j117q03o55k22J444J515j120j709m5L51J217J022p94j899j87J497N29
3289G31K62n24j751j19J824P82m78n46j254j76J450J389j155q99m24l43J747J007
3307A523r30j775n5Q78Q40R26r87j976K87J588M20J77p41j551K23J699P07p64
3325D89n50j021n2J712J011j007j469n7J79J292J163j416j507K26J028Q44K88
$$ plain form
3342 1153 185 -1588 -1103 688 988 648 -122 -1274 -957 623 1368 329 -387 -976 -787 727 1420 313
3360 313 -944 -1014 -397 732 1441 123 -1423 -819 236 932 1102 15 -1507 -1078 766 1155 507 -205
3378 -205 -1252 -940 854 1346 206 -479 -1042 -563 914 1467 62 -868 -573 -126 931 1330 -122 -1402
3396 -1402 -673 460 876 970 -175 -1396 -789 925 807 219 -343 -1188 -700 916 1266 -195 -761 -856
3414 -856 -346 919 1356 -297 -1156 -690 173 804 1027 -304 -1487 -813 624 974 499 -570 -1516 -575
3432 -575 997 816 3 -601 -1098 -648 1057 1191 -376 -905 -530 -214 892 1131 -554 -1313 -663 171
3450 171 1170 838 -562 -1581 -498 897 936 299 -402 -1097 -372 1145 986 0 -638 -658 5 1237 1175
3469 1175 -465 -1094 -353 43 971 1220 -660 -1297 -186 541 794 682 -550 -1348 -347 854 991 -73
$$ packed form
3342A153r68j773M85J791L00l40p70j152L17J580P45j039p16n89J89J514O93j107
3360C13j257p0O17J129P09j318j546O04J055O96J70j087j522M29J844L89o48p12
3378b05j047L12J794M92j140o85n63M79J477N53j405r30K95M47J057L99j452j280
3396a402P29J133M16R4j145j221O07J714j18n88n62q45M88J616L50j461n66r5
3414h56N10J265M37j653q59M66Q63O31K23j331j183O74J437L50m75j069r46R41
3432e75J572j81q13o04m97M50J705J34j567n29L75L16J106K39j685p59O50Q34
3450A71R99l32j400j019J083J395L9o37p01o95P25J517j59r86o38k0O63J232o2
3469A175j640o29P41L96R28K49j880o37J111P27K53j12j232p98J001J201J37j064
$$ plain form
3487 -73 -700 -1165 149 1172 911 -358 -717 -689 -25 1286 898 -744 -1064 -221 253 1087 691 -642 -1127
3506 -1127 -210 910 521 331 -560 -1402 -161 1183 832 -103 -835 -1084 -41 1248 644 -635 -985 -627
3524 -627 20 1177 785 -827 -1218 -227 339 997 731 -813 -1249 60 835 531 177 -791 -1166 314
3542 314 1161 664 -400 -531 -607 234 1550 656 -483 -938 -288 353 1074 509 -884 -1048 130 585 683
3561 683 347 -1021 -1268 141 862 310 -120 -857 -1072 440 1310 639 -557 -598 -542 240 1263 614 -649
3580 -649 -634 155 457 1307 341 -875 -909 319 837 604 91 -948 -883 523 943 264 -218 -616 -851 375
3600 375 1214 181 -746 -801 -663 577 1142 347 -959 -697 -3 491 1032 129 -1027 -699 273 711 428
3619 428 198 -1044 -688 718 901 407 -473 -627 -678 772 1201 143 -711 -801 -231 545 1203 61 -1021
$$ packed form
3487g3o27m65J314J023k61j269l59K8O64J311l88j642l20Q43M74Q34l96j333m85
3506a127R17J120l89j90q91q42J241J344l51r35p32k49J043J289o04j279l50L58
3524f27O47J157l92j612l91R91N66O58k66j544m36J309P75l04l54r68l75J480
3542C14Q47m97j064j31p6Q41J316q94j139m55O50O41P21n65j393j64J178M55R8
3561F83l36j368k47J409P21n52m30p37k15J512Q70o71j196m1N6P82J023o49j263
3580f49J5P89L02Q50r66j216l4J228N18k33n13j039O5J406M20o79m82l98k35J226
3600C75Q39j033r27n5J38J240N65p95j306K62O94M94N41r03j156L28R72M38k83
3619D28k30j242L56J406J83m94q80j54n1J450M29j058q54r0N70P76O58j142j082
$$ plain form
3638 -1021 -666 191 507 680 -142 -1204 -879 525 1003 155 -475 -840 -669 467 1040 -34 -427 -741
3656 -741 -600 580 1156 8 -798 -298 13 659 1147 -76 -1049 -590 610 749 654 -122 -1105 -636 650
3675 650 1094 90 -228 -962 -631 659 950 -144 -576 -750 -322 394 1057 -388 -1058 -373 97 784 910
3694 910 -54 -1160 -373 578 762 420 -99 -776 -408 733 862 76 -407 -1016 -432 879 1010 -238 -781
3713 -781 -536 -275 615 934 -447 -1050 -396 191 681 433 -363 -955 -338 730 406 99 -419 -1123 -338
3732 -338 726 817 107 -563 -703 -145 967 891 -599 -920 -333 -32 646 610 -313 -865 -78 514 748 611
3752 611 -447 -981 1 886 461 131 -452 -916 -71 939 646 -124 -484 -556 -143 810 691 -515 -772
3771 -772 -242 331 560 655 -449 -1005 -10 673 484 209 -627 -1135 -23 1019 596 -228 -456 -776 152
$$ packed form
3638a021L55Q57L16J73q22j062L25J404M78q48o30l65J71J136N73j074l93l14
3656g41J41J180N76j148q06N00L11O46M88j223r73M59J200J39r5p76r83M69J286
3675F50M44j004l18p34L31J290K91j094m32j74M28P16O63j445o70O85M70O87J26
3694I10r64j106P87R51J84l42n19o77L68J141J29p86m83o09N84J311J31j248n43
3713g81K45K61Q90L19j381o03O54N87M90k48p96n92O17J068l24l07n18p04P85
3732c38J064R1p10o70j40N58J112p6j490l21N87L01O78l6r23n52P87N92K34j37
3752F11j058n34R82Q85m25l30n83m64Q45J010k93p70l60p2M13R53j19j206k57
3771g72N30N73K29R5j104n56R95O83j89k75q36n08J112J042m23q24k28l20R28
$$ plain form
3790 152 1009 613 -603 -485 -326 76 1052 625 -689 -932 -125 380 650 392 -723 -967 91 630 640
3809 640 40 -494 -1012 277 993 584 -180 -789 -750 37 882 413 -610 -696 -171 203 916 708 -445 -727
3829 -727 85 484 739 259 -728 -914 208 705 449 -31 -495 -1019 210 1008 257 -443 -496 -688 174 945
3849 945 368 -728 -763 -274 204 895 189 -757 -745 314 557 339 43 -609 -941 272 911 190 -288 -537
3869 -537 -510 430 799 60 -643 -556 -350 227 779 55 -836 -643 108 489 527 38 -785 -632 396 720 422
3890 422 57 -691 -665 498 735 86 -203 -536 -475 405 910 -64 -723 -589 -24 418 896 217 -941 -292
3910 -292 148 501 518 45 -793 -748 392 732 131 -279 -963 -684 607 834 59 -554 -475 -266 597 775
3930 775 28 -705 -265 -88 500 862 40 -865 -350 347 632 371 -229 -833 -374 686 442 103 -237 -530
$$ packed form
3790A52Q57l96j216J18J59M02R76m27j314k43Q07N05K70k58j115k44J058N39J0
3809F40o00n34n18J289P16m09p64o09L9P87Q45m69j023q6N25L74P13k08j153k82
3829g27Q12L99K55m80r87j86J122M97k56m80m64n24J229P98p51p00n3j92Q62P71
3849I45n77j096l5M89M78O91p06r46J2J059K43k18k96o52l32J213O39p21m78k49
3869e37K7R40L69p39p03Q7K06N77N52p24q91J93P51L81L8m89q23J53J028L24k98
3890D22l65p48K6J163K37o49k89l33O1Q80N05r74o59J34N65M42M78o79j158O49
3910b92M40L53J7m73q38M5J140L40o01m10o84K79J291K27p75o13P9K09Q63J78
3930G75p47p33M40J77N88L62q22r05N15O97K85k61o00o04M59J060k44l39l40k93
$$ plain form
3950 -530 -422 540 721 -115 -622 -533 -100 560 766 -158 -851 -202 444 284 570 -82 -681 -347 420 466 376
3971 376 -113 -873 -308 525 539 28 -457 -756 -43 713 707 -295 -657 -305 -33 354 726 -143 -698 -114 316
3992 316 423 463 -244 -746 -233 393 214 60 -391 -751 -278 806 622 -6 -451 -590 -170 650 754 -266
4012 -266 -513 -227 250 500 785 -279 -860 -124 451 534 321 -77 -932 -162 618 242 -30 -455 -602 -113
4032 -113 734 379 -531 -542 -496 -198 914 566 -443 -570 78 282 492 387 -300 -868 -95 558 401 -65
4052 -65 -243 -815 -94 676 361 2 -616 -535 -79 709 291 -309 -713 -518 9 692 400 -544 -748 -231 341
4073 341 421 383 -604 -826 15 500 375 185 -334 -628 153 819 206 -162 -282 -303 125 644 433 -452 -580
4094 -580 -332 300 599 308 -757 -752 22 414 268 165 -468 -771 50 558 168 -81 -319 -750 291 757
$$ packed form
3950e30J08R62J81q36n07Q9M33O60K06r24o93O49O46j60K86o52n99L34P67M6r0
3971C76m89p60N65Q33J4n11m85k99P13P56oj002l62L52K72L87L72q69n55N84M30
3992C16J07M0p07n02N13O26j79j54m51l60M73J084j84o28m45j39M20Q20J04j020
4012b66k47K86M77K50K85j064n81P36N75Q3k13l98q55P70P80l76k72m25j47M89
4032a13Q47l55r10j1M6K98J112l48j009j27O48K04K10j05o87n68P73O53j57m66
4052f5j78n72P21P70l15l59o18Q1M56P88m18o00m04J95N27O83k92r44k04N17N72
4073C41Q0l8r87k22Q41M85j25j90n19k94P81O66o13l68j20k1M28N19k11q85j28
4094e80K48O32K99k91j065NP74L92j46j03o33l03Q21N08l90k49k38m31J041M66
$$ plain form
4114 757 282 -487 -455 -374 147 572 53 -652 -507 -57 253 591 316 -524 -607 165 504 412 164 -321 -636
4135 -636 381 762 353 -63 -485 -416 288 723 204 -353 -395 -179 191 648 52 -728 -388 -43 219 600
4155 600 101 -855 -470 315 422 215 216 -555 -526 279 524 195 -223 -370 -98 428 761 -66 -395 -349 61
4176 61 251 514 -4 -799 -295 197 398 426 355 -692 -298 322 569 -10 -106 -526 -372 477 564 -200 -329
4197 -329 -296 -355 312 576 55 -553 -459 163 502 516 61 -762 -362 427 357 228 87 -644 -274 464 485 162
4219 162 -227 -537 -215 518 643 40 -323 -449 -174 398 518 -65 -604 -146 -11 264 327 98 -724 -216
4239 -216 301 479 166 -5 -587 -391 607 352 -42 -302 -325 -2 599 539 -107 -473 -133 -10 398 524 102
4260 102 -690 -80 349 372 384 -258 -689 -216 499 510 241 -366 -474 -237 447 479 -146 -528 -347 -83 479
$$ packed form
4114G57m75p69L2Q1N21M25n19p05J45M50L10L38k75q40q3P72L39r2k48m85l15
4135f36J017L81m09m16m22O9P04M35n19n57m2K16L70M57n96p80L40L45K62L81
4155F00m99r56L85P85J07k07Jp71K9Q05K45l29m18j47K72N26L33q27l29M6M10
4176F1J90K63n18p95N04M92K01K8p1j047L94O20K47n79r6m20J54Q49Q7p64j29
4197c29L3n9O67K64n21o08R4O22L39J4m55q23M00P89p0j29j41p31L70P38K1l23
4219A62l89l10L22P33J25o03l63j26K75N72J20n83n39M58J35K75O3k29q22N08
4239b16N17J78l13j71n82J96R98k55l94k60k3L23O01o0o46l66L40J23M08J26m22
4260A02p92O10M29K3J2o42m31M73P15J1k69o07j08K37O84L2o25l82J81K64N62
$$ plain form
4281 479 618 -95 -472 -112 150 453 517 -103 -723 58 349 318 256 -327 -779 -164 639 301 75 -31 -458
4302 -458 74 746 324 -187 -380 -299 -33 434 332 -287 -414 -71 170 382 175 -392 -757 -79 520 147
4322 147 213 -208 -364 -71 460 205 158 -178 -464 -33 550 393 -289 -315 -333 50 574 463 -395 -461 -88 321
4344 321 687 475 -299 -671 -26 531 101 108 -215 -616 160 533 64 -276 -277 -153 208 780 284 -327 -365 -104
4366 -104 39 332 418 -472 -536 -31 299 424 173 -559 -566 158 700 226 25 -304 -332 276 547 82 -307 -110
4388 -110 -248 38 644 263 -628 -590 -151 127 341 114 -515 -373 366 174 378 52 -328 -473 226 494
4408 494 167 -221 -294 -438 138 772 97 -211 -309 -243 31 552 85 -628 -201 199 356 325 -1 -692 -444
4429 -444 267 81 188 -79 -397 -299 229 635 -252 24 -170 -214 115 518 -27 -429 -242 -16 257 469 -60
$$ packed form
4281D79J39p13l77L60K62L03O4o20o20P81K91l1o2n83m52O15Q03l38k26j06m27
4302d58N32O72m22n11j93Q1K66M67j02o19j27L43K41K12k07n67l65O78N99l73
4322A47O6m21j56K93N31k55m7l36k86M31N83j57o82k6j8L83N24j11q58o6L73M09
4344C21L66k12p74l72O45N57m30Pl23m01P76L73m69l40jJ24L61N72m96o11l8K61
4366a04J43K93Q6q90o4N05L30J25k51p32pP24N42m74k01l29k8O08K71m65l89J97
4388a10j38K86O06l81q91L8M39K78K14k27o29J42P39j92K04l26l80j45O99K68
4408D94l27l88p3j44N76O34o75l08r8O6K74N21m67p13M27M00J57l1l26o91K48
4429d44P11j86J07k67l18R8N28M06q87K76j94m4L29M03n45m02J87K26K73K12n29
$$ plain form
4450 -60 -653 -388 181 468 163 -4 -470 -238 305 410 68 179 -334 -482 276 544 -60 -193 -76 -234
4470 -234 435 559 -64 -370 -106 -22 303 478 -60 -351 -204 196 294 180 -54 -470 -466 408 254 -66 -209
4491 -209 -419 -278 267 244 -113 -469 -335 58 396 525 -26 -403 -54 191 523 309 163 -470 -258 401
4511 401 145 87 -232 -412 -155 329 447 -255 -221 -253 -138 471 238 -272 -451 -296 128 213 382 -101 -479
4532 -479 -108 3 130 241 -379 -691 -145 543 285 -223 -192 -362 -66 460 368 -40 85 -363 -52 430 415
4553 415 -401 -418 107 298 185 353 -256 -431 37 248 271 146 -47 -561 5 437 298 9 -160 -224 -76
4574 -76 379 55 -142 -491 -55 -5 408 458 -374 -506 -37 218 224 331 -429 -362 99 268 180 185 -165 -483 35
4597 35 476 -29 -98 -170 -204 -157 521 253 -262 -220 -198 188 439 231 -338 -279 74 152 23 131 -259 -348 80
$$ packed form
4450f0n93K65N69K87l05j67m66K32N43J05l42J11n13j48P58K68o04j33J17j58
4470b34O69J24o23l06K64Q4L25J75n38k91J47M00R8j14k34m16MQ74j54l20j43
4491b09k10J41N45k3l57l56J34L93L38J29n51l77L49K45L32k14j46o33K12O59
4511D01k56n8l19j80K57M84J18p02L4l2J15O09k33n10j79J55M24Q5J69m83l78
4532d79L71J11J27J11o20l12N46O88k58n08L1j70K96N26r2m08J25m48L11M82j5
4553D15q16j7N25J91j13J68o09j75M68K11K3j25j93n14N66M32j39k89j69o4J48
4574g6M55l24j97l49M36N0M13N0q32j32M69K55OJ07p60O7M61J69q8Nl50l18N18
4597C5M41n05o9p2l4M7O78k68n15M2K2L86K51k08n69N9L53P8j29J08l90q9M28
$$ plain form
4620 80 484 44 11 -88 -369 94 462 123 -217 -425 -202 -75 587 257 -237 -247 25 47 460 262 -401 -166
4642 -166 52 201 167 -12 -587 -551 108 311 -47 -77 -181 -397 158 439 114 -339 -141 119 131 678 304
4663 304 -357 -190 358 287 185 332 -339 -355 223 277 253 183 -263 -308 -93 443 128 -91 -213 -321 133 531
4685 531 -7 -396 -259 -148 -80 465 -21 -404 -359 10 136 375 236 -401 -406 169 200 -5 -120 -256 -538 277
4707 277 344 -110 -151 -285 -8 51 604 -128 -465 -194 43 165 243 -16 -448 -179 121 42 90 149 -405 -442 264
4730 264 245 117 -60 -168 -85 353 513 -146 -201 19 -236 284 409 -21 -350 -178 61 102 424 23 -580
4751 -580 -132 175 169 277 23 -592 -64 240 378 124 -19 -141 8 307 516 -132 -205 -38 42 80 371 -208
4773 -208 -470 33 127 -28 352 -125 -515 -65 255 203 23 0 -174 -88 402 171 -177 -44 -47 16 409 164
$$ packed form
4620H0M04m40l3r9k81M63L68l39l40k08K23J27O62l30m94j0K72K2M13j98o63K35
4642a66K18J49l4j79n75L6O59K03l58l0j04k16N55K81l25m53J98K60J2N47l74
4663C04o61J67N48p1j02J47o71j6N78N4k4p0m46m5K15N36l15k19j22j08M54L98
4685E31n38l89J37J11O8N45m86l83M5L69J26K39j39o37nN75L1k05j15j36k82Q15
4707B77O7m54m1j34K77N9N53p32l37K71K37J22P8k59m32K69L00p9M8N9n54l7P06
4730B64j9j28j77j08Q3M38J60o59n5K20k55N20J25m30l29J72K39M1L22m01o03
4751e80M48L07oJ08k54o15N28L04J38k54j43j22J49K99K09o48p3J67Q0L8K91n79
4773b08k62N03R4j55L80m77l90M50L20n2j80k3j74Q6M90k31l48J33lO3L93k45
$$ plain form
4795 164 -179 -319 -198 -47 248 459 -213 -507 2 276 108 357 -81 -508 68 230 227 2 -128 -223 -111
4816 -111 488 167 -220 -102 -126 -8 363 298 -174 -337 -25 7 140 311 -211 -397 135 208 217 94 -291 -498
4838 -498 -46 361 224 1 -148 -407 51 513 114 -220 -236 21 160 318 328 -249 -293 -52 132 181 360
4859 360 -261 -371 53 199 139 -38 -114 -472 73 409 68 116 -72 -226 -6 419 365 -387 -88 -147 -101 113
4881 113 173 -154 -376 25 226 125 159 -96 -408 19 218 -154 139 -118 -423 55 503 63 -228 -123 -152
4902 -152 -34 472 5 -473 -144 -236 210 420 32 -240 -161 52 89 -124 31 -227 -219 125 325 12 -50 -33
4924 -33 -297 61 458 41 -134 -184 -27 -60 388 3 -144 -59 -110 148 246 72 -396 -238 98 204 18 -18
4946 -18 -257 -366 138 383 6 -274 -108 -178 31 308 25 -94 -59 117 8 200 67 -303 -317 72 176
$$ packed form
4795A64l43j40J21J51K95K11o72k94N09K74j68K49m38m27N76J62lk25j30r5J12
4816a11N99l21l87J18k4J18L71o5m72j63L12L2J33J71n22j86N32P3Rj23l85k07
4838d98M52M07j37k23j49k59M58M62l99l34j6K57J39J58J0n77m4K41J84M9J79
4859C60o21j10M24J46o0j77p6l58N45L36l41M8j88j54K20M25n4p52K99n9M6K14
4881A13O0l27k22M01K01j01L4k55l12M27J99l72K93k57l05M78M48m40k91J05k9
4902a52J18N06m67m78L29r2M46K10l88k72P9K13L7k13J55k58QL44K00l13o2J7
4924c3k64L58L97m17j75n0J57l3M48l85j47Q5n1K58R8j74m68J58L36J06j86l6
4946a8k39j09N04K45l77k80J66p0K09K77k83j19L5J76j09J92j33l70j4L89J04
$$ plain form
4967 176 123 -97 -365 -204 237 301 -22 -6 -405 -424 219 463 -51 -44 -114 -153 175 412 199 -318 -46 113 -1
4990 -1 334 196 -368 -161 99 212 103 -48 -193 -87 223 73 -21 222 -127 -294 191 147 34 -246 -143
5011 -143 -103 319 279 -100 -259 -84 146 12 283 -123 -287 -144 84 233 147 -9 -347 -275 249 340 -6 -82
5033 -82 -29 -97 57 252 -78 -231 14 -1 271 259 92 -185 -161 189 170 136 76 -278 -122 293 211 76 92 -215
5057 -215 -268 409 122 -91 91 81 -199 258 299 40 -364 -68 9 392 184 -93 -237 -24 63 115 3 -141
5079 -141 -318 -221 140 225 76 -153 -379 -160 128 194 -118 -127 -118 12 111 292 -181 -422 97 174 119 189 -134 -257
5103 -257 98 483 13 -31 -162 -356 -112 228 -39 -127 -198 -256 99 263 310 -280 -209 34 70 233 -16 -154
5125 -154 -226 264 80 101 162 -158 -280 8 381 61 160 -180 -411 -23 370 110 -15 -163 -132 -16 228 145
$$ packed form
4967A76n3k20k68J61M41O4l23J6l99j9O43K44n14Pp0l9L28K37k13n17K72J59j14
4990aL35j38n64K07K60J13j09j51j45J06L10j50r4K43l49j67M85m4j13k80J03
5011a43M0M22m0l79j59J75K30j34K71m06j64J43K28J49q6j56l38P2N24R1l46p6
5033h2N3o8J54J95l30j53K45j5K72j2j67k77K4L50j9l4o0l54J56M15q2j35J6l07
5057b15n3O77k87k13J82j0k80M57M1k59m04K96P7L83k08k77j44K13Q7N2j12j44
5079a41j77R7L61Q5j49k29k26K19K88O6l12rRJ30R9J81m73k41N19P7n5P0l23j23
5103b57L55L85m70m4j31j94K44L40k67q8p1n8L55J64M7n90P1K43L6J63k49j38
5125a54p2M90j84K1O1l20j22K88L73l20R9l40k31L88L93k60j25j48L1J16K44q3
$$ plain form
5147 145 -267 -172 99 186 250 188 -257 -296 325 305 136 -25 -119 -276 60 275 -46 89 -205 -230 22 96 75
5170 75 -182 -118 -31 250 176 29 -256 -307 11 220 225 59 -77 -211 188 112 214 -49 -73 -285 267 302 28
5193 28 -49 -89 -104 42 154 -86 -395 -302 114 70 220 -12 -200 -170 72 207 88 -65 -318 -176 120 179 -311
5216 -311 87 -133 -268 350 301 -142 -17 -120 -279 109 362 -45 -316 -191 81 41 255 136 -195 17 63
5237 63 100 204 -11 -300 -148 372 217 76 15 -4 -218 101 368 25 -92 -50 5 25 217 196 -395 -24 138
5260 138 92 76 62 -328 -159 94 -3 47 -82 -266 -199 207 130 105 -132 -156 -159 254 398 -17 54 10 77 211 240
5285 240 -122 -291 32 193 87 174 15 -363 -125 173 240 169 68 -69 -41 318 79 -241 32 -20 -98 300
5307 300 252 1 -221 -99 32 252 166 7 -354 28 192 -144 124 -35 -303 -104 178 156 -198 46 -225
$$ packed form
5147A45m12R5K71Q7O4o2m45l9O21k0j69j61r4j57L36K15l21J35k94k5K52P4k1
5170G5k57O4Q7K81p4j47k85n1L18K09Nj66j36j34L99p6J02k63k4k12N52L5k74
5193B8p7m0j5J46J12k40l09R3M16m4J50k32j88L0K42J35j19j53k53J42K96N9m90
5216c11L98k20j35O18m9m43J25j03j59L88K53m07k71J25K72m0K14j19l31K12M6
5237F3L7J04k15k89J52N20j55j41o1j9k14L19K67l43j17M2N5K0J92k1n91L71J62
5260A38m6j6j4l90J69K53r7N0j29j84O7M06p7k5k37k4lM13J44m15P1m4O7J34K9
5285B40l62j69L23J61j06Q7j59l78K38K98O7p1j01j37K8L59k39l20K73n2p8L98
5307C00m8k51k22J22J31K20q6j59l61L82J64l36K68j59k68J99K82k2l54K44k71
$$ plain form
5328 -225 -116 382 127 -214 -211 -55 -149 152 194 -42 -174 -175 -38 201 247 -166 -596 -74 294 -18 263 -387
5350 -387 -107 50 132 -32 -79 35 -200 -177 319 30 -189 5 -24 27 45 166 -55 -198 87 105 34 107 -275
5373 -275 -224 307 136 19 35 -61 -294 119 336 296 16 -19 -229 -91 90 -11 -102 -16 -28 -2 131 194 -176
5396 -176 -134 64 106 55 110 24 -139 124 146 25 -56 66 -126 74 416 82 -243 -249 -7 -175 311 56 -187
5419 -187 -128 -98 239 139 190 -290 -173 329 84 -10 -5 -173 -94 88 370 184 90 -102 -98 -26 65 190 -204 -197 -30
5444 -30 -43 210 301 -124 112 149 96 -8 -58 -198 75 227 91 78 -83 -56 -152 131 329 -34 -131 6 -220
5467 -220 -118 96 -19 -195 -98 -193 21 282 127 -69 -229 146 -138 -85 91 -306 -185 197 80 -187 1
5488 1 -169 -19 96 254 -162 -191 168 -55 130 410 44 -159 -58 -51 115 246 67 -191 -117 300 147 33
$$ packed form
5328b25J09M98k55l41LJ56r4L01M2k36j32jJ37K39M6m13m30N22L68l12K81o50
5350c87K80J57Q2j64m7J14k35K3M96k89k19J94k9N1J8J21k21j43K85J8p1P3l82
5373b75N1N31j71j17J6r6k33M13K17m0k80l5k10J38J81j01r1Q6j2K6J33O3l70
5396a76M2J98M2n1N5q6j63K63K2j21q1J22j92K00L42l34l25oK42j68M86k55k43
5419a87N9L0L37j00N1m80J17N02k45r4Nj68P9J82K82j86r4j92MP2R1J25l94PJ67
5444c0j3K53R1m25K36L7n3j04n0j40K73J52j36j3j61K7r6K83J98l63r7J37k26
5467b20J02K14j15j76R7r5K14K61j55j96j60L75k84N3J76l97J21L82j17k67J88
5488Aj70J50J15J58m16k9L59k23J85K80l66k03J01PJ66J31j79k58P4M17j53j14
$$ plain form
5510 33 109 -494 28 217 158 -68 -250 46 -246 -18 288 -192 -237 6 73 109 114 83 -318 -38 -69 19 128 51
5534 51 -214 0 121 138 151 -83 -170 -187 241 -17 -108 -54 -71 -230 21 61 -25 -37 -9 70 -3 202 -63 -148 -61
5559 -61 130 213 382 115 -266 26 427 198 60 -51 -117 -196 278 132 -87 -44 -80 33 65 211 -187 -170 -214
5582 -214 59 59 89 -155 -286 41 -23 66 9 -162 -58 -118 77 110 26 -83 -137 -53 372 -90 -83 -93 129 -220 199
5607 199 370 -39 -240 37 69 241 382 -91 -295 141 81 -41 87 -78 -167 -164 203 56 -133 57 -157 32
5629 32 203 170 -256 31 71 139 213 59 30 -246 49 45 -6 -101 -47 -384 106 188 221 107 71 -147 85 182 -49
5654 -49 -144 -140 -108 32 319 176 -45 -62 -164 63 8 158 -169 -282 72 127 4 94 -38 -410 -42 66 111
5677 111 -13 -41 -151 -22 217 151 -100 -31 -116 -133 170 239 -279 -110 -138 -93 87 7 -247 -201 171 129 107 82
$$ packed form
5510C3P6o03N22J89n9k26j82K96k92K28L06m80m5K43O7L6Nl1m01K80l1Q8J09p7
5534E1k65K14J21J7J3k34q7j7M28k58r1N4j7j59K51M0q6j2K8P9p3K05k65q5Q7
5559f1J91Q3J69k67l81K92M01k29j38j11o6p9M74j46k19M3l6J13L2J46l98J7m4
5582b14K73%L0k44j31L27o4Q9n7j71J04o0J95L3q4j09n4Q4M25m62Pj0K22l49M19
5607A99J71m09k01K77L2J72J41m73k04M36o0j22J28j65q9LL67j47j89J90k14J89
5629C2J71l3m26K87M0O8P4j54k9k76K95mn1r5N4l37M90Q2L3j14l6k18K32R7k31
5654d9r5ML2J40K87j43k21j7j02K27n5J50l27j13L54N5j23R0j32l72L68J08M5
5677A11j24k8j10J29K39o6k51O9q5j7L03O9n18J69k8M5J80q0k54M6L72m2k2k5
$$ plain form
5701 82 -352 -182 33 207 -153 91 -26 -131 53 115 -9 -78 -166 -117 101 178 97 -280 -151 166 7 -131
5723 -131 142 -202 -62 354 166 -90 47 209 3 363 173 -120 -112 32 -76 78 23 229 -152 -22 0
5744 0 -71 287 33 32 -44 -111 -22 -2 8 10 -180 137 145 -22 65 -141 -63 81 237 52 -51 -84 -194 -189 240 20
5770 20 18 -68 -37 153 82 82 -122 -158 51 30 192 132 -241 -336 213 152 91 -31 13 -76 114 188 48 -23 -148 -20
5796 -20 258 37 -100 -186 9 137 51 249 -28 -353 -2 243 290 114 -40 -326 -21 163 311 -132 121
5817 121 -53 -171 61 200 -100 -269 -100 -30 143 92 -135 -49 -102 119 -45 10 113 -325 -196 259 151 4
5839 4 -98 -271 -44 136 33 -18 -73 -160 -102 130 205 14 -169 130 -90 24 168 -79 -125 43 18 197 154
5862 154 111 -233 -66 294 -65 38 87 -252 -174 111 7 -63 -389 -19 -2 249 111 -115 -167 135 171 64
$$ packed form
5701H2m34J70K15J74l60K44j17j05J84O2j24o9q8M9K18P7q1l77J29L17j59j38
5723a31K73l44J40M16j88k56J37J62k06L60j90k93QJ44j08J54n5K06l81J30K2
5744@p1L58k54jp6o7Q9K0J0Kj90L17Qj67Q7k06P8J44J56j85j03l3j10NM29k20
5770B0kq6L1J90p1%k04l6K09k1J62o0l73r5N49o1o1j22M4q9J90P4j40p1j25J28
5796b0K78k21j37q6J95J28q6J98k77l25L51K45M7j76j54k86L05J84J48m43K53
5817A21j74j18K32J39l00j69J69P0J73n1k27Q6n3K21j64N5J03m38J29M55j08j47
5839Dj02j73K27J80j03n1n5q7N8K32P5j91j83K99k20J14J44k47m6J68k5J79m3
5862A54m3l44J67L60l59J03M9l39P8K85j04p0l26L70J7K51j38k26n2L02L6j07
$$ plain form
5884 64 168 -92 -84 -61 22 140 -18 76 -83 -150 340 139 9 -32 -227 -81 224 277 -89 -154 -178 198 80 152
5908 152 -65 -101 4 85 172 147 -134 -224 -37 86 -11 -56 -46 -272 20 195 84 1 -104 -48 -40 138 150 -326
5932 -326 -99 30 -48 16 42 -200 -271 131 138 -49 40 -41 -184 159 410 -157 0 115 -241 60 261 32 51
5955 51 -63 -113 -149 152 90 -271 -174 72 152 138 131 -184 -371 208 199 -108 200 81 -239 108 144 -43 -162 -119
5979 -119 -77 11 443 64 -117 -74 -113 -143 188 -115 -96 -120 13 6 34 60 -266 -160 55 -34 99 254 -102 41
6003 41 -6 164 -119 -64 110 -87 -7 232 -23 -190 -89 -274 144 47 -75 -354 -115 -81 -173 -27 101 -262
6025 -262 -171 101 61 -37 -99 64 -84 128 62 43 9 -290 38 115 65 115 -131 -54 -65 -31 125 142 -238 -177 150
6050 150 89 -66 222 6 -263 96 302 12 -107 -107 -130 55 151 -138 -247 32 -33 -52 84 -211 -39 -66 34
$$ packed form
5884F4J04k60QK3Q3J18j58R4j59o7M90k01j30m1j95J46L05N3l66o5k4L76j18P2
5908A52k17l6J05Q1Q7k5k81r0J87J23r7m5J0k26K92J75j11q3j05N6QJ78J2m76
5932c26K27J29p8O4K6k42p1M02Pj87Q9q1j43L43K51n67J57J15l56L01K01k29J9
5955E1j14n0l6L01o2l61R7K46Q0j4pl15j87N79rl07L08j19l20L47L6j87j19M3
5979a19M2Q8M32l79j81M3l9l0L31l03J9k4J33pK8K6l26J06K15q9J33J55l56J43
6003D1m7J70k83N5J74j97Q0K39k55j67J01j85M18r7j22k79K39L4r2J46J28l63
6025b62R1K72m0r8o2J63j48K12o6j9l4k99L28P7n0N0k46P7j1L4J56J7l80O1L27
6050A50o1j55K88k16k69L59K06k90j19%k3J85R6k89j09K79o5j9J36k95J72k7J00
$$ plain form
6073 34 30 89 80 -106 -38 -17 -31 22 -131 -163 -97 182 269 -29 -44 -181 -150 100 111 -210 -192 -1 114 274 165 12
6099 12 -35 57 39 139 43 79 -49 -16 47 127 -212 -151 -49 -244 98 196 -44 -135 165 -137 -15 119 -143 -46
6123 -46 32 -10 63 46 -11 -78 -36 -26 -27 114 -187 -136 -114 76 -4 -228 -24 -132 -12 146 -72 -115 -5 57 -38 91
6149 91 -97 -63 -138 60 35 23 36 -134 -138 9 177 -60 -139 -4 -64 48 361 30 -90 -52 -99 -169 172 54
6173 54 -100 -196 -86 61 7 -61 -38 -184 169 153 101 139 -55 68 54 90 -25 44 -39 -159 -28 97 -35 -124
6197 -124 -179 -10 -127 56 94 -35 -191 -34 308 -71 74 67 -68 23 141 2 75 -140 92 336 78 -89
6219 -89 -115 108 -132 -30 84 75 -34 -57 -164 -7 377 65 -44 22 109 45 267 -89 -89 51 147 238 -16 4
6243 4 -139 -197 200 150 19 -80 241 84 11 233 96 -264 -189 -40 100 130 -124 -121 23 204 -15 195 -112
$$ packed form
6073C4mN9rj86O8K1j4N3j53l2O6K79Q7k98j5j37L1K50J1l21J8J91J15J60j09j53
6099A2m7R2j8J00r6L6j28L3O3Q0l39O1J02j95L42R8k40r1L00l02J22J34k62R7
6123d6P8m2P3j7n7o7M2J0jJ41l01N1K2J90q0k24K04j08J20J58k18m3J10O2r5J29
6149I1j88L4p5J98k5j2J3j70mJ47J68k37p9J35o0J12L13l31j20L8m7p0L41j18
6173E4j54r6J10J47n4o8K3j46L53j6n2L8j94J23j4L6j15O9q3j20J31J25j32q9
6197a24n5J69j17J83L8j29j56J57L42l79J45pj35R1J18j39P3k15K32K44k58j67
6219h9k6K23k40J02J14rj09k3j07J57L84l12j09O6Q7o4K22l56%J40R6R1k54K0
6243Dj43n8L97n0j31r9L21j57p3K22j37l60P5J49J40L0k54LJ44J81k19K10l07
$$ plain form
6266 -112 -220 -200 122 137 97 -21 122 -139 42 314 -51 -46 -138 -155 -45 298 24 -118 -143 -120 -32 129 -31
6289 -31 -167 -143 150 -31 139 242 -50 -76 99 91 -20 220 -84 148 -24 70 -32 38 -59 67 -95 -54 37
6312 37 -100 -43 95 6 -176 -98 -175 -128 -77 -48 75 -49 -125 -99 56 180 -48 3 57 -80 184 377 57 -32
6336 -32 -100 -95 169 102 125 -228 136 95 -36 85 -59 -133 -106 133 86 88 87 40 111 263 125 -130 -35 -26 58 189 211
6363 211 -47 117 -48 -57 6 16 -88 -97 33 226 -165 -44 8 -153 -87 115 36 -8 -5 -114 -78 218 325 -63
6387 -63 68 -64 -110 84 -4 -351 46 32 -173 -38 20 -66 -133 105 128 -4 -17 88 -181 -24 294 73 -244
6410 -244 82 -266 -128 147 94 60 -246 -30 263 121 281 9 8 33 -20 131 -16 12 -202 -24 -36 -20 48
6433 48 235 -69 -179 200 75 -316 -63 -25 74 86 -53 -32 -70 85 -95 -53 24 -66 -120 209 -105 257 -11
$$ packed form
6266a12j08K0L22J5m0j18J43k61J81K72l65Nr2j7J10L43k74j42k5K3Q8J61j60
6289c1j36K4K93j81J70J03k92k6J75qj11K40l04K32j72R4j02P0r7J26j62M1R1
6312C7j37N7J38q9j82P8p7M7N1K9J23j24p6K6J55J24k28N1N4j37K64J93l20q9
6336c2o8NK64o7K3l53L64m1j31J21j44p4K7K39m7Kjm7P1J52j38k55R5RQ4J31K2
6363B11k58J64j65rO3J0j04rJ30J93l91J21N2j61O6K02p9m4Lj09L6K96J07l88
6387f3J31j32m6J94q8l47L97j4k05J35N8q6o7K38K3j32j3J05k69J57L18k21l17
6410b44L26l48J38K75n3l4l06K16K93j42J60k72jK5n3J51j47K8k14J78j2J6O8
6433D8J87l04j10L79j25l91K53L8R9J2j39K1l8J55j80M2P7r0n4L29l14L62k68
$$ plain form
6456 -11 103 -323 235 -50 -99 -103 63 68 -226 116 116 -264 -145 -25 -172 180 99 -233 -29 138 139 48 -138 -170
6480 -170 -25 -43 18 71 -45 68 101 12 41 -25 -224 -127 -85 -67 93 17 21 -43 97 -106 25 -25 -54 71 -19 32
6506 32 51 -10 -11 19 23 113 -141 -201 -116 -194 184 61 -65 -168 -131 -75 -19 262 128 -92 61 -53 135 -149 -64
6531 -64 110 -160 -35 192 -67 248 -123 2 -99 -22 272 -58 -53 105 -4 105 103 -91 -80 -117 208 -38 -35
6554 -35 -103 56 128 -63 132 105 -242 -258 -31 333 66 -62 -268 -26 125 210 -33 -19 -131 115 -227 73
6576 73 24 6 66 -7 89 78 0 -308 50 14 -94 166 -114 -77 73 154 -70 21 -174 -210 -172 -70 -68 35 15 -13
6602 -13 -76 298 163 -72 -197 129 -1 -25 133 112 -183 145 -26 -15 -8 9 -122 -55 -29 24 2 184 12 61
6626 61 68 2 -170 -57 -115 -114 42 118 -125 -129 168 13 122 -58 -221 -226 -98 16 107 222 119 -165 -25 245
$$ packed form
6456a1J14m26N58k85m9mJ66Nk94L42%l80J19J20j47L52q1l32K04J67Jr1j86l2
6480a70J45j8O1N3j16J13L3q9K9o6j99R7M2J8J60p6Mo4J40k03J31n0k9J25r0N1
6506C2J9o1jL0MR0k54o0Q5p8L78j23j26j03L7N6N6K81j34k20J53j14J88k84Q5
6531f4J74k70J25K27k59L15l71J25j01P7K94l30NJ58j09J09kj94J1l7L25k46L
6554c5o8J59P2j91J95k7l47j6K27L64k67j28k06K42J51Q5k43J4j12K46l42L00
6576G3m9j8O0p3R6j1p8l08L58l6j08K60k80L7J50Q1k24R1j95l6L8J02KJ03k0k8
6602a3o3L74j35k35j25L26j30k4J58k1k95L28j71J1PJ7j31O7K6N3k2J82j72M9
6626F1Po6j72J13n8JJ56P6k43mK97j55J09j80j63nJ28J14R1J15j03k84J40K70
$$ plain form
6650 245 155 36 -39 -36 61 19 42 -44 -110 89 -129 287 237 -133 -135 -153 91 133 -110 -110 -265 -42 110 53 -8 77
6676 77 -212 -106 99 -8 -9 -35 -171 -83 311 92 -90 -221 -91 -138 83 258 -129 -187 165 174 -34 40 -64
6699 -64 -261 -229 -28 45 107 217 -64 39 31 -114 -138 83 -97 -121 167 27 -190 -161 115 139 -74 -12 -212 78
6723 78 -3 105 -39 -1 -153 39 53 192 -113 60 -27 -117 195 60 122 -91 23 155 -16 98 70 -146 -14
6746 -14 -47 -89 -107 120 -293 -142 190 -205 -60 247 -117 -311 -93 386 -30 -196 84 -214 -34 188 103 -98
6768 -98 -192 111 82 -78 196 -238 -160 102 -189 -43 54 53 -242 96 120 7 -48 -149 -53 -107 129 -37 40 -41
6792 -41 -22 116 261 122 -214 -78 -26 65 -165 -20 -62 -59 64 2 211 -34 -417 -277 124 54 144 7 19 -114
6816 -114 225 170 37 148 119 -77 -46 232 -140 -182 -70 -80 154 179 146 -72 -41 181 6 132 38 -118 -158
$$ packed form
6650B45r0j19p5LR7m2K3q6o6J99k18M16n0l70kj8K44M2k43%j55K23J52n7o1Q5
6676G7k89J06K05j07jk6j36Q8L94k19j82j31J30m7K21J75l87n8L52Rk08P4j04
6699f4j97L2K01P3O2J10k81J03qj45k4K21j80k4K88j40k17K9K76K4k13O2k00K90
6723G8q1J08j44L8j52J92J4J39l05J73q7r0L12j35O2k13J14J32j71J14k8k16J32
6746a4l3m2j8K27m13J51L32l95J45L07l64j94K18M79m16j66K80k98J80K22q5k01
6768i8r4L03k9j60K74m34P8K62k91J46R7jk95L38K4j13n5j01R6n4K36j66P7q1
6792d1J9J38J45j39l36J36N2R1k30J45m2LJ23o2K09k45l83J40M01p0R0j37J2j33
6816a14L39n5j33J11k9j96L1K78l72m2J12j0K34K5l3k18L1K22j75J26r4j56m0
$$ plain form
6839 -158 10 251 58 -91 128 -8 -90 127 31 -20 -100 -137 145 30 -6 93 38 -40 -93 238 204 -184 -14 69
6863 69 -15 -30 -115 7 14 73 56 -195 -192 -71 -76 66 116 -205 -103 152 -154 29 187 -138 -135 6 121 29 121 131
6889 131 -250 70 -40 -81 -7 66 65 6 -18 -65 -78 -57 -126 -86 192 180 20 -185 -90 -209 146 86 -14 -160 36
6914 36 215 99 63 162 -51 -83 -138 183 -60 31 -134 36 -156 124 -309 -14 89 -75 181 -96 -165 -36
6936 -36 153 41 -46 -66 -36 -9 196 -74 -130 -118 82 -210 79 124 75 -3 38 74 -154 246 -32 -216 -81 15
6960 15 -96 55 177 -37 -184 84 -121 13 119 106 -38 -12 25 150 17 -118 -105 -20 62 85 196 -72 -40
6983 -40 72 117 146 -84 28 76 -167 52 47 -136 -65 -59 5 -102 21 -3 -70 -149 51 -40 119 165 -85 -31 -173
7008 -173 -68 -146 -81 -69 -99 -110 19 -44 -3 68 55 1 -68 -69 1 27 -28 71 -54 74 72 -77 44 72 -61 3 -109
$$ packed form
6839a58J68K41j93j49K19j36q2K17r6n1q0l7K82j15l6R9n5p8n3L31l4l88J70Q3
6863F9q4j5q5J22PN9j7k51LJ21nJ42N0l21J02K55l06J83J58l25LJ41J15r2R2J0
6889A31l81L20j10m1P4P3jn9k4m7j3K1o9M0K78j2j60k05R5j19L55o0j00j46J96
6914C6J79j16l6R9k13l2n5L21k43R1j65J70j92K80m33K95J03j64K56k77o9J29
6936c6J89j12q7k0L0K7K05k70n6J2K00k92K89M5m9p8M1L6k28M00k78j84J35R6
6960A5j11J51J22k14j47K68k05J34J06j3j44K6L7J25j33j35J3Q5Q2K3J11k68L2
6983d0J12M5K9k30J12M8k43K19nj83P1OO4j07J23k4o7p9K00r1J59M6k50N4j42
7008a73J05p8O5J2l0j1J29o3M1P1j3n4o9jP0K6n5R9j25J28kj49J21K8j33O4j12
$$ plain form
7035 -109 -59 156 -173 43 -23 34 -23 162 -60 -36 -94 -11 15 75 -2 -108 -17 -59 74 125 -16 -7 58 -4 248 90
7061 90 -46 179 128 268 148 201 -111 68 -59 28 63 -11 -157 -144 -63 151 52 84 8 -55 -70 144 -32 -74 -163
7086 -163 -146 70 73 -116 -47 -35 -12 6 288 -13 -10 116 -34 -32 -61 14 52 -82 64 115 97 -21 -103 91 159 110
7112 110 -219 38 55 -179 54 57 -86 -45 94 -39 7 172 247 -148 -79 64 -127 25 -125 -96 -90 129 151 187
7136 187 -87 -12 -290 125 -137 -58 -212 -220 80 -36 145 -220 -136 26 -45 137 -27 2 -94 -5 -66 -53 161 -58
7160 -58 -147 14 46 -167 -28 1 0 143 64 15 -139 -48 16 -16 74 -38 -169 89 -100 -108 107 42 121 166 -40 67
7186 67 -45 -157 376 -79 -272 -55 -19 -183 267 -117 -154 190 4 82 -100 -31 -85 160 -127 -123 10 6 110
7209 110 -21 139 33 -152 127 87 -20 72 -250 -202 -68 77 67 -21 37 -47 -67 -45 53 -28 -194 -54 -261 22
$$ packed form
7035a09N0K15l29K16o6N7n7J85k22K4n8Q3K6O0p7j06R1m2J33N1j41RO5o2K52j58
7061I0j36K25n1J40j20N3l12J79j27Q7L5p4j46J3Q1K14r9L2p6o3j5K14j76m2q9
7086a63J7K16Lj89O9J2K3J8K82l01LJ26j50Kk9P5L8j34J46N1j8j18q2J94O8m9
7112A10l29K57J7k34K33Lj43M1J39j33M6J65P5l95O9J43j91J52j50K9OK19K2L6
7136A87k74P5k78M15k62P9j54qL00j16J81l65Q4J62p1J82j64K9r6Q9o1J3K14k19
7160e8q9J61L2k13J39K9jJ43p9m9j54R1O4l2R0j12j31K58j89qK15o5P9M5k06J07
7186F7j12j12N33m55j93K17L6j64M50l84l7L44j86P8j82O9n4K45k87MJ33mJ04
7209A10j31J60j06j85K79m0j07R2l22M8J34J45j0q8N8q4k0K2R8q1j66J40k07K83
$$ plain form
7233 22 101 -109 -118 64 110 -12 94 57 19 -2 69 26 18 -124 -67 -111 176 63 -121 57 -150 42 6 34 -114
7258 -114 83 -77 -143 -53 117 -21 138 216 -21 -89 -86 5 40 -84 87 -163 -84 -76 -72 69 -32 24 -36 10 66 -143
7284 -143 77 109 -28 68 -19 175 -208 2 -141 -179 162 50 -54 7 -119 -65 -52 45 -99 -59 27 -27 -100 356
7308 356 32 -183 -103 161 -103 112 103 -129 41 -92 40 38 -56 -115 0 21 -64 -112 29 96 66 -47 148 55
7332 55 38 -30 52 11 200 14 88 -37 -31 -28 -4 74 -92 45 -124 22 11 97 -68 -116 103 57 -92 4 -36 -27 95
7359 95 158 -123 -117 14 45 110 5 126 -108 -177 -161 91 199 -32 -76 -214 87 127 30 95 -57 -174 86 154
7383 154 -119 192 -51 33 -100 40 -257 -140 154 68 -93 -39 -154 -175 149 3 11 78 109 -75 2 46 -72
7406 -72 71 100 41 -57 146 32 179 -56 26 43 -108 -81 180 90 123 -94 94 -17 -38 -75 -161 124 -121 87
$$ packed form
7233B2P9k10rJ82M6j22J06l7l8k1P1m3qj42N7m4K87j13j84J78k07J92l6K8j48
7258a14J97j60o6R0J70j38J59P8k37o8LR1L5j24J71k50P9QMJ41j01N6o0M6N6k09
7284a43K20L2j37R6q7J94l83K10j43l8L41j12j04O1j26N4J3R7j44M0Q6n4p3M56
7308C56l24k15Q0K64k64K15rk32J70j33J32kr4n9J15K1q5m8J41O7l0j13J95r3
7332E5j7o8Q2m1J89j86P4j25OLK4P8j66J37j69J46j1Q6j65m8K19m6j49R6m0RJ22
7359I5O3k81OJ31L1O5j05J21k34o9J6K52J08k31m4j38L01M0r7O5j52j17K60O8
7383A54k73L11k43Q4j33J40k97J17K94q6j61N4j15k1L24j46QO7L1j84P7M4j18
7406g2J43K9n9r8K03j14J47k35Q2J7j51K7K61r0L3k17J88j11k1l7q6K85k45K08
$$ plain form
7430 87 -56 -40 -129 78 91 46 141 287 175 12 62 -66 -36 71 20 -38 -19 125 -227 15 -63 63 302 -42
7454 -42 -45 -148 52 153 61 112 -88 -13 157 23 1 246 -65 99 103 181 -6 53 93 -74 38 -1 -26 -168 66
7479 66 47 88 81 167 -42 128 31 11 -188 -127 -27 -152 132 96 -76 120 -164 -81 115 76 41 58 181 -99 -21
7504 -21 98 99 -81 6 11 -34 -100 40 -68 -52 261 36 -196 271 -63 -18 37 -12 -106 -99 -134 -53 82 53 -116 -230
7530 -230 -66 144 32 80 -64 59 -116 116 121 110 -17 58 87 131 82 -42 62 -215 67 106 0 -87 -70 -122
7554 -122 -127 46 191 -282 -6 168 5 -55 160 -2 19 219 159 -58 -235 -98 -58 -23 -45 -213 -111 -138 -67
7577 -67 -63 251 19 -149 10 77 173 100 44 -129 -103 -2 -17 -129 217 -6 -131 120 114 6 69 -16 -239 107
7601 107 119 -114 109 -2 24 105 32 -111 -84 40 75 113 49 81 -107 13 131 64 -18 132 -186 -120 282 62
$$ packed form
7430H7j43J6q9K07J3m5R5J46j12j63N0j28L0J07n1n8J9J44l52K42p8J26K39l44
7454d2lj03K00J01r2N1k00P5J70j34k2K45l11J64MP8j87N9M0j67J12l9k5j42K34
7479F6j9M1pQ6k09J70r7k0j99O1J00j25K84l6j72J96k84Q3J96l9l5J7J23k80P8
7504b1J19Jj80Q7Nm5o6J40j08J6L13k25k32M67l34M5N5m9r4Pl5Q1J35k9j69j14
7530b30J64K10j12M8j44J23j75K32Nj1j27P5K9M4m9j24J04k77K82L9j06q7J7n2
7554a22nJ73J45m73K76J74j63o0K15j62K1K00o0k17j77J37M0L5k2j68J02k7P1
7577f7ML14k32j68J59O7R6p3n6j73K6J01j5j12L46k23j25K51oj08O3q5k23L46
7601A07J2k33K23j11K6Q1p3j43K7J24L5L8o4L2j88J20J18o7q2J50l18O6M02k20
$$ plain form
7625 62 -25 80 131 -151 -64 -117 1 122 -165 -158 125 86 165 20 123 -66 -109 41 52 -123 74 165 -5 35
7649 35 165 -214 54 166 49 25 7 -85 -18 -21 172 -91 -38 -19 -90 -175 147 -51 -288 203 107 -96 -74 67
7673 67 -77 170 -56 213 -77 162 17 63 -139 -145 -129 -51 79 -154 -120 182 -9 -5 -46 27 -8 123 131 -232 104
7698 104 4 -135 31 -61 -134 -56 53 -118 -9 -11 104 68 -59 185 -10 281 -239 -88 171 25 -1 -223
7720 -223 74 -138 145 181 -10 -222 156 14 32 67 -150 -86 -50 66 -37 -81 -32 -17 34 127 -61 -144 -86 47
7744 47 73 -12 -71 -161 -105 -38 85 -25 45 -22 -143 -20 -12 99 -12 -151 18 -40 153 -142 -223 125 -87 9 217
7769 217 310 91 -128 -60 -229 194 31 -40 -104 -113 183 -28 -80 56 -62 105 261 65 242 -41 -44 134 147
7792 147 -50 -8 105 -89 -151 34 9 83 -120 113 -123 -21 325 -84 49 228 -20 -10 121 -73 15 51
$$ packed form
7625F2q7J05N1k82Q7n3J18J21k87PK83l9P9j45J03j89m3J50J1j75J97R1j70M0
7649C5J30l79K68J12j17k4j8r2O7lJ93k63N3J9p1q5L22j98k37M91r6k03K2J41
7673F7j44K47k26K69k90K39j45M6k02oJ6P8J30k33L4L02j91Mm1P3l5J31Ql63L36
7698A04j00j39J66r2p3P8J09j71J09kJ15l6j27K44j95K91n20J51K59j46k6k22
7720b23K97k12K83L6j91k12L78j42J8L5k17O4L6J16j03m4M9J5N1R3j88q3N8J33
7744D7K6q5n9r0N6O7J23j10P0o7j21J23QJ11j11j39J69n8J93k95q1L48k12R6K08
7769B17R3k19k19O8j69M23j63p1o4rK96k11n2J36j18J67J56j96J77k83lJ78J3
7792A47j97M2J13j94o2J85k5P4k03K33k36J02L46m09J33J79k48J0J31j94Q8L6
$$ plain form
7814 51 31 -272 -115 109 -154 182 175 102 -19 -81 -95 -22 62 132 -39 168 229 -68 159 239 126 -103 71 29
7838 29 -12 123 -49 -154 149 -54 -59 -172 58 -29 84 48 -67 -125 -7 -73 -105 197 -26 32 -85 3 -83 34
7862 34 -3 -206 -108 -188 135 28 46 142 78 99 4 -8 157 -51 -31 -91 205 -126 -117 25 142 -65 -127 138 11
7887 11 -156 45 111 201 57 -220 -113 263 84 -95 241 -37 184 -37 -66 -49 93 53 -187 41 51 89 -137
7910 -137 -77 -187 43 -35 64 -78 -91 -153 220 120 -71 -147 37 64 -86 -113 68 75 20 82 65 -3 -129 -100 -203
7935 -203 -203 109 237 -122 -81 45 164 62 64 92 57 -16 107 -75 24 131 16 53 79 36 -12 -36 26 32 75 -148
7961 -148 9 -87 9 -175 108 66 -128 -62 58 80 242 158 -18 -74 154 -17 -105 52 -60 -21 87 -171 37
7984 37 52 35 -184 -51 200 158 -5 -103 163 157 -49 36 101 36 -39 116 -79 165 -160 -63 -79 -56 -89 -70 6 49
$$ packed form
7814E1k0l03J57K24k63L36pp3j21o2j4P3Q4P0j71K07O1k97K27Q0j13k29J74m2
7838B9m1J35j72j05L03k03nj13K30q7J13l6j15n8J18o6l2L02k23N8j17Q8q6J17
7862C4l7k03R8q0L23j07J8R6o4K1r5j2J65k08K0o0K96l31RJ42J17k07o2K65j27
7887A1j67K01O6R0j44k77J07L76j79j79L36k78K21k21k9J7J42m0k40K28J0L8k26
7910a37O0j10K30p8R9j42j3o2L73j00j91p6J84K7j50k7J81Pn5O2j7o8j26K9j03
7935b03%L12J28l59M1J26J19j02KK8l5p3J23j82R9J07j15L7K6m3m8k4O2OM3k23
7961a48J57r6R6j84K83m2j94O6J20K2J62q4j76n6K28j71q8J57j12L9J08k58K08
7984C7J5j7k19J33K51m2j63r8K66ok06Q5O5o5p5J55j95K44l25R7j6K3l3J9P6M3
$$ plain form
8010 49 208 -306 23 -15 210 228 75 229 -54 -59 160 -5 1 -18 -7 51 59 65 5 158 13 -179 157 56 89
8035 89 -81 -12 -76 -327 -7 -16 145 -154 65 117 -161 -119 -22 -69 -210 59 245 140 -18 -194 -313 67 42
8058 42 -41 33 -64 -33 124 41 26 50 -101 18 -22 2 -96 -158 108 89 99 -35 -110 -143 -77 -136 48 -68 27 59 -12
8085 -12 70 89 -178 -159 -39 -62 154 -101 -24 -63 -14 -76 151 -49 -108 -36 -16 150 31 -12 128 -57 -6 44 60
8110 60 181 -33 -39 -19 61 31 -249 -201 12 -31 26 -59 -81 -50 17 50 100 111 58 -140 121 163 -68 90 -87 41
8136 41 -13 123 -110 -40 -199 -94 -37 124 214 6 30 -14 -99 113 66 -55 119 -62 -122 95 -59 -78 -101 -71
8160 -71 7 -143 -92 -71 -95 -105 79 -58 -112 -23 -88 153 -30 -59 -65 -14 -54 78 14 169 -92 64 45 -135 47
8185 47 50 -15 -191 30 85 -76
$$ packed form
8010D9J59n14L29l8K25J8j53J54k83nK19j65Oj9J1N8QOo0J53j45j92L36j01L3
8035H9j70O9o4k51L20rJ61k99K19N2k78M2R7m7j41K69J86j05j58j76j19L80k5
8058D2q3P4r7L1J57q3j5K4j51J19m0K4r8o2K66j9J0j34p5l3O6n9J84j16R5L2p1
8085a2Q2J9k67J9J20k3K16k55P7l9M9o2K27k00n9P2K0J66j19m3J40j85N1N0J6
8110F0J21k14oK0Q0l0k80M8K13m3N7q5k2L1O7L3N0J1n3j98K61M2k31J58j77J28
8136D1n4J36k33P0j59J05N7J61R0k08K4m4q5K12m7j21J74j81o0K17j54j9k3L0
8160g1P8j50N1K1k4j0J84j37n4Q9o5K41j83k9oN1m0J32o4J55k61J56j9j80J82
8185D7Lo5j76K21N5j61
8191g6
$$ Imaginary data points
##PAGE= N=2
##DATA TABLE= (X++(I..I)), XYDATA
$$ plain form
0 0 0 0 0 0 0 0 -8 8 -8 8 -16 16 -16 24 -27 32 -40 48 -56 65 -76 88 -103 118 -134 155 -177 200 -226 255
30 255 -289 322 -359 402 -450 500 -557 617 -686 759 -841 928 -1029 1140 -1262 1402 -1561
47 -1561 1740 -1949 2193 -2482 2833 -3268 3826 -4568 5609 -7174 9785 -14951 29036 -146308
61 -146308 -444850 -36095 283452 105967 -202889 -121792 94186 64353 -105421 -41172 125228
72 125228 52690 -160484 -113364 93143 73638 -128788 -126875 66846 122300 -24547 -91454
83 -91454 17474 80815 -22194 -70128 60074 124457 -43933 -182184 -59191 133506 126281
94 126281 -26906 -112273 -62056 19568 40491 21716 1671 -37942 -72580 -34473 39833 50160
106 50160 7931 -18878 -21824 -5745 28380 32251 -17123 -58565 -39675 17482 51831 18295
$$ packed form
0@%%%%%%qJ6j6J6k4L2l2M0n1N9p2Q8j04J21j41J64j91K21k52K89l32L77m26M81
30B55n44O11o81P61q52R50j057J174j303J445j600J769j957K169k402K664k963
47a561L301l689M142m675N315o101P094q394J0177j2783J6959k4736M3987j75344
61a46308k98542M08755L19547j77485l08856Q1097K15978k9833j69774O4249J66400
72A25228p2538k13174M7120K06507j9505k02426J913J93721N5454j46847o6907
83i1454J08928O3341j03009m7934J30202O4383j68390j38251J22993J92697p225
94A26281j53187q5367N0217Q1624K0923j8775k0045l9613l4638L8107P4306J0327
106E0160m2229k6809k946J6079L4125L871m9374m1442J8890N7157L4349l3536
$$ plain form
118 18295 -47060 -49295 25092 90962 89612 21914 -63110 -64404 41362 110689 44040 -49700
130 -49700 -48137 6348 28258 25510 42155 51106 -10682 -85235 -28265 109446 96673 -67764
142 -67764 -116952 23673 120891 44406 -55065 -33079 33154 17263 -28249 7470 41635 -51538
154 -51538 -135859 -26648 125751 68763 -102173 -112417 37129 109871 22876 -54213 -7863
165 -7863 35524 -25638 -54625 46236 102378 -9227 -108995 -29623 104389 93960 -34619
176 -34619 -97354 -26122 49400 23631 -30628 -31325 -24327 -36091 -12238 34510 26495 -32791 -69215
189 -69215 -42937 17460 39830 -7396 -62209 -56944 -7288 40005 50802 9970 -37202 -25041
201 -25041 22872 40304 27790 4151 -31229 -45387 -4221 50298 50481 -7869 -60274 -34186
$$ packed form
118A8295o5355k235P4387O5870j350o7698q5024j294J05766O9327o6649r3740
130d9700J563N4485K1910k748J6645Q951o1788p4553N6970J37711j2773j64437
142f7764m9188J40625R7218p6485r9471K1986O6233j5891m5512L5719L4165r3173
154e1538q4321J09211J52399n6988j70936j0244J49546P2742q6995p7089M6350
165g863M3387o1162k8987J00861N6142j11605r9768P9372J34012j0429j28579
176c4619o2735P1232P5522k5769n4259o97O998j1764K3853M6748q015n9286l6424
189f9215K6278O0397K2370m7226n4813N265M9656M7293J0797m0832m7172J2161
201b5041M7913J7432j2514k3639l5380j4158M1166N4519J83n8350n2405K6088
$$ plain form
213 -34186 48334 71224 1808 -56133 -41278 -154 27717 35488 8453 -34173 -37506 9368
225 9368 58894 53808 -11290 -59434 -25818 32228 34960 4614 -15379 -29203 -23750 18999 54749
238 54749 33465 -21121 -45240 -10611 40946 38836 -9266 -31033 -18147 -6374 18215 53428
250 53428 34743 -35262 -55403 12114 76915 46141 -46593 -75975 -2375 57785 25398 -21649
262 -21649 -13345 375 -10994 -3057 30106 31636 -20200 -67096 -37631 41037 56129 -15094 -62444
275 -62444 -27487 25289 39281 21890 -11332 -37099 -28356 5942 33228 26254 -19551 -54973
287 -54973 -22156 42690 52713 5436 -35346 -33507 3423 33831 18800 -17874 -27215 -15752
299 -15752 -5610 14087 33126 14912 -27195 -40111 -1744 50668 45039 -30497 -75971 -20715
$$ packed form
213c4186Q2520K2890o9416n7941J4855M1124K7871P771k7035m2626l333M6874
225I368M9526n086o5098m8144L3616N8046K732l0346j9993j3824N453M2749L5750
238E4749k1284n4586k4119L4629N1557k110m8102k1767J2886J1773K4589L5213
250E3428j8685p0005k0141O7517O4801l0774r2734k9382P3600O0160l2387m7047
262b1649Q304J3720j1369P937L3163J530n1836m6896K9465P8668J5092p1223m7350
275f2444L4957N2776J3992j7391l3222k5767Q743L4298K7286o974m5805l5422
287e4973L2817O4846J0023m7277m0782J839L6930L0408j5031l6674r341J1463
299a5752J0142J9697J9039j8214m2107j2916L8367N2412n629p5536m5474N5256
$$ plain form
311 -20715 51898 45244 -9374 -35677 -19835 10151 26727 22436 6969 -17346 -39041 -18189
323 -18189 33166 39644 -9319 -37728 -15678 15143 28238 21846 -2871 -26922 -27509 402 35840
336 35840 30445 -27725 -59465 -7355 55020 42628 -11647 -36071 -19368 10348 26807 18794
348 18794 -2838 -26440 -35461 -3959 44591 40636 -14821 -39994 -11653 19796 25304 10791 -13193
361 -13193 -28647 -21792 4086 31287 26135 -22385 -49787 -4788 50030 35235 -22285 -46963
373 -46963 -20727 20167 29853 3267 -18583 -16945 -10414 2185 29306 33944 -4225 -39409 -28464
386 -28464 15186 45515 23163 -29950 -42657 2030 39112 31194 2204 -20219 -20695 4218 26914
399 26914 19955 -6687 -30041 -27246 11460 42744 18030 -28145 -32332 -719 22676 22167 1798
$$ packed form
311b0715P2613o654n4618k6303J5842K9986J6576m291j5467k4315k1695K0852
323a8189N1355O478m8963k8409K2050L0821J3095o392k4717k4051n87K7911L5438
336C5840n395n8170l1740N2110O2375j2392n4275k4424J6703K9716J6459q013
348A8794k1632k3602r021L1502M8550l955n5457k5173K8341L1449N508j4513k3984
361a3193j5454O855K5878K7201n152m8520k7402M4999N4818j4795n7520k4678
373d6963K6236M0894R686k6586k1850J638O531J2599K7121M638l8169l5184J0945
386b8464M3650L0329k2352n3113j2707M4687L7082p918k8990k2423m76K4913K2696
399B6914o959k6642k3354K795L8706L1284k4714m6175m187L1613K3395n09k0369
$$ plain form
412 1798 -20952 -26398 -14093 7347 29893 22116 -23277 -44371 -4855 40616 34519 -7584 -36988
425 -36988 -24083 15674 32753 11295 -12270 -17109 -7629 14901 33612 17990 -17030 -27826
437 -27826 -8086 18475 28015 4487 -29317 -31433 -2055 21934 23868 2079 -30673 -36176 -2016
450 -2016 27706 17268 -16465 -39366 -26255 13952 32438 6861 -21570 -21345 -4360 15306 25777
463 25777 10222 -17877 -24734 -5090 23618 35776 9779 -28613 -25557 13223 34270 20779
475 20779 -6693 -27823 -23175 6188 25952 15359 -12174 -31866 -19444 19853 35406 2963
487 2963 -29029 -21833 2568 17690 16265 -1139 -18896 -17969 -980 20487 29137 4884 -31489
500 -31489 -27288 13205 34498 16401 -14541 -29849 -14532 18461 30732 11715 -12503 -20938
$$ packed form
412A798k2750n446J2305K1440K2546p777m5393k1094L9516M5471o097m2103k9404
425c6988J2905L9757J7079k1458k3565m839R480K2530J8711j5622l5020j0796
437b7826J9740K6561R540k3528l3804k116K9378K3989J934k1789l2752n503L4160
450b016K9722j0438l3733k2901J3111M0207J8486k5577k8431K25J6985J9666J0471
463B5777j5555k8099o857J9644K8708J2158k5997l8392L056L8780K1047j3491
475B0779k7472k1130M648K9363J9764j0593k7533j9692J2422L9297J5553l2443
487B963l1992P196K4401J5122j425j7404j7757R27J6989K1467Q650k4253l6373
500c1489M201M0493K1293j8097l0942j5308J5317L2993J2271j9017k4218q435
$$ plain form
512 -20938 -7361 21126 30122 4571 -20085 -16416 2402 19534 23407 4040 -20495 -17597 7748
525 7748 25792 19636 -9472 -33972 -21000 13039 23228 4999 -19093 -32408 -19154 14761
537 14761 27632 2554 -26957 -29474 -5623 22301 23459 -3915 -21947 -11618 7065 21565
549 21565 24582 4930 -19718 -14442 14045 29804 17463 -11767 -28429 -9669 21707 24241 1126
562 1126 -19821 -25208 -9515 17418 20532 -7405 -29902 -24660 -2330 17426 15514 -8576 -24019
575 -24019 -14552 4528 18859 19401 -3203 -25983 -14440 16835 28835 12849 -12516 -22928 -3096
588 -3096 24936 25572 1747 -17975 -19944 -1512 23348 21542 -7780 -25245 -14403 6729 20601
601 20601 14821 -8584 -22574 -11197 8816 19342 13371 -10222 -26885 -10577 18282 23261 4574
$$ packed form
512b0938J3577K8487Q996k5551k4656L669J8818J7132L873j9367k4535K898K5345
525G748J8044o156k9108k4500J2972L4039J0189j8229k4092j3315J3254L3915
537A4761J2871k5078k9511k517K3851K7924J158k7374j8032J0329J8683J4500
549B1565L017j9652k4648N276K8487J5759j2341k9230j6662J8760L1376K534k3115
562A126k0947n387J5693K6933L114k7937k2497N242K2330J9756j912k4090j5443
575b4019R467J9080J4331N42k2604k2780J1543L1275J2000j5986k5365j0412J9832
588c096K8032O36k3825j9722j969J8432K4860j806k9322j7465J0842K1132J3872
601B0601n780k3405j3990J1377K0013J0526n971k3593j6663J6308K8859M979j8687
$$ plain form
614 4574 -17298 -23960 -4083 22072 20174 -5248 -23107 -19676 2005 23235 16746 -11722 -23765
627 -23765 -9170 10066 19871 12889 -8920 -21270 -6851 15216 23102 11888 -11773 -22098 -1523
640 -1523 23958 22210 374 -17407 -18808 919 22504 16538 -9468 -23590 -15893 4525 19931
653 19931 10283 -16167 -24898 -8890 9181 16055 7271 -13735 -22284 -4646 17307 20809 6200
666 6200 -14355 -19274 3136 25570 20389 -1669 -16041 -13554 6756 25906 16611 -9968 -21124
679 -21124 -9279 10436 20457 7724 -16633 -21893 -5080 10850 14446 3471 -16558 -22685 -3088
692 -3088 16727 15358 -1888 -19090 -19103 3826 23024 13597 -8177 -18600 -11770 8334 23303
705 23303 11404 -13913 -20904 -6156 12812 19772 5694 -17088 -19680 -272 15087 15135 1380
$$ packed form
614D574k1872o662J9877K6155j898k5422j7859L431K1681K1230o489k8468j2043
627b3765J4595J9236R805o982k1809j2350J4419K2067P886j1214k3661j0325K0575
640a523K5481j748k1836j7781j401J9727K1585n966k6006j4122P697K0418J5406
653A9931r648k6450q731J6008J8071O874q784k1006q549J7638K1953L502j4609
666F200k0555m919K2410K2434n181k2058j4372K487K0310J9150r295k6579j1156
679b1124J1845J9715J0021j2733k4357n260J6813J5930L596j0975k0029o127J9597
692c088J9815j369j7246j7202j3K2929J9198r427k1774j0423O830K0104J4969
705B3303j1899k5317o991J4748J8968O960j4078k2782k592J9408J5359M8j3755
$$ plain form
718 1380 -17296 -19143 2061 19568 12811 -5157 -18208 -14306 7277 21807 9633 -11754 -18401
731 -18401 -8619 9680 20080 6454 -16696 -19159 -2227 13692 17262 2467 -18103 -17958 2703
744 2703 16700 13414 -1636 -17386 -15260 6974 21793 12219 -6624 -16560 -9653 11387 22860
757 22860 8031 -13015 -16017 -3531 13443 20020 4526 -16127 -15531 2085 14959 14926 -395
770 -395 -18572 -15829 5785 17769 10241 -5840 -17417 -11248 10254 19926 6324 -10892 -15986
783 -15986 -7285 11548 19935 4048 -15377 -15321 -778 14704 17922 1163 -17936 -14887 3924
796 3924 15319 12486 -2773 -18723 -14091 7769 18296 8010 -8432 -17543 -9269 11375 17445
809 17445 1141 -14401 -14941 -3623 12133 16396 -326 -17069 -13397 2196 14518 13587 -3833
$$ packed form
718A380j8676j847K1204J7507o757j7968j3051L902K1583J4530j2174k1387o647
731a8401R782J8299J0400j3626k3150k463J6932J5919L570j4795k0570J45K0661
744B703J3997l286j5050j5750K126K2234J4819r574j8843r936O907K1040J1473
757B2860j4829k1046l002J2486J6974O577j5494k0653N96J7616J2874l3j5321
770c95j8177K743K1614J1984p528j6081j1577O169K1502R672j3602j7216n094
783a5986Q701J8833Q387j5887j9425N6J4543J5482L218j6759j9099L049J8811
796C924J1395k833j5259j5950M632K1860J0527j0286j6442r111Q274K0644O070
809A7445j6304j5542n40J1318J5756M263j6722j6743L672J5593J2322r31j7420
$$ plain form
822 -3833 -19790 -12971 6465 15552 9683 -5652 -18588 -11123 10474 18476 5838 -10978 -17658
835 -17658 -7000 13129 17664 -94 -15095 -12254 567 14042 14797 -2526 -16784 -10220 5527
848 5527 14334 10105 -5741 -17859 -8271 10978 16519 7072 -7539 -16468 -6474 13429 17257 2250
862 2250 -12752 -15172 -2942 15425 17051 -1677 -16079 -11009 3099 14918 12727 -5416 -17807
875 -17807 -8946 7227 13833 8114 -7219 -16723 -5673 12269 14914 2985 -10118 -15364 -4062
888 -4062 14128 14562 -1493 -13435 -12007 1248 15988 14287 -4746 -16194 -8598 5480 14003
901 14003 9597 -7871 -17576 -6073 10333 14343 6194 -9070 -16543 -4415 13463 13380 -125 -12373
915 -12373 -14492 -1459 15307 13659 -3555 -14122 -9682 3815 15706 10940 -7966 -16380 -5538
$$ packed form
822c833j5957O819J9436R087n869j5335j2936P465K1597Q002j2638j6816o680
835a7658J0658K0129M535j7758j5001K841J2821J3475P55j7323j4258O564J5747
848E527Q807m229j5846j2118R588J9249N541r447j4611q929R994J9903L828j5007
862B250j5002k420J2230J8367J626j8728j4402N070J4108J1819k191j8143j2391
875a7807Q861J6173O606n719j5333r504J1050J7942K645j1929j3103n246J1302
888d062J8190M34j6055j1942J428J3255J4740j701j9033j1448P596J4078Q523
901A4003m406j7468r705J1503J6406M010q149j5264p473J2128J7878q3j3505j2248
915a2373k119J3033J6766j648j7214j0567M440J3497J1891m766j8906q414J0842
$$ plain form
928 -5538 8351 13648 6901 -8659 -14689 -1685 13050 12962 2403 -10167 -14424 -1205 14329 12224
942 12224 -2133 -12527 -11419 1897 16516 12064 -6098 -15180 -8922 4636 14462 8274 -10180
955 -10180 -16758 -4250 10121 13077 4122 -10814 -14698 -386 12983 9703 -1825 -12219 -12274 1734
969 1734 14506 9097 -5232 -12443 -8536 4153 14903 8094 -9634 -15602 -6601 6472 13503 6162
983 6162 -11064 -15799 -1932 11201 11640 1476 -12660 -15160 592 13375 8525 -3926 -12602
996 -12602 -10218 4368 15210 7296 -7501 -12330 -5870 6205 13750 5540 -10593 -13161 -1565
1009 -1565 10137 13443 4378 -11183 -12815 2071 13259 10709 -496 -12217 -11421 4545 15753
1022 15753 9028 -4104 -10864 -6965 7139 16068 6361 -8877 -11473 -3204 8507 13980 4526 -10433
$$ packed form
928e538J3889N297o747j5560o030J3004J4735q8j0559j2570m257J3219J5534k105
942A2224j4357j0394J108J3316J4619m452j8162r082O258J3558R826o188j8454
955a0180o578J2508J4371K956q955j4936l884J4312J3369l280j1528j0394n5J4008
969A734J2772n409j4329p211L907J2689J0750o809j7728n968R001J3073P031p341
983F162j7226m735J3867J3133M39j0164j4136k500J5752J2783m850j2451q676
996a2602K384J4586J0842p914j4797m829O460J2075P545q210j6133k568J1596
1009a565J1702L306r065j5561j632J4886J1188k550j1205j1721P96J5966J1208
1022A5753o725j3132o760L899J4104Q929r707j5238k596Q269J1711N473r454j4959
$$ plain form
1036 -10433 -10814 1825 11430 11835 1463 -12272 -11481 3760 13382 8110 -3124 -11998 -8604 7049
1050 7049 15363 5998 -7496 -11475 -5734 7204 13672 2696 -11742 -11531 -1279 9208 11938 1035
1064 1035 -13032 -11385 2041 10009 7717 -2907 -14356 -11369 4374 12224 5082 -6242 -13051
1077 -13051 -8094 6513 12919 1650 -11189 -12441 -4535 7363 11632 -116 -12785 -10479 855
1090 855 9543 9633 -1965 -14102 -10119 3882 10326 5599 -4707 -13141 -7940 7293 12867 3662
1104 3662 -7264 -11702 -5119 8547 12978 683 -10872 -9629 -139 10765 12324 50 -11512
1117 -11512 -7023 4786 11496 9349 -2020 -12109 -5902 8645 13074 6153 -3922 -9858 -3466
1130 -3466 10526 13538 2276 -7568 -9261 -1930 10685 13074 -285 -10454 -7320 3012 11697
$$ packed form
1036a0433l81J2639R605M05j0372j3735P91J5241R622n272j1234q874L394J5653
1050G049Q314r365j3494l979N741J2938O468j0976j4438K11J0252J0487K730j0903
1064A035j4067J647J3426P968k292j0624j1449K987J5743P850p142j1324o809
1077a3051M957J4607O406j1269j2839j252P906J1898M269j1748j2669K306J1334
1090H55Q688R0j1598j2137L983J4001O444m727j0306q434N201J5233N574r205
1104C662j0926m438O583J3666M431j2295j1555J243R490J0904J559j2274j1562
1117a1512M489J1809O710k147j1369j0089O207J4547M429o921j0075n936O392
1130c466J3992L012j1262r844j693P331J2615K389j3359j0169L134J0332Q685
$$ plain form
1143 11697 10711 -2498 -12418 -5976 6182 10953 6663 -3962 -11714 -4120 9974 12154 3494 -6160
1157 -6160 -10506 -2985 10020 10747 -1256 -9862 -8964 -603 9862 9759 -3757 -12905 -7426 2393 8861
1172 8861 6159 -6837 -14784 -6499 6145 8786 2469 -7371 -12728 -4111 8723 8826 -1115 -9678
1186 -9678 -11494 -2677 9229 8920 -3809 -11515 -7767 1162 9682 7491 -5921 -13050 -5981 4311
1200 4311 8646 4590 -7020 -13006 -3108 8904 9463 1755 -7512 -10760 -1027 10552 8567 -2140
1214 -2140 -8713 -7783 1359 11882 9278 -4198 -10087 -4628 4333 10845 6798 -6364 -11260 -2331
1228 -2331 7822 10092 4883 -6062 -10110 603 11466 9620 936 -6954 -8065 2355 12738
1241 12738 8811 -2494 -7432 -4595 4259 12350 7816 -5372 -9621 -2940 5706 10033 4830 -7693
$$ packed form
1143A1697r86j3209r920O442J2158M771m290j0625p752P594J4094K180q660r654
1157f160m346P521J3005P27j2003q606Q98Q361J0465j03j3516r148N479R819O468
1172H861k702j2996p947Q285J2644K641o317r840n357Q617J2834J03r941q563
1186i678j816Q817J1906l09j2729p706L748Q929Q520k191j3412p129P069J0292
1200D311M335m056j1610n986R898J2012N59p708r267l248R733J1579j985j0707
1214b140o573R30R142J0523k604j3476n889N459Q961O512m047j3162m896Q929
1228b331J0153K270n209j0945m048J0713J0863j846q684p890j111J0420J0383
1241A2738l927j1305m938K837Q854Q091m534j3188m249O681Q646M327n203j2523
$$ plain form
1255 -7693 -10889 -273 8778 8248 1317 -8448 -10296 849 9964 6631 -2774 -8946 -7978 2380 11443
1270 11443 6234 -5436 -9453 -4943 4152 10106 4201 -8484 -10852 -2443 5614 8218 2020 -9409
1284 -9409 -10833 210 8350 5923 -2175 -10347 -9818 1672 9435 4177 -5149 -9289 -6382 3442 10444
1299 10444 3497 -7960 -9970 -3628 4973 9240 2483 -9131 -9690 -84 7503 8026 1044 -9517
1313 -9517 -9248 2302 9582 5366 -2662 -9068 -6884 4563 11182 4230 -5156 -7565 -3433 5806 10985
1328 10985 3059 -7769 -7892 -56 7597 9564 1906 -8920 -7377 3270 9256 7188 -697 -8892
1342 -8892 -7098 4808 10461 4741 -3445 -7645 -4557 5987 10964 2939 -6498 -7359 -2122 6373 9711
1357 9711 1126 -9022 -7321 1592 7464 7698 -461 -9853 -7268 3850 8429 4608 -3253 -9565 -5677
$$ packed form
1255g693l196J0616R051n30o931r765j848J1145R115l333r405o172R68J0358R063
1270A1443n209j1670m017M510R095N954n905j2685k368Q409Q057K604o198j1429
1284i409j424J1043Q140k427q098q172N29J1490P763n258r326m140K907R824P002
1299A0444o947j1457k010O342Q601M267o757j1614n59R606P587N23o982j0561
1313i517K69J1550P280m216q028o406K184J1447O619o952r386k409M132R239N179
1328A0985p926j0828j23P836P653J967p658j0826J543J0647N986k068p885q195
1342h892J794J1906N653n720q186m200L088J0544M977q025r437q61N237Q495L338
1357I711q585j0148J701Q913N872K34q159r392K585J1118M579l821p861o312L888
$$ plain form
1372 -5677 6019 9711 2542 -5254 -7676 -3490 6216 9637 370 -8054 -7210 -950 6792 8452 -703
1387 -703 -9835 -6572 2412 7286 5475 -2851 -10642 -6068 4682 7788 2811 -4664 -9377 -4503 6594
1402 6594 8736 143 -6641 -7312 -2273 6789 8373 -1046 -8709 -5609 1695 7583 7430 -1617 -9506
1417 -9506 -4762 4601 8042 4895 -3444 -9626 -3812 7173 8806 1972 -4925 -7954 -2333 7678
1431 7678 8419 -897 -7355 -6296 -428 7299 7314 -2432 -8978 -4854 2521 7191 5563 -3627 -9774 -3752
1447 -3752 5467 7336 3019 -4638 -8775 -2119 8206 8189 257 -5604 -6624 -550 8415 7802 -1606
1462 -1606 -7279 -4714 1617 8244 6835 -3262 -8875 -3370 3778 7066 3638 -4874 -9593 -2661 6200
1477 6200 6615 557 -5961 -8511 -1444 7700 6224 -2318 -7417 -6117 481 8014 5964 -3629 -7627
$$ packed form
1372e677J1696L692p169p796k422M186R706L421r267q424Q44O260P742J660r155
1387g03r132L263Q984M874j811q326p791M574J0750L106m977p475m713M874J1097
1402F594K142q593o784o71N039R062J584r419p663L100P304N888j53r047p889
1417i506M744R363L441l147q339o182N814J0985J633o834o897l029N621J0011
1431G678P41r316o458J059N868P727J5r746o546M124P375M670j628r190o147O022
1447c752R219J869m317p657m137O656J0325j7p932n861j020O074Q965o13r408
1462a606n673K565O331O627j409j0097n613N505P148L288l428q512m719O932Q861
1477F200M15o058o518k550P067R144j476q542n099J300O598P533k050r593l998
$$ plain form
1492 -7627 -3349 2968 7897 5434 -4223 -8268 -1444 5970 7381 3418 -4608 -8107 -238 8404 6861
1507 6861 -62 -5987 -6884 671 8456 5641 -3384 -7199 -4830 1509 7590 4324 -5395 -8507 -3246
1522 -3246 3038 6200 2744 -6212 -8900 -734 6233 5986 1116 -5595 -7385 1097 8688 6007 -1215
1537 -1215 -5680 -4835 2674 9438 5454 -3770 -6187 -2774 3510 8049 3724 -6035 -7941 -1318 4370
1552 4370 5808 1265 -7032 -8530 -260 6036 4264 -1474 -7228 -7425 1232 7666 3639 -3750 -6545
1567 -6545 -4228 2824 8587 3306 -5018 -6161 -1359 4384 7518 2626 -6138 -6606 864 6136 6122 946
1583 946 -6439 -6392 2274 7530 4333 -1782 -6245 -5343 3079 8530 2952 -4572 -6410 -2852 3673 7673
1599 7673 1791 -6689 -6592 -887 4384 6066 585 -7528 -6531 1398 5638 4263 -868 -6933 -5502 3434
$$ packed form
1492g627M278O317M929k463r657m045O824P414J411l963q026l499P869Q642j543
1507F861o923n925q97P555P785k815r025l815K369O339O081l266r719l112N261
1522c246O284L162l456q956k688Q166O967k47m870o711j790Q482P591k681p222
1537a215m465Q45P509O764l984r224k417L413O284M539m325r759j906O623N688
1552D370J438m543q297j498Q270O296j772n738n754j97Q657O434m027p389k795
1567f545K317P052N763n281q324j143M802N743L134m892q764m68P470N272j4n176
1583I46p385M7Q666N256l197o115m463R02Q422N451n578p524j838L558O525M000
1599G673n882q480R7N705N271J682n481q113R97P929M240j375n131o065J431Q936
$$ plain form
1615 3434 7752 3324 -2728 -5497 -3167 5090 8991 2737 -4331 -4624 -249 5624 8094 1711 -6180
1630 -6180 -5167 1082 5393 5494 -662 -8158 -6362 1869 5117 2090 -3008 -8069 -5784 2915 6089
1645 6089 786 -5008 -6384 -3110 4562 7272 561 -5792 -4263 664 5860 7231 596 -6143 -3554
1660 -3554 3009 6402 5171 -1102 -6958 -4144 4141 6356 2000 -3669 -7119 -4019 4253 6189 -194
1675 -194 -5887 -5944 -2001 4785 6141 -1135 -6735 -4263 1102 5479 5301 -1455 -7272 -3481 3645 5931
1691 5931 3464 -2328 -6976 -2763 5437 6273 1138 -3942 -5785 -1717 5603 6379 -729 -5694 -4132
1706 -4132 180 5861 5972 -1408 -6437 -3126 2791 5773 4413 -2195 -7194 -2779 4535 5350 1679
1721 1679 -3593 -6975 -2502 5009 4945 -927 -5393 -5625 -1266 5275 5143 -2131 -6057 -3600 1337 6005
$$ packed form
1615C434M318m428o052k769K330Q257L901o254p068k93M375N873K470o383p891
1630f180J013O249M311J01o156p496J796Q231L248l027n098n061K285Q699L174
1645F089n303n794j376L274P672K710o711o353J529M927N196J371o635o739K589
1660c554O563L393j231o273n856K814Q285K215m356n669l450L100Q272J936o383
1675a94n693n7L943O786J356p276n600K472N365M377j78o756n817L791P126K286
1691E931k467n792m648M213Q200Q36n135n080j843M068P320P76p108m965J562
1706d132M312N681J11p380n029L311N917K982j360o608m999M415P314Q15l671
1721A679n272l382M473P511o4n872m466k32M359O541j32p274l926K457M937M668
$$ plain form
1737 6005 5042 -2342 -6286 -1723 4293 6041 4033 -2513 -6190 -716 5766 5755 1156 -3826 -6026 -1035
1753 -1035 6049 4827 -1966 -5694 -4768 -356 5451 4105 -3441 -6541 -3124 1867 5086 3328 -3818
1768 -3818 -6714 -1081 4645 5161 2277 -3326 -5757 22 6300 5169 -94 -4097 -4998 649 6457
1783 6457 4537 -2366 -5178 -3550 1247 5566 3378 -4135 -6349 -1786 2856 5000 2440 -4205 -6159
1798 -6159 -91 4834 4377 585 -4289 -5710 491 6079 3975 -1550 -4731 -4267 1238 6580 3279
1813 3279 -3547 -5407 -2496 2290 5531 2603 -4843 -6057 -786 3656 4633 1425 -4590 -5671 725
1828 725 5390 3935 -574 -4700 -4872 1517 6390 3485 -2408 -4741 -3259 2063 6332 2545 -4257
1843 -4257 -5187 -1376 3341 5307 1809 -5128 -5214 637 4513 4028 423 -4948 -5124 1944 5778 2878
$$ packed form
1737F005r63p384l944M563O016J748k008o546l677N474O482j1m599m982k200M991
1753a035P084j222o793l728R26M412N807j346p546l100L417M991L219j758p146
1768c818k896N633N726N16k884n603k431N779O278j131n263m003r01N647N808
1783F457j920o903k812J628M797M319k188p513k214M563M642K144k560o645j954
1798f159O068M925m57l792m874j421O201N588k104n525l181M64N505N342l301
1813C279o826j860K911M786L241k928p446j214N271M442R77l208o015j081O396
1828G25M665j455m509m126j72O389M873k905n893k333J482N322M269l787o802
1843d257r30L811M717J966l498o937q6N851L876m85l605n371j76P068L834k900
$$ plain form
1859 2878 -1450 -4452 -3987 2500 6482 2399 -3242 -4689 -2053 2687 5931 1689 -4644 -4665 -19 3888
1875 3888 5134 1023 -4986 -4553 1773 5091 3520 -552 -4759 -3800 2542 5858 2447 -2269 -4564
1890 -4564 -2662 3069 5921 1192 -4442 -4531 -1362 3369 5295 582 -5445 -4654 765 3782 3807 -375
1906 -375 -5880 -4132 2099 4681 2473 -1635 -4923 -3393 3237 5605 1202 -3281 -4265 -2078 3530
1921 3530 5747 403 -4649 -3753 132 3929 4758 -265 -5514 -3489 1833 4126 3098 -1348 -5530
1936 -5530 -3350 2813 4837 1395 -2463 -5171 -2783 3354 4869 -48 -4270 -4388 -1378 3640 4873
1951 4873 -574 -5204 -3407 1060 3995 4239 -850 -5482 -2491 3014 4826 2967 -1217 -4599 -1685
1966 -1685 4588 5208 1227 -2577 -4030 -1381 4307 5214 -658 -4535 -3593 -246 3940 3954 -1413 -5773
$$ packed form
1859B878m328l002M65O487L982m083n641j447K636M740L244m242o333k1M646L907
1875C888J246m111o009M33O326L318j571m072m207R59O342L316l411m716k295
1890d564J902N731K852m729n634q9L169M731J926m713o027P91N419L017K5m182
1906c75n505J748O231K582k208m108l288J530O630K368m403m483r84K187N608
1921C530K217n344n052Q96L885L797Q29n023n249K025N322K293j028m446m182
1936e530K180O163K024l442l858k708K388O137J515m917m222j18L010N018J233
1951D873n447m630J797M467K935K44n089m632K991N505J812j859m184l382K914
1966a685O273O20l981l804j453K649N688R07n872l877R42L347M186J4n367m360
$$ plain form
1982 -5773 -3306 1164 3653 2855 -2287 -5843 -2549 3217 3879 1445 -2398 -4554 -1545 4494 4800 205
1998 205 -3103 -3347 -208 4995 5114 -715 -4219 -2230 1272 4729 4121 -1631 -5183 -1858 2615 3925
2014 3925 2159 -2635 -5405 -1502 3756 3637 67 -3396 -4745 -1623 3998 3469 -1550 -4221 -3618 142
2030 142 4367 3571 -2058 -4605 -1934 1955 4390 3145 -2206 -4766 -584 4095 4252 1841 -2270 -4093
2046 -4093 -38 4911 3832 13 -3079 -3509 -199 4829 3366 -2052 -4262 -2833 675 4064 2562
2061 2562 -3458 -5233 -2018 1933 3370 1426 -3627 -5478 -544 3601 3019 164 -3328 -4382 180
2076 180 4564 3111 -792 -3119 -2914 1191 5225 3152 -2267 -3727 -1259 2244 4681 2367 -3343
2091 -3343 -4387 -100 3171 3539 978 -3643 -4514 483 3938 2342 -893 -3946 -4078 234 3994 1850
$$ packed form
1982e773K467M470K489p98n142l556L294N766O62k434l843k156L009O039L06m595
1998B05l308k44L139N203J19n829l504J989L502L457o08n752l552L325M473J310
2014C925j766m794k770L903N258j19l570l463j349L122N621n29n019k671O03L760
2030A42M225p96n629k547K671L889K435j245n351k560M182M679J57k411m111j823
2046d093M055M949j079l819l092m30L310N028j463n418k210J429L508L389j502
2061B562o020j775L215L951J437j944n053j851M934M145n82k855l492j054M562
2076A80M384j453l903k327K05M105M034k073n419j460K468L503K437k314n710
2091c343j044M287L271L68k561m621q71M997L455j596l235l053j32M312L760k144
$$ plain form
2107 1850 -2380 -4025 -2941 1097 4542 1977 -3393 -4080 -1128 2627 4229 1590 -3241 -3605 976
2122 976 4104 3742 914 -2835 -3017 2049 5026 2829 -619 -2832 -2561 1649 4953 2083 -2677 -3544
2138 -3544 -1988 1780 4123 926 -4195 -4443 -704 2377 3063 109 -4310 -3802 1061 3676 2634 -394
2154 -394 -3518 -2832 2148 4779 2231 -1166 -2724 -1555 2413 5178 1751 -2866 -3280 -892 2392 4183
2170 4183 662 -4303 -3658 381 3026 2603 -723 -4701 -3691 1624 3202 954 -1684 -3769 -2807 1826
2186 1826 3989 488 -2708 -3331 -1808 2084 3953 383 -4013 -3587 -436 2726 3602 -159 -4596 -3098
2202 -3098 1377 3306 2301 -847 -4065 -2404 2777 3893 1505 -1414 -2853 -1286 2859 4424 687
2217 687 -2410 -2938 -736 2685 3988 -109 -4043 -2905 601 2870 2946 -873 -4696 -2704 1974 3260
$$ packed form
2107A850m230j645J084M038L445k565n370o87K952L755J602k639m831l64M581
2122I76L128l62k828l749j82N066K977k197l448k213K71M210L304k870m760q67
2138c544J556L768K343l197n121k48L739L081O86k954m419N08M863K615j042l028
2154c94l124O86M980K631k548l397j558J169L968K765l427m617m14K388L284J791
2170D183l521m965O45M039K645m23l326l978J010N315J578k248k638k085R62M633
2186A826K163l501l196o23J523L892J869l570m396M26L151L162Q76l761m437J498
2202c098M475J929j005l148l218J661N181J116k388k919j439J567M145J565l737
2217F87l097n28K202L421J303m097l934J138L506K269P6l819l823J992M678J286
$$ plain form
2233 3260 1553 -1501 -3774 -1528 3131 3925 1032 -1566 -2566 -484 3573 4597 679 -2348 -1831
2248 -1831 616 3564 4152 -248 -3844 -1982 1535 3064 2301 -1662 -4631 -1882 2621 2954 472 -2406
2264 -2406 -4026 -1565 2882 2930 -412 -2732 -2877 -763 3056 3368 -445 -3320 -1996 740 3374 3153
2280 3153 -1317 -4356 -1703 1979 2997 1201 -2290 -4615 -1452 2847 2662 -237 -2753 -3365 -784
2295 -784 3156 2549 -1121 -3060 -2369 -138 2918 3040 -1208 -3752 -1734 956 3130 2566 -1859 -4511
2311 -4511 -1301 2587 2971 916 -2491 -3983 -173 3449 2531 -648 -2398 -2762 135 3567 2669 -1201
2327 -1201 -2712 -1702 723 3633 3026 -1490 -3585 -819 2289 3428 1939 -2331 -3881 73 3437
2342 3437 2900 239 -2551 -3153 325 3755 2356 -1132 -2390 -1925 399 3346 2539 -1508 -2656 -1279
$$ packed form
2233C260j707l054k273K246M659P94k893k598j000K082M057J024l918l027N17
2248a831K447K948N88m400l596J862L517J529p63l963k969K749M503L33k482k878
2264b406j620K461M447M8l342k320j45K114L819L12l813k875J324K736K634k21
2280C153m470l039K653L682J018j796l491k325L163M299j85k899k516o12K581
2295g84L940o07l670j939O91K231L056J22m248k544K018K690K174n64m425k652
2311d511L210L888L84k055l407j492L810L622r18l179j750l64K897L432q98l870
2327a201j511J010K425K910o07m516k095K766L108J139j489m270j550L954L364
2342C437n37k661k790o02L478L430j399l488j258M65K324K947q07m047j148J377
$$ plain form
2358 -1279 1105 3647 2320 -2238 -3495 -501 2449 2854 1054 -2759 -3853 332 3454 2029 -875
2373 -875 -2841 -2832 429 3439 1491 -1784 -2592 -1742 658 3221 1733 -1952 -3167 -1178 1189 2962
2389 2962 1312 -3041 -3758 105 2681 2392 108 -3091 -3539 670 3078 1434 -1430 -2878 -2386 631
2405 631 3233 882 -2199 -2360 -1310 889 3065 1201 -2724 -3139 -398 1871 3054 875 -3178 -3250
2421 -3250 895 3429 2137 -587 -2928 -2429 1715 3722 1204 -1348 -2413 -1252 1573 3379 1166
2436 1166 -2096 -1992 -354 1594 3152 1001 -2782 -2804 11 2167 2440 284 -3254 -3122 1340 3403
2452 3403 1407 -1154 -2813 -1830 2210 3533 491 -1830 -1971 -686 1847 3322 846 -2227 -1826 204
2468 204 2112 3013 884 -2771 -2309 898 2886 2235 -512 -3664 -2446 1883 3150 714 -1948 -2860
$$ packed form
2358a279K384K542j327m558j257K994K950M05j800l813j094M185L122j425k904
2373h75j966RL261L010j948l275q08Q50K400K563j488l685j215J989K367J773
2389B962j650m353p17L863K576k89k284l199m48M209K408j644k864j448M92L017
2405F31K602k351l081j61J050K199K176j864l925m15K741K269J183k179m053p2
2421c250M145K534j292k724k341M99M144K007k518k552j065J161K825J806k213
2436A166l262J04J638J948J558k151l783k2K815K156K73k156l538J32M462K063
2452C403j996k561j659R83M040J323l042k321j41J285K533J475k476l073M01K030
2468B04J908R01k129l655M62L207J988o51k747l152J218M329J267k436k662r12
$$ plain form
2484 -2860 -1587 1977 2603 -340 -2572 -2256 -921 1599 2617 -93 -2902 -1903 363 1874 2658 -180
2500 -180 -3292 -2207 1433 2986 1619 -964 -3123 -1377 2727 3031 250 -1936 -2377 -691 2367 2646
2516 2646 -587 -2392 -1652 -7 1857 2373 -219 -3001 -1936 664 2083 2094 -744 -3630 -2077 1847
2532 1847 2577 877 -1522 -3135 -984 2782 2913 -438 -2183 -2071 -159 2606 2531 -560 -2326 -1083
2548 -1083 394 2193 2501 -333 -2845 -1433 1289 2491 1926 -873 -3447 -1275 2688 2648 42 -2210
2564 -2210 -2605 -630 2824 2249 -1127 -2565 -1583 -22 2216 1894 -1176 -2670 -1169 457 1899 1886
2580 1886 -987 -3046 -956 1944 2632 1395 -1370 -3161 -524 3422 2666 -169 -1855 -2209 421 2916
2596 2916 2116 -1466 -2403 -783 453 2072 1504 -1311 -2709 -932 695 1759 1427 -1360 -3285 -809
$$ packed form
2484b860J273L564O26k943k232L16J335K520J018k710k809R99K266J511P84k838
2500a80l112J085L640J553j367k583k159J746M104L04k781k186m41J686L058K79
2516B646l233j805P40J645J864N16k592k782J065K600J419J1k838k886J553L924
2532A847P30j700k399j613K151L766J31l351j745J12J912K765p5l091j766J243
2548a083J477J799L08k834k512J412K722J202n65k799k574K172L963m0k606k252
2564b210l95J975L454n75l376j438R82J561K238l22l070j494J501J626J442j3
2580A886k873k059K090K900O88j237k765j791K637L946p56k835j686l54K630K495
2596B916q00l582r37J620J236J619n68k815j398J777J627J064l32k787j925K476
$$ plain form
2612 -809 1995 1936 214 -2215 -2894 -30 3382 2208 -1167 -2324 -1442 706 2937 1572 -1332 -2018
2628 -2018 -328 984 2142 1528 -1139 -2368 -381 1659 2156 1302 -1828 -3136 -238 2485 1953 -332
2644 -332 -2415 -2650 587 2952 1429 -1551 -2321 -1269 946 2424 1076 -2167 -2255 -301 1187 2033
2660 2033 1167 -1530 -2356 -137 1956 1891 786 -1782 -2738 481 2941 1774 -896 -2258 -1824 1067
2676 1067 3320 797 -1842 -2120 -431 1039 2189 668 -2210 -1857 37 1303 1654 922 -1979 -2736
2692 -2736 242 1959 1668 -115 -2240 -2417 730 3163 1096 -1474 -2197 -1311 1334 3113 403 -2170
2708 -2170 -1444 28 1257 2230 552 -1820 -1647 524 1665 1811 644 -1980 -2161 864 2439 1372
2724 1372 -502 -2397 -1978 1317 2919 506 -2204 -2253 -553 1537 2532 -39 -2351 -1495 250 1498
$$ packed form
2612h09K804n9j722k429o79K864L412j174l375j157Q82K148K231j365k904o86
2628b018J690J312J158o14k667j229J987K040M97q54l130j308K898K723n32k285
2644c32k083k35L237K365j523k980p70J052K215J478j348l243q8J954J488Q46
2660B033q66k697q26K219K093o5j105k568r56L219K460j167k670j362M34K891
2676A067K253k523k639k78J689J470J150j521k878L53J894J266L51p32k901p57
2692b736K978J717k91j783k125j77L147K433k067k570p23Q86K645J779k710k573
2708b170P26J472J229R73j678k372J73K171J141J46j167k624j81L025J575j067
2724A372j874j895M19L295J602k413k710m9J700K090R95k571k312Q56J745J248
$$ plain form
2740 1498 2058 388 -2242 -1535 928 1691 1594 302 -2313 -2050 1208 2756 1017 -1172 -2230 -1525 1701
2757 1701 2914 -1 -2341 -1808 -82 1589 2004 -601 -2386 -1349 449 1134 1582 -156 -2363 -1623
2773 -1623 982 1816 1097 -320 -2447 -1774 1706 2778 475 -1523 -1970 -817 2172 2653 -455 -2462
2789 -2462 -1339 466 1728 1642 -649 -2432 -834 845 1322 1215 -288 -2085 -1380 1285 2005 870
2805 870 -729 -2047 -1293 2188 2610 -103 -1787 -1784 -271 2036 2254 -1099 -2548 -917 584 1580 1360
2822 1360 -708 -2259 -755 1107 1450 817 -470 -2177 -1044 1653 2082 594 -1020 -2241 -905 2437
2838 2437 2437 -655 -1987 -1329 129 2149 1724 -1234 -2428 -440 959 1530 941 -974 -2382 -658 1324
2855 1324 1373 620 -679 -2314 -785 1989 1993 -97 -1528 -2001 -338 2674 1901 -1191 -2078 -944 468
$$ packed form
2740A498N60j670k630P07K463P63r7j292k615K63L258J548j739k189j058P05L226
2757A701J213k915k340N33J726J671M15k605j785J037J798O85M48j738k207P40
2773a623K605Q34p19j417k127O73L480J072k303j998m47J153K989M81l108k007
2789b462J123J805J262q6k291j783J598J679M77j07j503j797P05K665P20j135
2805H70j599j318P54L481M22k713j684LJ513K307K18l353j449J631J501R96k20
2822A360k068j551J504J862L43o33j287j707J133K697M29j488j614j221J336L342
2838B437%l092j332O58J458K020m25k958j194J988J399N71n89j915j408J724J982
2855A324M9p53j299j635J529K774Mk090j431m73J663L012p73l092q87J134J412
$$ plain form
2872 468 2058 1374 -1465 -2463 -179 1337 1363 614 -985 -2114 -497 1661 1455 372 -1111 -2296 -487
2889 -487 2283 1752 -519 -1685 -1459 104 2529 1692 -1210 -2111 -523 800 1686 1106 -1510 -1961 129
2906 129 1370 1276 476 -1140 -2249 -152 1935 1054 34 -1296 -2010 -92 2355 1518 -902 -1871 -1144
2923 -1144 728 2412 1150 -1838 -2047 -38 1429 1600 510 -1648 -1725 384 1497 942 92 -1312
2939 -1312 -1995 149 1964 1335 -420 -1500 -1731 428 2531 1098 -1513 -1676 -602 969 2065 653
2955 653 -1900 -1721 456 1138 1220 197 -1446 -1763 557 1718 986 -16 -1183 -1664 489 2260 850
2972 850 -600 -1494 -1160 950 2376 968 -1852 -1569 -102 1136 1761 275 -1984 -1616 614 1264 957
2989 957 -119 -1523 -1486 754 1708 758 -471 -1523 -1367 833 2422 767 -1316 -1451 -595 934 2214
$$ packed form
2872D68J590o84k839r98K284J516K6p49j599j129J617K158k06j083j483j185J809
2889d87K770n31k271j166K26J563K425q37k902r01J588J323Q86n80k616m51K090
2906A29J241r4q00j616j109K097K087q81j020j330p14J918K447q37k420r69P27
2923a144J872J684j262k988k09K009J467J71j090k158p7K109J113n55q50j404
2939a312o83K144J815o29j755j080k31K159K103j433k611j63J074J571J096j412
2955F53k553J79K177O82Q2j023j643l17K320J161p32j002j167m81K153J771j410
2972H50j450q94L34K110J426j408k820K83J467J238O25j486k259L68K230O50l07
2989I57j076j404L7K240R54r50j229j052J56K200J589j655k083j35Q56J529J280
$$ plain form
3006 2214 200 -2056 -1484 141 1216 1414 -31 -2018 -1186 977 1449 644 -222 -1656 -1153 954 1940
3023 1940 371 -591 -1405 -1176 993 2417 456 -1460 -1403 -568 1159 2045 11 -1974 -1305 717 1233
3040 1233 1242 -508 -1999 -1143 960 1204 324 -277 -1457 -1040 1083 1720 264 -896 -1190 -958 1269 2038
3058 2038 -29 -1955 -1216 106 1282 1757 -165 -1983 -665 1261 1169 803 -585 -1580 -822 1294 1320
3075 1320 252 -783 -1532 -916 1284 1700 -109 -1242 -1138 -359 1416 1897 -443 -1775 -816 476 1568
3092 1568 1284 -853 -2225 -585 1329 1146 452 -690 -1638 -721 1344 1507 108 -844 -1312 -610 1626
3109 1626 1719 -430 -1356 -1016 -47 1489 1439 -802 -2114 -689 881 1534 856 -1080 -2055 -329 1299
3126 1299 1105 144 -679 -1513 -325 1352 1211 -201 -901 -1431 -535 1667 1544 -815 -1431 -863 314 1487
$$ packed form
3006B214k014k256N72J625J075J98j445j987Q32K163M72q05q66j434N03K107R86
3023A940j569r62q14K29K169J424j961j916N7Q35J727Q86k034j985O69K022N16
3040A233Rj750j491Q56K103K44q80o01j180M17K123O37j456j160k94K32K227P69
3058B038k067j926P39J322J176M75j922j818J318J926r2l66j388r95P58K116K6
3075A320j068j035p49O16K200M16j809j133J04P79J775M81k340j332R59J292J092
3092A568k84k137j372J640J914j83o94j142r48R17K065J63j399r52m68P02K236
3109A626R3k149r26L40R69J536n0k241j312J425J570O53o78j936r75J726J628
3126A299j94r61q23q34J188J677j41j412p00n30Q96K202j23k359o16N68J177J173
$$ plain form
3144 1487 1061 -931 -2055 -397 1123 1344 518 -980 -1772 -37 1649 854 -227 -964 -1346 -159 1680
3161 1680 1011 -611 -1035 -1164 -87 1707 1304 -950 -1625 -543 766 1406 974 -1445 -2035 12 1154
3178 1154 1035 228 -1226 -1693 358 1576 617 -271 -853 -1186 27 1725 828 -840 -1150 -721 361
3195 361 1598 1187 -1320 -1650 10 819 1182 744 -1271 -1689 403 1419 1080 58 -1089 -1446 472
3212 472 1613 530 -700 -1117 -1132 278 1750 703 -1018 -1335 -572 375 1540 691 -1698 -1538 266
3229 266 1211 1283 361 -1506 -1392 732 1352 688 -137 -1055 -1313 589 1808 478 -748 -883 -898 510
3247 510 1665 532 -1293 -1102 -327 655 1575 329 -1606 -1360 512 1228 815 109 -1298 -1129 623
3264 623 1304 402 -397 -1042 -927 628 1745 133 -881 -847 -572 575 1505 295 -1440 -1175 -41 944
$$ packed form
3144A487m26j992j124J658J520K21q26j498p92J735J686p95j081p37l82J187J839
3161A680o69j622m24j29J077J794m03k254o75J082J309O40m32k419n90K047J142
3178A154j19q07j454m67K051J218r59q88n82l33J213J698q97j668l10M29J082
3195C61J237m11k507l30J660Q09L63m38k015m18K092J016l39j022j147l57J918
3212D72J141j083j230m17j5J410J472j047j721l17P63R47J165q49k389J60J804
3229B66R45P2r22j867J14K124O20o64q25r18k58J902J219j330j226j35j5J408
3247E10J155j133j825J91P75R82R20j246j935K46J872P16m13p06j407J69J752
3264F23O81r02p99o45J15J555J117j612j014L4K75J147R30j210j735K65J134R85
$$ plain form
3282 944 1200 183 -1679 -1226 679 1169 568 -397 -1226 -1109 980 1639 61 -595 -1040 -811 745 1553
3300 1553 32 -1117 -959 -426 675 1283 48 -1555 -1232 293 948 1118 -160 -1497 -915 1041 1218
3317 1218 547 -168 -1060 -655 936 1399 94 -891 -799 -514 868 1532 219 -1334 -727 227 754 1305
3335 1305 -40 -1491 -744 773 846 854 -281 -1648 -494 1048 1205 154 -658 -1159 -613 1194 1542 -313
3353 -313 -730 -771 -240 1147 1290 -397 -1524 -576 314 1068 1026 -415 -1614 -630 859 994 385 -745
3371 -745 -1333 -387 1326 1133 25 -961 -1048 -279 1258 1015 -416 -1163 -527 67 836 1176 -476 -1452 -534
3390 -534 381 889 492 -490 -1739 -315 1036 810 15 -889 -1349 -270 1209 920 -285 -873 -749 -57
3408 -57 1241 968 -475 -979 -430 226 1117 979 -660 -1272 -308 941 1016 488 -705 -1427 -139 1200
$$ packed form
3282I44K56j017j862M53J905M90o01r65q29J17K089O59j578o56m45K29J556Q08
3300A553j521j149J58N33J101O08j235j603L23J525O55J70j278j337N82J956J77
3317A218o71p15q92M05J591M63j305r85R2K85J382O64j313j553O07R54N27N51
3335A305j345j451P47J517P3Qj135j367J154J542J57j051q12n01N46J807L48j855
3353c13m17m1N31J387J43j687j127R48Q90P54m2j441j199R84J489J35o09j130
3371g45n88R46J713j93j108r86q7P69J537k43j431p47O36N94P69L40j652r76R18
3390e34R15N08l97r82j249J424J351k26p95r04m60J079J479k89j205n88J24O92
3408e7J298k73j443n04N49O56Q91j38j639o12R64J249P5n28j193p22J288J339
$$ plain form
3426 1200 839 -128 -758 -1236 -7 1332 1042 -590 -982 -695 97 1249 1036 -688 -1328 -189 575 1098
3444 1098 621 -777 -1259 198 1158 1154 423 -809 -1207 180 1562 875 -154 -783 -853 244 1626 903
3462 903 -765 -969 -438 190 1262 722 -1067 -1084 25 566 832 538 -1043 -1291 -48 1054 573 -47
3480 -47 -767 -1245 193 1156 466 -653 -683 -715 260 1413 493 -809 -792 -257 501 1234 564 -1066 -1092 61
3500 61 764 619 226 -854 -1287 424 1207 499 -117 -910 -1034 269 1446 393 -901 -750 -560 241
3518 241 1290 419 -1212 -1078 -135 173 1046 228 -1210 -1238 331 934 708 94 -1121 -900 642 1205
3536 1205 333 -329 -654 -723 237 1366 392 -843 -525 -418 473 1162 219 -1172 -979 145 643 731 90
3555 90 -1293 -935 341 736 414 -78 -1137 -922 648 1260 146 -478 -738 -424 672 1224 213 -783
$$ packed form
3426A200l61r67o30m78J229J339k90j632l92K87P92J152k13j724o40J139P64N23
3444A098m77j398m82J457R60mp31j232l98J387J382o87j029o29p0J097J382p23
3462I03j668k04N31O28J072n40j789j7J109N41K66k94j581k48J243J102m81o20
3480d7p20m78J438R63o90j119l0l2R75J153r20j302J7N35P58P33o70j630k6J153
3500F1P03j45l93j080m33J711P83p08o16p93j24J303J177j053j294J51J90Q01
3518B41J049q71j631J34R43L08Q73q18j438k8J569O03k26o14j215K21J542N63
3536A205q72o62l25o9R60J129r74j235L18J07Q91O89r43j391J93J124M98Q8o41
3555I0j383L58J276L95l22m92j059K15J570O12j114o24k60L14J096N52j011r96
$$ plain form
3573 -783 -313 96 660 1037 265 -1101 -721 357 833 558 -209 -1306 -713 455 848 329 -293 -1034 -570
3592 -570 644 1047 102 -871 -700 -481 722 1092 -107 -992 -629 192 645 1019 -20 -1119 -561 541
3610 541 901 434 -258 -1160 -494 811 889 153 -303 -740 -450 1027 1043 -308 -789 -483 -200 772 939 -405
3630 -405 -1185 -598 359 603 866 -375 -1218 -573 689 758 227 -316 -1077 -520 688 729 -114 -575 -737 -270
3650 -270 1245 1120 -222 -705 -403 -49 874 908 -297 -1042 -169 516 658 794 -261 -1156 -292 808 764
3669 764 207 -385 -932 -305 1065 717 -396 -926 -686 -209 872 933 -370 -949 -458 -34 698 643 -454
3688 -454 -1151 -210 634 669 660 -375 -1027 -61 914 703 -56 -575 -764 -103 1115 720 -286 -585 -383 -55
3708 -55 834 652 -735 -1057 -222 391 564 527 -682 -1206 -189 587 512 23 -580 -984 -303 939 511 -101
$$ packed form
3573g83M70M09N64L77p72j366L80J078M76k75p67j097N93J168L93n19o22p41M64
3592e70J214M03r45r73J71K19J203L70j199q85L63Q21M53L74j039j099N58J102
3610E41L60m67o92r02O66J305P8p36m56m37K90J477J6j351m81L06K83R72J67j344
3630d05p80N87R57K44K63j241q43O45J262O9n31n43p61N57J208M1q43m61j62M67
3650b70J515j25j342m83L02L54R23L4j205p45Q73O85J42J36j055q95Q64J100m4
3669G64n57n92n47O27J370l48j113n30K40M77J081O1j303n79M91M24P32n5j097
3688d54o97R41Q44L5rj035o52R66R75k11p59n19j89O61J218l95j006k99K02L28
3708e5Q89j82j387l22Q35O13J73l7j209n24J017P76p5m89o03m04O81J242m28o12
$$ plain form
3728 -101 -493 -793 82 944 758 -567 -734 -251 243 820 680 -556 -835 -53 539 883 522 -678 -956
3747 -956 216 803 395 -102 -418 -847 124 897 567 -499 -630 -629 -26 1043 530 -751 -905 -50 239
3766 239 1019 400 -602 -706 233 460 511 253 -599 -817 307 873 298 -142 -470 -745 238 1165 334 -431
3786 -431 -509 -301 210 872 222 -745 -485 56 258 788 159 -781 -944 288 816 494 117 -695 -665 281
3806 281 838 259 -121 -681 -635 380 1049 270 -692 -616 -205 256 801 307 -996 -501 201 575 655 155
3826 155 -840 -663 496 693 353 -130 -658 -676 489 729 90 -346 -588 -638 404 743 225 -758 -685 -1
3846 -1 394 963 41 -954 -643 108 501 487 -87 -691 -346 476 760 217 -226 -667 -506 501 661 -25 -745
3867 -745 -461 -51 442 963 -240 -708 -416 74 407 717 -100 -885 -646 615 732 353 -113 -919 -244
$$ packed form
3728a01l92l00Q75Q62j86j325j67M83M94N77j40j236k79P82N92L44l61j200k78
3747i56J172N87m08m97l16m29R71P73l30j066j31JO03J069n13j281j54Q55K89
3766B39P80o19j002j04R39K27N1k58q52k18J124N66n75m40l28k75R83R27q31p65
3786d31p8K08N11O62o50r67K60N41K02N30o29r40j63J232N28l22l77q12L0R46
3806B81N57n79l80n60M6J015O69p79r62P6M11M61N45m94j303M95P02L74Q0n00
3826A55r95J77J159J97l40m83n28j8J165K40o39m36k42n0J042L39n18r83P3O84
3846aL95N69r22r95L11P51L93j4n74o04L45Q22K84n43m43m41J61J007J60o86p20
3867g45K84M10M93N21j203m68K92M90L33L10q17p85K39J261J17l79m66q06O75
$$ plain form
3886 -244 555 745 -182 -395 -539 -602 693 711 51 -707 -550 -233 471 592 -136 -1001 -329 250 490 466 -152
3907 -152 -1021 -365 523 473 360 -162 -852 -255 742 699 -246 -437 -424 -71 594 750 -168 -750 -330 123 606
3928 606 669 -351 -755 -252 497 469 397 -335 -867 -386 713 401 120 -431 -719 -316 652 575 -294 -639 -550
3949 -550 -94 619 696 -530 -784 -285 160 657 621 -483 -908 -113 294 583 252 -319 -860 -111 522 477
3969 477 -11 -327 -759 -76 659 642 -533 -611 -358 -126 681 573 -507 -922 -82 235 530 491 -430 -820
3989 -820 2 643 479 143 -330 -625 119 797 553 -214 -494 -419 58 1001 540 -476 -508 -131 153 561
4009 561 502 -665 -684 3 402 401 294 -586 -830 18 655 282 -16 -534 -712 115 574 143 -531 -508 -364
4030 -364 87 861 496 -661 -321 -102 214 612 372 -385 -690 56 457 610 31 -368 -737 139 550 260
$$ packed form
3886b44P99J90r27k13j44o3J295J8o60p58J57L17P04J21p28q65O72N79K40k4o18
3907a52q69O56Q88n0j13n22o90N97R97m3r45j91J3L53O65J56r18n82M20M53M83
3928F06O3j020m04N03P49k8p2p32n32M81J099l12k81n51k88M03R68p7q69l45Q9
3949e50M56P13P7j226k54M99M45M97l6j104m25P95M07K89l31n71n41P49O33m5
3969D77m88l16m32O83P35j7j175p8K53K32Q07j08j080m15Q40L17K95l9r21l90
3989h20Q22O41j64l36m73k95P44O78k44p67k80P5M77R43m61j016l2L77K84M08
4009E61n9j167j9O87L99jj07q80k44Q48O37l73k98n18j78Q27M59m31o74K3J44
4030c64M51P74l65j157L40K19L16L98k40p57l05P46M01J53n79l99l69Q76M11k90
$$ plain form
4050 260 -91 -458 -687 141 862 355 -529 -307 -450 -63 490 281 -679 -581 -6 291 520 149 -599 -659 350
4071 350 510 476 90 -547 -640 514 767 -47 -249 -435 -423 225 820 102 -596 -428 -149 239 846 121 -940
4092 -940 -693 150 485 432 90 -701 -632 440 645 -12 45 -425 -418 347 794 257 -372 -384 -364 505 666 -51
4114 -51 -543 -265 -294 304 614 -15 -724 -529 196 477 350 -45 -780 -407 613 532 166 -105 -394 -300 452
4135 452 652 91 -400 -510 -141 273 626 -186 -956 -240 78 343 288 -210 -819 -311 420 317 353 63 -619
4156 -619 -336 364 565 175 -174 -446 -370 537 776 -246 -470 -263 -147 333 605 -128 -807 -76 9 349
4176 349 303 -235 -756 -308 353 407 110 -275 -511 -298 588 553 -206 -212 -528 -200 551 769 -195 -593 -174 12
4198 12 536 472 -269 -499 101 315 315 447 -148 -579 -146 522 445 36 -284 -790 -187 577 465 -275 -182 -287
$$ packed form
4050B60l51l67k29Q28P21n07q84K22j43L87N53k09r60R8N75K97K29l71p48o0J009
4071C50J60l4l86o37r3J154K53q14k02j86J2O48N95p18o98J68K79L88O07p25j061
4092i40K47Q43L35n3l42p91O9J072K05o57N7m70PP65M47n37o29j2K0Q69J61p17
4114e1m92K78k9N98L10o29p09J95P25K81j27l95p35L73J020q1l66k71k89R4P52
4135D52K00n61m91j10L69M14L53q12p70P16L18K65n5m98o09N08P31j03L6k90o82
4156f19K83P00K01l90l49k72P6R07K39j022k24K07J16M80K72p33o79P31Q5L40
4176C49m6n38n21M48O61N4k97l85k36K13Q86l5p59ol16L28P51K18r64l98M19J86
4198A2N24o4p41k30O00K14%J32n95m31M33O68p7m09l20n06O03P64j12p40R3j05
$$ plain form
4220 -287 -56 602 466 -361 -460 -32 -65 284 475 -306 -516 -297 596 384 -2 -97 -680 -116 557 360 -112
4241 -112 -250 -463 -156 677 392 -364 -109 -221 3 506 525 -413 -492 67 198 365 229 -272 -608 30 551
4262 551 322 115 -314 -632 -93 730 334 -336 -323 -434 -84 502 299 -505 -503 -153 186 533 339 -384 -574
4283 -574 38 259 272 41 -330 -757 18 259 113 -24 -386 -490 12 724 312 -355 -405 -219 114 563 278
4304 278 -319 -596 -103 155 383 272 -431 -479 224 465 328 158 -352 -444 41 652 117 -172 -425 -432 197
4325 197 521 223 -542 -352 -29 63 680 150 -462 -220 -13 187 349 224 -529 -334 223 435 315 89
4345 89 -322 -440 199 568 2 -178 -318 -403 258 639 201 -299 -177 -8 316 393 160 -686 -485 181 350
4366 350 327 44 -656 -535 341 476 128 45 -385 -393 106 611 -96 -405 -291 -366 243 467 -94 -454 -194 -137
$$ packed form
4220b87K31O58j36q27r9M28l3L49J91p81k10K19Q93k12l86r5n83N64O73j97m72
4241a12j38k13L07Q33k85p56K55j12K24N03J9r38p9N59J31J67j36n01l36O38N21
4262E51k29k07m29l18N39Q23l96o70J3j11L50N86k03q04KL50L39L47j94p23j90
4283e74O12K21J3k31l71m27P75K41j46j37l62j04N02P12m12o67n0J86L33M49k85
4304B78n97k77M93K58K28j11p03m8P03K41j37j70n10r2M85O11n35k89k53pO29
4325A97L24k98p65J90L23R2O17n30o12K42K07K00J62j25p53J95N57K12j20k26
4345H9m11j18O39L69n66j80j40q5O61L81m38n00J22J69L24P7k33q46K01O66J69
4366C50k3k83p00J21Q76J35l48q3m30qM99N05p07l09J14p5O09K24n61l60K60N7
$$ plain form
4388 -137 329 354 63 -473 -251 171 315 43 -128 -614 -458 340 377 38 -112 -336 -269 185 623 -225 -323
4409 -323 -234 -194 142 778 -210 -565 -124 145 144 238 31 -401 -346 276 318 73 -138 -197 -295 424 266 -229 -113
4432 -113 -268 -164 425 376 109 -405 -246 -158 247 407 -236 -574 -58 185 328 187 -161 -520 -140 290 297
4453 297 154 -89 -513 -133 432 280 -292 -104 -218 -71 366 391 -263 -496 52 183 123 309 -176 -496 33
4474 33 157 106 90 -201 -548 -50 617 298 23 -77 -253 -205 304 339 -51 -149 -313 -24 472 463 -233 -505 -54
4497 -54 87 547 511 -85 -627 -254 324 154 229 -213 -311 33 525 95 -175 -198 -303 -66 473 315 -127 -427
4519 -427 -263 -158 273 301 -288 -446 -9 108 180 163 -483 -514 61 313 321 -19 -207 -307 161 567 341 -284
4541 -284 -358 -369 -88 615 377 -356 -289 -218 52 449 -89 -432 -524 -149 302 50 143 -106 -411 21 395 63
$$ packed form
4388a37M66K5k91n36K22M22J44k72j71m86J56P98L7l39j50k24O7M54M38q48r8
4409c23Q9M0L36O36r88l55M41K69jR4k07m32N5O22M2k45k11n9r8P19j58m95J16
4432a13j55J04N89m9k67n14J59Q8M05J60o43l38N16K43J43j41l48l59L80M30P
4453B97j43k43m24L80N65j52n72J88j14J47M37K5o54k33N48J31o0J86m85l20N29
4474C3J24n1j6k91l47M98O67l19k75j00j76M8N09L5l90r8j64K89M96ro96k72M51
4497e4J41M60l6n96n42L73N78j70P5m42r8L44M92m30k70k3j05K37N39j58m42l00
4519d27J64J05M31K8n89j58M37J17P2j7o46l1N75K52Ql40j88j00M68M06k26o25
4541b84p4j1K81P03k38p33O7P1K70L97n38l43r2L75M51k52R3k49l05M32L74l32
$$ plain form
4563 63 -133 -51 -402 15 630 207 -380 -214 3 77 530 153 -223 -423 82 127 198 313 -242 -441 318 293
4585 293 274 -252 -199 -383 223 563 -22 -191 -221 -287 99 564 336 -365 -243 22 333 375 148 -484 -470 91
4607 91 227 106 93 -575 -494 330 245 236 -50 -340 -429 235 575 84 -153 5 -152 119 473 -62 -391 -297 201
$$ packed form
4563F3j96Q2l51M17O15m23n87J66K17P4M53l77l76k00N05M5P1J15n55j99P59k5
4585B93j9n26N3j84O06L40n85j69l0o6L86M65k28p01J22K65L11M2k27o32J4N61
4607I1J36j21j3o68Q1Q24q5rk86k90q9O64L40m91k37J58j57K71L54n35l29R4M98
$$ [...]
8191d6
##END NTUPLES=NMR FID
##END=
