##TITLE=1H_CA-8622-2
 DMSO, 8 sc, 
 4.7.2019
##JCAMPDX= 6.0         $$ Bruker NMR JCAMP-DX V2.0
##DATA TYPE= NMR FID
##DATA CLASS= NTUPLES
##ORIGIN= UXNMR, Bruker Analytische Messtechnik GmbH
##OWNER= root
$$ XWIN-NMR		Version 3.5
$$ Thu Jul  4 15:32:10 2019 Russian Standard Time (UT+4h)  she@DPX200
##.OBSERVE FREQUENCY= 200.13155
##.OBSERVE NUCLEUS= ^1H
##.DELAY= (6, 6)
##.ACQUISITION MODE= SIMULTANEOUS
##.ACQUISITION SCHEME= undefined
##.AVERAGES= 8
##.DIGITISER RES= 18
##SPECTROMETER/DATA SYSTEM= spect
##.PULSE SEQUENCE= zg30
##.SOLVENT NAME= Pyr
##.SHIFT REFERENCE= (INTERNAL, Pyr, 0, 15.7039)
##AUDIT TRAIL= $$ (NUMBER, WHEN, WHO, WHERE, WHAT)
$$ ##TITLE= Audit trail, XWIN-NMR		Version 3.5
$$ ##JCAMPDX= 5.01
$$ ##ORIGIN= Bruker BioSpin GmbH
$$ ##OWNER= she
$$ F:/spectra/data/she/nmr/H-F/1/audita.txt
$$ ##AUDIT TRAIL=  $$ (NUMBER, WHEN, WHO, WHERE, WHAT)
(   1,<2019-07-04 15:30:40.60 +0400>,<she>,<DPX200>,
      <created by zg, POWCHK disabled, PULCHK disabled
       configuration hash MD5:
       00 E9 B6 7A A2 85 ED C7 34 08 36 98 17 FE 4E 26
       data hash MD5: 16K
       12 38 05 BF 51 02 98 A2 69 ED 57 4B B2 99 30 27>)
$$ ##END=
$$ 
$$ hash MD5
$$ 04 E9 A0 18 63 E1 9A 6C 45 F3 1A 65 5B 4B A6 C5
##$RELAX= 
##$RELAX= 
##$RELAX= 
##$RELAX= 
##$RELAX= 
##$RELAX= 
$$ Bruker specific parameters
$$ --------------------------
##$DU= <F:/spectra>
##$EXPNO= 1
##$NAME= <H-F>
##$PROCNO= 1
##$TYPE= <nmr>
##$USER= <she>
##$AMP= (0..31)
100 100 100 100 100 100 100 100 100 100 100 100 100 100 100 100 100 100 
100 100 100 100 100 100 100 100 100 100 100 100 100 100 
##$AQSEQ= 0
##$AQ_mod= 1
##$AUNM= <au_zg>
##$AUTOPOS= <>
##$BF1= 200.13
##$BF2= 200.13
##$BF3= 200.13
##$BF4= 200.13
##$BF5= 200.13
##$BF6= 200.13
##$BF7= 200.13
##$BF8= 200.13
##$BYTORDA= 1
##$CFDGTYP= 0
##$CFRGTYP= 5
##$CHEMSTR= <none>
##$CNST= (0..31)
1 1 145 1 1 1 1 1 1 1 1 1 1 1 1 1 1 1 1 1 1 1 1 1 1 1 1 1 1 1 1 1 
##$CPDPRG= <>
##$CPDPRG1= <>
##$CPDPRG2= <>
##$CPDPRG3= <>
##$CPDPRG4= <mlev>
##$CPDPRG5= <mlev>
##$CPDPRG6= <mlev>
##$CPDPRG7= <mlev>
##$CPDPRG8= <mlev>
##$CPDPRGB= <>
##$CPDPRGT= <>
##$D= (0..31)
0 1.2 0 0 0 0 0 0 0 0 0 0.03 0 0 0 0 0 0 0 0 0 0 0 0 0 0 0 0 0 0 0 0 
##$DATE= 1562239839
##$DBL= (0..7)
120 120 120 120 120 120 120 120 
##$DBP= (0..7)
150 150 150 150 150 150 150 150 
##$DBP07= 0
##$DBPNAM0= <>
##$DBPNAM1= <>
##$DBPNAM2= <>
##$DBPNAM3= <>
##$DBPNAM4= <>
##$DBPNAM5= <>
##$DBPNAM6= <>
##$DBPNAM7= <>
##$DBPOAL= (0..7)
0.5 0.5 0.5 0.5 0.5 0.5 0.5 0.5 
##$DBPOFFS= (0..7)
0 0 0 0 0 0 0 0 
##$DE= 6
##$DECBNUC= <off>
##$DECIM= 24
##$DECNUC= <off>
##$DECSTAT= 4
##$DIGMOD= 1
##$DIGTYP= 9
##$DL= (0..7)
0 120 120 120 120 120 120 120 
##$DP= (0..7)
150 150 150 150 150 150 150 150 
##$DP07= 0
##$DPNAME0= <>
##$DPNAME1= <>
##$DPNAME2= <>
##$DPNAME3= <>
##$DPNAME4= <>
##$DPNAME5= <>
##$DPNAME6= <>
##$DPNAME7= <>
##$DPOAL= (0..7)
0.5 0.5 0.5 0.5 0.5 0.5 0.5 0.5 
##$DPOFFS= (0..7)
0 0 0 0 0 0 0 0 
##$DQDMODE= 0
##$DR= 18
##$DS= 0
##$DSLIST= <SSSSSSSSSSSSSSS>
##$DSPFIRM= 0
$$ [...]
##$SUBNAM2= <"">
##$SUBNAM3= <"">
##$SUBNAM4= <"">
##$SUBNAM5= <"">
##$SUBNAM6= <"">
##$SUBNAM7= <"">
##$SUBNAM8= <"">
##$SUBNAM9= <"">
##$SW= 24.9336996594482
##$SWIBOX= (0..15)
0 0 2 0 0 0 0 0 0 0 0 0 0 0 0 0 
##$SW_h= 4990.01996007984
##$TD= 16384
##$TD0= 1
##$TE= 0
##$TE2= 300
##$TE3= 300
##$TEG= 300
##$TL= (0..7)
0 120 120 120 120 120 120 120 
##$TP= (0..7)
150 150 150 150 150 150 150 150 
##$TP07= 0
##$TPNAME0= <>
##$TPNAME1= <>
##$TPNAME2= <>
##$TPNAME3= <>
##$TPNAME4= <>
##$TPNAME5= <>
##$TPNAME6= <>
##$TPNAME7= <>
##$TPOAL= (0..7)
0.5 0.5 0.5 0.5 0.5 0.5 0.5 0.5 
##$TPOFFS= (0..7)
0 0 0 0 0 0 0 0 
##$TUNHIN= 0
##$TUNHOUT= 0
##$TUNXOUT= 0
##$USERA1= <user>
##$USERA2= <user>
##$USERA3= <user>
##$USERA4= <user>
##$USERA5= <user>
##$V9= 5
##$VALIST= <valist>
##$VCLIST= <CCCCCCCCCCCCCCC>
##$VD= 0
##$VDLIST= <DDDDDDDDDDDDDDD>
##$VPLIST= <PPPPPPPPPPPPPPP>
##$VTLIST= <TTTTTTTTTTTTTTT>
##$WBST= 1024
##$WBSW= 4
##$XGAIN= (0..3)
0 0 0 0 
##$XL= 0
##$YL= 0
##$YMAX_a= 254040
##$YMIN_a= -431084
##$ZGOPTNS= <>
##$ZL1= 120
##$ZL2= 120
##$ZL3= 120
##$ZL4= 120
##$ABSF1= 10
##$ABSF2= 0
##$ABSG= 5
##$ABSL= 3
##$ALPHA= 0
##$AQORDER= 0
##$ASSFAC= 0
##$ASSFACI= 0
##$ASSFACX= 0
##$ASSWID= 0
##$AUNMP= <proc_1d>
##$AZFE= 0.1
##$AZFW= 0.1
##$BCFW= 1
##$BC_mod= 2
##$BYTORDP= 1
##$COROFFS= 0
##$CY= 11.3945322036743
##$DATMOD= 1
##$DC= 2
##$DFILT= <>
##$DTYPP= 0
##$F1P= 18.9103706918063
##$F2P= -1.10871071338519
##$FCOR= 0.5
##$FTSIZE= 0
##$FT_mod= 4
##$GAMMA= 1
##$GB= 0.15
##$INTBC= 1
##$INTSCL= 1
##$ISEN= 128
##$LB= 0.24
##$LEV0= 0
##$LPBIN= 0
##$MAXI= 10000
##$MC2= 0
##$MEAN= 0
##$ME_mod= 0
##$MI= 1.114404
##$NCOEF= 0
##$NC_proc= 0
##$NLEV= 6
##$NOISF1= 3.799351
##$NOISF2= 2.8
##$NSP= 1
##$NTH_PI= 0
##$NZP= 0
##$OFFSET= 15.70392
##$PC= 1
##$PHC0= -8508.763
##$PHC1= 27.00096
##$PH_mod= 1
##$PKNL= yes
##$PPARMOD= 0
##$PSCAL= 0
##$PSIGN= 0
##$REVERSE= no
##$SF= 200.130013532006
##$SI= 16384
##$SIGF1= 3
##$SIGF2= 2
##$SINO= 400
##$SIOLD= 16384
##$SREGLST= <1H.CDCl3>
##$SSB= 0
##$STSI= 0
##$STSR= 0
##$SW_p= 3612.71676300578
##$SYMM= 0
##$S_DEV= 0
##$TDeff= 0
##$TDoff= 0
##$TI= <>
##$TILT= no
##$TM1= 0
##$TM2= 0
##$TOPLEV= 0
##$USERP1= <user>
##$USERP2= <user>
##$USERP3= <user>
##$USERP4= <user>
##$USERP5= <user>
##$WDW= 1
##$XDIM= 8192
##$YMAX_p= 0
##$YMIN_p= 0
$$ End of Bruker specific parameters
$$ ---------------------------------
##NTUPLES= NMR FID
##VAR_NAME=  TIME,          FID/REAL,        FID/IMAG
##SYMBOL=    X,             R,               I
##VAR_TYPE=  INDEPENDENT,   DEPENDENT,       DEPENDENT
##VAR_FORM=  AFFN,          ASDF,            ASDF
##VAR_DIM=   8192,          8192,            8192
##UNITS=     SECONDS,       ARBITRARY UNITS, ARBITRARY UNITS
##FACTOR=    0.0002004,     1,               1
##FIRST=     0,             0,               0
##LAST=      1.6414764,     0,               0
##MIN=       0,             -431084,         0
##MAX=       1.6414764,     254040,          0
$$ Real data points
##PAGE= N=1
##DATA TABLE= (X++(R..R)), XYDATA
0@%%%%Qj6J6j6J6k4L2m0N4o5P6r2J15j37J61j93K28k66L07l57M13m72N41o15O98
$$ 0 0 0 0 0 8 -8 8 -8 8 -16 16 -24 30 -35 41 -51 64 -73 88 -105 123 -143 164 -193 220 -252 289 -326 372
29C72p93Q91j001J127j262J410j575J753j946K161k397K655k942L258l606L995
$$ 372 -421 470 -531 596 -666 744 -831 922 -1024 1137 -1260 1395 -1547 1711 -1895 2100
45B100m429M916n467O097o825P676q686R910j1430J3377j5973J9630k5217L4907
$$ 2100 -2329 2587 -2880 3217 -3608 4068 -4618 5292 -6138 7239 -8734 10896 -14321 20586
59B0586n6403J87272j06290l90895J58194K87610J53966j20215j56713r3101M5379
$$ 20586 -35817 151455 45165 -345730 -187536 100074 254040 133825 -22888 -115989 -70610
70g0610Q4476J01762j2742j50531j09233J58990J92916q1212k57149o7728J76235
$$ -70610 13866 115628 102886 -47645 -156878 2112 195028 113816 -143333 -211061 -34826
81c4826K02502O438j62041j51730k3923P1236J57374J47494p8500k84520j13247
$$ -34826 167676 174114 12073 -139657 -163580 -92344 65030 212524 134024 -150496 -263743
92b63743K08013K21430l8055j78787o3175J02423P3778p0433o4827O1622N3337
$$ -263743 -55730 165700 127645 -51142 -114317 -11894 61884 -8549 -73376 -11754 41583
103D1583l2718O97L6308n6426r4689L1255J39998P6931p9542j37363k2664Q1207
$$ 41583 8865 9562 45870 -10556 -105245 -73990 66008 142939 63397 -73966 -96630 -15423
115a5423L8608K997N9298J2021j31319j01345Q1912J36669J9110p6995n0040K4103
$$ -15423 23185 26182 85480 97501 -33818 -135163 -53251 83418 102528 25533 -24507 -404
127d04Q467n7822K920J19923M2764j23875q4169P3503P3943l9470o5531J8812
$$ -404 8063 -49759 -46839 73084 115848 -8027 -92196 -18693 55250 15780 -49751 -30939
139c0939Q4737K5581q5759p5922J8729M1663L8688P5099Q265j50771j35486P5402
$$ -30939 53798 79379 -6380 -82302 -63573 -21910 16778 91877 100142 -50629 -186115 -110713
151a10713J93207P8740j10153j55395j8784R8550N7404j907O431l3946q6007Q235
$$ -110713 82494 161234 51081 -104314 -123098 -24548 32856 30949 37380 3434 -82573 -74338
163g4338J22936M3876j15516j10099O1244J76851N6083j68805j74800M7299J78817
$$ -74338 48598 92474 -23042 -133141 -71897 104954 161037 -7768 -182568 -135269 43548
174D3548J03520k5478j26435j48253r916J73163J69622k7046j93910j41334Q6419
$$ 43548 147068 121590 -4845 -153098 -163014 10149 179771 152725 -41185 -182519 -96100
185i6100J97974L8235j38829r0863L9885P1146M4619m534p9561q5948K5379J38819
$$ -96100 101874 140109 1280 -89583 -49698 21448 66067 61533 -18028 -103976 -78597 60222
197F0222J10037p7683k23942q9393J90515K22068k2314j93036j30609K8103J35294
$$ 60222 170259 92576 -131366 -220759 -30244 191824 169510 -23526 -154135 -126032 9262
208I262J08922k1933j14577q5608J7928J10703Q0751p5902j33289J6322J33353
$$ 9262 118184 96251 -18326 -103934 -86006 24697 105448 29546 -103743 -87421 45932
219D5932M7787q0527q9430j1409O4941P3702J5964l8308o7141o8573K1948J36110
$$ 45932 93719 13192 -76238 -87647 -22706 50996 66960 28652 -38489 -107062 -85114 50996
231E0996P9490r4701j27151j168Q5717N7191j6120m6588o010K4070r452j7451
$$ 50996 130486 35785 -91366 -92534 -6817 50374 34254 -12334 -18344 5726 -3726 -21177
243b1177K1295J2209j7818J2647K7418k5268m3160O278L9985K2938j4574k7289
$$ -21177 118 12327 -5491 7156 34574 9306 -33854 -27576 12409 35347 20773 -6516
255f516J0543K4235l6117m7819M8226Q4073q159p6809m5964J2672M7602M1671
$$ -6516 4027 28262 -7855 -55674 -7448 76625 68466 -8343 -54307 -41635 5967 47638
267D7638L376k2951l9628m8424J0545R2476M8475p0627p9943R577O2381L9521
$$ 47638 51014 28063 -11565 -59989 -49444 43032 91507 20880 -59063 -49486 12895 52416
279E2416k1071o1790k4065M4760N5189J2078m5528q7532k6484J10520J19529m1716
$$ 52416 31345 -30445 -54510 -9750 45439 57517 11989 -75543 -102027 8493 128022 86306
291H6306j49200p4224P2051J32583M7419q5375j03421j2912N5860O8847M0674
$$ 86306 -62894 -137118 -65067 67516 114935 29560 -73861 -86773 -30913 37934 78608
302G8608m5708j03720k2502R6184Q4908k7400j04519o2323O6776J21323J9687
$$ 78608 32900 -70820 -93322 2862 87770 60370 -44149 -106472 -39696 81627 101314
313A01314r7929r1903n579Q4195J13381J4484j27319j19655L3101J38802Q9130
$$ 101314 3385 -88518 -94097 -9902 103479 117963 -9356 -129011 -95910 42892 132022
324A32022n7199j37791m7874R3364R4637q002o3217n2851p260N8308O7752j2491
$$ 132022 74823 -62968 -110842 -17478 77159 69157 5940 -46911 -54171 4137 71889 59398
336E9398q0386n6020K9626R6987N6988p1743j14572r138Q7905P4265K723o6604
$$ 59398 -20988 -77008 -47382 49605 106593 34850 -79722 -88860 -955 73310 76033 9429
348I429q0773l304Q0010O5194j5009p1809n5377L0425Q2494J4676o6701l8237
$$ 9429 -71344 -74648 5362 70556 55547 -16262 -71639 -41214 41280 55956 -10745 -48982
360d8982K7027L5629J0746j3857l0141j2044J6024J9975J8437K901l8511l8581
$$ -48982 -21955 13674 24420 10563 -19578 -31622 -15598 4377 22814 25715 -12796 -51377
372e1377K4984M8496O534k1250j8993j2905P176J9716P031J338l58j8352j3818
$$ -51377 -26393 22103 28637 7387 -11606 -24511 -17335 2381 9412 10750 10392 -7960 -21778
385b1778J7284J3301o287O368O365k2732j5410K0033K6534K003k7395l2094J7340
$$ -21778 -4494 8807 2520 8888 15253 -7479 -22889 -2856 23678 25681 -1714 -33808 -16468
398a6468N6854O695n8312l5045K4170M5541K9454j8015o0739l1748L5966N7912
$$ -16468 40386 47081 -11231 -46276 -22106 23435 52889 34874 -25865 -57613 -21647 36265
410C6265K6325l0899p2747l1482O1251P3195m918o0436n1036K006O2049N6690
$$ 36265 62590 31691 -41056 -72538 -11287 61908 56990 -3446 -54482 -52476 9573 66263
422F6263k4159p5535l8255L5319P9345M0825o6678j04471m53J02099P4851k8995
$$ 66263 42104 -33431 -71686 -36367 42978 83803 17125 -87346 -87799 14300 89151 60156
434F0156r7528o4496M6375J05410L5856o2409q1733k6297N7228R1021J3508q5647
$$ 60156 -37372 -101868 -55493 49917 85773 23364 -58369 -84666 -27438 63583 77091 -8556
446h556p2118K1577P8163N3400k7859q6070l9775N5534P7507J7767n1542p7291
$$ -8556 -80674 -59097 19066 72466 44607 -41463 -81238 -25704 51803 69570 18028 -59263
458e9263k0405P7508Q5019j5349q8038n6743K8282Q5162M7486n2155q0009q310
$$ -59263 -79668 -2160 82859 67510 -20528 -77271 -48989 36173 83659 31504 -48505 -56815
470e6815N2521M8870P081m4785n2696P617N5862L0692j9473m2990k9203K2375
$$ -56815 -4294 44576 51657 6872 -45824 -38207 17655 48347 28874 -14116 -43319 -20944
482b0944N3148J3046l6624l4056o027J9732L8677J3590l6626l6595M212K8716
$$ -20944 32204 45250 8626 -25430 -31457 -11725 26952 40542 3916 -32679 -28467 249
494B49K5965p34l4272k2704K1251K2897m268q140m779o917N310R584l330j656
$$ 249 26214 25480 -8792 -31496 -10245 12652 8384 244 -4535 -11452 -6142 3442 112 -1544
508a544L513q644p197J2437Q628l325j954r729j2126J3728K4849j962j8712j4954
$$ -1544 1969 -6675 -13872 -1435 7193 3868 1914 -7815 -19941 -6213 18636 16674 -2038 -16992
522a6992m452J9624K8173l339k9510j3847M057J5863K6516M325l4555k7101J2146
$$ -16992 -21444 -1820 26353 23014 -6496 -20343 -16286 -423 26093 30418 -4137 -31238 -19092
535a9092L2366K5079j0575m7482k4363L7113M7935K032l8222m2573m304N3628
$$ -19092 13274 38353 27778 -19704 -44067 -6954 40981 43013 4791 -37782 -42086 11542
547A1542M8961k1493o2052l0445K6445N9934L2666m3661o9294q326N3259N0425
$$ 11542 60503 39010 -23042 -53487 -27042 32892 65558 21897 -47397 -55723 -2464 47961
559D7961M246n1662n9148Q446O8535M2424k6083o2936l9916L4079Q0269K3154
$$ 47961 52207 545 -58603 -50157 18378 60802 34719 -28217 -68133 -34054 46215 69369
571F9369o4323o8029Q91O3256O2856j0109q0745n1500L8616P3933L0383l9648
$$ 69369 5046 -62983 -62092 1164 64020 53911 -26834 -78334 -39718 34215 64598 24950
583B4950p2917k3917O1429O7143o902n8848m5484R807O0306M4134k9138o2142
$$ 24950 -47967 -71884 -10455 56688 49786 -9062 -54546 -44739 15567 59701 30563 -31579
595c1579k0068L3549N2176K1094m1575n9537K53N4376M0045r422m6366l8069J7931
$$ -31579 -51647 -18098 34078 55172 13597 -45940 -45687 8689 48734 39312 -7054 -45123 -27192
608b7192N5156J9100l1305l5764r726K3438L7244L047l6162k2379J2719K1607
$$ -27192 27964 47064 15759 -20005 -29731 -6293 30951 33998 -2164 -24543 -11824 9783
620I783J2070o345k4394j0311J7353J3482j963l783r767j0829P946J4482j365
$$ 9783 21853 15508 -8886 -19197 -1844 11638 9675 5892 -3875 -14704 -6758 7724 6359
633F359m945l325q927o21J1913K821l173J830o833j2400O766J5171K223m792r672
$$ 6359 1414 -1911 -10838 -11459 454 3275 102 1932 -4901 -17301 -10535 4636 6859 2067 -7605
648g605j2986P424K3544M327j6631j4107m540J4722K6964M32l3245j9291J6725
$$ -7605 -20591 -13167 10377 14704 -1927 -16034 -20574 -5852 21112 21544 -11701 -30992 -14267
661a4267K8466J5959j4971l7706j2488L2315L2448R51k4137l2094p056L7306L6890
$$ -14267 14199 30158 15187 -22519 -35007 -2692 29756 30707 6570 -25524 -32580 4726 41616
674D1616j0236l8694k4679R808M1115K8998k5472m7838r815L1206L8424J0331
$$ 41616 31380 -7314 -31993 -22185 18930 47928 22456 -25382 -35197 -3991 34433 44764
686D4764l7302m8847M359N3055L5329j7491m9828l5152K4865O1185J9896m2116
$$ 44764 7462 -41385 -37026 16029 51358 33867 -15961 -51113 -26248 34937 54833 12717
698A2717m8352r317L6082N0129N173n2487m3088J3362M8145L3408j6457n6470
$$ 12717 -35635 -44952 -8870 41259 46432 -6055 -49143 -35781 12364 45772 29315 -27155
710b7155k9339L8452N3459P178l8946m6135o519M9285M8323j3365n4116l1661
$$ -27155 -56494 -18042 35417 42595 3649 -42486 -49005 280 48603 35238 -18878 -50539
722e0539J7740N1911L1398l1518n6006q182L9843L7170K058l4415l6900Q103M2713
$$ -50539 -32799 19112 50510 18992 -37014 -45196 -5353 31817 33875 -540 -37440 -29337 13376
735A3376K1393j7171l1401j9215J7804M1369J0128l4121k8775M128K4958K4847
$$ 13376 34769 17598 -13803 -33018 -15214 26155 36283 2162 -26613 -22485 2473 27320
747B7320k341l0791j8465J3299K0355R494n022k0202j2520J5276J7702m905j1509
$$ 27320 24979 -5812 -24277 -10978 9377 18871 13849 -6353 -18873 -3597 14105 9200 -2309
760b309l616Q74P101M496q442m796P863j43o345L175L765l244m4r69p346K687
$$ -2309 -5925 -5051 2050 6546 -1896 -6692 1171 1028 -5317 -2142 1623 -1621 -1665 -2634 -9980 -7293
776g293J2113J641p260r448q867Q597K4775L805k4169j8074M957J8220J9541j442
$$ -7293 4820 6461 -799 -10247 -19114 -10517 14258 18063 -6106 -24180 -19223 -1003 18538 17096
790A7096k7503j7573J3426K3820J2792r722l0623j3855K8691L3082n956l1146
$$ 17096 -10407 -27980 -14554 9266 22058 12336 -18287 -32142 -3451 29631 23675 -7471
802g471k2485Q325L6707K4448k1966l9927j0373K2939L5899J6182l0655m5425
$$ -7471 -29956 -21631 15076 39524 17558 -22369 -32742 -9803 26096 42278 11623 -33802
814c3802j369M1814L2552o387l8218l2324J5750M5109J6445k5434l3892j3112
$$ -33802 -35171 6643 39195 32808 -5410 -37734 -21984 23125 39570 14136 -19756 -32868
826c2868K3458M3006P079m2781l7656J0434M1660L1148j5018n0680k4535L0910
$$ -32868 -9410 33596 40675 -2106 -39762 -29328 12332 43480 28462 -22218 -46753 -15843
838a5843M2684J0099k4704l9826j4469L3685M1820k281l7250k9409N498L9685
$$ -15843 26841 36940 12236 -27590 -42059 -8374 33446 31165 -6085 -35494 -29996 9689
850I689K7310k2214m1088o750K5858K7756P619k5420l4537R08L5182K6103o623
$$ 9689 36999 14785 -26303 -33053 -7195 20561 28180 2760 -31777 -30869 4313 30416 23793
863B3793l2014k7505J2644M1089J5042k4418k5431n231J4684K4292O282k1209
$$ 23793 -8221 -35726 -23082 18007 33049 8631 -16800 -22031 -7347 16945 23227 2018
875B018j8356M055J5990J4012j581k2507j2781J7622J9160k796j2981j0205k137
$$ 2018 -16338 -12283 3707 17719 16138 -6369 -19150 -1528 17632 14836 1855 -8350 -10487
888a0487J2578J2477l688j0034m700l504N259J2937q92j1146p13L273l477K82
$$ -10487 2091 14568 10880 846 -3854 -7358 -2099 10838 9946 -1200 -1913 1360 -2117 -1835
902a835M936J555J017m239j0808J008J4381L395r399n254k061J936J0826M999
$$ -1835 3101 4656 5673 1434 -9374 -8366 6015 9410 11 -5243 -7304 -5368 5458 10457
916A0457j3385j1748M182J3553J2342m700k5654j2868K1888K5731k56j8866k2387
$$ 10457 -2928 -14676 -10494 3059 15401 10701 -14953 -27821 -5933 19798 19542 676 -21711
929b1711n015K5320K7526n481k7549k0213N141L0485K4543j8384l8248n992K8026
$$ -21711 -26726 -1406 26120 20639 -6910 -27123 -21982 8503 33046 14662 -23586 -29578 -1552
942a552K6801R03k8110k8937Q607L7541J9418j5659l3506k1862J9938M6118J3683
$$ -1552 25249 26152 -1958 -30895 -22288 15253 34671 19012 -14494 -36356 -16418 29700 43383
955D3383l6805l7927K07L3617L3548m160m0148k5359J6547L2675J6697j4437l6283
$$ 43383 6578 -31349 -31142 2475 36023 31863 -8285 -33644 -17097 15578 32275 17838 -18445
968a8445j6360L0100L6701k642l3865k7558O215L7631K6020k0614l8108j1692
$$ -18445 -34805 -4705 31996 29354 -4511 -32069 -25854 11777 37797 17183 -20925 -32617
980c2617J9241K9929J5770k2446l6818m489K9159K5153j567k5815k4173R378L0735
$$ -32617 -13376 16553 32323 9877 -26941 -31430 -2271 22882 21315 -4500 -28673 -19295 11440
993A1440R487j7106j7944n790J2264K2060M325k2087j7971N468J8025J6338l945
$$ 11440 20927 3821 -14123 -19913 -7649 14411 18736 -3351 -21322 -15854 2171 18509 14564
1006A4564k3728j2872J4889J6711K629n475j1103q269P962J2856L60n494n455
$$ 14564 -9164 -22036 -7147 9564 12193 6718 -4385 -12654 -4692 8164 8524 3030 -2425
1019b425l580O180R125n151q274M016M028j835N36P80l753L97J685k427K849N096
$$ -2425 -6005 175 9300 4149 -4125 -109 3919 2084 2620 3400 -353 44 1729 -698 2151 7247
1035G247m916n599J479j60O66R255K441j2281r555L062R717J1941j434j9294j0477
$$ 7247 2331 -3268 -1789 -1949 -1283 7972 10413 -1868 -11423 -8361 1356 13297 11863 -7431 -17908
1050a7908J0968J4019L642m356j4878j0229J2892J9694q04j6291j5161Q25K2450
$$ -17908 -6940 7079 10721 6365 -8513 -18742 -5850 13844 13040 -3251 -18412 -17587 4863
1063D863J8829j4560k8171n279J7768K1759Q024j8946k9376j341K7482K3550k273
$$ 4863 23692 9132 -19039 -24318 -6550 15209 23233 4287 -25089 -26430 1052 24602 22329
1076B2329k6415k6747R013L7275J5851k1626k8207o763K0094K9666L031l0286
$$ 22329 -4086 -30833 -21820 15455 31306 9680 -18527 -25290 -5196 24470 27501 -2785
1088b785k3919Q003K8429K1898r054l7901j9699K5893L6740M812k6295l0098m166
$$ -2785 -26704 -18701 9728 31626 22572 -15329 -35028 -9135 27605 32417 6122 -23976 -28142
1101b8142L1225K8930p980l0349j8892P689K8937K0377j8157l4842m798K5469
$$ -28142 3083 32013 24033 -6316 -25208 -17519 11418 31795 13638 -21204 -26002 -533
1113e33K3273n63k5275k3833Q923K9854J2472j3955k2027j3309J2565K9255P115
$$ -533 22740 22177 -3098 -26931 -18008 11846 24318 10363 -11664 -24973 -12408 16847 23962
1126B3962k3451k0913J880J7853J7500l574k1955r849J2401J2471K610n153j2607
$$ 23962 511 -20402 -18522 -669 16831 13257 -8698 -18547 -6146 6325 8935 3782 -8825
1139h825n343J3133J2489m756j0811n480K692J1236O847r442q698L787L774O76
$$ -8825 -14168 -1035 11454 6698 -4113 -9593 -6901 4335 11182 1740 -6958 -3171 603 1279
1153A279K861m54n128J312J779k528J227L525j127N27J81p118j242J0905N382
$$ 1279 4140 3686 -1442 -130 1649 -879 348 3873 2746 3273 3454 -3664 -4906 5999 11381
1168A1381q387p274n90M933R171R84j2946o480O594Q241M042j933j4030r317J2998
$$ 11381 2994 -4280 -4870 63 9234 10218 -2728 -9208 -2614 5627 9669 7736 -6294 -15611 -2613
1183b613J7284j374j4314j4441l60J9407J6328j0014k0738p253Q015J7094J2131
$$ -2613 14671 13297 -1017 -15458 -15818 3589 19917 9903 -10835 -18088 -10073 7021 19152
1196A9152j2727k4624l345J9314J8121j03j9586k1450P700K8250J1297j5211k1285
$$ 19152 6425 -18199 -21544 -2230 15891 15788 -3798 -25248 -17548 10702 21999 6788 -14497
1209a4497r033J3758K7449O218k4232k2746J880K2873K2520l340l0449j8280J6939
$$ -14497 -23530 -9772 17677 23895 -337 -23083 -21203 1670 24190 20850 -9599 -27879 -10940
1222a0940K6511Q217j3942k4802r340K2702K5725k462k3191j9474L504K6785K0698
$$ -10940 15571 23788 9846 -14956 -24296 -1594 24131 21669 -1522 -20996 -17492 9293 29991
1235B9991j4919l0243p434J8043K2772O762j9845k5689J533K4949J6308n217k1138
$$ 29991 15072 -15171 -22605 -4562 18210 24972 5127 -20562 -19029 5920 22228 17011 -4127
1248d127j7571Q719K7651Q280j9031j8539k033J4662J8525n96k1603j2845Q728
$$ -4127 -21698 -12979 14672 22952 3921 -14618 -16651 -1989 16536 15940 -5663 -18508 -9780
1261i780J5301Q637n882j9216q120J5875J5701l284j1680r923J350J3527Q269
$$ -9780 5521 14158 8276 -10940 -19060 -3185 12516 9232 -2448 -12371 -11021 2506 10775
1274A0775q956r760Q22M441N418K986o960p353N304P422j629l221k164m35N390
$$ 10775 1819 -7941 -7119 -2678 2740 5726 -1234 -8587 -3283 4139 2510 -711 -2875 -3310 2080
1289B080L803p390m217O936L764k235k492l480n81Q345N144p847p494O06N384
$$ 2080 5883 -1507 -5724 1212 4976 2741 249 -3231 -3812 4533 9677 1830 -5664 -5058 326
1304C26R188K342j4069j1032Q896J3837L602p451j4346n459J4462J6070l844j6023
$$ 326 9514 11856 -2213 -13245 -4349 9488 13090 5639 -8707 -14166 296 16366 12522 -3501
1318c501j0371K810J6778J4429j1886k2783l955J6063J6704K506j7460k0500M335
$$ -3501 -13872 -11062 5716 20145 8259 -14524 -18479 -2416 14288 16794 -666 -21166 -16831
1331a6831K3545J1785r263j8636j3457J0751K6051P092k0491k0483RJ8413K1238
$$ -16831 6714 18499 9236 -9400 -22857 -12106 13945 21037 546 -19937 -19928 -1515 19723
1344A9723k927k6689j4780J3001K1688R456j0332k4610r027K0691K3295j567k0245
$$ 19723 16796 -9893 -24673 -11672 10016 19472 9140 -15470 -24497 -3806 19489 17922 -2323
1357b323j7526K221K4060J7442j2522k3536o281J1977J8781Q815j5575k1958m96
$$ -2323 -19849 -17628 6432 23874 11352 -12184 -18465 -6488 12293 21108 5533 -16425 -16921
1370a6921J9611J5009j876j8525j6488P790K3334P612j4044j5361m784J0699J8061
$$ -16921 2690 17699 15823 -2702 -19190 -11400 11934 19546 5502 -9859 -14643 -3944 14117
1383A4117J824j7472j2425L410J3456J1049l587j8818p774J2685J3014o83q369
$$ 14117 15941 -1531 -13956 -10546 2910 13959 10372 -8446 -16220 -3535 9479 8796 427
1396D27r998j656J1819Q572n342q943l467J589R061O674q433r960L497P049K022
$$ 427 -9571 -11227 592 9164 3822 -5121 -8588 -6999 2062 8736 303 -9657 -6160 889 2911
1411B911j238m974l521N161N339m181l102J930K77J790K471m121m779N211O533
$$ 2911 1673 -3301 -6822 -1661 3678 -503 -3605 -1675 -1398 392 2863 -1258 -6037 -826 5707
1426E707k297m999l841J496R442M858j0123q786M978P885M223j295j0544p074
$$ 5707 3410 -1589 -5430 -3934 5508 10366 243 -8543 -3565 4320 8543 7248 -3296 -10370
1440a0370Q081J3236R46r102j1539l237J5116J5457p389j9258o005R872J4602
$$ -10370 -2289 10947 11893 2791 -8748 -11985 3131 18588 11199 -8059 -14064 -4192 10410
1453A0410O748j2233j8913l95J6585J3075j370j6294j7336O495K5392Q582j6401
$$ 10410 17158 4925 -13988 -14383 2202 15277 13907 -2387 -19723 -13228 12164 20746 4345
1466D345j9637l067J6180K0089j097k2238j4748P032J8401J3311o588k4367j1898
$$ 4345 -15292 -18359 -2179 17910 16813 -5425 -20173 -13141 5260 18571 11983 -12384 -24282
1479b4282J8014K2480J188j7728j8209R38K1634J5886j0281j9356p717Q012J9237
$$ -24282 -6268 16212 17400 -328 -18537 -17599 4035 19921 9640 -9716 -17433 -9421 9816
1492I816J0195j4689k2424m90J8930J6123k492j9111j5125R720K0425N462j1049
$$ 9816 20011 5322 -17102 -17592 1338 17461 14969 -4142 -19267 -9547 10878 16340 5291
1505E291j2318n779Q956J6843K119j4998j1838K979J2506J1098n357j7111m490
$$ 5291 -7027 -12806 -3850 12993 15112 114 -11724 -8745 3761 14859 9502 -7609 -12099
1518a2099J2285R294r38n981r427k359J0847Q299l341q290o315J618J0605N670
$$ -12099 186 9480 8542 2561 -6866 -9225 1622 9921 6580 -1710 -8025 -6407 4198 9868
1532I868r373p952M008M830N73q63l087k263L506K680k296p06q65k385L880M631
$$ 9868 495 -7457 -3449 1381 1954 1091 -1996 -4259 -753 1927 -369 -1075 -1940 -4325 -445 4186
1548D186m883n855L668N770j658l089k593Q72O956J181p025l725L580L181L518
$$ 4186 -697 -6552 -2884 2886 1228 -1861 -4454 -3582 3374 4555 -2470 -6195 -2615 566 4084
1563D084K078p651q644M852J1558M049o316j1576l748J2481J2217n623j1926l755
$$ 4084 6162 -1489 -10133 -5281 6277 10326 4010 -7566 -11314 1167 13384 7761 -4165 -7920
1577g920L709R174P686o435j4855k746J1379J2119K245j4681j6293O035K0776
$$ -7920 -4211 4963 12649 6214 -8641 -11387 -8 12111 14356 -325 -16618 -10583 10193
1590A0193P358j1527j4831n461Q978J7651M013j5373j4263m70J4312J5769k613
$$ 10193 17551 6024 -8807 -14268 -5290 12361 16374 1001 -13262 -13732 580 16349 13736
1603A3736k2378j1661J4443J8555K070j3888j5660j593J7548J4465m908j5721
$$ 13736 -8642 -20303 -5860 12695 14765 877 -14783 -16376 1172 15637 10729 -4992
1615d992j2241L367K0394J3793j3406k2229k996J6092J5067N06j5916j3603O133
$$ -4992 -17233 -13866 6528 20321 6915 -15314 -18310 -2218 12849 13355 -2561 -16164 -10031
1628a0031J5455O524n436j2167r374Q582J8893K538j6323j2754L805J4620J1512
$$ -10031 5424 11948 6512 -5655 -15029 -6447 12446 14984 -1339 -14093 -10288 4332 15844
1641A5844p302j6323l598R472Q744L063m418j1372m132J0788R462k924q976n705
$$ 15844 8542 -7781 -11379 -1907 6837 9900 5482 -5890 -10022 766 10228 7304 -1672 -7377
1655g377M141J0747J379j0610m487N118L829J353j63m939m676L393N833J021k860
$$ -7377 -3236 7511 8890 -1720 -6207 -1089 2740 4093 3930 -1009 -5685 -2292 3541 4562 1702
1670A702n242j582O195M203o430m498N053L759k246k987k783J157O123K018m520
$$ 1702 -3540 -5122 1073 5276 -1154 -5652 -599 3160 914 -2073 -4856 -3699 2424 4442 -78
1685g8l701j286P45P250M633q173q998M008R381K521m576q800j506R703P469m385
$$ -78 -3779 -5065 -4320 2930 7563 -610 -9608 -5600 3781 6302 1726 -7074 -8580 1123 8592 4207
1701D207q145l404P49J0078R323o395j5145l825J0474J3114K629j3409j3448M950
$$ 4207 -3938 -7342 -6593 3485 12808 6413 -8732 -12557 -2083 11031 13660 251 -13197 -8247
1715h247J4293O048n618r263p546N328J4705M165j1421j3062m19J3628J3638m920
$$ -8247 6046 12094 6476 -2787 -10333 -5005 9700 13865 2444 -10618 -11037 2591 16229 11309
1729A1309j9217p710J2157J3244L923q706j4639m907J2540J4328R6j2121j3546
$$ 11309 -7908 -15618 -3461 9783 13706 5000 -9639 -14546 -2006 12322 12418 297 -13249
1742a3249O86J7366J0877j0717j5788j466J0494J0678J441j1373j2157L086J2478
$$ -13249 -12563 4803 15680 4963 -10825 -12291 -1797 8881 10322 -1051 -13208 -10122 2356
1755B356Q741k035j4200j1915Q492J8830L081j3060j0992j32J0300J0103j871
$$ 2356 11097 9062 -5138 -17053 -8561 10269 13350 290 -10702 -10834 -534 9569 7698
1768G698j1227n115L586P163O900l679j2312l503J1262R596l675r555n506L960
$$ 7698 -3529 -8644 -5058 2105 9005 5326 -6986 -10489 773 10369 6694 -2861 -8367 -4407
1782d407J0902K743p335n757j79K041O037M149o476p351K895N910J778l044n037
$$ -4407 6495 9238 1903 -3854 -4033 -1992 4045 8194 1718 -5633 -2738 3172 4950 1906 -3131
1797c131n6O765K119o641k592K431K741J136O50m026m282K898M702M04k411m497
$$ -3131 -3187 3578 5697 -944 -3536 -1105 1636 2772 3422 -604 -4886 -1988 2714 3118 707 -3790
1813c790r52O865L847p342o126L755O475K387k979p345l697O553Q024L85n170
$$ -3790 -4742 2123 5970 -1372 -7498 -3743 2732 5119 2140 -5205 -8902 -2349 5675 6060 890
1828H90q044l383J0042J1347m417j2838m281P006J0131K888r128j0354K812J0528
$$ 890 -7154 -10537 -495 10852 6435 -6403 -10684 -3678 6453 9341 213 -10141 -7329 3199
1842C199N648k109j0054r061N683J6305M892j2353j2944j201J2787J3552l258
$$ 3199 8847 6738 -3316 -12377 -6694 9611 14503 2150 -10794 -11995 792 14344 11086
1855A1086j5338p447O553J0901O037m883j3714n413J1547J2532q80j2031j0981
$$ 11086 -4252 -11699 -5146 5755 11792 6909 -6805 -12218 -671 11861 10981 -1050 -12031
1868a2031L104J5770P932j0319j3031j810P510J0988L867r992j2895N92J0919
$$ -12031 -8927 6843 14775 4456 -8575 -10385 -2875 8113 11980 1988 -10907 -10315 604
1881F04R403r33j2684r032O773J2737J626q453p020r32O728Q576j323r675n387
$$ 604 10007 9074 -3610 -12642 -5869 6868 8494 41 -6979 -7911 -1183 7393 6070 -3605 -8992
1896h992K602Q579O872m465j2516k548R988O496o11o028n575J22P671L894k840
$$ -8992 -6390 2189 9061 4596 -7920 -10468 -480 6016 5405 -623 -6198 -6076 1595 5489 2649
1911B649m077k536R33O585K366o455m633L704M836Q41k097m759j146M990K966
$$ 2649 -1428 -3964 -3031 3554 5920 -535 -5168 -1464 3372 4213 2116 -2643 -3789 1201 4167
1926D167k171j566j133j185K943L649k828m290K011K914R3j911l414J89N774K440
$$ 4167 1996 430 -703 -1888 1055 4704 1876 -2414 -403 2511 2604 693 -2721 -2532 3242 5682
1942E682n244m057Q03K631K956K092n664n162K477N612K363k054o989l129P443
$$ 5682 438 -3619 -2816 -185 2771 4863 -801 -5963 -3486 2126 4489 2435 -4554 -7683 -240
1957b40P433l706q057k869L523P180M363o070r614o58P516P966J231r328j0542
$$ -240 7193 3487 -4570 -7439 -3916 3264 7627 1557 -8057 -8715 -1199 6767 7998 -1330 -11872
1972a1872L668J3427M984p197j0137k663P760J1112J8j1558o596K758R200Q491
$$ -11872 -8204 5223 10207 3010 -7127 -9790 -2030 9082 9100 -2458 -9054 -6296 2904 11395
1986A1395m089j4479n294J0949J1722Q29r795j1435J035J3377Q356n789j0493
$$ 11395 7306 -7173 -12467 -1518 10204 11033 1238 -10197 -9162 4215 12571 6782 -3711
1999c711n501M437J1416N574r232j1632P48R265Q229j432j1601p163O420J1497
$$ -3711 -9212 -4775 6641 12215 2983 -8649 -7901 1364 9593 8161 -3440 -10603 -4183 7314
2013G314J573o633q258l162P862J0085j251r890n758J992Q029O391m603j0001
$$ 7314 8887 2254 -6004 -9166 -1304 8781 7530 -2360 -8118 -6126 1903 8294 3691 -6310
2027f310j274O678M851m7m275n610M68O980L085l037m689k495L046O519Q67o185
$$ -6310 -7584 -906 3945 3898 -377 -5987 -5519 1461 4546 1509 -3180 -5675 -2629 3890 4757 -1428
2043a428l772K502L645J821j69m257j945L338K467j231n32j557n30L277J665l771
$$ -1428 -5200 -2698 947 2768 2599 -1658 -3603 -265 2202 971 439 -1118 -1648 1629 3294 -477
2059d77k440L166K112L14j554k720n96L944J809k691j573JR3L133J220m012l256
$$ -477 -2917 249 2361 2675 1121 -1599 -2195 1749 3558 867 -706 -705 -612 2521 3741 -271 -3527
2076c527K334M223J144k368n481j790O049N348k007n502l494R20N908M874l934
$$ -3527 -1193 3030 4174 1806 -3675 -5465 584 5932 3925 -1577 -5071 -4151 1757 6631 2697
2091B697p701j339M833O026J543o955p649K753R094K735l715p138l542N799Q905
$$ 2697 -5004 -6343 -1510 4516 6059 -896 -8545 -5792 3302 6037 2322 -4816 -8358 -2559 6346
2106F346R02q250o810O7Q144Q244k112j1110n388O345Q962L039n745r795j326
$$ 6346 7248 -1002 -7812 -7745 399 8643 6531 -4579 -9967 -3622 5340 8379 2634 -7161 -8487
2121h487R484P534k327q184n972K414J1075N183p891j0177k61P608Q334M43r790
$$ -8487 997 8531 6204 -1980 -7952 -5538 5537 10720 2829 -7348 -7609 -1 8333 8776 -1014
2136a014p609M048Q915M068l335q065n313N934R601L48p741n860O22P132N966
$$ -1014 -8623 -4575 4340 8408 5073 -2992 -8305 -2371 7230 7578 -163 -6023 -5401 1731 7697
2151G697l291q646k045M830N558K240m611q124P8P484M716k514n871l504K663
$$ 7697 4406 -4240 -6285 -1455 4103 6343 1732 -6392 -6314 1170 5886 3372 -2499 -6003 -3340
2166c340O552R50m831l178P40K565K469K96m394k095L136K982j85j799l026l91
$$ -3340 3212 4162 -669 -3847 -3107 -542 1927 2223 -2171 -4266 -1130 1852 1667 -132 -3158 -3549
2182c549M912J958l457j970L99J429J788M50k773j402K728J499q71j371j564M14
$$ -3549 1363 3321 -136 -2106 -1707 -278 1510 1960 -813 -2215 513 2012 1141 -230 -1794 -1380
2198a380L822K232m641l467J323L994K370j034n396k137M561M398p44l333l499
$$ -1380 2442 4674 33 -3434 -2111 1883 4253 3219 -2177 -4314 247 4645 3901 568 -2931
2213b931o82N401M198l519n821p53L277N169J705o145o421K324O321L729k061
$$ -2931 -3613 1788 5986 2467 -3354 -4107 -830 4339 6044 -101 -6522 -4198 2123 5852 3791
2228C791o295n089L785Q703J796o245o357q06O121P621k132q958l508M660O135
$$ 3791 -2504 -7593 -3808 4895 6691 446 -5911 -6717 -596 7025 4893 -4065 -7573 -2913 3222
2243C222K731m237q302j063P637O585j454o461o493J655R206N031n419p301j935
$$ 3222 5953 1716 -6586 -7649 -12 6573 5119 -1342 -7835 -6180 3026 8057 2638 -4663 -6598
2258f598M292O847K659o102p494J570O418M918r39p728n403N288Q584M77o044
$$ -6598 -2306 4541 7200 1098 -6396 -4826 1592 6510 5571 -2157 -7560 -2272 6312 6789 745
2273G45n746M4O269N849k382o666l357K534N225L731k651p456r56M996L969o34
$$ 745 -5001 -4957 1312 7161 4779 -1887 -5244 -2710 2515 6246 3595 -3861 -4817 179 4148 3514
2289C514l377l611P02N005J761l144l078j353J632M711J342n254l475J951L576
$$ 3514 137 -3474 -2772 2233 3994 850 -2228 -3581 -1949 2762 4104 -1150 -4625 -2674 902
2304I02J903j427l978j683L887K100j596j507m32M25J739J280k981j455K274J849
$$ 902 2805 1378 -2600 -4283 -396 1704 108 -1399 -1831 -1406 333 1613 -1368 -2823 -549 1300
2320A300j25p06k426r80L588K303k396k169M03L88K122J220k943j981J916K382
$$ 1300 1175 469 -1957 -2937 651 2954 558 -1611 -1208 -820 1302 2522 -421 -2402 -486 1896
2336A896P74j210l670j866M423N379k235n198k518J730N768L169m594n837k09
$$ 1896 2670 1460 -2210 -4076 347 5726 3491 -1707 -4225 -2495 3273 6442 1848 -3989 -4198
2351d198M784M062J27n270n581L232O741J914m716n369j109N197O193j260p136
$$ -4198 586 4648 4775 -495 -6076 -2844 3897 5811 1095 -4274 -5383 -186 6007 4747 -2389
2366b389l437J999N375M724k254q532l282N707O954P05n509o684M28Q048M519
$$ -2389 -5826 -3827 1548 6272 4018 -4514 -7796 -2089 4865 5570 61 -6623 -6195 1853 6372
2381F372l930o480k215L424P110J989o635o398J944N969M929j548p298m251M375
$$ 6372 2442 -4038 -6253 -2829 4281 6270 -365 -6763 -4819 1150 6079 4531 -2767 -7018 -2643
2396b643O813J073l700m498j986M032N450l85m458l461Q35M534L733k376o434
$$ -2643 4170 5243 1543 -2955 -4941 -909 4541 4156 -302 -3763 -2928 1606 5339 2963 -3471
2411c471m91M484L697J79l914m640J490N148K428k745l238k114J387M884J106
$$ -3471 -3962 522 4219 4398 484 -4156 -2666 2482 4910 2165 -1073 -3187 -1800 3084 4190
2426D190m348j860J072J188J392m11k236q29K534L04n42l66j007j459K396K067
$$ 4190 -158 -2018 -946 242 1634 1223 -1013 -1842 692 996 454 88 -919 -2378 18 2085
2442B085j738k100j42R32J566Q03k178j527J678J587j211o85q6m58J972J612k678
$$ 2085 347 -1753 -1895 -963 603 1406 -772 -2299 -621 966 -245 -930 -1016 -1474 498 2110 -568
2459e68k292J377K267J587n87l743j959L511L553j082k388j391JK507K650k041
$$ -568 -2860 -1483 784 2371 1784 -1959 -3918 -407 3146 2064 -324 -1715 -1714 793 3443 1402
2475A402l036l43J542L158J458l565m840J580N022K519k104m335l721L219O625
$$ 1402 -1634 -1977 -435 2723 4181 616 -4224 -2644 2378 4897 2793 -1542 -5263 -2044 4581
2490D581J427n188m540o60M639N665j563o950l159M510N123R17m108n785j13O643
$$ 4581 6008 820 -3720 -4380 259 5924 4361 -2589 -5748 -1238 3885 4802 694 -5091 -5204 1439
2506A439L583k313m996l352J331O813L639m616o158j064M151N601J075o021n383
$$ 1439 5022 2709 -2287 -5639 -4308 2505 6144 1528 -4630 -5694 -1543 4058 5133 -888 -6271
2521f271K270N828K328j882n530k560M111O505p13n321l713Q22N642M202l640
$$ -6271 -4001 1827 4155 2273 -3257 -5817 -1706 4799 4086 -1235 -4948 -4126 1516 5718 2078
2536B078n942l35L464L439P91k663m173J68M066K409q69k484k695J159M066R65
$$ 2078 -3864 -4199 -735 2704 3495 832 -3341 -3173 893 3302 2433 -51 -2746 -1587 2479 3444
2552C444l246k245P28J805K630j88l733k070K194K767L54j391k548q74L562J258
$$ 3444 198 -2047 -1319 486 3116 2928 -805 -2875 -681 2086 2440 1049 -1499 -2373 1189 2447
2568B447j802j682L75P84R92n42j722k24K064N60j232n80p95m56K354O32j711
$$ 2447 645 -1037 -662 122 1114 572 -1150 -1374 690 1250 18 -562 -1357 -1813 541 1173 -538
2585e38j026M85N47J072N77k262j101J582J338j35l11k043p02K428K970r69l705
$$ -538 -1564 -1079 -532 540 1117 -1145 -2246 -664 674 539 228 -1815 -2517 -89 2881 1912 -1793
2602a793j220J435L613K117l480m782J321L996K099j054l151k592K223M295L22
$$ -1793 -3013 -1578 2035 4152 672 -4110 -2789 1207 3306 2252 -899 -3491 -1268 3027 3349
2617C349k779k461q11K674M509r84m782k344K114L436K537j610n512j839L687
$$ 3349 570 -1891 -2702 -28 4481 3497 -1285 -3629 -1515 1921 4458 2848 -2664 -4503 -816
2632h16M434O02k928n500k52O289L781l298n106j427K864M853N02m972l960J736
$$ -816 3618 4220 1292 -4208 -4460 1829 5610 2312 -2794 -4221 -1357 3496 3998 -974 -4934 -3198
2648c198M390K750j391m654l701L429N209Q38l487l694j147L746M352n48m567
$$ -3198 1192 3942 2551 -2103 -5804 -2375 2834 3672 185 -3509 -4656 -910 3442 2894 -1673
2663a673j737P98L275K958j952n087p71M315L201l55l730l387J574M934J637l669
$$ -1673 -3410 -2612 663 3621 1669 -3418 -4189 126 3327 2972 -758 -4145 -2571 2363 4000 331
2679C31k698o7J830L419J77l429j700J317J965P23m09k391o77K278J590j670o51
$$ 331 -2367 -2434 -604 2815 2992 -437 -2137 -820 1145 1868 1459 -932 -1609 669 2259 589 -62
2696f2m64k69K076R17j621j913M17J037J313L96k399j793K502J727j374j453l11
$$ -62 -526 -795 1281 2198 577 -1336 -919 118 1431 1827 -572 -2365 137 1864 490 -963 -1274
2713a274O91J717Q78k990j614J664K217J97r43k371j419L051K793j596k390r82
$$ -1274 -583 1134 2012 -978 -2592 -928 1289 1486 543 -1828 -3247 -196 2597 1001 -1389 -2371
2729b371P29K027J730k127k391M52J734J398P45k282l007J131L939J460j970l275
$$ -2371 -1642 385 2115 -12 -2403 -1951 -217 1181 1926 -356 -3363 -2232 1707 3167 1197 -2078
2745b078j816K864N032k78m228k784R37L312L278j472n018j599L281L826M43l131
$$ -2078 -3894 -1030 4002 3724 -504 -3288 -2351 961 4239 2767 -2251 -3850 -569 3257 3700 569
2761E69l918P86M547K470k538l360j647J679L829J722l189l950R5K694L452M05
$$ 569 -3349 -2563 1984 4454 1916 -1444 -3091 -1412 2417 4139 950 -3000 -2905 -211 3241 3646
2777C646m252l927K310M408J434k412l717j567L398M197p82m036k181P73L747
$$ 3646 -606 -4533 -2223 2185 3619 1207 -2510 -4077 -679 3518 2736 -1300 -3481 -2708 1039
2792A039K610k162m650n59L128K572M71k615l111N03L471J016o67j689j866O71
$$ 1039 3649 1487 -3163 -3722 -594 1978 2449 -166 -3277 -2774 697 1713 1046 -643 -2509 -1838
2808a838L095J466k929k067K99K022K515o61k990j724K662K344n53j302j810l81
$$ -1838 1257 2723 -206 -2273 -1974 48 2563 1902 -1088 -2812 -150 2194 1641 339 -1471 -1852
2824a852K603J621j527j605j87Q65J822K2k057r59J860R46j101l34j30n82J156
$$ -1852 751 2372 845 -760 -947 -82 1740 1762 -295 -1254 606 1552 451 117 -13 -595 561
2841E61J155r95j375J55J49J248M20j486j936J113K246K80j346j576o86K304K099
$$ 561 1716 721 -654 -499 -350 898 1318 -168 -2104 -991 1255 1535 189 -1387 -2073 231 2330
2858B330j475k218j313J256K692J357k748l610J079L472K042j769k902j512K335
$$ 2330 855 -1363 -2676 -1420 1272 2629 -119 -3729 -2650 822 2864 1095 -1807 -3319 -984
2873i84L201J55k852j663p6J870L153o72l801j761K085L390J283j846m262o05
$$ -984 2217 2372 -480 -2143 -2219 -349 2804 2132 -1669 -3430 -1345 2045 3328 1482 -2780 -3385
2889c385M103L219j065l139k812L70N102K062l118l801j54K409L590M1m432k782
$$ -3385 718 3937 2872 -267 -3079 -2709 2393 4455 1337 -2464 -2618 -209 3381 3422 -1010 -3792
2905c792K677L223R91j557l344j425K657L609n85k782k199J30K804K891j520l426
$$ -3792 -1115 2108 3099 1542 -1802 -3227 -570 3039 2454 -328 -2527 -2397 407 3298 1778 -1648
2921a648r08J815J937J405j962l409K85K918J961j258k297j851J413L438O48l202
$$ -1648 -2556 -741 1196 2601 639 -2770 -2485 433 2394 1136 -1161 -3012 -1599 1839 2487 -715
2937g15j805O17J766K102q96k225q00J410J015M79o20j310j049K047J575j027
$$ -715 -2520 -1903 -137 1965 1069 -1156 -1956 -546 469 948 328 -982 -2031 16 1591 564
2953E64j187l08L12J564N53j580j002Q35O22O26N68j718j359J218K049p65j017
$$ 564 -623 -931 -619 945 1498 -82 -1084 -249 373 999 1567 -151 -1510 -292 1757 992 -25
2970b5n60j43J906O81k068j162J031J642k73l72j406p31J625J871j053j645r23
$$ -25 -585 -728 1178 1859 -209 -1371 -340 1302 1029 657 -749 -1480 145 2016 963 -682 -1605
2987a605O81J440J767j860k266L22J555J208L97k183j794N63K728J066j597j681
$$ -1605 -924 516 2283 423 -1843 -1521 34 1242 1639 -544 -2338 -1775 953 2019 422 -1259
3003a259j964K118L376K40l441k401J510K808J814j676l787k29K732K435n59j811
$$ -1259 -3223 -1105 2271 2511 -930 -3331 -1821 987 2801 1125 -2662 -2891 -159 2276 1717 -94
3019i4k532J09L946J686k008k664r40J762L498P47l598k647Q64L156J866m14l434
$$ -94 -2626 -2517 1429 3115 1107 -1557 -2497 -735 2763 3510 -88 -2735 -1871 1285 3151 2737 -697
3036f97k516K140L687O16k692k574n46L422K640j634l124q97J581K095J699k325
$$ -697 -3213 -1073 2614 3230 538 -2036 -2582 840 3480 1846 -1278 -2175 -594 1501 3200 875
3052H75l147r4L028J709m77l060j551J117L275N07k357j356j00R34K090L72k767
$$ 875 -2272 -2366 662 2371 1894 -1166 -2717 -1600 1675 2182 -175 -1531 -1631 -697 1393 1765 -1002
3069a002j085J111J504P64o23k616j75K406J642j206j732p27O97J860O30j581
$$ -1002 -2087 -976 528 1292 669 -1947 -2122 284 1926 720 -1012 -1739 -1042 818 1448 -133
3085a33r39L54N56R52p4j110j016J698J238j191q04J04j61J377O91j817p38Q74
$$ -133 -1072 -718 -162 790 716 -394 -1410 288 1526 335 -469 -365 -526 851 1542 -275 -1013 -139
3103a39N60M67K56r71j316Q20J765Q0j378q59m11J611J823j813j700Q5J021J265
$$ -139 421 888 1144 173 -1143 -323 1442 1522 144 -715 -1126 485 2308 495 -1205 -1120 -99 1166
3121A166M33j539k109P13K448O35q63k066j274J723K717n04k220r80N77J550J647
$$ 1166 1599 60 -2049 -1336 1112 1747 884 -1182 -2456 -733 1984 1480 -740 -1720 -1143 407 2054
3138B054j154k195j009J700J537Q42j396l208jL505J914j306k748j537J335K788
$$ 2054 900 -1295 -2304 -604 933 1775 379 -2829 -2830 675 2589 1283 -1465 -3002 -1667 1121
3154A121J515k352k521k6J895K464J78l009k212K203K736L30j721k363n10K435
$$ 1121 2636 284 -2237 -2263 -368 2096 2274 -735 -2947 -744 1992 2322 601 -1762 -2272 163
3170A63K605j054k227j046j87K161K612j413l286m89J973K268L22k353k207P47
$$ 163 2768 1714 -513 -1559 -1746 415 3027 1614 -1672 -2161 -188 2080 2402 49 -2158 -1411
3186a411K804R13j856j030j221J232K115P53k453j887Q27J934J179o72k631o27
$$ -1411 1393 2306 450 -580 -1801 -569 1546 2299 -154 -2041 -1214 720 1899 1227 -1404 -2031
3202b031K105J106m67r76r08j98J545P68p02j295J9Q44J196J17k215r25J657J151
$$ -2031 74 1180 713 -263 -1171 -1369 176 944 242 -1053 -1034 -190 1006 1123 -1092 -2017 -360 791
3220G91J9q68j015k40J368J092q87n86p79P68J062N57j597j321J459J573Qj779
$$ 791 810 -58 -1073 -1313 55 1147 260 -326 -1105 -337 725 1282 -315 -1636 -177 1396 1404 -375
3238c75q33J14J875J303j454j463p9M66J297Q91j051k075K47J600J193o43j467
$$ -375 -1208 -1094 781 2084 630 -833 -912 -446 851 1742 691 -1384 -1137 463 1656 1013 -454
3255d54j451J522K320n52j925r63J35J630J840o13k738j382J821J955J037j737
$$ -454 -1905 -383 1937 1385 -540 -1503 -1368 262 2102 1489 -1249 -2631 -810 1145 2182 445
3271D45k824R0K903R98p32j860o60P51K006O32j740j847K7J433J967k23k560j510
$$ 445 -2379 -2289 614 1612 880 -980 -1640 -889 1117 1749 9 -1838 -1811 -378 1589 1366 -1194 -2704
3289b704J791J780P32q96j997j057K097K111m15j771j086m7K086J683j521k156
$$ -2704 -913 867 1599 703 -1294 -2351 -254 1857 1442 -329 -1415 -1462 624 2307 786 -1370
3305a370l06J602J608K42k176j457O83J951R75p82j181j442J075K085P38j983
$$ -1370 -1676 -74 1534 1776 -400 -1857 -1174 777 1752 970 -211 -1653 -578 1507 2245 262
3321B62j401L21R76J445k25k284l08J566O0M57o03j259k07J616J346j510q06o58
$$ 262 -1139 -818 158 1603 1378 -906 -1214 352 412 869 266 -993 -1200 416 1762 252 -554 -1212
3339a212M53J916M30j985p63Q88O99l7l91l27p77J060P11o34m67q24O39J502K48
$$ -1212 -759 1157 1587 -398 -1161 -273 426 389 -2 -329 -1106 -46 665 31 -436 -1260 -621 881 1129
3358A129j654q37O03J113N14m52q43p79J177J146m54p79n84M5J237J122j195k210
$$ 1129 -525 -1362 -759 354 868 416 -427 -1206 -29 1117 663 -116 -700 -655 582 1704 509 -1701
3376a701N08J984O72M4j771j311Q57K015J43q25j207p61J018K321l32k118r99
$$ -1701 -1193 791 1463 1507 -264 -1575 -718 1297 1440 615 -592 -1353 -335 1986 1654 -464 -1463
3393a463O84J575R75j228j915N8J942P17k08j608j402M03K601Q43j411j869n86
$$ -1463 -779 796 1771 543 -1372 -1314 628 1345 1137 -471 -1873 -1470 1131 1974 563 -1306 -1892
3410a892J331K209j63k470q39P58K094j4o59j154r43J337J523p3j246j848P10
$$ -1892 -561 1648 1485 -985 -1824 -1066 1028 1014 355 -799 -1742 -405 1118 1045 -201 -2049 -1339
3427a339J903J551j551j842k50J067J355Q17j557j793L50J888P21l10j061j323
$$ -1339 564 2115 564 -1278 -1528 -461 894 1711 154 -1639 -1289 599 1320 1010 -51 -1374
3443a374P93J691L28j704p88J33J297J071q32j344k40P99J025N80p93j483j77
$$ -1374 -581 1110 1438 -266 -1054 -921 376 1447 615 -729 -969 -170 855 1435 642 -841 -1018
3460a018J220J364o20j016m81n6J082L62q10o64L34J26J014p36m68n07P72Q34
$$ -1018 202 1566 946 -70 -551 -607 475 837 27 -637 -303 -177 837 101 -367 -874 -102 732
3478G32m67n67o08kQ42N88r96k24K09K88P22k08q66o64R68P09r5n95p34J18J132
$$ 732 265 -302 -910 -912 -70 518 -478 -702 -493 -205 517 309 -557 -1221 -253 456 361 -234 -968 -850 282
3499B82R26j147p39j5P03P52j11p49j045O42Q36O50k58j185r51J024J816m40j396
$$ 282 1208 61 -678 -693 10 762 651 -98 -1143 -501 335 985 727 -458 -1409 -385 1431 991 -405
3518d05n69M90J300L02n70j599l20J530P66Q1p25j446k65K034J042p14j761k45
$$ -405 -974 -484 816 1118 548 -1051 -1371 159 925 1006 281 -1165 -1430 604 1646 932 -829 -1074
3536a074P23J856j55j738j045O29J150R24m38j452r89J323J314K28j254j202m25
$$ -1074 -351 1505 1350 -388 -1433 -804 346 1270 832 -620 -1609 -286 1028 1256 2 -1200 -1625
3553a625K088J137j150j312m89O71J382O12j281j335M37Q81Q57l44j198r72J322
$$ -1625 463 1600 450 -862 -1351 -680 702 1314 33 -1302 -865 16 873 529 -669 -1641 -319
3570c19J527m15n63j035m46J244J376q13r24o07O57J199K94o04j313J6R98N75
$$ -319 1208 793 230 -805 -1251 -7 1369 556 -368 -975 -318 881 1175 571 -742 -726 272 847
3588H47l50q29j85K52J043L12j119p96K48J016K47L29j589j94R46M41k60m4q18
$$ 847 497 -332 -517 -265 778 1090 -29 -825 -577 439 686 1015 -574 -768 178 619 359 315 -503
3607e03J28N89L04n06l65K45p6N63N1r10l04O40O77j82p12m71qP46P62o05n66
$$ -503 -375 214 518 12 -353 -108 -184 379 430 -480 -784 -144 533 351 -361 -832 -840 -94 668 63 -503
3628e03p2M26P80J22q85p57K01R07M63m39r14k87P67J336n80r00m25P0J232N40
$$ -503 -575 -149 631 753 -132 -889 -688 219 682 243 -671 -958 -191 1145 565 -335 -760 -690 542 1082
3648A082m59j347k63R78P89l4n44j099%J598K74n09p90o39Q12J552k80j120n38
$$ 1082 623 -724 -987 -9 780 746 202 -897 -897 701 975 466 -324 -963 -151 1401 1121 1 -537
3667e37p2J034N39j62j290m61R87R02J12n93j375j13J449P55q90n80l75k3J346
$$ -537 -609 425 964 802 -488 -949 38 940 1052 459 -916 -1029 420 1175 285 -295 -670 -693 653
3686F53O78j345j145K38P49Q05L07j539r40R63R40J39n29n73l08Q37J039m62q78
$$ 653 1331 -14 -1159 -921 -172 633 940 -599 -1539 -576 364 503 -26 -599 -907 -70 969 507 -371
3705c71j52J78M94Q63p79j036L06L96Q12k24o90q09M78J057L49n11p70l00Q21
$$ -371 -523 -345 149 1012 233 -803 -497 -101 711 487 -203 -1012 -534 523 872 361 -409 -709 112
3724A12P06j09j025k17O55O16m09k68n48N2O19N87p80l80k46M97R31J10j310j70
$$ 112 818 709 -316 -533 122 738 329 61 -487 -435 184 771 -9 -389 -635 -138 793 903 -407 -577
3744e77K61M03N34o14n24KN69N12n03o08J78l1Q61J42m55j136J43J059M26l39
$$ -577 -316 87 621 7 -517 -515 54 566 63 -545 -367 -398 463 605 150 -986 -843 216 642 303
3764C03p53o58J063N34j8m89q49oR45N95n99o81j82O38P03M83j061q30J93J172
$$ 303 -450 -1108 -45 489 471 -18 -867 -873 72 667 68 -613 -795 -157 546 1029 -32 -862 -669 503
3784E03J75k99p52m40N03J269j21p49n03l67P03J197m40j101k35N33P93P5l13
$$ 503 678 379 -373 -813 -310 959 838 89 -414 -781 -78 1119 679 -422 -657 -124 669 744 431
3803D31j129q9J101O78j00j008o19L78R10K72p48p12Q4L09Q40J76r88m75L75N91
$$ 431 -698 -787 314 992 892 -116 -735 -357 553 825 77 -635 -551 -242 598 774 -214 -689 -314 277
3823B77J48j7j186q3K61J241k39r50o0J4Q91M69l79p71m04P89L61K16l73j228
$$ 277 425 408 -778 -861 -600 641 402 -548 -608 -594 297 766 387 -384 -788 1 362 578 205 -1023
3843a023O29J036j45k91o87%N73M30j19p24o6K26K04J11K89o27j31N29L12o1l18
$$ -1023 -394 642 497 206 -481 -481 92 522 403 -321 -387 -161 43 154 443 -184 -315 214 526 465 147
3864A47n31K73M23M09n71l48J64K17M35l60p04k9N29L74j64l52l99J34N56M49
$$ 147 -384 -111 312 721 150 -198 -34 183 618 258 -446 -475 54 428 264 -88 -487 -353 203 652
3884F52p38k45N5N87m8L26j115k67P58N84k15n49j71k16R42N15n16n79n22L66
$$ 652 -86 -331 -276 311 263 589 -526 -793 -35 549 334 -215 -386 -602 340 855 339 -240 -762 -396
3904c96R75R7o83j030M94O95M48l35k82p65M43Q51J3p49l51K23L95N28N9j033
$$ -396 579 676 -7 -1037 -543 152 600 265 -17 -782 -339 512 525 -224 -575 -352 43 571 630 -403
3924d03k03L06P99L57m04r33r9P42O45m01q10J12j02J063J41r22l86J71K93O53
$$ -403 -606 -300 499 856 452 -481 -580 162 807 406 -404 -292 -394 669 810 -112 -498 -327 -34 619
3944F19K5n95p85M61N72K07mj033j36P11Q10m52k64p09K56L67K80k47o51J99K20
$$ 619 644 49 -736 -275 297 504 500 -533 -669 42 852 400 136 -573 -317 50 330 83 -568 -369 -149
3965a49J72L90k68j048M25O09L25l72n25l3j1R82r9m94k20L2M6J62L07o15j45
$$ -149 23 413 145 -903 -478 131 456 84 -441 -474 -485 497 398 -96 -316 -284 -238 -76 231 -384 -529
3986e29P38j01m8n0m30K35N03J17o78K22p6K47J93Kn73l13N74P1K69k69k64k2
$$ -529 209 108 60 10 -420 -185 318 435 -243 -21 -97 150 343 345 -228 -541 33 104 373 104 -160 -182
4008a82M55J84n35k61j04K82O37J10r06KL14L84J66j45n71j64O99J80n07j89n30
$$ -182 273 457 -78 -339 -443 -161 476 586 -320 -318 -4 380 546 401 -170 -334 365 545 38 -151 -681
4029f81M26K81L26l42o72L04L99L35Ln20n87L65P69J81o27o01k12R28N41k51m37
$$ -681 -255 26 352 10 -662 -358 41 376 379 -141 -728 -363 406 587 -40 -641 -853 75 616 365 -72
4050g2n20K28M22M46k55q91L87N4N84J28n15p06L17P47R1j85o54L3O1N17K99m59
$$ -72 -592 -364 58 504 249 -642 -255 -201 383 511 -4 -710 -393 354 445 260 -394 -361 -300 217 516 57
4072E7l22j20P25J90J77r90j43M51O38l3o73l12J1O14L80m98n82k99M80O71J39
$$ 57 -265 -385 340 530 707 -283 -426 25 663 630 -43 -355 -344 270 650 152 -430 -729 -249 422 561
4093E61l80o98N26K59L17n43k03j12m0N29j35m12Q2P9k9O07j41m85k74M33M61
$$ 561 181 -517 9 268 585 42 -161 -273 -313 216 81 -331 -249 -170 -199 408 267 -218 -492 -59 402
4114D02k35j02k15J25L44j76l9m85q8N53L45m44k8l0M0M17q1l16m90M47O00k40
$$ 402 167 65 -150 -25 319 143 104 -381 -469 84 429 -15 -43 -73 -33 384 303 -13 -503 -56 544 304
4136C04jm22j54N7N67J54o84j55J39K92q9J94l02k64M57J29L4l84l40M75L03M2
$$ 304 303 -119 -273 -216 351 505 -179 -334 -195 97 8 202 -100 -364 93 222 256 -128 -468 7 310 352
4158C52l90l66m5J60L86M19o49p43O95K27L63n46l50K29J63M12k21k88j30l53
$$ 352 -38 -404 -449 -289 97 516 -133 -876 -181 46 409 -137 -487 -258 -95 317 96 -192 -322 -675
4178f75P33K23l99n66O7J054j74lm87m63L11M88K64no15r9L01K71M8l64l42K72
$$ -675 58 281 -118 -684 -617 437 263 260 -227 -690 -379 109 373 368 -247 -346 -45 226 274 -90 -432 -160
4200a60L60L00m85p21M23O84J04q9o35J23n36O59P20l13p30k11N05K17M58n54
$$ -160 200 500 15 -706 -283 401 505 416 -219 -96 -632 27 747 434 -296 -507 -2 215 673 119
4220A19m00N4M31Q1k00n47k16O79N86n15k98j21j77Q84j00j6o57L36Q4j60K09
$$ 119 -281 -227 204 285 85 -462 -678 1 587 72 -226 -347 -524 360 260 244 -413 -77 7 -153 56
4241E6Q9o49K64J10L83k10j88j73K52M46j05m91j72L65K09j2j53l74n5P96j75
$$ 56 145 -504 -240 -130 253 43 -145 -318 -66 380 275 -216 -388 -23 186 174 21 -353 -408 388 213
4262B13k16k57L4K50M94k9n58r1J33J35L18n34n8M6M22K09j31j25m10j61N79M90
$$ 213 -3 -260 -226 24 518 489 -69 -160 -27 108 426 -108 -166 -120 302 511 380 255 -155 -316 263 753
4284G53p68k77p2M99M34k05n29j13K70K31m2k27k64n2M05M10Q9q56q8J60O11K43
$$ 753 -15 -292 -364 135 569 364 -165 -278 -8 223 181 -46 -310 -362 43 453 542 -314 -402 -242 369 612
4306F12o50n12L0K05O59j62m18m04K55M15J96j60k27n29O46L74Q3p36j63J68K04
$$ 612 -38 -550 -520 -315 344 182 -236 -640 -385 30 226 66 -161 -690 -44 330 413 -323 -486 -318 -114
4327a14M99o5o68j40N83OK10j92q27L38N08J54j02l69j46K70O15j09n74m61K50
$$ -114 385 320 -348 -488 95 101 311 119 -708 -370 138 292 190 -179 -325 -55 560 451 -123 -584 -334
4348c34K88N86l84l11L2K96K62j63k60r0O7K40K47l35n2j42J19j79N17m30m94
$$ -334 -46 540 156 -155 -123 173 435 272 12 -78 -11 229 476 141 89 -53 66 -113 404 -26 -520
4369e20L02K46L54m39j43m99N87N45n11k21J51O3R6K47K1m54k41K94K67Q7j79
$$ -520 -218 28 382 -57 -200 -699 -112 433 -78 -299 -148 -85 11 258 279 -175 -416 -122 145 232 53
4390E3l75N02kK53p67K43p5L17K41J8n15j6M6L34J34j0o68J43L91K70n18j16m01
$$ 53 -322 180 178 431 -336 -93 -168 149 390 408 -107 -123 -77 257 391 381 -287 -144 247 517 -1 -117 -518
4413e18M82J71M08n79o04O12J53L85l16l73l95O50K68L59p51k61k16P18L07l09
$$ -518 -36 135 543 -36 -640 -28 125 510 194 -179 -574 76 344 703 -48 -309 -525 193 500 191
4433A91p08O7N61K73k9n04o10L94O67j69J37n92j54N76M47k13m51l27OL67M58
$$ 191 -517 -450 111 384 355 -149 -759 -365 302 133 270 -322 -476 100 547 334 -117 -444 -438 -71 387
4454C87k10q18mO59K48j10l43j94J0N82L95o30J31q17L82O96r1j36m69R3M65L22
$$ 387 177 -641 -645 14 262 152 -191 -385 -375 207 602 -28 103 -714 -332 364 273 137 -332 -239 226 548
4476E48k6o24k23J36N98l07m18M4jO05Q7o50K54j33L5K90L01m73k64J87J95J38
$$ 548 522 -102 -325 -189 409 102 -316 -272 -273 332 419 -231 23 -110 -75 215 516 43 -221 -34 161 299
4498B99k76j81j14R7N29j71l49j26qk3K44p3m77K38P54j12j44l61P8J8Q34l08
$$ 299 23 -158 -272 -175 354 183 -166 -292 -300 -323 -79 -152 -629 -391 363 251 107 -254 -176 -158 676 368
4520C68n25J60k41K90J3J10l24PM7m0N38n41j59R0L87M00n47k90L06j09O94l79
$$ 368 -157 3 -238 52 65 175 -149 -142 -95 -135 403 -138 -297 -207 180 580 33 -257 49 -60 634 255
4542B55m86j39J04J42O70m66k47k21L18N74j7n88k54k81Q81M60n79m36R2M37K66
$$ 255 -231 -370 -266 -124 546 80 -167 -388 -70 504 487 -101 -355 -636 245 705 126 -310 -218 219 485
4563D85J59p74K4n6L01L35k55l18l36N61J23L60p00n46O05J19L58k54q62L7L78
$$ 485 644 -130 -106 -162 139 474 219 -99 -435 126 249 609 -91 -637 -32 87 445 191 -671 -634 -256
4584b56O31lp37k11J70M92K74k54j91j84o3M94R0k43k09j71L15O51m51n80L87
$$ -256 375 372 -365 -576 -406 86 360 106 -85 -269 -332 162 252 9 -200 -371 -56 595 144 -436 -49
4605d9J02J89J97j58p82L43M22J0j59k54m4K59K42K11k79n16L52L18j25j42k41
$$ -49 53 242 439 281 -501 -158 264 274 115 -139 -183 76 318 529 250 -266 86 404 279 137 -104
4626a04l47L73L10l05l8k9Q3L74M5k16l19k2J40R6K85k63o59N66L33p8k41j03
$$ -104 -451 -78 232 -73 -111 -140 -57 317 362 146 -173 -195 -55 41 326 63 -596 -30 303 225 -16 -119
4648a19j02L08L05m61n2N7j19L86L6l7o35r9O81N1q2k78j38K26K59j2n29J51Q0
$$ -119 -221 87 392 -69 -121 -64 -183 203 239 202 -433 -532 149 200 118 -160 -298 -72 187 175 -354 -203 -123
4671a23J50L73j52m92q8M70L89l3m36k65N3N22P3k32l23j77J61N96N7q01l6L58
$$ -123 27 400 248 -244 -332 138 527 494 58 -207 -154 368 441 209 -114 -291 -130 466 523 -278 -314 44
4693D4K08K55l69m20j6L90J75O9k05o96K60K42P77n92l17p4J96L51J30n37m33
$$ 44 252 507 138 -282 -298 92 267 336 131 -565 -305 -63 714 122 -195 -269 -73 278 408 -129 -562
4714e62N06L35k51Jj7o48K80P67k79j32m80J21L98K07j64l60K8K40O5JJ60m06
$$ -562 -56 279 28 29 12 -636 -356 411 132 0 -480 -359 39 246 82 -278 -250 -10 55 56 216 -190
4736a90k57P12o1o0j55j07m89R69p6k27k95J54K09K59q4l48l61M01N67l15p8q8
$$ -190 -447 265 204 144 -11 -118 -607 362 286 59 -236 -82 127 386 302 -46 -407 -6 561 246 168 80
4758H0m33M89K72k01k30Jj15K28N42p92m0j2N02m2M7n79K7J44N68m59R1m8l67
$$ 80 -353 136 408 207 -23 -22 -137 91 633 -159 -199 -211 291 249 296 -283 -256 -112 456 -3 88 40 -327
4781c27L04J83m0m80m9J92L62r4J28m79j22Q48l02n82j05K55J29L21J7l13l16
$$ -327 -23 160 120 -360 -409 -217 145 51 179 -300 -422 426 124 -458 -563 -308 -179 142 159 -154 -470
4802d70N30PL40k35p34N57m8j7L70n49l82N27L49J53n47k53L23K83q4L68o82l31
$$ -470 60 67 407 172 -562 -5 -53 -70 300 -249 -631 -104 245 398 -149 -402 -79 204 120 488 -194 -525
4824e25M44N45j60k09n20p8R85kk54l81j92L99O1M11m04q11O40L2J48R1k92o15
$$ -525 -81 464 304 95 -425 -503 482 480 226 -155 -347 52 113 524 120 -691 -51 -19 129 220 -72 -687
4846f87N25P12K13p29n02j48P90K34m01k53K19p0L98J92m45o99L87k8N54n7l40
$$ -687 -162 550 763 34 -468 -616 174 408 7 -246 -27 -97 301 493 48 -651 -264 -292 262 205 -135
4867a35k85J97M31M98p28k92J04nM63Qm20k54L01r2N68j60o24J93M52L57o95k22
$$ -135 -420 -223 208 706 -22 -314 -210 -215 248 256 -164 -418 -117 -209 359 199 -425 -232 220 577 -118 -340
4889c40K00o9K18M30n15j99K32J73K89o13K64o91P08J15n6Qm42L81R2p0j16l56
$$ -340 -140 -209 9 439 -76 -275 -43 130 419 -194 70 -621 87 202 146 154 -288 93 185 115 -1 -357
4911c57J62m5R8L84m40k35K67L64L6l42m08J74N21L3O5j24p08K3M86M87k47p81
$$ -357 -195 -240 -142 242 -198 -433 -166 198 234 -108 -516 -342 179 212 277 153 -555 -532 -46 441 194 -587
4933e87K15P71k77j47k49m25P04K07J99m07j35k43K87L40r3k70k14M07r5P16n53
$$ -587 -372 399 122 -25 -274 -699 5 212 411 4 -131 -374 -87 253 160 -110 -324 83 -12 704 151
4954A51l29l8N44M6p9m65k58J05M98M60l63q55K01M07N11Pn21l70kO70J1k28l02
$$ 151 -178 -216 328 374 295 -170 -428 -323 175 635 272 -583 -382 25 536 543 22 -348 -350 320 331 103 -199
4977a99o7K90Q02n97n44M0M9K48L65l54p22K54L34M89j52k7o35j7Q30j53k68k41
$$ -199 -266 24 826 229 -315 -275 -226 22 387 33 -689 -435 -101 388 236 209 -426 -443 387 234 -34 -275
4999b75J34O2J40K34o70q9L78L44j65j52j22j00K76M82l66k63j63K64L78n2k11
$$ -275 -141 -79 61 295 -375 -464 -86 258 93 -59 -181 -281 -5 477 111 -152 -315 -51 327 275 64
5020F4l19l8K30O11j58n34l10O55K93k52j43k02K40P7M45l00l00j84K01M05k73
$$ 64 -255 -293 -63 548 390 -144 -454 201 494 242 99 -103 137 214 659 359 59 -125 76 481 208
5041B08k18m98L79L99l48N3jk01J38K73j20j5J4j17K25K17m84k82q4M75M2n0j10
$$ 208 -10 -508 -129 270 -78 -25 -26 -227 -89 184 64 49 63 -54 171 388 -96 -378 -462 13 55 5 -105
5064a05k12Q0M33K18l99l90M4L1P39k00m87l0R7M38M65o58m72k9M05K33n4l33
$$ -105 -317 -237 196 414 15 -375 -331 -300 439 239 -248 -278 -181 257 722 64 -408 -437 -32 201 147 -186
5086a86K27n24O12L05n03k36J20L77J79L24q38j76J91M91nj47k85n15L24Q83n29
$$ -186 41 -483 129 434 -69 -305 -185 192 371 695 -143 -319 -128 363 358 211 -74 -589 -265 618 89
5107H9Ml95J29M88J06m03n32Q7M83L42J80k35j087M96N94J12n24m34J80K18K31
$$ 89 93 -302 -173 315 421 18 -514 -427 56 398 578 343 -744 -248 346 458 -66 -500 -320 -102 129
5128A29K8n42L43M6l7L59o5m19m04M74M73k13l16l96K72J40N60l32n66L54LK65
$$ 129 157 -385 -42 4 -33 326 261 -158 -562 -88 385 172 -144 -540 -268 -128 432 100 -466 -112 -109 156
5150A56m8j46n33L79K84Q4m8l04l93O21L7J39j08m01j35P61k89%l17K13M06K4
$$ 156 108 -38 -571 -192 92 176 128 -176 -569 52 89 228 120 -281 -416 345 56 56 -261 -48 358 382
5172C82j03l49m83N89L22k55j45k27J10J20L84k19j14m28N28J89m7o28J00j09
$$ 382 279 -70 -553 36 358 103 -42 -269 -159 -39 345 126 12 -416 112 301 254 -374 -274 -383
5192c83M49L55o22R6j20L38K27k57k25j76k4P65k65M9l34m44M72K45j13P5l75
$$ -383 66 421 -201 -105 -225 113 340 83 -142 -318 -342 423 158 207 -127 -571 -99 146 33 108 -267
5213b67q1O09P8l6n99J14j26O05q3o33j28M39L41K21o93L0k46M63K44K63k84o37
$$ -267 -348 261 339 303 -296 -182 -308 297 214 -419 -547 -108 233 454 -239 -209 -455 8 252 515 231 -406
5235d06J31M58M89q32K5k33N82j58L73l61k65j03M09N81j66n62k24M18K81M1m95
$$ -406 -275 183 672 -160 -135 -368 214 56 429 68 -197 -300 109 690 524 -38 -262 156 437 478 -17
5256a7j79k26N5P49l50ql45N25j8Lk92r4j21N05j8r5m24J96J40J05K09m73n2L94
$$ -17 -196 -422 -367 382 32 24 -321 204 186 189 -103 -197 -318 187 169 74 -350 -154 -14 91 300 -173 -225 169
5280A69j70K46l3o35q0O12J98k69%m05j6O99k01l83n4J42K39J3J18l72l1J85M43
$$ 169 -1 245 212 -423 -503 109 307 38 38 -367 -383 316 115 -268 -322 -180 59 72 190 -182 -213 -28 415
5303D15l27M2m44q3M86L02k62l64R1J42J30K14l16q14M04N87q3K81p60P4K04O30
$$ 415 88 130 -314 -397 89 391 129 -235 -144 -2 128 342 26 -788 -384 203 120 401 -359 -285 -81 549
5325E49m23n6k65K5L85R7n0l93p67Q77M12rl84k00m5N53K8k49l37k8J27K44M86
$$ 549 126 70 -195 -170 215 312 262 -131 -898 -21 391 382 -2 -202 -247 306 334 85 -252 -280 -153 91 577
5348E77p17m62J76N17M0N9m58m51O55L40J2J88p37j90P20K36m01q3k47P8M24K61
$$ 577 -140 -602 -426 91 131 190 -268 -719 -64 276 288 476 -261 -451 269 505 104 21 -226 -148 276 537
5370E37m78n04N5P82p6J0k87k31o1L27K8k75J99l43L52K16q9m36o6M17K0L48l34
$$ 537 59 -445 -390 392 316 326 39 -192 -253 74 102 -173 26 -317 35 251 162 -274 -340 77 97 445 111
5393A11m30K9N32P3n05QO0L9k6l2J99k33P0K74Q8j02p07J05M95L59k60k08j85
$$ 111 -319 -290 242 315 -190 -182 -122 -83 -109 -141 58 -175 -105 169 257 155 -552 -447 48 407 147 -61 -246
5416b46N6L25K47r7m46k39M23J54j41m89J78J59K67J76O3n79k79L30L26L6m49
$$ -246 -190 135 382 285 -161 -400 23 177 36 -453 -275 -116 151 327 390 -189 -468 -138 188 224 -225
5437b25J08M8K32N06p88j75J58M96m4o6m26k59O73J21o5j06n98R2L78L83k26l06
$$ -225 -117 -69 163 669 -119 -294 -136 360 316 250 -176 -435 238 359 294 188 -410 -318 60 443 217 -89
5459h9J44K48j61J11m44l05K11N27j55k33k6n6J6N53p7o65j97J63M99R6J35q08
$$ -89 55 303 142 253 -191 -496 -285 242 87 -146 -172 -228 -212 341 264 -401 -598 -435 64 160 295 -513
5481e13p9M58J50J72k41m01k4L24M60m06p6k5J3J00P61n09n58J95M56k09K32l57
$$ -513 -592 -134 16 188 -53 -454 -478 -154 306 -100 -176 -201 -188 -88 673 164 -394 -199 257 48 280 -77
5503g7j87L86J06J34l57k75L3K12M74m73L5k65K34J73L97n39o4N1J38J07K6k31
$$ -77 -264 122 228 362 5 -270 -237 -25 449 -24 11 -254 -20 153 550 11 -53 -2 136 243 269 38
5525C8k13L77J05l40Q4l33j8K48K33k2n49K3J66L17J28m75j59L47M5L01l98j08
$$ 38 -175 202 307 -33 51 -282 -300 -52 181 159 -390 -367 -201 116 244 -231 -390 -43 2 303 -95 -203
5547b03j38OK73L26j96m09L35MJ55l55l1M3O40k77k01k7J5K26r7J09l85J51j15
$$ -203 -341 -335 -62 264 68 -341 -6 -2 153 -202 -233 -190 450 173 -28 -55 -40 186 89 198 -187 -36 -151
5570a51K52N5K21l37m25L60L20r0p9p0m27J26O17o5j89L6l1K6K99j69l44k67M73
$$ -151 101 156 377 40 -385 -25 295 205 126 56 -371 -245 372 307 118 154 123 149 448 279 -65 -332 141
5593A41Mm8J70n62R0P53j75l50o47M33P9L21Lk36k57N53j09k0k21k98k28L62N90
$$ 141 145 97 267 -295 -205 548 373 23 -624 -191 -112 209 212 -24 -281 272 163 143 -78 -376 -604 -242 348
5616C48k59L2l27j43M21K25k41p44L72J29L18K65n43l36L44M79m1k6j90m59M93
$$ 348 89 121 -206 -349 72 297 56 -688 -316 -187 131 396 -147 -483 -139 340 299 273 83 -376 117
5637A17L31m9j59n18J11N57n0j26o78L20K78qo2p2l84J15M98Qk06n5m52N30K01
$$ 117 448 399 240 -278 -167 390 340 214 -464 -144 134 126 64 -8 -392 -277 221 229 23 -32 -484 46 247
5660B47J20m45K5n2J73n7J87k11j33K88R1m48K50k65K00K35J60n24J50l32L62
$$ 247 367 -78 -53 -105 68 11 198 -13 -146 142 233 -215 35 -230 -30 205 365 -159 -9 -341 21
5681B1K0j7j79m60O80L33rm50p2j84J87L68m7l77rj2N01j19j05l56K66K79k60
$$ 21 41 24 -155 -615 65 398 389 -61 -133 -317 -130 238 191 -186 -195 -207 294 175 70 -286 -20 259 -1
5704aK7j10k04K56K59j06q59O22j72j7O90k37k51PL55j05N3j90n27J92N63K63
$$ -1 26 -84 -288 -32 227 121 -738 -116 -288 -305 385 148 -103 -96 259 154 207 17 -510 -318 245 508
5726E08o4n25j83L76L53l39k87J43O7K90m3j09j28j41m1M69k60l75l70L56M39
$$ 508 444 -81 -264 112 465 126 -161 -18 49 339 296 187 59 -82 -123 346 86 -289 -659 -303 136
5747A36L12l33m68K84M3K54j66j71k94L89P4o3J36n75J84O9P09l37m46Oj20L59
$$ 136 448 115 -353 -69 -26 228 62 -109 -403 -14 60 -3 133 -442 -258 -189 520 183 -263 -257 -377 -18
5769a8M55m27l24K26j84M30L05k88m79PO41j17j71J0l22N6M60j1o36j0L82J6R7
$$ -18 437 10 -314 -88 -272 158 463 175 -304 -297 344 227 56 66 -256 -200 260 249 -387 -397 -15 1 98
5792I8R8m57J64J81J81l23L44o99N27O2M1k68j30K38j25J90N6l69M4J12J99L06
$$ 98 196 -261 -97 84 265 -58 286 -413 114 176 217 -51 -181 57 -68 122 178 -191 -147 -35 164 470
5814D70n41o7l18O99j50J4k72K01k8j37J75K0j31K9J54j92q1j96j43K71N30l70
$$ 470 -71 -138 -456 243 93 107 -165 36 8 -129 46 66 -65 -36 118 -74 -155 -351 -494 -223 307 -63
5836f3k10J99k4J62o3j45J77j4o6K39J1k95j38J54L36k14r5k67r5N69K48j94l98
$$ -63 -273 -74 -98 64 1 -144 33 19 -47 192 203 -92 -230 -76 260 46 -49 -316 -411 158 406 212 -186
5859a86M1M97k94L47k68l59J40J10J2N38n73j11r3M70Q6m89q5J7K44J14J30m83
$$ -186 -145 352 58 405 137 -222 -82 28 40 578 5 -106 -199 271 357 -132 -217 -200 44 158 288 -195
5881a95NM2K09L73l47m26L11l43M24nJ48n90L34J61J51k22l19N8r5K97K07k78
$$ -195 -190 -148 61 434 87 -339 -28 -371 53 48 196 -394 -60 101 252 30 -289 -231 -326 -29 178 -100
5903a00oO9O5j31n4K4j48J55L06O3l21M6k49L55K43j81m60K68K13m7K2r5J56n62
$$ -100 -106 -37 28 -103 -157 -133 -281 -126 180 243 -78 -32 -281 74 317 136 -324 -56 157 110 132 37 193 -369
5927c69O79K09p6m90l1R9J23J07j91j24OJ77P7k14Q0j40J24P0k27j37n4L4L52
$$ -369 310 519 443 -47 -78 21 144 251 60 -64 -58 119 196 -18 62 -78 46 116 -111 -248 -302 -268 84
5950H4L1l1m37K09J23M20l26l75J39J01K69j44J70m04P8Q7K19j76j93r4J74k98
$$ 84 115 84 -353 -144 -21 399 73 -302 -163 -62 207 63 233 -171 -93 -6 213 37 -156 -250 -76 -374
5972c74O36m41n8L04l5PJ9j14l07J91L11N9m3k04J27j86L75R8n71J85p3j9K82
$$ -374 262 -179 -237 67 32 39 58 -56 -363 -172 139 198 155 -49 78 -108 267 365 -206 -21 -94 -113 169
5995A69K36o25R7N53R1m58k8l52K76m3M99o11M6J92j18L73k30Kj58J70J8J78l98
$$ 169 405 -220 -123 430 521 63 35 -317 -41 -84 415 -196 -150 42 -76 297 67 69 -89 81 99 277 -121
6018a21M8j12K09L60n85J90l3j85J45L94j99k64K4J16J70J25m96j05K01O07k93
$$ -121 -73 -185 24 384 -201 -11 -44 -229 -84 310 111 -153 -129 -13 157 282 -214 -319 -118 489 196
6039A96l19J75j27l4N07k86l31J00J2O9K5J18l1k09L12k17N0l6K7j26O29k25j88
$$ 196 -123 52 -75 -109 398 112 -219 -119 -107 -38 -13 105 74 -135 177 -40 10 -26 1 -125 504 279 91
6062I1r1l7L47k47K9j12J64k70J44J92l20j84J07K6L76l39L4k2j01N18r5n47R6
$$ 91 0 -37 310 63 92 -20 144 -126 18 210 -110 -294 -187 -161 215 -124 -90 -112 -213 305 210 -337 -241
6085b41J57P9M44k44l04o2K40K54l33j17j90J45L29O1k8m72K75j8K06n4j14l18
$$ -241 -84 -5 439 195 -109 -171 69 323 -10 -127 -317 -172 157 218 190 -282 -7 -25 181 127 13 -305
6107c05j0N17j33k97J31Qk66L07J26n03L20J28J82K9j61k59k52K30L18J01l13
$$ -305 -315 202 69 -228 -97 -89 -355 -48 78 -425 -105 23 205 234 73 -186 -438 -208 110 211 -102
6128a02l93L66M59k51r1j05Q6j24M26k2j70l2j60K12N1J81n43k6M86r2K09m06
$$ -102 -495 -129 330 79 -12 -117 -31 -155 271 249 79 47 -113 99 150 331 -212 -238 248 156 365 -41
6150d1l7L3J41j83m6Jk92l1O69l7o2m34N20k92K01m5r7k92K04K28l04M3j02J33
$$ -41 -78 -45 96 -87 -133 -132 -424 -455 214 177 115 -319 201 -91 110 65 -32 -324 -120 108 -196 -153 -255 -122
6174a22q9NM02n41J70K03R5mk58r1K3J56L85o28K26J8k30K07L9j17o2L86k36L57
$$ -122 -211 -206 196 -345 -175 28 123 119 -139 -230 -207 -51 334 -294 -68 -50 -280 -73 -34 -151 -213 173 -63 294
6198B94l07p2lK68J47l41j35Q7j44M55j86j13j56Q0K65k13J63l81K99k17M26j96
$$ 294 -13 -85 -88 180 327 -14 -149 -62 -206 249 63 -50 -206 -126 139 -74 89 -292 7 -210 216 20
6220B0k05J26j81K99k0M55q38J70L14J09j6l15l42L69N00r0k42J0m04R0J64Q3
$$ 20 -185 -59 -240 59 39 494 -344 -174 140 249 233 -82 -424 -55 445 355 113 123 -281 -191 -27 56
6242E6l02J68L5J80L23m48l80J03L76J8K87n39MM1J31J51k22n7K94K4j25L0k64
$$ 56 -246 -78 -43 137 460 12 -368 -265 111 129 416 -123 -119 -78 53 204 -18 -75 219 243 118 148 -116
6265a16j84K72L01j14l2l14J8N52r3L3j93l87K00R3n6L22l73r3J64l7K71j7j93
$$ -116 -300 -28 273 159 127 -187 -169 383 290 323 130 -257 -57 36 -20 302 -71 -164 0 -37 234 217 24
6288B4l7J81J26j28j58j11QK98k80K07j05o39L89K93J43n57O1J76J64r3J53k09
$$ 24 -13 168 294 166 8 -103 -95 203 -77 130 25 -614 -225 68 211 -346 -285 -109 55 -38 115 -94
6310i4m5M3J66J1l77J6L91K83l87n2o9k29M07N3K3k15j24K42j74K01p4o0j12J37
$$ -94 -139 -96 70 81 -296 -280 111 394 7 -45 -114 -343 64 117 140 -75 -199 43 -131 70 -4 -64 -176 -39
6334c9K28k15M8Q1m28N34l13j36J63K96J44N5j99p2k84N1O05l38k89q5o3K57K92
$$ -39 189 -26 22 103 -325 209 -104 -240 -77 219 363 418 219 147 -137 -86 519 181 -108 -193 -256 1 293
6357B93m88L77k24L53o9j06n3j58k01N14q2k85q0L2m5L23L19o54K81L6J60j62
$$ 293 -195 182 -42 311 242 136 83 -75 -276 238 156 -129 -209 -177 -222 101 420 -234 47 83 243 81
6379H1j05k72j32L39J58j69l0k13L46K99q8j50m39J89K11M2NK19n85K48L08M5
$$ 81 -24 -296 -428 -89 69 -100 -130 -343 3 302 214 64 -375 -186 25 67 72 291 -294 -46 262 307
6401C07J09k65l02J42J22l07M42o22P9P26l92j83%K72l08L40N1l35O7o2J44L82
$$ 307 416 151 -151 -9 113 -194 248 -374 -295 431 39 -144 -144 128 -180 160 211 -124 -57 -119 25 407
6423D07m12k02K43j6K64j44j4j67K31o5j03Mr3K3L82k49k28j41K40m2J29k19p
$$ 407 -5 -207 36 20 284 140 126 -41 190 125 22 26 -67 -44 338 89 -139 -280 -40 -82 47 -172 -179
6446a79l3N36n05K58J4O5m21L29J47J8j90k88Q0L44J8l10J17q3J91J59l10m4j54
$$ -179 -212 324 -181 77 91 156 -265 64 211 229 39 -249 -169 175 193 -117 0 -83 108 267 -43 -87 -241
6469b41j09M76k43K69j83o1J56J83j87k1j21J72M0jQ4n39M57o2J61N7q2p32M81
$$ -241 -350 126 -117 152 -31 -92 64 247 60 39 -82 90 130 129 213 -326 131 69 230 287 205 -527 -46
6492d6L66m47K76j65P3J37j3j06l51L50o9J88j19k5k99j7L07P1j29k16K6L11j12
$$ -46 320 -127 149 -16 57 194 181 75 -276 74 5 193 74 49 -250 -267 40 111 -18 -234 -208 103 -9
6515iL55m61j85J86J42J02j38M6j82Q6j2J7R5l56K29N3K12p7j3r3kJ21J38m11
$$ -9 346 -115 -300 -114 28 130 -8 38 -144 -58 -70 -53 42 -314 -85 -32 180 103 90 -3 -5 116 254 -157
6539a57q3J38J65L3K3m12r0N04j50J36N5l9l89J77K43o4m26L41K16k84o8K69k17
$$ -157 -240 -102 63 96 119 -293 -383 121 -29 107 162 123 -266 -89 154 90 -336 5 221 -63 -131 138 -79
6562g9k47L29L45l50K52n25R5K33K41j94p4j85m1K45j56Q6r1K18q9O5j6Jk73N23
$$ -79 -326 3 348 -2 250 -275 -180 53 294 100 26 -159 -200 45 -111 -25 -116 102 13 78 62 63 -210 313
6586C13k66j46%J15k57K95L30l73j10M2MM1L46j98l50L19k38L02j25l10L00K08
$$ 313 47 -99 -99 16 -241 54 384 11 -99 -57 -53 -12 334 136 -214 105 -133 169 44 -266 34 242
6608B42m5n64rL95j01L23J76l41j49O5M04m36j27M6j99J88L82j52j66k19L09M
$$ 242 197 -367 -376 19 -82 241 417 76 -73 -8 396 -40 -167 -121 -320 -132 250 98 -68 -287 22 26
6630B6J45k81K45k42n8K02J18M7n71J60m8K88M0k41j76M2L28L02l34p1J81RL1
$$ 26 171 -110 135 -107 -165 37 155 202 -369 -209 -257 31 71 -170 -346 -304 24 326 -8 -79 102 111 142
6653A42j2k07j51K15k2oo2J71k42K3J68j33J33j04K21k36L78j24l10J96K7J13
$$ 142 130 -77 -228 -13 -35 -41 -103 68 -174 -151 17 -116 17 -87 134 -102 276 152 -158 38 65 178
6675A78l66K7J67J38J17k74j18l8J71K8M33n68L65k49O7j5K30l14j26J58j05r0
$$ 178 -188 -161 6 144 261 -13 -131 -169 2 30 463 -105 260 11 78 63 293 -21 -147 11 -94 -184
6697a84J07r2l33M21L35l62k98J28K85JK70k35J5k13J82J63m1q4j00J95J62k78
$$ -184 -77 -169 -502 -81 254 -108 -406 -278 7 8 278 43 58 -155 27 190 149 65 -35 160 322 44
6719D4k29J86k65L49Q2k70P2K64j93J87l53r2P6L7mJ37k04J70p7k29M96k56J45
$$ 44 -185 1 -264 85 167 -103 -31 233 40 227 -126 -218 -142 -105 -109 28 -176 -6 -83 -312 184 -72 73
6742G3K9l08J40J01R7R0l02RK40j50j48Q9K39p2q5N4k73K30l11M34j7j40K29n63
$$ 73 102 -206 -66 35 132 222 -80 -71 169 19 -129 -40 199 127 42 96 -177 53 -258 176 159 19 248 -315
6766c15N22j55r6K42l40K30Q7M3l48l3K73J6k29J24l6m18K34L85j23j71j23J05
$$ -315 207 52 -44 198 -142 88 175 218 -130 -163 110 126 -103 21 -15 -433 -199 186 63 -108 -231 -126
6788a26L22J12l02R4o7j01J37m24K49N1J09J44k5k19j10k0K79k48K69n08N56p55
$$ -126 196 308 6 100 33 -68 69 -355 -106 -55 54 198 173 -46 -156 -176 103 -145 124 -384 172 -583
6810e83R01l2l88l0j13O05l92J26l82L04j85Q3J36J90p00K77j78N78k26J17j08
$$ -583 318 286 -102 -132 -245 360 -32 94 -288 16 -169 -86 50 240 -460 -183 -361 217 -9 108 0
6831@j42K98K05m10p8L7L03L7k10r2R8j38L03k52l85N25o6q1M07j97m94J70k0
$$ 0 -142 156 361 -49 -127 -90 213 250 40 -52 46 -92 211 -41 -426 99 33 -48 359 162 -332 -162 -182
6854a82J21K14n3k04N2K15j48k16j65L58j51J99K85k30j34j95J51J29ql8m24L83
$$ -182 -61 153 100 -104 -52 163 15 -201 -366 -8 -159 40 325 95 -39 -234 -83 46 38 0 -424 -41
6876d1L06l39j33N5j16J99M28l15l84J90L75l85QK10l29N23j34J89k68k48K56
$$ -41 265 -74 -207 -152 -268 -69 359 44 -340 -150 225 -160 -152 58 -271 252 118 307 39 -209 47
6897D7j24K24R7m44K34k44L48j57l3J97OJ91o60N42l48p2k30N38N4o0j15l04K35
$$ 47 -77 147 244 -200 34 -210 138 -19 -52 145 151 342 -318 224 -124 -196 -426 112 166 106 -9 -313 -78
6920g8J27l5L25m02j8p6M01j80k53r4N27l9j98l8p9j04K54M5j6J02j11L2J8k0
$$ -78 49 14 339 -63 -81 -157 244 64 -189 -283 244 205 7 -31 -110 -214 40 85 69 171 60 92 110 90
6944I0n23K92J13J20k36N37o01K5L06O7l97J27J81k45o4M19k35k38K03m4K57l1
$$ 90 -433 -141 -28 92 -144 393 -208 -183 123 190 -207 -80 101 -144 -208 211 -24 -262 -59 -103 154 123
6966A23O0l27k98L83K75J27m83J38k42L38M5l40K2J42J23j73k1J13j30L91q4k40
$$ 123 183 -144 -442 -59 216 343 -140 -2 -244 94 139 -201 -179 -37 86 -87 -108 5 -125 266 182 -58
6988e8j94Q9K33o3K28k99J8Kj27J96m3j44j72L43L2j66n6j0L68j05M8k9m4k70
$$ -58 -252 -163 70 7 235 -64 -46 -44 -171 25 -18 -162 -334 9 41 -125 -181 -191 177 72 120 91 47 -223
7012b23L16l5o8J02j0k12K10Qj94J67J65l34N56m01j63N3l6L83j60R5k84m8K34
$$ -223 93 58 -10 92 82 -130 80 88 -106 61 226 -108 448 47 -116 -63 -99 284 124 219 -65 -113 121
7035A21j67K05j77j95K38j32M32m14J44j07j42M14Lk02L8N0o5K54l76K00j17j72
$$ 121 -46 159 -18 -213 25 -107 325 -89 55 -52 -194 220 223 21 59 109 44 298 -78 122 5 -167
7057a67J47J29r7m75K65M64J3l59k39K17J66K79j81k03p6R0l9K3P2j16j87K03
$$ -167 -20 109 12 -463 -198 266 279 -80 -319 -102 64 343 162 -41 -117 -27 -66 -43 29 -87 -274 -71
7079g1K33k42N2L3k11L44K6k96J45J73l9Q2k93Q4k07K76L49k36O2k72n5J2R0L92
$$ -71 162 -80 -28 5 -206 138 164 -132 13 186 147 229 -64 20 -187 89 438 202 264 -8 -63 -51 39 431
7103D31p11j42N64m3mo5n9n0K64j68K84l94L6K4L6j14Q1m1m6k5K17r4k08N4j6
$$ 431 -280 -422 142 99 95 30 -29 -79 185 17 301 -93 -57 -33 3 -111 -30 -71 -117 -142 75 -19 -227 -173 -189
7128a89M22K8m92J24K20k76M53j88rj61O7J34r7J52l63J38J83r6p9m06L32K85
$$ -189 233 261 -231 -107 113 -163 290 102 93 -68 -1 133 36 188 -175 -37 146 50 -29 -435 -103 182
7150A82k0J54m33J97k28K43pJ15m85J73J63j62OO3l44K75O7J33k11n1K2L05Q4
$$ 182 162 316 -117 80 -148 95 88 203 -282 -109 54 -108 -102 -39 -383 -108 -41 92 -119 -170 -148 157 241
7173B41j31p0j82K4L9M29m10j48K13J14M0K07k09j66j91J69K85l01j66k99J71
$$ 241 110 40 -142 -118 -79 350 -60 -208 5 119 159 366 157 -9 -200 -31 254 -47 -213 -512 -341
7194c41L82j08J23l8K48j29M9l41K47j07PJ64k87N28l64J25n0L62o52R6L6l5K65
$$ -341 41 -67 56 18 266 137 186 -155 92 -15 -8 156 -131 397 33 158 108 470 -182 -86 -50 -85 180
7217A80j15j44J61J64j06O9q4J6k78R0K92J3l38o4J90j49k7P3J31k69K90NQ8R6
$$ 180 65 -79 82 246 140 209 125 141 -137 -47 245 258 -80 -144 46 -103 -130 -57 74 -195 95 100 188 284
7241B84r2jj05K57l98k31K19J17j53K46l07J53ml87L30O2J23j85K14L23p02K87
$$ 284 192 191 86 343 -55 -286 -67 50 -103 143 -164 -11 -15 -402 -72 -10 113 -72 142 465 -237 50
7263E0o0J24q0J96l17j07K84k61N97n0m97j72J70J78j34N2R6j73L62K00l66j90
$$ 50 -10 114 34 230 -87 -194 90 -171 426 376 -121 -293 -123 55 -79 -27 69 -104 258 458 92 -98
7285i8o2K03j1J20N5k74j54L70J62j74P7k11j43L34k97J98k3l48J22J89j7K82
$$ -98 -160 43 32 152 207 -67 -221 149 311 137 214 3 -140 194 -103 95 72 -276 -154 35 18 300
7307C00m58J00r9M29l1j44j15l6kL1j76j82K57L03k83rJ44l13L36Nk57J44L9J07
$$ 300 -158 -58 -157 272 241 97 -18 -54 -56 -25 -201 -383 -126 177 -106 -115 29 -284 52 57 -200 -56 -17 90
7331I0L37k70j02k29M34l03J81k71K4K69p7N1j10J73j90l14L09Nn0pP0P0N4j66
$$ 90 427 157 55 -174 260 -43 138 -133 -109 160 83 134 24 197 7 -307 2 7 -43 -50 20 90 144 -22
7355b2m7l1J05P0k47m4J8J09l0j47L81j94o2L76l06O1K12m0l39J73J92l34NL9
$$ -22 -69 -100 5 75 -172 -216 -198 -89 -119 -266 115 -79 -141 235 -71 -10 202 162 -177 -4 188 -146 -141 -102
7379a02m3M74m44L19l47M69k70J24j79P5k60J50J77k64N49k72k17K24K7j07j22
$$ -102 -145 329 -115 204 -143 326 56 180 1 76 -184 -34 143 -121 428 156 -61 163 190 83 -39
7400c9k61J57L69j44j49J06j92J74r8o3J74m72M17J35J53l74l39J29L40J50k02
$$ -39 -300 -143 226 82 -67 39 -153 21 -77 -140 34 -438 -21 114 267 -107 -446 -317 23 173 -29
7421b9J67m65N30J73p5k35k83K07J9M06l09l01k98K94K32K07p2l28J76J44K05
$$ -29 138 -327 203 376 301 66 -217 -10 9 415 106 -195 -493 -199 33 240 168 -160 16 160 365
7442C65j82n15N58p9o3j33Q6k6j32K94n06M65j97k15J75O4L20k98j32K04K17k38
$$ 365 183 -332 226 147 84 -49 37 11 -121 173 -333 132 -65 -280 -105 -41 279 -19 -151 53 270 32
7464C2k02p0J65K0R0p4J86M5l98L6J38N5j41K4J35L47l92j4m45L65K8J48k24l4
$$ 32 -170 -240 -75 -55 35 -39 147 192 -206 -170 -32 23 -118 -94 41 388 -4 -18 -463 -98 -70 78 -146 -180
7488a80L18P4j36n8K17o33K24K23J94l78K9j2j24L76r8j8l05O23k15l2J29o0j92
$$ -180 138 212 76 18 235 -398 -174 49 243 -135 -106 -118 -242 134 36 18 -287 336 121 89 218 158 -34
7511c4J18n1L1J0l86M03J66l08L44j93O1k19j62L72m29N08l06N8M3L22l73k44
$$ -34 84 33 64 74 -312 91 257 -51 293 100 161 -58 -220 152 -277 231 -75 -17 26 348 -25 -269
7533b69Q3L64k46k74N80k40J30O6p0k90k9L56k25l1J54j53K05l8M5j25n4Q8J2
$$ -269 -186 178 -68 -342 238 -2 128 194 124 -166 -195 161 -64 -95 59 -94 111 73 118 -7 -61 27 39
7556C9q7j08j61M65l29M26l09K54j23k68J04J05O9k08q8o7K66M75k63l38J47Q7
$$ 39 -48 -156 -317 148 -181 245 -64 190 67 -201 -97 8 77 -131 -219 -286 -20 455 192 -146 1 88
7578H8p7P0k36K8J84j7j25l5j46K44J95j30K25m64K18j93L45m1j40j56J35j71
$$ 88 11 81 -155 -127 57 40 -85 -120 -266 -22 173 43 268 -196 22 -171 174 133 -7 -163 -28 -199
7600a99L74o3nk09L33k20P6j13l10K25K18j1k80J61J63k05j36K86M7l95P7J80
$$ -199 175 112 107 -102 231 11 87 -26 -336 -111 107 96 -184 -23 140 -65 -201 85 132 -263 -186 -6
7622fQ6J9j47N6J44j23R9m04K9L67J25l17p9K25r2K9l3q1M36l86K75j70L03m64
$$ -6 80 99 -48 8 152 29 128 -276 -247 120 245 -72 -151 74 -18 11 -22 -103 333 -53 222 52 355 -109
7646a09j79L19j15K65j35j95k47M19J40J24J17n90M89%l26K33j54k50J01K16J01
$$ -109 -288 31 -84 181 46 -149 -396 23 163 287 404 -186 303 303 -23 210 56 -194 -93 123 224
7667B24l70J2j05L1M13l41j50J98J71K5k99M09k58j22L22Lr7k67J82R3L7m8n4
$$ 224 -146 -134 -239 -208 205 -136 -286 -88 83 108 -191 218 -40 -162 160 163 66 -201 -19 74 111 63 9
7690Ik53R2J77J89j61j3R4M4J15l72J66j1J04l88M13KJ79m08L0K46j50n6J27p0
$$ 9 -244 -152 25 214 53 40 134 178 293 -79 87 76 180 -208 205 207 386 -22 8 254 104 48 175 105
7714A05kk46m1J88N8q4l9M30m46K19l02P9p2Q3K74q5q9p1J78k67J64j39K79j46
$$ 105 103 -143 -184 4 62 -22 -61 369 -77 142 -160 -81 -153 -70 204 119 30 -41 137 -130 34 -105 174 28
7738B8k79L27l04j15O17l12J03j95J76n1K23j18j35m1P2J40k11N0j2R7p0N06j42
$$ 28 -251 76 -228 -343 274 -38 65 -130 46 -5 218 100 -35 -76 -4 136 -75 -25 -37 60 -10 496 354
7761C54n07J47k32L91j3k81K64n41M81j42j43L97k64n7M17j46j27L5J47l78J62
$$ 354 -153 -6 -238 153 140 -141 123 -418 63 -79 -222 175 -89 -146 271 125 -2 33 180 -198 -36
7782c6m1o9r9M19l3J51j21j67j34O00k77k60K46n48L35L38k50j61J0J51j31m3
$$ -36 -77 -146 -245 174 141 292 171 4 -130 470 193 -67 179 -369 -34 304 54 -107 -97 54 -77 -120
7804a20J76k81J12J77K7l04R2j9K3k24J09J12J6M9o0Q2j9k00N79m03m5p7J15j26
$$ -120 56 -225 -113 64 91 -213 -121 -140 -117 -341 -232 -120 -104 -55 -115 -33 -52 -252 327 -76 -121 -198 -83 -209
7828b09J55m0N1J50k59L2j25K00q5M8j95L77j18Q8j45M39m77J67J50p6k7r7lk62
$$ -209 -54 -94 -43 107 -152 -120 -245 -45 -130 -82 -277 100 -18 70 -75 364 -113 54 204 128 101 4 1 -261
7852b61J68L72n21r9N75p0r0N6l23P1L89r7k29o5K43k0k6k42L05l04n2K37r1K4
$$ -261 -93 279 -242 -341 234 164 74 130 -193 -122 267 170 -59 -124 119 99 73 -169 136 -168 -220 17 -74 -50
7876e0J01j38J40j45L87k39l26K64K85j84n6j26L3O7q9J39k26J00j18N4L04p5
$$ -50 51 -87 53 -92 295 56 -270 -6 279 95 39 -87 -54 13 -76 63 -163 -63 -181 -127 177 102
7898A02k10j78K15j4K06J10L7l03J4j21J19o0J94j34n3K25j91j13M7K24n7o9m5
$$ 102 -108 -286 -71 -85 121 231 268 -35 -21 -142 -23 -83 111 -23 -76 149 -42 -155 -108 116 59 -10 -55
7921e5Lq5L42j54j55l19K46M15l22R6J37k81J84K60l34M3j24m3M46r1k65j10M55
$$ -55 -52 -137 205 51 -104 -423 -177 238 -84 12 149 -132 52 312 -22 21 -103 -146 300 209 -56 -166 289
7944B89o13M40j65l7P1j87J80p1J01L3q3k10N14k48j36J12j77M53j28Rl83K39
$$ 289 -324 116 -49 -86 -15 -202 -22 -93 8 41 -42 -252 262 14 -122 -10 -187 266 138 147 -236 3
7966CpK54j3k62j84K26r1J95k54J46Q0j77J78J79n39J0L1L21j13j85J31k89M36
$$ 3 -4 250 237 -25 -209 17 -74 121 -133 13 93 -84 94 273 -266 -256 -225 96 -17 -202 -71 -360 76
7989G6J44l8L1o23O02j00n3k49R3L2j74L20M97n27j21qJ35O8k20J64j84J85k12
$$ 76 220 182 213 -410 192 92 39 -210 -117 -85 -259 61 558 31 -90 -98 37 105 -115 49 -135 50 -162
8012a62M23l19k92N40q2n2Q0n41M57k5N3J37l51K3M38j47K21l18j31m14J84K14
$$ -162 261 -58 -350 190 108 56 136 -405 52 27 80 217 -134 -111 327 180 401 83 -48 -462 -278 -64
8034f4J39j24Lq6P9J1l0J08l24M22O4j28j15r2J0K82m4k4j78J55J5J04p5m25L88
$$ -64 75 -49 -46 -132 -53 -42 -72 36 -288 134 198 70 -45 -137 -127 155 111 87 -91 64 79 183 108 -317 71
8059G1k9O7L73l90l35K46M4j92L74n84L2J70j65L60j39j75J07R6L36m94m8M82
$$ 71 42 109 482 92 -243 3 47 -145 229 -355 -323 -153 -318 42 -97 -272 -165 -69 267 -227 -275 207
8081B07k68J27N4j85k9J48j34k17L92l46K98J60j95o9K54n26K67K15oj36k99L00
$$ 207 -61 66 120 -65 -94 54 -80 -297 95 -251 47 207 12 -57 197 -329 -62 153 147 11 -288 12
8103A2o7K96Q5k47J92k01j89K27l7k23N2J25m2p8O0L7j25J35r0L58k97j88K71
$$ 12 -55 241 326 79 271 70 -119 108 71 -152 -100 25 -17 -95 -35 2 -123 12 -78 280 -17 -205 66
8126F6PM6n4lj2%J28j18l1j73K85K02l98o7K02o1J36k50O9j33K38n5L38k97k02
$$ 66 73 119 65 62 50 50 178 60 29 -144 141 343 -55 -122 80 19 155 -95 -26 -159 79 24 362 65 -137
8151a37p0L55N5l31L27n75M80O7P8j50n1k22J75J26J77l43k33M27j90P0J12k16
$$ -137 -207 148 203 -128 199 -376 104 171 249 99 48 -174 1 127 304 -39 -272 155 -35 35 147 -69
8173f9n2K79l02J27k30L02j98K03P6j89K02j95j11L12K00j58k26r3
$$ -69 -121 158 -144 -17 -247 55 -143 60 136 -53 149 -46 -157 155 355 197 -29 -122
8191a22
$$ Imaginary data points
##PAGE= N=2
##DATA TABLE= (X++(I..I)), XYDATA
0@%%%%%%qJ6j6J6j6K4l2L8m6N6o8P6q8J08j28J47j71J98k26K60k99L37l81M31
$$ 0 0 0 0 0 0 0 -8 8 -8 8 -8 16 -16 22 -24 32 -36 40 -48 60 -68 79 -92 106 -120 140 -159 178 -203 228
30B28m85N48o14O84p66Q54r47J052j168J294j433J587j756J944k156K393k658
$$ 228 -257 291 -323 361 -405 449 -498 554 -614 680 -753 834 -922 1022 -1134 1259 -1399
47a399K961l309L714m193M767n470O359p520R109j1433J5158k2095L9322j58442
$$ -1399 1562 -1747 1967 -2226 2541 -2929 3430 -4090 5019 -6414 8744 -13351 25971 -132471
61a32471k98613K98405L39803L6680k29457j74160j3578J17206J02498M1517n8711
$$ -132471 -431084 -132679 207124 243804 14347 -159813 -173391 -56185 46313 87830 29119
72B9119j30710n2811J65362J50508j27423k37367J5946K35688J51372r2199k05768
$$ 29119 -101591 -154402 10960 161468 34045 -203322 -187376 48312 199684 107485 -98283
83i8283r9969Q0080J40931J14661L4248j42616k39420j4253K70556J88600j21688
$$ -98283 -198252 -118172 22759 137420 171668 29052 -210368 -224621 45935 234535 112847
94A12847k12381k5463J38572P5986p9060o7661O8533O2348m7232l1247K7325l4069
$$ 112847 -99534 -124997 13575 89561 10501 -57160 11373 73721 26489 -4758 22567 -11502
106a1502o0489N8342J26725J9063j23457j21152K4733J21476M7539l3213K114
$$ -11502 -71991 -13649 113076 132139 8682 -112470 -87737 33739 81278 48065 50179
117E0179j1984j08607n5969J20430J31499k9172j15063m8438M1426L1403l2137
$$ 50179 38195 -70412 -126381 -5951 125548 96376 -18687 -67125 -25699 5704 -26433
128b6433N131R1406J4834j32398o9562J00089Q3214n2713o6426K9854P2933j159
$$ -26433 -21302 70104 84938 -47460 -117022 -16933 66281 13568 -52858 -23004 49929 48770
140D8770r3188n5601N8905P3108J8588J2474l0929j27575p0167J31945J82219
$$ 48770 -44418 -100019 -41114 31994 50582 63056 32127 -95448 -165615 -33670 148549
151A48549K871j66428j34571M2399J40670N3786m6362l2943k5672m9137K6839
$$ 148549 151420 -15008 -149579 -107180 33490 87276 40914 7971 -17701 -66838 -39999
162c9999J10921J6546j23588p4825R6031J47469q514j86915j22248J20817J97613
$$ -39999 70922 87468 -36120 -110945 -14914 132555 124041 -62874 -185122 -64305 133308
173A33308L4789j16742j38171p1085P2394J85398R8823j14539k03374o5644J50256
$$ 133308 168097 51355 -86816 -157901 -85507 99891 198714 84175 -119199 -184843 -34587
184c4587J86777j8663j79356p5731Q9054Q7820O039m2842p1362m1275O5190J22254
$$ -34587 152190 133527 -45829 -121560 -32506 55314 61353 18511 -52851 -94126 -28936 93318
196I3318L6032j25590j79647N02K28987J69948j15928k30655o7666J18206J53668
$$ 93318 129350 3760 -175887 -175385 53602 223550 107622 -123033 -190699 -72493 81175
207H1175N4084q6126j29585l9703P3132J08999L5887r7725j13381M7822J40150
$$ 81175 135259 49133 -80452 -120155 -47023 61976 97863 138 -113243 -65421 74729
218G4729J6659j13166p3857L6461Q7701N2474k7097o8757n0938j1950N7585J14719
$$ 74729 91388 -21778 -95635 -59174 28527 81001 53904 -14853 -65791 -77741 -20156 94563
230I4563K9189j28002j14631M7460J15932L8819m8038n7461j830L3505L27j8656
$$ 94563 123752 -4250 -118881 -71421 44511 83330 35292 -22169 -23999 9506 9833 -8823
242h823J7871J6979j9302j306K0217k2565l6473J9478M5000R412k7858k8216P213
$$ -8823 9048 26027 6725 5419 25636 3071 -33402 -13924 31076 40488 12630 -15586 -8373
255h373K3997k1929l2373M7732O7165l4481q9137k2335M8798N5187K0507k5291
$$ -8373 15624 -6305 -38678 9054 76219 41738 -47399 -69734 -20936 34251 54758 29467
267B9467m2487k8492j1416L2493P7927J8823q8833p1021M1151P6235J7732m3239
$$ 29467 -13020 -41512 -52928 -20435 57492 76315 -12518 -83539 -42388 33847 51579 8340
279H340n4587j947N9146M2160k1115n7335n1223J6644J09860P5604q6941j46448
$$ 8340 -46247 -48194 10952 53112 31997 -25338 -76561 -59917 49943 125547 38606 -107842
291a07842j6739J22414J16057j0220j20309q8481L7034R1218N0652p721o5856
$$ -107842 -124581 -2167 113890 103670 -16639 -105120 -68086 23132 73784 66063 207
302B07q0203J4844J08985N6776o6337j01598j7555R2998J00176k6452j22276o1939
$$ 207 -79996 -65152 43833 100609 34272 -67326 -84881 8117 108293 81841 -40435 -102374
314a02374N3282J00731O5728m2678j35784p3354R0308J43354L1293j06891j26478
$$ -102374 -49092 51639 117367 74689 -61095 -134449 -44141 99213 130506 23615 -102863
325a02863Q21J25223Q1074n1556q7171k8734K9137O2431M1239m1073q2057k2107
$$ -102863 -102042 23181 104255 52699 -34472 -63206 -34069 28362 69601 28528 -53529 -75636
337g5636O1893Q3297J2102r4017r4005L4414J12257M8144m6625q1123m9136L5479
$$ -75636 -13743 69554 81656 -12361 -106366 -71952 40305 88449 41824 -39299 -88435 -52956
349e2956R1373L9606n1956p6420k3675N4474P5593n823p8775l0263M8644M0302
$$ -52956 38417 78023 26067 -50353 -74028 -19554 56039 50216 -28559 -58822 -10178 30124
361C0124o603k5908k4267N71K7548J9659J101j1633l1764k1143L5768M8773q309
$$ 30124 23521 -2387 -26654 -26083 1465 21124 22225 10592 -21172 -42315 -6547 42226 33917
374C3917l8416j6102K657J5438K0552K212j0860n980j2061p529K0584J6541j1643
$$ 33917 -4499 -20601 -17944 -2506 18046 20258 9398 3418 -8643 -16172 4412 20953 9310
387I310m786M265j6240j0318K3802K2042j1432k8593j7117K3961M5991p432o1614
$$ 9310 4524 8789 -7451 -17769 6033 28075 16643 -11950 -29067 -5106 40885 33453 -28161
400b8161k2237M5203M4247K673l7289n1277o578N5167N0277o671n1563n5272P82
$$ -28161 -50398 -5195 39052 41725 4436 -46841 -53419 1748 52025 45354 -6209 -61481 -60699
413f0699P4551N7866l6259p4239k6586L4270O3364L0237m8079p3401o461O2388
$$ -60699 13852 71718 35459 -38780 -65366 -31096 32268 62505 14426 -58975 -65436 -3048
425c048O4409J000q0756p8048L7794J13564M0986p1960r5294j9672P9957R5344
$$ -3048 61361 62361 -18395 -96443 -58649 54915 95901 23941 -71353 -91025 -11068 84276
437H4276m833r2729o6636J9513P8288O6247k4315r7287m7502N8652Q3404J8434
$$ 84276 79443 -13286 -79922 -60409 17879 84126 59811 -37476 -84978 -26326 57078 75512
449G5512n8031p7662o640P8584O5140k0793p2409n2775J8499Q5835N8091n2373
$$ 75512 17481 -60181 -66821 11763 76903 56110 -16299 -69074 -50575 35260 93351 40978
461D0978r5960k3571O3944P9121J1437p5627p1313K1437P3059L3469k4309n2667
$$ 40978 -54982 -78553 -14609 64512 75949 322 -70991 -49554 23505 56974 32665 -20002
473b0002l4369K8030O0393J2996m1816m0874o073L5661M5687m024n0288k7429
$$ -20002 -54371 -26341 34052 47048 5232 -35642 -41715 -6054 39633 35609 -14679 -42108
485d2108J6227L0637K6115m113m2108k8735K2600L6707J2454j5071l3538j3047
$$ -42108 -25881 4756 30871 26758 -15350 -44085 -21485 15222 27676 12605 -20933 -33980
497c3980K9520K5488j1631j6545j630J15O137J0201l812o619L348l841m892J2501
$$ -33980 -4460 21028 9397 -7148 -8778 -8663 -2526 7675 3863 -2756 592 -3249 -8141 4360
511D360Q916r099o570k864m028J3715J9367q599k4575o963R004J9719J8194j3454
$$ 4360 13276 4177 -2393 -5257 -9285 4430 23797 15198 -9377 -16340 -7336 12383 30577 17123
525A7123l1865o446J8939J7549J2615p559l4573j7113K6686L3335N700k4800l9433
$$ 17123 -14742 -21188 -2249 15300 27915 20356 -14217 -31330 -4644 28691 34391 9591 -29842
538b9842o966M6703L9575k0855m7485k4516J9574N2852K8403m2569o1678m428
$$ -29842 -36808 9895 49470 28615 -18870 -43386 -23812 29040 57443 14874 -46804 -51232
550e1232M9121N0312K701n8219n6484J9277O8089L3200k7593n6904l5151L3780
$$ -51232 -2111 48201 50902 -7317 -63801 -44524 23565 56765 29172 -27732 -62883 -29103
562b9103P0691J8455n2407n8197p511N4344O6621o975p9431n0033L6688P2985
$$ -29103 41588 60043 7636 -50561 -58072 -3728 62893 55918 -23513 -73546 -36858 36127
574C6127L4596m1460p9196k2655O6306P0187l931o2667n7653Q763P4185N0963
$$ 36127 70723 29263 -49933 -72588 -6282 63905 59974 -2693 -60346 -51583 22602 73565
586G3565l7034o9525k2527L8031N8922J9613m9213n9194M672N2785M0408o948
$$ 73565 36531 -32994 -55521 -17490 41432 61045 11832 -47362 -42690 10095 50503 43555
598D3555n2094m4975K2733O2989K2068l5475m8272j6874L5114N2074Q65m7776
$$ 43555 -8539 -53514 -30781 32208 54276 18801 -29471 -46345 -11231 40843 41708 -6068
610f068l1394J0648L2566K6323j1174m0285j5143K5870K4541j09j5238k1153k602
$$ -6068 -37462 -26814 5752 32075 20901 -19384 -34527 -8657 15884 15775 537 -20616 -23218
623b3218K2431J3926j0112j0172n465l744J0377J4413m299j1540j838k134K297
$$ -23218 -787 13139 3027 -7145 -12610 -16354 -5977 8436 4137 -7403 -9241 -11375 -9078
636i078J1924K536p992j395k430o829Q678J5708k828j0904o357m103J0278K0115
$$ -9078 2846 5382 -2610 -4005 -6435 -13264 -4586 11122 8294 -2610 -8967 -13070 -2792 17323
650A7323j647k2108j0121P858J6447J6600p974l3068j0258K8543K6371j243k4315
$$ 17323 15676 -6432 -16553 -8695 7752 24352 16378 -16690 -26948 1595 27966 26723 2408
663B408k9543J508L9182K5306j7792l2443j8496R852L8786K4273k6884m2558q357
$$ 2408 -27135 -25627 13555 38861 21069 -11374 -29870 -20018 18768 43041 16157 -26401 -34758
676c4758K7312L6476J0021l7714m2725Q822M3698K6809j2674m2672l2562K3321
$$ -34758 -7446 29030 39051 1337 -41388 -32566 11132 37941 25267 -17405 -49967 -26646
688b6646N6852J6102l9487m7522j0059M1832N3937l289n7100l8517J8149M7123
$$ -26646 30206 46308 6821 -40701 -50760 -8928 45009 41720 -15380 -53897 -35748 11375
700A1375L3636j7433n6630k7065L6537N0973J1139l5220m9969o577N3117M5770
$$ 11375 45011 27578 -29052 -56117 -19580 31393 42532 7312 -42657 -49234 3883 49653
712D9653j7487n1078k9459J8942N3477L0828l5367n6321j0220M0364M6684P674
$$ 49653 32166 -18912 -48371 -29429 24048 54876 19509 -36812 -47032 -6668 40016 47690
724D7690m5467m8654J2096N2996K6095k0336l9527k2116K2917M4274P848l2913
$$ 47690 2223 -46431 -34335 18661 44756 24420 -15107 -37223 -14306 29968 37816 4903
736D903k9699j340K7442L3261m526m1441k2225K0390L0085J1708j4635l1443j0236
$$ 4903 -24796 -26136 1306 34567 30041 -11400 -33625 -13235 16850 28558 13923 -17520 -27756
749b7756K4062K1976j939j3682j7210m907J8749J7038j0689j5470K90N340N796
$$ -27756 -3694 18282 16343 2661 -14549 -19456 -707 16331 5642 -9828 -9538 -4198 1598
762A598K546q210n084Q051K221o781K240N374m233k131J494l022K734J0208j223
$$ 1598 4144 -4066 -9150 -1099 1122 -5659 -3419 1955 -2278 -4409 -2915 -5937 -3203 7005 5782
777E782j1135n410N26J0355J8347l454k7091j1543J6767K0341Q697j1248k6436
$$ 5782 -5353 -10763 -10237 118 18465 15011 -12080 -23623 -6856 13485 22182 10934 -15502
790a5502q494K3000K3361k65j9088k3593j438L2942K5091j9926l4866q603K1418
$$ -15502 -23996 -996 22365 22100 3012 -20581 -22019 10923 36014 16088 -18778 -27381 -5963
803e963L2812Q660l3337l5594O848L5143K5986m805l7456l4575J6412M8636J8797
$$ -5963 26849 35509 2172 -33422 -26574 8569 34555 29750 -7706 -42281 -25869 22767 41564
816D1564k7009l9350j4868K9332M2654O01l9199k8319O761L2219L0535j0077m7234
$$ 41564 14555 -24795 -39663 -10331 32323 32924 -6275 -34594 -27833 4386 34921 24844 -22390
829b2390k4501K9748M3769J1413l1672m5774n163M5565L7593j0713l8005k8527
$$ -22390 -46891 -17143 26626 38039 6367 -39407 -44570 995 38588 27875 -10130 -38657
841c8657O320M1489L1583j9863m3647j5579K3882L8306J2426l3126l7749Q016
$$ -38657 -32337 9152 40735 20872 -22775 -38354 -14472 23834 36260 3134 -34615 -26599
853b6599L7142J9994r960k9949k3166J5300L9062J4137k3637l2311j1343K4595
$$ -26599 10543 30537 20577 -9372 -32538 -17238 21824 35961 12324 -19987 -31330 -6735
865f735L8471K144l5573k3459R362K2541J7230m184k5476j4208J3654J8970N672
$$ -6735 31736 33880 -1693 -25152 -15790 6751 23981 19797 -5679 -19887 -6233 12737 18409
878A8409r693k0427n973K1740J7313j1214j7704m581N235J3241Q641r524j3090
$$ 18409 8716 -11711 -17684 4056 21369 10155 -7549 -12130 -6895 6346 14987 5463 -7627
891g627j274L381O358R097l852j3189o95P612j696m53N017J54l136l309n861K878
$$ -7627 -8901 -5520 838 9935 6083 -7106 -7801 -189 -1885 -2338 2679 2833 -303 -3612 -9473 -6595
907f595J3707J796j3150n208M747M056O936J335j3493q334J0694J3545L602j0059
$$ -6595 7112 8908 -4242 -9450 -4703 -647 6289 7624 -5869 -14203 -3509 10036 13638 3579
921C579k0716l669K6950K1097j2297k5312j2417Q993K6727J8302j7582l0887p904
$$ 3579 -17137 -20806 6144 27241 14944 -10368 -22785 -13792 12935 31237 13655 -17232 -25136
934b5136J8880K8032J0246k6980l3935O587L6101J8145j5156l0427j6163K0424
$$ -25136 -6256 21776 32022 5042 -28893 -22306 13795 31940 16784 -13643 -29806 -9382
946i382L6795N693l0313k9833k649L0327L7132m020m6216k8518J9972L9484J8675
$$ -9382 27413 33106 2793 -27040 -29689 638 37770 33750 -12466 -40984 -21012 18472 37147
959C7147k0573m1122j2814L1101L2622Lk6077k9565j049L6453K8825j8217l8466
$$ 37147 16574 -24548 -37362 -6261 26361 26364 287 -29278 -30327 6126 34951 16734 -21732
972b1732j3690K1933L6431J0378l1866l5704M747L1523K4147j840k9116k9746
$$ -21732 -35422 -13489 22942 33320 1454 -34250 -29503 2020 26167 24327 -4789 -34535
984c4535R814L6720J7132j6439k8167j3092J9270L0727N04k5688j5475O320J6717
$$ -34535 -24721 11999 29131 12692 -15475 -28567 -9297 21430 21934 -3754 -19229 -12909 3808
997C808J5821m014k4839j2164J5358K0543O401j2793k2377m999K1245J6786o151
$$ 3808 19629 15615 -9224 -21388 -6030 14513 20914 8121 -14256 -19255 1990 18776 12625
1010A2625j1911q341k572J1144J2064l739j0169l572P88N571O979n809r172M443
$$ 12625 714 -7627 -10199 945 13009 9270 -899 -4471 -3683 1888 8867 3058 -6114 -1671
1024a671O371l282k208J673l020j82L024r57L72L620m758o177L480L733j88M764
$$ -1671 4700 1418 -790 883 -2137 -2319 705 -252 120 3740 -1018 -7195 -3715 18 -170 4594
1040D594k96j1872o253R097J1192M191o688j6756n539J7233J4019m064j0737j0222
$$ 4594 4298 -7574 -13827 -4730 6462 10653 3965 -12791 -18330 -1097 12922 8858 -1879 -12101
1054a2101k373J5464J5779p346j9608p125R590K1055Q868k0199k5029N164K5488
$$ -12101 -14474 990 16769 9423 -10185 -17310 -7720 13335 22203 2004 -23025 -17861 7627
1067G627J5263n467k3169k0139J0195L1553J3873j6452k7671j3270J9379L5114
$$ 7627 22890 17423 -5746 -25885 -15690 15863 29736 13284 -14387 -27657 -8278 26836
1079B6836M226l2334k4497Q185K6358J9992r224l2837j5707K1617K9094P060k1417
$$ 26836 31062 -1272 -25769 -17584 8774 28766 19542 -13295 -29002 -7385 21709 28769 7352
1092G352l2761n499L5089L1012j1740l4704k0297J2018L4130J8688k1573l3594
$$ 7352 -25409 -30908 4181 35193 23453 -11251 -31548 -19530 14600 33288 11715 -21879
1104b1879o152K0961K6679O488k5752l0375O878L3180J5653j4272k6895j2983
$$ -21879 -28031 -7070 19609 26097 345 -30030 -23152 10028 25681 11409 -15486 -28469
1116b8469J8911K9987J906k4028j9729J014J9662K3433l088k8586j5914J3527
$$ -28469 -9558 20429 22335 -1693 -21422 -20408 -746 22687 19599 -8987 -24901 -11374
1128a1374K1699R206j1262k1333m280J8850J2468m541r473q672j18J4321R834
$$ -11374 10325 19531 8269 -13064 -17344 1506 13974 9433 -40 -8712 -8830 5491 15325
1141A5325r467j2991l21P236R688K584j1405q668O812O938j928M71q85m939N96
$$ 15325 5858 -7133 -7454 -218 9470 12054 649 -8019 -1207 5731 3803 4274 3389 -1550 -954
1156i54L829j755n56L676j324k945M43l496r39R733L579j0847o923M109O433N536
$$ -954 2875 1120 564 4240 2916 -29 414 -3082 -4021 5712 9291 -1556 -8479 -4370 2063 7599
1172G599k435j2453m242J0755Q303j672o151j0271k929J5194J3696q347j7501
$$ 7599 5164 -7289 -11531 -776 7527 5855 -296 -10567 -13496 1698 15394 7047 -10454
1185a0454o980Q122J8752Q845j5958k0650J719J6143J4027K090j6753k0246N349
$$ -10454 -17434 -9312 9440 18285 2327 -18323 -16604 -461 13566 15656 -1097 -21343 -15994
1198a5994K4515J2200j1179k1019j0907J5288K7118J838k3355j7779L200J9808
$$ -15994 8521 20721 9542 -11477 -22384 -7096 20022 21860 -1495 -19274 -16074 3734
1210C734K0302m370k8605j6162J4815K5345J1573j4889k9400q045K5683K5025
$$ 3734 24036 19666 -8939 -25101 -10286 15059 26632 11743 -17657 -25702 -19 25006
1222B5006m399k2400j8973K830K6408J9168j3980k7871r026J4868K5266R328k3254
$$ 25006 20607 -1793 -20766 -17936 8472 27640 13660 -14211 -23237 -8369 16897 26225 2971
1235B971k8239L676K7220J6443o558k3803j8272J1685K8167Q480j6970k1003o938
$$ 2971 -25268 -21592 5628 22071 15513 -8290 -26562 -14877 13290 21770 4800 -16203 -23141
1248b3141J6468K5189j15k6020j4904Q956J8401J2204q733k2507o597J6425J5925
$$ -23141 -6673 18516 18401 -7619 -22523 -13567 4834 17038 8305 -14202 -20799 -4374 11551
1261A1551p2j1034j5752j026J8976J3240r432j5066l942O920J3107M353j2198
$$ 11551 11479 445 -15307 -16333 2643 15883 6451 -8615 -12557 -5637 7470 11823 -375
1274c75r843N190P892K777k07o824n714O730P728l299n560J11J013L875K424o501
$$ -375 -10218 -5028 2864 5641 5434 -1390 -7104 -374 7354 4055 -1505 -1394 -381 3494 5918 -583
1290e83m064P191M018m829l890q9J022O885K559r337o680M918O656M889k835j2316
$$ -583 -4647 2544 6562 1733 -2157 -2246 -1224 5661 8220 -1117 -7797 -2879 3777 8666 5831 -6485
1306f485o963J2269J3457l156j1869r497J012J5517J1777j0275j7861l422J0420
$$ -6485 -13448 -1179 12278 9122 -2747 -12244 -11232 4285 16062 5787 -12074 -15496 -5076
1319e076J5541N737j6207k0194M427K1636J1065p217j9124j2671J2390K4596L855
$$ -5076 10465 16202 -5 -20199 -15772 5864 16929 9712 -9412 -22083 -9693 14903 18758
1332A8758j7633j7258j967J6360K1993j694k6125j4903J1433K1987J1426j2026
$$ 18758 1125 -16133 -18100 -1740 20253 18559 -7566 -22469 -11036 10951 22377 10351
1344A0351k5792o847K1798K0747k092j7972j8485R59K4953J7953j1890k4066r035
$$ 10351 -15441 -22288 -490 20257 18165 193 -18292 -17333 7620 25573 13683 -10383 -19418
1357a9418J1854K3279Q685k0334k2844K861J9820J4258j901j9228j7074Q431K3019
$$ -19418 -7564 15715 24400 4066 -18778 -15917 3903 18161 16260 -2968 -20042 -11611 11408
1370A1408Q318j2058j8600q574J4170K2396J40k0971j3130M945J4700J2848n167
$$ 11408 19726 7668 -10932 -19506 -5336 17060 17200 -3771 -16901 -11956 2744 15592 10425
1383A0425j9937q187J1387J4403M430r477j6820k630J7431J1460o635j1611n862
$$ 10425 -9512 -17699 -6312 8091 12521 3044 -13776 -16406 1025 12485 5850 -5761 -11623
1396a1623L445J2475O479r972r732J184O132O865K586q939q968O096R173L7m291
$$ -11623 -8178 4297 10776 804 -8928 -7744 -1612 5253 7839 -1100 -10068 -3972 5201 5238 947
1411I47m012j237N436M809m591m165L144J263O06Q61k816l866N396N523l971o190
$$ 947 -3065 -4302 1134 5943 1352 -2813 331 1594 2200 3061 245 -3621 1775 7298 3327 -2863
1427b863n91L800O743J558j0793o985Q158Q769j29n189q259l295J0019J1277m136
$$ -2863 -3454 346 7089 8647 -2146 -9131 -973 7796 7667 2478 -5781 -9076 943 12220 8084
1442H084j2366p403L765J4318J0147j2598j9053M38J5964J1476j562j5131j4403
$$ 8084 -4282 -11685 -7920 6398 16545 3947 -15106 -14668 1296 12772 11210 -3921 -18324
1455a8324O696J9553P495j0247j6301q376J2760K3395R01k2953j5553P342K0043
$$ -18324 -11628 7925 15420 5173 -11128 -19504 -6744 16651 17552 -5401 -20954 -13612 6431
1468F431J2658r191k3498p484J6506J8262L371j3752k0551k611K3226J9281r050
$$ 6431 19089 9898 -13600 -21084 -4578 13684 17055 3303 -17248 -19859 3367 22648 13598
1481A3598k2143j1184J0567K2490Q368j7773j9629J328J5540J4781J181j8394
$$ 13598 -8545 -19729 -9162 13328 21696 3923 -15706 -14378 1162 15943 17124 -1270
1493a270j8150Q176K2370R495j2008j9305p356J5594J9999k099j7282j0404K579
$$ -1270 -19420 -11244 11126 20621 8613 -10692 -18048 -2454 17545 15446 -1836 -12240 -9661
1506i661J1878J2555l455j7753q043R832J3132M402r691j5335J22J5790P986p527
$$ -9661 2217 14772 11317 -6436 -14479 -4647 8485 12887 3196 -12139 -12017 3773 11759 4232
1520D232q575m832K113J0890N897p572r371j776N346R174K578j0843p282O723
$$ 4232 -4343 -9175 -7062 3828 9725 2153 -7218 -8994 -3648 5526 8104 -2739 -10021 -3298
$$ [...]
8191A76
##END NTUPLES=NMR FID
##END=
