##TITLE=1H_CA-8622-1
 DMSO, 8 sc, 
 4.7.2019
##JCAMPDX= 6.0         $$ Bruker NMR JCAMP-DX V2.0
##DATA TYPE= NMR FID
##DATA CLASS= NTUPLES
##ORIGIN= UXNMR, Bruker Analytische Messtechnik GmbH
##OWNER= root
$$ XWIN-NMR		Version 3.5
$$ Thu Jul  4 15:26:10 2019 Russian Standard Time (UT+4h)  she@DPX200
##.OBSERVE FREQUENCY= 200.13155
##.OBSERVE NUCLEUS= ^1H
##.DELAY= (6, 6)
##.ACQUISITION MODE= SIMULTANEOUS
##.ACQUISITION SCHEME= undefined
##.AVERAGES= 8
##.DIGITISER RES= 18
##SPECTROMETER/DATA SYSTEM= spect
##.PULSE SEQUENCE= zg30
##.SOLVENT NAME= Pyr
##.SHIFT REFERENCE= (INTERNAL, Pyr, 0, 15.7039)
##AUDIT TRAIL= $$ (NUMBER, WHEN, WHO, WHERE, WHAT)
$$ ##TITLE= Audit trail, XWIN-NMR		Version 3.5
$$ ##JCAMPDX= 5.01
$$ ##ORIGIN= Bruker BioSpin GmbH
$$ ##OWNER= she
$$ F:/spectra/data/she/nmr/H-F/1/audita.txt
$$ ##AUDIT TRAIL=  $$ (NUMBER, WHEN, WHO, WHERE, WHAT)
(   1,<2019-07-04 15:24:57.70 +0400>,<she>,<DPX200>,
      <created by zg, POWCHK disabled, PULCHK disabled
       configuration hash MD5:
       00 E9 B6 7A A2 85 ED C7 34 08 36 98 17 FE 4E 26
       data hash MD5: 16K
       11 34 37 B8 E8 F2 A5 F8 A6 1C 29 55 A2 4F D7 59>)
$$ ##END=
$$ 
$$ hash MD5
$$ AE F3 9A B8 9C E4 26 C2 D0 86 F6 E2 4C 70 F3 0A
##$RELAX= 
##$RELAX= 
##$RELAX= 
##$RELAX= 
##$RELAX= 
##$RELAX= 
$$ Bruker specific parameters
$$ --------------------------
##$DU= <F:/spectra>
##$EXPNO= 1
##$NAME= <H-F>
##$PROCNO= 1
##$TYPE= <nmr>
##$USER= <she>
##$AMP= (0..31)
100 100 100 100 100 100 100 100 100 100 100 100 100 100 100 100 100 100 
100 100 100 100 100 100 100 100 100 100 100 100 100 100 
##$AQSEQ= 0
##$AQ_mod= 1
##$AUNM= <au_zg>
##$AUTOPOS= <>
##$BF1= 200.13
##$BF2= 200.13
##$BF3= 200.13
##$BF4= 200.13
##$BF5= 200.13
##$BF6= 200.13
##$BF7= 200.13
##$BF8= 200.13
##$BYTORDA= 1
##$CFDGTYP= 0
##$CFRGTYP= 5
##$CHEMSTR= <none>
##$CNST= (0..31)
1 1 145 1 1 1 1 1 1 1 1 1 1 1 1 1 1 1 1 1 1 1 1 1 1 1 1 1 1 1 1 1 
##$CPDPRG= <>
##$CPDPRG1= <>
##$CPDPRG2= <>
##$CPDPRG3= <>
##$CPDPRG4= <mlev>
##$CPDPRG5= <mlev>
##$CPDPRG6= <mlev>
##$CPDPRG7= <mlev>
##$CPDPRG8= <mlev>
##$CPDPRGB= <>
##$CPDPRGT= <>
##$D= (0..31)
0 1.2 0 0 0 0 0 0 0 0 0 0.03 0 0 0 0 0 0 0 0 0 0 0 0 0 0 0 0 0 0 0 0 
##$DATE= 1562239497
##$DBL= (0..7)
120 120 120 120 120 120 120 120 
##$DBP= (0..7)
150 150 150 150 150 150 150 150 
##$DBP07= 0
##$DBPNAM0= <>
##$DBPNAM1= <>
##$DBPNAM2= <>
##$DBPNAM3= <>
##$DBPNAM4= <>
##$DBPNAM5= <>
##$DBPNAM6= <>
##$DBPNAM7= <>
##$DBPOAL= (0..7)
0.5 0.5 0.5 0.5 0.5 0.5 0.5 0.5 
##$DBPOFFS= (0..7)
0 0 0 0 0 0 0 0 
##$DE= 6
##$DECBNUC= <off>
##$DECIM= 24
##$DECNUC= <off>
##$DECSTAT= 4
##$DIGMOD= 1
##$DIGTYP= 9
##$DL= (0..7)
0 120 120 120 120 120 120 120 
##$DP= (0..7)
150 150 150 150 150 150 150 150 
##$DP07= 0
##$DPNAME0= <>
##$DPNAME1= <>
##$DPNAME2= <>
##$DPNAME3= <>
##$DPNAME4= <>
##$DPNAME5= <>
##$DPNAME6= <>
##$DPNAME7= <>
##$DPOAL= (0..7)
0.5 0.5 0.5 0.5 0.5 0.5 0.5 0.5 
##$DPOFFS= (0..7)
0 0 0 0 0 0 0 0 
##$DQDMODE= 0
##$DR= 18
##$DS= 0
##$DSLIST= <SSSSSSSSSSSSSSS>
##$DSPFIRM= 0
$$ [...]
##$SUBNAM2= <"">
##$SUBNAM3= <"">
##$SUBNAM4= <"">
##$SUBNAM5= <"">
##$SUBNAM6= <"">
##$SUBNAM7= <"">
##$SUBNAM8= <"">
##$SUBNAM9= <"">
##$SW= 24.9336996594482
##$SWIBOX= (0..15)
0 0 2 0 0 0 0 0 0 0 0 0 0 0 0 0 
##$SW_h= 4990.01996007984
##$TD= 16384
##$TD0= 1
##$TE= 0
##$TE2= 300
##$TE3= 300
##$TEG= 300
##$TL= (0..7)
0 120 120 120 120 120 120 120 
##$TP= (0..7)
150 150 150 150 150 150 150 150 
##$TP07= 0
##$TPNAME0= <>
##$TPNAME1= <>
##$TPNAME2= <>
##$TPNAME3= <>
##$TPNAME4= <>
##$TPNAME5= <>
##$TPNAME6= <>
##$TPNAME7= <>
##$TPOAL= (0..7)
0.5 0.5 0.5 0.5 0.5 0.5 0.5 0.5 
##$TPOFFS= (0..7)
0 0 0 0 0 0 0 0 
##$TUNHIN= 0
##$TUNHOUT= 0
##$TUNXOUT= 0
##$USERA1= <user>
##$USERA2= <user>
##$USERA3= <user>
##$USERA4= <user>
##$USERA5= <user>
##$V9= 5
##$VALIST= <valist>
##$VCLIST= <CCCCCCCCCCCCCCC>
##$VD= 0
##$VDLIST= <DDDDDDDDDDDDDDD>
##$VPLIST= <PPPPPPPPPPPPPPP>
##$VTLIST= <TTTTTTTTTTTTTTT>
##$WBST= 1024
##$WBSW= 4
##$XGAIN= (0..3)
0 0 0 0 
##$XL= 0
##$YL= 0
##$YMAX_a= 78033
##$YMIN_a= -181980
##$ZGOPTNS= <>
##$ZL1= 120
##$ZL2= 120
##$ZL3= 120
##$ZL4= 120
##$ABSF1= 10
##$ABSF2= 0
##$ABSG= 5
##$ABSL= 3
##$ALPHA= 0
##$AQORDER= 0
##$ASSFAC= 0
##$ASSFACI= 0
##$ASSFACX= 0
##$ASSWID= 0
##$AUNMP= <proc_1d>
##$AZFE= 0.1
##$AZFW= 0.1
##$BCFW= 1
##$BC_mod= 2
##$BYTORDP= 1
##$COROFFS= 0
##$CY= 11.3945322036743
##$DATMOD= 1
##$DC= 2
##$DFILT= <>
##$DTYPP= 0
##$F1P= 18.9103706918063
##$F2P= -1.10871071338519
##$FCOR= 0.5
##$FTSIZE= 0
##$FT_mod= 4
##$GAMMA= 1
##$GB= 0.15
##$INTBC= 1
##$INTSCL= 1
##$ISEN= 128
##$LB= 0.24
##$LEV0= 0
##$LPBIN= 0
##$MAXI= 10000
##$MC2= 0
##$MEAN= 0
##$ME_mod= 0
##$MI= 1.114404
##$NCOEF= 0
##$NC_proc= 0
##$NLEV= 6
##$NOISF1= 3.799351
##$NOISF2= 2.8
##$NSP= 1
##$NTH_PI= 0
##$NZP= 0
##$OFFSET= 15.70392
##$PC= 1
##$PHC0= -8501.029
##$PHC1= 14.80096
##$PH_mod= 1
##$PKNL= yes
##$PPARMOD= 0
##$PSCAL= 0
##$PSIGN= 0
##$REVERSE= no
##$SF= 200.130013532006
##$SI= 16384
##$SIGF1= 3
##$SIGF2= 2
##$SINO= 400
##$SIOLD= 16384
##$SREGLST= <1H.CDCl3>
##$SSB= 0
##$STSI= 0
##$STSR= 0
##$SW_p= 3612.71676300578
##$SYMM= 0
##$S_DEV= 0
##$TDeff= 0
##$TDoff= 0
##$TI= <>
##$TILT= no
##$TM1= 0
##$TM2= 0
##$TOPLEV= 0
##$USERP1= <user>
##$USERP2= <user>
##$USERP3= <user>
##$USERP4= <user>
##$USERP5= <user>
##$WDW= 1
##$XDIM= 8192
##$YMAX_p= 0
##$YMIN_p= 0
$$ End of Bruker specific parameters
$$ ---------------------------------
##NTUPLES= NMR FID
##VAR_NAME=  TIME,          FID/REAL,        FID/IMAG
##SYMBOL=    X,             R,               I
##VAR_TYPE=  INDEPENDENT,   DEPENDENT,       DEPENDENT
##VAR_FORM=  AFFN,          ASDF,            ASDF
##VAR_DIM=   8192,          8192,            8192
##UNITS=     SECONDS,       ARBITRARY UNITS, ARBITRARY UNITS
##FACTOR=    0.0002004,     1,               1
##FIRST=     0,             0,               0
##LAST=      1.6414764,     0,               0
##MIN=       0,             -181980,         0
##MAX=       1.6414764,     78033,           0
$$ Real data points
##PAGE= N=1
##DATA TABLE= (X++(R..R)), XYDATA
$$ [...]
1903C82o00J76j07O72j04l27k4k16J020n40r83M46O62j2p12p6j81N99P10m98n64
$$ 382 -218 -42 -149 523 419 92 68 -148 872 332 -651 -205 457 445 -267 -343 -524 75 785 287 -277
1924b77J83J25j01j96M9j45N65k5l10j00N45l24N8J48l61j2O76J9p58j50P05m06
$$ -277 -94 31 -70 -266 -217 -362 203 178 -132 -232 313 -11 47 195 -166 -178 498 517 -241 -391 314 -92
1946i2k96M17k05R6q0M31m65L61q9k95k53P12m8j11M8q5N6J05m46l48J029J85
$$ -92 -388 29 -176 -80 -160 271 -194 167 78 -217 -470 242 194 83 131 46 102 207 -239 -587 442 627
1968F27o34k94J30K42K1O7o17K01O40p1m86j80M44k03P9j06l59N49M58l98p5n4
$$ 627 -7 -301 -171 71 92 159 -458 -257 383 312 -174 -354 90 -113 -34 -140 -499 50 508 110 35 -19
1990a9L6j43L2k79J4K05N91p28L22J89l45L62J94q5j83J20l76j06P98k35r83L24
$$ -19 17 -126 -94 -373 -359 -154 437 -291 31 220 -125 237 431 346 163 283 -93 -199 599 364 -619 -295
2012b95Q02m61Nk61l86P80M80p36n31M45M49k86J00l24r6P65j7o82j73N56l0O4
$$ -295 507 46 51 -210 -596 184 664 -72 -603 -158 291 5 105 -219 -315 450 433 -249 -422 134 104 168
2034A68k77k82L82J64j03n61K53L49p9L0K0m47L84M21k89l01L43J8j81J34P8k29
$$ 168 -109 -391 -9 155 52 -509 -256 93 14 44 64 -383 1 422 133 -168 175 193 12 146 224 -5
2056eP7l2j32K59K51n45j54N55K25m68j84j86L75O00m02n08N4L49J37l87l43L
$$ -5 72 40 -92 167 418 -127 -281 274 499 31 -153 -339 36 636 234 -274 -220 129 266 -121 -464 -461
2078d61O50N4n93j20L90L20m70J31K56m14K01K44m4k60J78j49J32j28K04l43M66
$$ -461 189 243 -350 -470 -80 240 -230 -99 157 -257 -56 188 144 -116 62 -87 45 -83 121 -222 244
2099B44j62j05J58M2m49L07J93n1q08L83Q2J19N3m3k00K39K56m20l0k51Q18j38
$$ 244 82 -23 135 177 -272 35 228 177 -631 -248 -166 -47 6 -37 -237 2 258 -162 -192 -443 375 237
2121B37Q6n38q9P44j05o52j79M15K24J79n27j71O59K49n80m79M91O8l2pJ64l61
$$ 237 323 -215 -304 440 335 -317 -496 -81 143 322 -205 -376 283 532 -48 -527 -36 32 0 -7 157 -204
2143b04N19j08l36N7M35j90n52N04l2j74M8o3q2M96j14m35J10J89K71m45N9J05
$$ -204 315 207 -129 -72 363 173 -379 125 93 -81 -33 -96 -178 318 204 -231 -121 68 339 -106 -47 58
2165E8k36O27m00n91M66L04p7m61K96n63O69N20q43k13N12K75k35k48k92O51O4
$$ 58 -178 449 49 -542 -76 228 151 -310 -14 -577 92 612 -231 -444 68 343 108 -140 -432 219 283
2186B83J01o47R8O58j37m33K41j37J3O5k73J48Q3J33m64K81J45l7l99L08k77N33
$$ 283 384 -263 -165 493 356 -77 164 27 40 105 -168 -20 63 196 -268 13 158 121 -278 30 -247 286
2208B86q8k42k78N02J78j93k67K47k31j63R0J53j24L85J54n10j73L72L6P3r7n35
$$ 286 198 -44 -322 180 358 165 -102 145 -86 -249 -159 -6 -130 255 409 -101 -274 98 134 207 110 -425
2230d25M09L21nj26l44R7O00k17n40P7K18L72k27m52L73k42K04R1K15m64J89N3
$$ -425 -16 305 300 174 -170 -73 527 310 -230 -153 65 437 210 -242 131 -111 93 184 399 -65 124 177
2252A77n85P19l42k30P0L61Q5j06k74j22L63J13n4l54j58L54j47L44m18N9K27
$$ 177 -408 311 -31 -261 -191 170 255 149 -125 -247 116 229 175 -179 -337 17 -130 214 -204 -145 82
2273H2N06n21l10L47k21R1L89o63J84P27m8o65j22K31R6k29K60j34j05O4J7j30
$$ 82 588 67 -243 104 -117 -26 363 -300 -116 611 563 -102 -224 7 103 -126 134 0 -105 -41 -24 -154
2295a54R7K49n02K89p4k65J15M58n14K76J20k21l07N00K45k90j43J93N1M8k41
$$ -154 -57 192 -310 -21 -95 -360 -245 213 -301 -25 95 -126 -433 67 312 22 -121 72 123 171 -70
2316g0j7q5M1M44l62j8J68p3J32k32k52J14N24k47K2N2k61M60r9n38q0M96q8r5
$$ -70 -87 -172 -131 313 -49 -67 101 28 160 -72 -324 -210 314 67 89 141 -120 340 241 -297 -377 119 31 -64
2340f4l22K95m3L91k27k45j9L93r0j15Q7J26m20M29k90j34M90k96j30M3L35l38
$$ -64 -386 -91 -134 257 30 -215 -234 159 69 -46 41 167 -253 176 -114 -248 242 -54 -184 -141 194 -144
2362a44j45L10j41L81l51m2Rl5N60m90k86M17p1M7J48n13K05N05j7o29M56L5J17
$$ -144 -289 21 -120 261 -90 -132 -123 -158 402 -88 -374 43 -28 19 167 -346 -141 364 347 -282 174 209 326
2385C26j61K76n17J7N67j78m47J47j37K62j5p3m8K8J68j70l79N02k07MJ47p3J49
$$ 326 165 441 -76 -59 508 330 -117 30 -107 155 140 67 19 47 215 45 -334 168 -39 -35 112 39 188
2408A88m8k66M6K30J46n43k6K80p1l25L09k37L43M84m28n33M70J84j74l31M08
$$ 188 140 -126 -80 150 296 -247 -273 7 -64 -389 -80 -317 26 510 82 -451 19 203 29 -302 106
2429A06k51K55k9j3j49J64R7j44j14K3N6n1K6K40l89J19K61j98k2j62L2L50l05
$$ 106 -145 110 81 68 -81 83 180 36 -78 -55 1 -50 -24 216 -173 -54 207 9 -13 -175 -143 207 -98
2452i8K38m0j04K12j85K0K3k70J94p6n9O93n23l6O0K67l46l22L12J41K42n1p66
$$ -98 140 100 -4 208 23 43 66 -204 -10 -86 -145 548 25 -11 49 316 -30 -352 -40 101 343 292 -474
2475d74M21J88J71l42j08O33l20j03l67J6O18k01j05n27O78j2R0j62k93R8l15
$$ -474 -53 135 306 -36 -144 489 169 66 -301 -285 333 132 27 -500 178 166 256 94 -199 -101 -416
2496d16M69l02K65M5k8p5L7l11K74j92K59k84J40K94l57J66l36K55J95p1l02K68
$$ -416 53 -249 16 61 33 -42 -5 -316 -42 -234 25 -259 -119 175 -182 -16 -352 -97 98 27 -275 -7
2518gNl4r1L3K08n8J66M8n39O30L5k70k77J09L44m89j18J19K2L14K3l13L0L96
$$ -7 -2 -36 -127 -94 114 56 222 270 -269 361 396 126 -151 -42 302 -187 -305 -186 -164 150 173 -140 -110 286
2542B86j52j51K2n3R3R4q8m8k84L54m00L76K89n58n9K46K03l88J09R6k44M56k74
$$ 286 134 -17 5 -48 45 139 51 3 -281 73 -327 49 338 -220 -279 -33 170 -218 -109 -13 -257 199 -75
2565g5k14J76L32m14L71j47Q3j2Lj22j24J1k4R1K32k44l2k0K66J9k13O9J09k11
$$ -75 -289 -113 219 -195 176 29 112 100 103 -19 -143 -132 -156 -65 167 -77 -109 -129 137 156 -57 12 121 -90
2589i0O1k08K87K46j07l67R8J35m51K67M5o3J79k09r3L88k9P6m72m1K48J48O9
$$ -90 -29 -237 50 296 189 -178 -80 55 -396 -129 -84 -147 32 -177 -270 118 89 165 -307 -348 -100 48 117
2612A17k65O8K9L39j42k12o7K30l42M11l70l1O45l58q1j83L82J44p1l56k37J52
$$ 117 -148 -80 -51 288 146 -66 -133 97 -245 166 -204 -235 410 52 -29 -212 170 314 243 -113 -350 -198
2634a98M56o9n55L37J58k07J48M9j40J21pj98j19L07K07j93j08j89J89K06o8l94
$$ -198 258 189 -366 -29 129 -78 70 119 -21 100 93 -105 -224 83 290 97 -11 -200 -11 195 127 -267
2656b67L12L20n05j05R8L59l43K87m60M19p0p9k98j51O74n5j01k44j06K79K10
$$ -267 45 365 -140 -245 -147 212 -131 156 -304 115 45 -34 -332 -483 191 136 35 -209 -315 -36 174
2677A74j2k88l0N26r4m38M42l57N13k18j43j89J80J0r7J99m7j56M81k97l75j74
$$ 174 162 -126 -156 370 276 -162 280 -77 436 218 75 -114 66 76 -21 178 131 -25 456 159 -216 -390
2699c90N18j17J26j25n8J53j50lR0J10k10j65L60j7k37M1K57O1l48L81l76K87
$$ -390 128 11 137 12 -46 107 -43 -46 44 154 -56 -221 139 122 -115 -74 183 244 -104 277 -99 188
2721A88P3k81O2j10L74m42M34k76m9L0J17j81J72k05J82J2L7j05j39Q2J4L10m28
$$ 188 261 -20 42 -68 306 -136 298 22 -27 3 120 -61 111 -94 88 100 137 32 -107 -25 -11 299 -129
2744a29J12J98n11L50N5q8jJ85k61K21L9l00L0j86L61k44K46n29M48N16j56m46
$$ -129 -17 181 -330 20 75 -13 -14 171 -90 131 170 -130 -100 -286 75 -169 77 -452 -4 512 356 -90
2766i0j71N75k28J89k89J53P4Q7n30r7O37j69j66q7J39J29j40N5m30J40K62Oj61
$$ -90 -261 314 86 275 -14 139 213 300 -230 -327 310 141 -25 -112 27 156 16 71 -359 -219 43 49 -112
2789a12K12k74l3M47j37n16L00L67l47J20j2k92M29J04l86L04Qj47p6j63L08r0
$$ -112 100 -174 -207 240 103 -413 -113 254 -93 27 15 -277 152 256 -130 174 182 35 -41 -204 104 14
2811A4J43O0o02M11J94k8m81R2N47n97k37L2N57k38J76l7J09JJ28o38M67J1J50
$$ 14 157 217 -385 26 220 192 -289 -197 350 -247 -484 -452 105 -133 43 6 115 116 244 -394 73 84 234
2834B34N9m85K08J73J35n69L38j01P1J30j2j90k52L51K8j93J50j90j57J88M18
$$ 234 293 -192 16 189 324 -245 93 -8 63 193 181 -9 -261 90 118 -75 75 -115 -272 -84 334
2855C34k35j98L64k21J20PL2j75k8P2LJ54k48J8J29J8m42K33R8k68K54J1j84k4
$$ 334 99 -99 265 44 164 171 203 28 0 72 75 229 -19 -1 128 146 -296 -63 35 -233 21 32 -152 -176
2879a76N8J11j53m3L45N3ok48R6J30nl2k5j79L33j25n7j29J4j66M10m10K65qj0
$$ -176 -118 -7 -160 -203 142 195 189 -59 37 167 162 130 105 -74 259 134 77 -52 -38 -204 206 -204 61 53 43
2904D3k17K86M2j40j41J39j29l1M54n08M02l7P5k01k49j35N07K8l37J24J14M3
$$ 43 -174 112 154 14 -127 12 -117 -148 306 -202 200 163 238 37 -212 -347 160 188 -149 -25 89 132
2926A32r9r0q1M84O0n72Oj7J36J16p8l5l3K20o8j5r7j91L04l34R9K72K7k42K53
$$ 132 33 -57 -138 346 406 -166 -160 -177 -41 75 -3 -38 -71 149 81 66 -31 -222 82 -252 -153 119 146 -96 157
2951A57k34n4L96j11l42L95l0r3k06J57j93o3O6K46p6J2l7m10L63J27k79J61L8
$$ 157 -77 -131 265 154 -188 207 177 84 -122 35 -158 -221 -155 91 15 27 -10 -420 -57 70 -209 -48 -10
2974a0j22jL42ok16j27L67k94J45l5j21J71J33m1j70q5J29j56j12J59j63L3J97
$$ -10 -132 -133 209 203 -13 -140 227 -67 78 43 -78 93 226 185 15 -70 59 -97 -209 -50 -213 -180 17
2997A7K35m1k45j09J01j79N2k0K37p8L7n0j53L60o1J61l91J1Q5k49M32k27oj58
$$ 17 252 211 -34 -143 -42 -221 -169 -189 48 -30 7 -43 -196 164 103 264 -127 -116 -31 -280 152 -75 -81 -239
3021b39K72J23M78m14k52l92M67k9J0k66L85K96n54J15kk14M18l61K05q0j2L57
$$ -239 33 156 634 220 -32 -424 43 14 24 -242 143 439 -115 0 -2 -216 202 -159 46 -34 -46 311
3043C11n63n9K06j73N72k05n16M14M21n25J12QQ1m5k99J83L98k05j61J04j93J92
$$ 311 -252 -311 -105 -278 294 89 -427 -13 408 -117 -5 3 84 39 -260 -77 321 116 -45 59 -134 58
3065E8l30n0L44J67j91j78J35J38L94p84M65l93j58N45L5l50N4K05n0K2Or6l92
$$ 58 -272 -322 22 189 -2 -180 -45 93 487 -297 168 -225 -383 162 197 -153 -99 106 56 78 84 -12 -404
3088d04M61J59m5l33J41Q6k20L19j50K8j3k02K96L6K6j70l55N25l13K07l63L50
$$ -404 57 216 171 -162 -21 65 -155 164 14 42 29 -173 123 159 185 15 -340 185 -128 79 -284 66
3110F6j61M3N3j31L1L81k93k89J82n0JK2jO5J22O6l47M43j44J59p2K0j46l12J08
$$ 66 -95 -52 1 -130 -99 282 -11 -300 -118 -168 -167 -145 -146 -81 41 107 -240 203 59 218 146 166 20 -292 -184
3135a84L39k20j01J36P6J16k11J1J46P0m59L69r2K38l48Q7P8l4Pj77O3J43K07
$$ -184 155 -65 -166 -30 46 162 -49 -38 108 178 -281 88 -4 234 -114 -27 51 17 24 -153 -90 53 260
3158B60k99J42J22j52k83M43k02q6L44p6j67J05J88l57q8K81j08j87K51l02J01
$$ 260 -39 103 225 73 -210 233 31 -55 289 213 46 151 339 -18 -106 175 67 -120 131 -171 -70
3179g0J33K59m75J5L33n05R8J59J07M5j07O4k33L61l6k77M96l77J0p5j16J91J8
$$ -70 63 322 -153 -138 195 -310 -212 -53 54 99 -8 56 -177 184 148 -129 367 -10 0 -75 -191 0 18
3202A8J60l38K46J8q9K77k54k38l2K70l8j00J49l68J14M2K58j01o2R8J4j76J53
$$ 18 178 -160 86 104 15 292 38 -200 -232 38 0 -100 49 -319 -205 -163 95 -6 -68 30 44 -132 21
3225B1j19K18j40l07J73l9J36j97J55Q5lK82j57o9O4m2j35K97j79k3k24J54K19
$$ 21 -98 120 -20 -327 -154 -193 -57 -254 -99 -14 -17 265 108 39 103 61 -74 223 44 21 -203 -49 170
3248A70j53J25j22q0m8J37P6j55K0P8j31O6K93m37Pj17J93R9o6R4k36K04j51K16
$$ 170 17 142 20 -60 -108 29 105 -50 -30 48 -83 -17 276 -161 -154 -271 -78 21 -45 49 -187 17 -134 82
3272H2P2j33J80m39J89j41L09k70J77k24L38j16j22Q2j97K79J46j14j86j89L64
$$ 82 154 21 201 -238 -49 -190 119 -151 26 -198 140 24 -98 -16 -213 66 212 98 -88 -277 87
3293H7r9J23p7J39j81P9l57J07L29j55j18O5M5j46RN3K22k80o2L20j39O4J78l67
$$ 87 -12 111 34 173 -8 71 -286 -179 150 -5 -123 -58 -13 -159 -150 -97 125 -155 -217 103 -36 28 206 -161
3317a61J83J48Q1j46n8j18j46K46j58O2j70L26k52k34L51Q8K16k80K19j72K4j00
$$ -161 22 170 251 105 47 -71 -217 29 -129 -67 -237 89 -163 -397 -46 42 258 -22 197 25 49 -51
3339e1K24j90P7N9k00N4L0j02k9j28K64k76K81J47j61K10l02J86k31J53M7J93
$$ -51 173 -17 60 119 -81 -27 3 -99 -128 -256 8 -268 13 160 -1 209 -93 93 -138 15 62 255
3361B55k47P8p2j2J80m6j5k86l1J07L08q9J7M0k64q3K54k26J07L43k80j27K13
$$ 255 8 86 14 2 182 136 121 -165 -196 -89 219 130 147 187 -77 -160 94 -132 -25 318 38 -89 124
3384A24j82K00k94k54L02M12o09O7K86j14R3J2j81K9K12N4k17j52M87k31j10M3
$$ 124 -58 142 -152 -406 -104 308 -301 -234 52 -62 31 43 -138 -109 103 157 -60 -212 275 44 -66 -23
3406b3p6K42j87K18k45J33r9p4L2K33k15M3J38j44j21j25M22j24m1J61j72R6L8
$$ -23 -99 143 -44 174 -71 62 -37 -111 -79 154 -61 -18 120 -24 -145 -270 152 28 -13 148 -24 72 110
3429A10k28M53j87j63N3n5K97l76K99k49J98J01q9l21O1m6J63l19M24j38j06q6
$$ 110 -118 335 148 -15 38 -17 280 -96 203 -46 152 253 164 -157 -96 -142 21 -298 126 -12 -118 -204
3451b04J52o3K41m28K20J94j49M23j21l67K54L0l3l05N7K0K20k40P9j48L31k17
$$ -204 -52 -115 126 -302 -82 112 -37 386 265 -102 152 182 149 -156 -99 -79 141 -99 -20 -168 163 -54
3473e4J35j69K52j44M7n7j2K40k28l0k51L99r8k44j2L20q6n0l8J34j84L10r5K3
$$ -54 81 -88 164 20 67 10 -2 238 10 -20 -271 128 30 -214 -226 94 8 -42 -80 54 -130 180 85 108
3497A08r2k3K3p0J55J75k22j70K39j48j4J34n4Pq1R4k34j5K29k92K88o3j21J82
$$ 108 16 -7 16 -54 101 276 54 -116 123 -25 -39 95 41 48 -33 61 -173 -188 41 -251 37 -26 -147 35
3521C5J86j57L09n61m9J38K74N9o42M20K3k41K75l4J10J83k36k54O9k50K02nl
$$ 35 221 64 373 -188 -237 -99 175 234 -408 12 35 -206 69 35 145 328 92 -162 -93 -343 -141 -146 -149
3544a49L5N9M3J8J0k81K41J11k26K84j9l74M85l21J63j15J90K1n03M36k1j45j7
$$ -149 -114 -55 -12 6 16 -265 -24 87 -139 145 126 -248 237 -84 79 -36 154 175 -328 108 87 -58 -75
3567g5M32m04L23o3j17k45J71k6Q5k14K43R6j84j37L65k36m4J5r0R7Qj41K73L9
$$ -75 357 -47 276 213 96 -149 22 -4 81 -133 110 206 22 -115 250 14 -30 -15 -105 -8 0 -141 132 171
3591A71k26r3p1K88n0R4j7J06k72J22m2K88l07P6J05m12j20L32P3k87J93J70l51
$$ 171 -55 -148 -219 69 19 113 96 202 -70 52 10 298 -9 67 172 -240 -360 -28 45 -242 -49 121 -230
3614b30K89N6k05J95j07O3l02L61j66p3KK3K18j44J07L9j73Q1L4K40k52l16L84
$$ -230 59 115 -90 105 -2 61 -241 120 -46 -119 -117 -94 124 -20 87 126 -47 34 68 308 56 -260 124
3637A24K3k26L51l30K11j00L10q4o76L08N1K05n0j86J67j70J42k04n3J14K59J13
$$ 124 147 -79 272 -58 153 53 363 279 -397 -89 -38 167 117 -69 98 -72 70 -134 -187 -73 186 299
3659B99j95j26J55r8j85J61k92L08Q4m9J08j49P1O8j77j45M1O5j40l4K94J82m68
$$ 299 104 -22 133 35 -150 11 -281 27 111 62 170 21 92 160 -17 -162 -121 -56 -196 -230 64 246 -222
3682b22PK86J53l06j99J38J67K7K00n06K59n2p7K00q5m4k58K92j41J82l29N57
$$ -222 -215 71 224 -82 -281 -143 24 51 251 -255 4 -48 -125 75 -10 -54 -312 -20 -161 21 -308 249
3704B49k29K20k72KJ70o44O06P7J91m40N9N4j7q6q2L5K71j21K42k79j53J90K8
$$ 249 20 240 -32 -30 140 -504 102 179 370 -70 -11 43 26 -60 -142 -107 164 43 285 6 -147 43 71
3727G1j62J45j7l15N64n16J33j10L24l9k08N5n4K98p2J10j05k0J24j34J08p3P8
$$ 71 -91 54 37 -278 286 -230 -97 -207 117 78 -130 -75 -129 169 97 207 102 82 206 72 180 107 185
3750A85J57n44L35k02L28k08r4K17l31J25J49j47O6J80l57J7O00o58L03k03Q9
$$ 185 342 -202 133 -69 259 51 -43 174 -157 -32 117 -30 36 216 -141 -124 476 -182 121 -82 7
3771GQ3k15k1j34M91l25K94j61K74k43j41m1J04k43K42J41j5p4k20p1J28J20o2
$$ 7 90 -125 -146 -280 211 -114 180 19 293 50 -91 -132 -28 -271 -29 112 97 23 -197 -268 -140 -20 -82
3794h2Rj08K52k49J35M6lJ72j88o9J51J85K69p06P3K59j15K00l49K62P4k18k3
$$ -82 -73 -181 71 -178 -43 3 0 172 -16 -85 66 251 520 -186 -113 146 31 231 -118 144 218 0 -23
3817b3K7j11L83j40j26Q2k99J46L5L30p1l3r5J8r7L48n29R8qm5J72j64Nm9O1J12
$$ -23 4 -107 276 136 10 92 -207 -61 -26 304 233 200 105 123 26 374 -155 -57 -65 -110 62 -102 -97 -146 -85 27
3843B7Q0K1n8J40p5L3j55m07K74J45M2Q3j16J36o6j78J75j97J07k7r4O4R9q5j05
$$ 27 107 128 70 210 135 168 13 -394 -120 25 67 150 34 170 104 -74 101 -96 11 -16 -110 -46 53 -32 -137
3868a37J89j59N38o23M02M6l4j28k47nJ45Pj72J00M17m75M02l83k66N04K9q4k43
$$ -137 52 -107 431 -192 210 256 222 94 -153 -158 -13 -6 -178 -78 339 -136 266 -117 -383 121 150 66 -177
3891a77J21JR5n6k18L06k07Q9K98l84L26k88K7L21k84pq9r6M11k00J16J15m61
$$ -177 -56 -55 40 -16 -234 72 -135 -46 252 -132 194 -94 -67 254 -30 -37 -126 -222 189 -11 105 220 -241
3914b41K26J17l47J00K38l0P6l01K19n3k01J46Q7J80j45l29M05Qq2J48o3j7N0
$$ -241 -15 102 -245 -145 93 63 139 -162 57 4 -197 -51 36 216 71 -258 147 155 73 221 158 141 191
3937A91m70J05M02l05p7L7R4k4k1o3Q3n6J09n6K20o9q2k08J24K56M4j55k08j0
$$ 191 -279 -174 228 -77 -154 -117 -23 -47 -68 -131 -48 -104 5 -51 169 100 18 -190 -66 190 234 79 -129 -139
3961a39J76O9K53j00j19j86l4K58k16l1q2N38k06J20m25L7N7j99M38n10K52j42
$$ -139 37 106 359 259 140 -46 -80 178 -38 -69 -151 387 181 301 -124 -87 -30 -229 209 -301 -49 -191
3983a91K2L85k69J46p6j03R0j68K86K30n89J88NK84m27J36J82l7j85O7L1Q1J64
$$ -191 -169 216 -53 93 17 -86 4 -164 122 352 -237 -49 -44 240 -187 -51 131 94 -91 -24 7 88 252
4006B52o03K99Q6j32j32J52m7J09N9k73K83p1j04J33J3R2J44o21M8K61O8L18m90
$$ 252 -351 -52 34 -98 -230 -78 -125 -16 43 -230 53 -18 -122 11 24 116 260 -361 -313 -52 16 334 -156
4029a56N8M9Nj1j51O7L1N7J90M6k93J20j67q0L31j88o9jJ83L86j70p0J09n13L62
$$ -156 -98 -49 -44 -55 -206 -139 -108 -51 139 185 -108 12 -155 -235 96 -92 -161 -162 21 407 237 167 276 -237 125
4054A25j17k33L25j71j51K7K51J60l12J19jO7j57J76j10l9J39j20j59L81l02K1
$$ 125 8 -225 100 -71 -222 -195 56 216 -96 23 22 89 -68 108 -2 -41 98 -22 -181 200 -102 -81
4076h1k3J76l16M91m88N4J32K09j43j75K78P8r3j24q0P6J11j4J15n30L16n0K83
$$ -81 -104 72 -244 247 -241 -187 -55 154 11 -164 114 192 99 -25 -105 -29 82 68 183 -347 -31 -81 202
4099B02m29M92K12o82K04mn9j45j8K82o2q7L05k58J40j92n0m9J48K79j97J05j68
$$ 202 -227 265 477 -205 -1 -5 -64 -209 -227 55 -7 -94 211 -47 93 -99 -149 -198 -50 229 32 137 -31
4122c1K67k12J10l93K24K07q0N8j47J91J4k12k87L08j16J06P2j45l7K56p4O6k32
$$ -31 236 24 134 -259 -35 172 92 150 3 194 208 -4 -291 17 -99 7 79 -66 -103 153 79 145 -87
4145h7j90k5L81J11j23k24M92l63j53J49l5K34N8l37J88n9j98M98l35n6K92q7
$$ -87 -277 -302 79 190 67 -157 335 -28 -181 -32 -67 167 225 -112 76 17 -181 317 -18 -74 218 131
4167A31K81m84n0L16k18K9j14L07k48R5k09K1n5K79j76K86k05K76j91P2j5l16
$$ 131 412 -72 -122 194 -24 5 -109 198 -50 45 -164 -143 -198 81 -95 191 -14 262 71 143 128 -188
4189a88L21j9J70n20Q2P1K13J43j93P9p7k2J68O7k49j67K87l46Q4o8L01L5k39
$$ -188 133 114 284 -236 -154 -83 130 273 80 159 82 60 228 295 46 -121 166 -180 -96 -164 137 172 -67
4212f7M6J84r8j15j06Q5J31K5j78P0j87N4R1J14J41j32l61L1M13Q6m75P4j23R4
$$ -67 -21 163 65 -50 -156 -71 60 85 -93 -23 -210 -156 -65 49 190 58 -303 -272 141 227 -248 -174 -297 -203
4236b03L18j92J77k81L27j60o0K0J96K48k70k20J56j19J00j1R9k15k46J03L67
$$ -203 115 -77 100 -181 146 -14 -74 -54 142 390 120 -100 56 -63 37 26 125 -90 -336 -233 134
4257A34k32J16pk56m7K04K70j96p8J66P7k85K3J31N0k16N09l89K5n6K13l04O3
$$ 134 -98 18 11 -245 -292 -88 182 -14 -92 74 151 -134 -111 20 70 -146 363 -26 -1 -57 156 -148 -85
4280h5j06j2L58l31Q8k5J83j38R6j07K84m74N80m27j62L14k49J64j08J05qJ83
$$ -85 -191 -203 155 -176 -88 -113 70 -68 28 -79 205 -269 311 -116 -278 36 -213 -49 -157 -52 -60 123
4302A23j89J35o6J2k35J30J15K06j45k6j4R4j94M18q6l37L8q8K03K32o68K78j53
$$ 123 -66 69 3 15 -220 -90 25 231 86 60 46 140 -54 364 278 -59 -21 -109 94 326 -342 -64 -217
4325b17M30j65j19j26j11J65K41nm3K47n53J84k53O07j21k59K8K23j81J86l3j65
$$ -217 213 48 -71 -197 -308 -143 98 93 50 297 -256 -72 -325 282 161 -98 -70 153 -28 158 125 -40
4347d0k76J81P4k65L67J03q0m64K84P9j41j86J11K13M04k43Q4k9j39l4m60P71
$$ -40 -316 -135 -61 -326 41 144 64 -400 -116 -37 -178 -364 -253 -40 364 121 205 176 37 3 -457 314
4369C14k84P4l45L35j19J91j23l00K25K0m2N4k4K25k37J45j30K39k58K43k66J01
$$ 314 30 104 -241 94 -25 166 43 -257 -32 -12 -54 0 -24 201 -36 109 -21 218 -40 203 -63 38
4391C8j31L36P7k31j72L04j16K04m06K44o35N25J13n3j82L1J74k38J72Q8l12J60
$$ 38 -93 243 320 89 -83 221 105 309 -97 147 -488 37 150 97 -85 -54 120 -118 54 142 -170 -10
4413a0j72L15m3J48m28M68k59P1k39j66K13j04K34p2mM6k69L96P3k01JmJ2j52
$$ -10 -182 133 90 238 -190 278 19 90 -149 -315 -102 -206 28 -44 -48 -2 -271 125 198 -3 -2 -6 6 -146
4437a46p7l5J88J22MJ74j20j5P6k45k3P6J06j77K13j09k17K94j1j45j69P0R1r2
$$ -146 -223 -258 -70 52 56 230 110 95 171 -74 -97 -21 85 -92 121 12 -205 89 78 -67 -236 -166 -75 -167
4461a67L10n9M0j70n4K18r3m9M4o2J91j56q6k3nK46j53O6k3K79j26l33J90j18
$$ -167 143 84 124 -46 -100 118 25 -24 20 -42 149 -7 -93 -116 -121 125 -28 38 15 294 168 -165 25 -93
4485i3J3nj41J66K25P2k43K3J8j8R5j07j22Q9K0j67N9L36p9p7K10n38L30j76J85
$$ -93 -80 -85 -226 -60 165 237 -6 17 35 17 112 5 -117 -28 -8 -175 -116 220 141 64 274 -264 66 -110 75
4510G5q4j95K06k6J80j23J06j02k1J8j15J57L05p51O00k38M13o47L33R2p1j13
$$ 75 -9 -204 2 -24 156 33 139 37 16 34 -81 76 381 -370 230 -8 405 -242 91 183 112 -1
4532aL5k21K78k32N5j67L2L51k06J99K16k76J3k30l0J58M4L3k61M46k60J27j17
$$ -1 34 -187 91 -141 -86 -253 -221 130 -76 123 339 63 76 -154 -184 -26 18 51 -210 236 -24 103 -14
4555a4j90K20j4km4K4R4L6j33j7O5o6k85M36j52K37m10L21k03j59K30j90J58K36
$$ -14 -204 16 2 0 -44 -20 74 110 -23 -40 25 -41 -326 110 -42 195 -215 106 -97 -256 -26 -216 -58 178
4579A78k27M3P5K9M2mm56L01P9p0N0l08M29N5k30l18L39j20j06K46O4j01J42l38
$$ 178 -49 -6 69 98 140 136 -320 -19 60 -10 40 -268 161 216 -14 -332 7 -113 -219 27 91 -10 132 -206
4603b06K28j25J61j82L25m76L17Mm98L70K65k19R2j95P3K72k90K07l5l84L45k10
$$ -206 22 -103 58 -124 201 -275 42 46 -452 -82 183 -36 56 -139 -66 206 -84 123 88 -296 49 -161
4625a61J85R4P1k06N6j6K1k07J30J39l85M89j69k28J43K46l37k59Q14k84J22k85
$$ -161 24 118 189 -17 39 23 44 -163 -33 106 -279 210 41 -187 -44 202 -135 -394 420 136 258 -27
4647b7J33j95K08L2k55K00j20J76j86J02L33j20m17K07j91K51p2l2K2K9k76j21
$$ -27 106 -89 119 151 -104 96 -24 152 -34 68 401 281 -136 71 -120 131 59 27 49 78 -198 -319
4669c19M33J6m6lj62k1j09L29j30P8j30o8J13l9J76j74L42l00n7Q4N2O2j67Q3
$$ -319 114 130 84 81 -81 -102 -211 118 -12 66 -64 -132 -19 -58 118 -56 286 -14 -71 13 65 127 -40 43
4693D3J35p5J57k24j19K19j71K6k77K74J32O3j19j34J65J33k73p5l2O0K71k26
$$ 43 178 103 260 36 -83 136 -35 -9 -286 -12 120 183 64 -70 95 228 -45 -120 -152 -92 179 -47
4715d7nJ4K18m32R9J83q9k03R5K92r2R3jj46K16r6j46J71k11M0J2Ok3j47J35J92
$$ -47 -52 -38 180 -252 -153 30 -59 -262 -167 125 33 126 125 -21 195 99 -47 124 -87 -47 -35 -29 -52 -199 -64 128
4741A28l31L91J0k55O9J58j05O4k54L01p3o3Q2Jk92N36l77o6p8L29k68J27O1j97
$$ 128 -203 188 198 -57 12 170 65 129 -125 176 103 40 122 123 -169 367 -10 -76 -154 175 -93 34 95 -102
4765a02j8p0K49o7Op8j82K43J45k90L48l29J62k7K38n15K29L7J84k78N5K45j54
$$ -102 -120 -190 59 -8 -2 -80 -262 -19 126 -164 184 -145 17 -10 228 -287 -58 -21 163 -115 -60 185 31
4788C1oj51J4j5M9j18P9M8L4J47j1o6m9j54L7J3q5k64L90K17l79K13r7Q8nK57
$$ 31 25 -126 -112 -127 -78 -196 -117 -69 -35 112 101 35 -14 -168 -131 -118 -203 -467 -77 140 -239 -26 -123 -35 -40 217
4814B17p4J21j88j01nq5K35j2j53ML00j90k5p5j63J53RJ63k22J32J83o0m3J6l71
$$ 217 143 264 76 -25 -30 -115 120 108 -45 -41 259 69 44 -31 -194 -41 -32 131 -91 41 224 164 121 137 -234
4839b34R2r4NM20K37j34l96L65l69j10j0J04n4r4L26k66L64J01j38J6k67K00M4
$$ -234 -142 -236 -231 189 426 292 -104 261 -108 -218 -228 -124 -178 -272 54 -212 152 253 115 131 -136 64 108
4862A08l03L73k37j6k46M04r4l38M40j59k28K13J2M7J50l5k34J51p3J41j03m5
$$ 108 -195 178 -59 -75 -321 83 -11 -349 91 -68 -296 -83 -71 -24 126 91 -143 8 -65 76 -27 -72
4884g2q7J68p3J06J03k43M59l70p6J03KO5o1l3%L7j03J43K84m39M2k04M16l0M7
$$ -72 -159 9 -64 42 145 -98 361 -9 -85 18 20 85 24 -9 -9 28 -75 68 352 -87 -45 -249 167 137 184
4909A84m65R7M23j38l61R6L3j12J72o4N1j31M75l61m7J77m3K1K56m44J97L0r7
$$ 184 -281 -184 239 101 -260 -164 -131 -243 -71 -135 -84 -215 260 -101 -148 29 -14 7 263 -181 16 46 -51
4932e1K8k35J65N41l10R5l61M2O0l4j7P7L41j16J9l66O8J21ql91K25L32k57k6
$$ -51 -23 -258 -93 448 138 233 -128 -86 -26 -60 -77 0 341 225 244 -122 -54 67 59 -332 -107 225 -32 -58
4956e8L38o8l08O5L32m38J20L09J08k86k71Q1K75j32l35M61l28J74j19J49j05
$$ -58 280 212 -96 -31 301 -137 -17 292 400 114 -157 -76 199 67 -268 193 -135 39 -80 69 -36
4977c6J23l07L24j5j35n4lJ21M5K64j86K2n01K11L61k01m80M89l0l06O2L17j47
$$ -36 87 -220 104 89 -46 -100 -103 18 63 327 141 163 -338 -127 234 33 -447 42 12 -294 -232 85 -62
5000f2J61n0q5J54j83O6K67l31J87n63K96K48J63j79m07K23J09j12k45N59o6j6
$$ -62 99 49 -36 118 -65 1 268 -63 124 -439 -143 105 268 89 -318 -95 14 -98 -343 216 150 134
5022A34k57J02M8nK37J35l74k17K4J97J37j26q8l02J14K34L9L6j34J87j33K67
$$ 134 -123 -21 27 22 259 394 20 -197 -173 24 161 35 -53 -355 -241 -7 32 68 -66 121 -12 255
5044B55N4p10L23J10l92L75k08K38k83Q3P9J37p2J07l66L53j40J8J80l93K99m0
$$ 255 309 -401 -78 32 -360 15 -193 45 -238 -155 -76 61 -11 96 -270 83 -57 -39 141 -252 47 7
5066Gj57K59j11j46K63k23K85N6j85Lr6K07k54J38q3L3j86K53m9j34J32L8j49
$$ 7 -150 109 -2 -148 115 -108 177 233 48 51 -45 162 -92 46 -37 -4 -190 63 14 -120 12 50 -99
5089i9k49L00j81K20Q4K97j77%m42J16J06l20K68K64l85m7K77q1j85M2J17L4L1
$$ -99 -348 -48 -229 -9 75 372 195 195 -247 -131 -25 -345 -77 187 -198 -245 32 -49 -234 -192 -75 -41 -10
5112a0R4j68K9J66j26j47K67k9J10l57J59k2j18M04k61k23K42O1m4L6j32K20j09
$$ -10 84 -84 -55 111 -15 -162 105 76 186 -171 -12 -34 -152 252 -9 -232 10 71 27 63 -69 151 42
5135D2N2j12j12L2L76m60R1N9K85k26k12o5J96J26j31m05N25P0j37N1J0j80K59
$$ 42 94 -18 -130 -98 278 -182 -91 -32 253 27 -185 -250 -54 72 -59 -464 61 131 -6 45 55 -125 134
5158A34k33K70q7p9M9m4J30k02l03J94K53r5J32k43J55m1l5Nr2K92k6N4J54j23
$$ 134 -99 171 84 5 54 10 140 -62 -365 -171 82 -13 119 -124 31 -10 -45 -40 -132 160 134 188 342 219
5182B19o9j32j11J29m2j20J15J3j11J03m5j80L29L2J65n47k3L61j63K91k93Mk03
$$ 219 150 18 -93 36 -6 -126 -11 2 -109 -6 -51 -231 98 130 295 -252 -275 86 -77 214 -79 -75 -278
5205b78M79R2l53K05k0l08K74N2n5j05L0r3Q4J57K17l13K00j40l43P3j67K27Q0
$$ -278 201 293 -60 145 125 -183 91 143 88 -17 13 -80 4 161 378 65 265 125 -218 -145 -312 -85 -5
5228ek86J88J61J95j50k99K77l41K67l5J60l22M76l84q6l5K33k26O5K68l25j37
$$ -5 -291 -103 58 253 103 -196 81 -260 7 -28 132 -190 286 -98 -184 -219 14 -212 -147 121 -204 -341
5250c41R8J50J11o3l4p1L13k36K7M33q5j35k89N6O3j05K68j54J03j33l1j3m1R4
$$ -341 -243 -93 18 -45 -79 -150 163 -73 -46 387 302 167 -122 -66 -3 -108 160 6 109 -24 -55 -68 -109 -15
5274a5J85m88K95kJ05j06j46K57M9l05k90M35j09J76Pk55J11m5Q6L3J59l7Q3j32
$$ -15 170 -318 -23 -25 80 -26 -172 85 134 -171 -461 -26 -135 41 48 -207 -96 -141 -55 -22 137 100 183 51
5298E1p6N1k80J21K11j46p7N7J21k4r6p9L5K86k35j47L50j95J76l12O76j59m16
$$ 51 -25 26 -254 -133 78 -68 -145 -88 33 9 -87 -166 -131 155 -80 -227 123 -72 104 -208 468 309 -107
5321a07M9l7M7j44J69n1N64n07N28m99M1j52k9P6j32RK94J29l41J84m48K39L39
$$ -107 -58 -95 -48 -192 -23 -74 490 -17 511 12 53 -99 -128 -52 -184 -175 119 248 -93 91 -357 -118 221
5344B21k79j67K43r8o1L20j72O0K3j61K19k82K35L53p55N64m07J32R2k02J79L
$$ 221 -58 -225 18 -80 -141 179 7 67 90 -71 148 -134 101 454 -301 263 -144 -12 80 -122 57 60
5366F0k06Q2K28N8k09j03Jo5j6m1J68J36j18j6k09M00k1k58Q4J89k59K35N9k62
$$ 60 -146 -64 164 222 13 -90 -89 -154 -170 -211 -43 93 -25 -41 -250 150 129 -129 -45 144 -115 120 179 -83
5390h3K39J01k44M6M1k31K21k59k5K26J32n61K04O35m43J14k46J90j65m3L77M
$$ -83 156 257 13 59 100 -131 90 -169 -194 32 164 -397 -193 442 -1 113 -133 57 -108 -151 226 230
5412B30j77J30j47J1K70k23j39r8Q6L51p6Jm25L19k79M3L6j52K34j10O9k2N7l17
$$ 230 53 183 36 47 317 94 -45 -143 -57 294 218 219 -206 113 -166 -123 -87 -239 -5 -115 -46 -68 -11 -328
5436c28M49k48lQ1j46J26L46n76K50J08l1J4K4l6J66J74k89q7R3r8m0J13L5j14
$$ -328 121 -127 -130 -49 -195 -69 277 -299 -49 59 28 42 66 30 196 370 81 -6 87 -11 -51 62 97 -17
5460a7K63k58o8L25M5j40j16J67p9p7m8k40J73K9K31m28J82J39o1J39j74K25p7
$$ -17 246 -12 -80 245 290 150 34 201 122 45 -3 -243 -70 -41 190 -238 -56 83 22 161 -13 212 135
5483A35o1p3q7K97l00J1J26q7J15k95L11J48J8j90k65K03j48N1K3R3N0j7j25P8
$$ 135 74 1 -86 211 -89 -78 48 -39 76 -219 92 240 258 68 -197 6 -142 -91 -68 25 75 58 -67 11
5507A1j06%K9J02k4q9q7j00K80k18M91n23L68r9q6k53N4M74j42k73o6J40L27k25
$$ 11 -95 -95 -66 36 12 -77 -164 -264 16 -202 289 -234 134 35 -51 -304 -250 224 82 -191 -257 -117 210 -15
5531a5j06K01%qm5k73K08K73j28j42N7j33JJ63q7k36L11l24K67J37j89K98k47
$$ -15 -121 80 80 72 27 -246 -38 235 107 -35 22 -111 -110 53 -34 -270 41 -283 -16 121 -68 230 -17
5554a7K07j55j60J07J1J10N7p1o1K91k11J69k46j27K48m11K54P4K7l75L35j98
$$ -17 190 35 -125 -18 -7 103 160 89 28 319 108 277 31 -96 152 -259 -5 69 96 -279 56 -142
5576a42J92p6j0J6l3J74K4k8k07Q5J33j63l0J22Rj78q6N1K27n1k3j79R8J35k39
$$ -142 50 -26 -36 -20 -53 121 145 117 -90 -5 128 -35 -65 57 66 -112 -198 -147 80 29 6 -173 -75 60 -179
5601a79Q0M7L01n2k14K06j74J82k10K43l60k21J57K58j16JK04j27q3rk30J66J19
$$ -179 -99 -52 249 197 -17 189 15 197 -13 230 -130 -351 -194 64 -52 -51 153 26 -57 -66 -296 -130 -11
5624a1j48J25r5K80j83P5o0n2J77q4j7mJ53m09K06j06J52M0N2k54J84q9q8l9J47
$$ -11 -159 -34 -129 151 -32 43 -17 -69 108 24 7 3 156 -253 -47 -153 -1 39 91 -163 21 -68 -156 -195 -48
5649d8k18K05Nl3K34n7j17J24k01o7KL52j48k19K86j48lJ91k50m3L89m47O2J77
$$ -48 -266 -61 -56 -89 145 88 -29 95 -106 -173 -171 181 33 -186 100 -48 -51 140 -110 -153 236 -211 -149 28
5673B8j22M8J84k94N8K94k38qk3J04j96L40l71J61K34J6q3J52l46J1P5M2P5j24
$$ 28 -94 -46 138 -156 -98 196 -42 -50 -73 31 -165 175 -196 -35 199 215 132 284 -62 -51 24 66 141 17
5697A7r2R1j3Q2k44O2K78M9k24J3J02j79l11M53j14o4J38m75N63k17m1J87Ro3
$$ 17 -75 16 3 85 -159 -97 181 230 6 19 121 -58 -369 84 -30 -94 44 -431 132 -85 -126 61 70 7
5721Gk07K06J39l80N42m28J34o8M09o99R7J74K23j68r6J65K10j76k3k36K14L51
$$ 7 -200 6 145 -235 307 -121 13 -55 354 -345 -248 -74 149 -19 -115 50 260 84 61 -175 39 390
5743C90p18J94m4P1K0m01P47l86K00R9l33L56n4J71l68L60k76k70J24L23k02l3
$$ 390 -328 -134 -178 -107 -87 -488 259 -127 73 172 -161 195 141 312 -56 304 28 -242 -118 205 3 -30
5765c0m8P2J59k19L2n6K55l5m04K73j37L25j70M7q9j02K88j92K51k33j90J38K9
$$ -30 -78 -6 153 -66 -34 -90 165 130 -274 -1 -138 187 17 64 -25 -127 161 -31 220 -13 -203 -65 -36
5788c6P4j83JJ88l36N13k75QJ76l76M55j97j91M7M16k50j61RK7K55k51P7j42O0
$$ -36 38 -145 -144 44 -292 221 -54 -46 130 -246 209 12 -179 -132 284 34 -127 -118 -91 164 -87 -10 -152 -92
5812i2j7J22lL46k81j23J79q9k43N7O2k10L72j65k3L10l84J12mM9n9J07R9o8J2
$$ -92 -109 13 10 356 75 -48 131 42 -201 -144 -82 -292 80 -85 -108 202 -182 -70 -74 -25 -84 23 122 54 66
5837F6J94L9k59J01m22L40j11k30J64L33j74m22M86k60K31j77L76k45n3q8L56
$$ 66 260 299 40 141 -281 59 -52 -282 -118 215 41 -381 105 -155 76 -101 275 30 -23 -111 245
5858B45j24L5J8l57k87L01J21R8O6n0m43M52j41N0M7J75m35J55K83Q0k93J54k82
$$ 245 121 156 174 -183 -470 -169 -48 50 116 66 -377 75 -66 -16 31 206 -229 -74 209 289 -4 150 -132
5881a32J34K98l30n1j39K34q4n4n1N6N7J9J35k0l23J91K35k62K36k29J43n5p0
$$ -132 2 300 -30 -81 -220 14 -70 -124 -175 -119 -62 -43 92 72 -251 -60 175 -87 149 -80 63 8 -62
5904f2J13j93J19J20j79l6j08L23j40j58K29J53J26m08j61K93O9j85Q5q0%o1J23
$$ -62 51 -142 -23 97 -82 -118 -226 97 -43 -201 28 181 307 -101 -262 31 100 -85 0 -80 -80 -141 -18
5927a8n3R2R3L1l10J15mk46R6L26j06j0r8L01k85p8L71k8j66j78K65j31P1J78
$$ -18 -71 21 114 145 -165 -50 -54 -300 -204 122 16 6 -92 209 -76 -154 217 189 23 -155 110 -21 50 228
5951B28k54jr6Q7J07J02J1k25N9K30k30j57J76R9m3p7j09j24K62L39n03P4L15
$$ 228 -26 -27 -123 -36 71 173 184 -41 18 248 18 -139 37 136 93 16 -93 -217 45 384 -119 -45 270
5974B70n7l05J76rr0m32M59J10j94l15J91J82k55OJ70QJ45k62J23K26l20k1J87
$$ 270 213 -92 84 75 -15 -447 12 122 -72 -387 -196 -14 -269 -263 -93 -85 60 -202 -79 147 -173 -194 -7
5997gR5Jj5QJ47J33k56k23q9k0K39j76K19J25j31J7J49n2N8n06O9K59j7j05J41
$$ -7 88 89 74 82 229 362 106 -117 -206 -226 13 -163 56 181 50 67 216 164 222 -284 -215 44 27 -78 63
6022F3J37q3l2l70K50K9J24ol99L25j33P4RQ1k89Q2K07l15L67J29k41nj13N34
$$ 63 200 117 85 -285 -35 -6 118 112 -287 38 -95 -21 -12 69 -220 -138 69 -246 121 250 9 4 -109 425
6046D25j53k03J00q1N5k12j13J79J14j56J11j8L9r6K30n32L47J19m7j1k39J02
$$ 425 272 69 169 88 143 -69 -182 -3 111 -45 66 48 87 -9 221 -311 36 155 108 97 -142 -40
6068d0K51m56J73J62j45J66j17J9j60K09j45K24K7k94K8J42J08M9k34LR4k5n8
$$ -40 211 -245 -72 90 -55 111 -6 13 -147 62 -83 141 168 -126 -98 44 152 201 -33 -30 64 39 -19
6091a9j73O4L7J95L0l9Q0n5k35j5K60j03l7k32J83N2m4j1J43R1k64P5J96j1O4
$$ -19 -192 -128 -91 104 134 95 175 120 -115 -130 130 27 -10 -242 -59 -7 -51 -62 81 172 -92 -17 179 168 232
6116B32l49L78l71K27J54l19k02L71j83jo2J66j40j9K43J78l88o5J99K3k28K40
$$ 232 -117 261 -110 117 271 -48 -250 121 -62 -63 -125 41 -99 -118 125 303 -85 -150 49 72 -156 84
6138H4K67j64J00m01J51L1Q2m59K43K75O7k23K29j58r2K03l75K11k62K34k4m6
$$ 84 351 187 287 -114 37 68 150 -309 -66 209 276 53 282 124 32 235 -140 71 -191 43 19 -27
6160b7n0r5j78J76J56j09M43m41J07l8k20N81k79j10J04k08K70j45k6P7r2p1q2
$$ -27 -77 -172 -350 -174 -18 -127 316 -125 -18 -56 -276 305 26 -84 20 -188 82 -63 -89 -12 -104 -175 -257
6183b57L04n7k77J09N5L15oM1k06k01M50m79J30j79K78J98k70J17J2r4r6N4J59
$$ -257 47 -10 -287 -178 -123 192 186 227 21 -180 270 -209 -79 -258 20 218 -52 65 77 -17 -113 -59 100
6206A00l1J58m1j52j15K57j01K19l34j63K90L4k94J94k18O7L2n5j15K32K37l96
$$ 100 69 227 186 34 -81 176 75 294 -40 -203 87 121 -173 21 -197 -130 -98 -153 -268 -36 201 -195
6228a95K73j64K3L55k26j50j43M90K14p32K57J02k0P0p5k62L95l03k25J62J26
$$ -195 78 -86 -63 292 66 -84 -227 263 477 -255 2 104 84 154 79 -183 212 -91 -316 -154 -28
6249b8j7l73L51PK0n7K59p1mq6Klj15L24k71j87J62J53j51O2k1J11K7k76L33k41
$$ -28 -45 -418 -67 -60 -40 -97 162 91 87 1 3 0 -115 209 -62 -249 -87 66 -85 -23 -44 67 94 -182 151 -90
6275i0L27j9m50M03r0J20j61L3L5J21o5l27j04K04K54k76J78n6P8R9k38l88O65
$$ -90 237 218 -232 171 81 201 40 73 108 229 164 -163 -267 -63 191 -85 93 37 115 214 -24 -412 253
6298B53k33l7l5l5P4O3j01J83j00k68J64J8l0J84k56M81n60J85N0K90m09J85K0
$$ 253 20 -17 -52 -87 -13 50 -51 132 32 -236 -72 -54 -84 100 -156 325 -235 -50 0 290 -119 66 86
6321H6m8k19N0J14o8J31m38L64J7K34l17P2Q2p6m36O97l36j50K71J23k32N9J9
$$ 86 38 -181 -131 -17 -85 46 -392 -28 -11 223 -94 -22 60 -16 -452 245 -91 -241 30 153 -79 -20 -1
6344aJ05Lj65n5J13j9mQ7l25o2L43R0O7k79M8K0j51L5L41j39k57Q0K97j37j06
$$ -1 104 107 -58 -113 0 -19 -23 64 -261 -323 20 110 177 -102 -54 -34 -185 -150 191 52 -205 -125 172 35 -71
6369g1j13K91R3k28r5r4L04Q1%l8j61J79J58k02p3jM5j07p9L55j17o1O4M3j43
$$ -71 -184 107 200 -28 -123 -217 87 168 168 130 -31 148 306 104 31 30 75 -32 -111 244 127 66 130 173 30
6394C0j03J02J68m13L61N9k50j12n5L85l26M7J11j04J96J04L5k38J68k46o6L3
$$ 30 -73 29 197 -216 145 204 -46 -158 -213 172 -154 -107 4 -100 96 200 235 -3 165 -81 -147 -114
6416a14jL3L03j13k61O3K81N5n34L08R8kq5P6K57l11l1m1N7j43L61J89m68l4K6
$$ -114 -115 -82 221 108 -153 -90 191 246 -288 20 118 116 31 107 364 53 22 -19 38 -105 256 445 -23 -57 -31
6441c1J36k38jJ07k17K62j81j81O50m33Q0K30Q6p5l45K44j74k6q8L06j81j21L30
$$ -31 105 -133 -134 -27 -244 18 -163 -344 306 -127 -47 183 269 194 -151 93 -81 -107 -195 111 -70 -191 139
6464A39Kk07J42j8j95k36O19l8m84J79K94k60K63q7pJ03j84j88J32M9J21j84L
$$ 139 141 -66 76 58 -137 -373 246 208 -276 -97 197 -63 200 113 106 209 25 -163 -31 18 139 -45 -42
6487d2K82m97L1K75l5K87m33K3K9L0j99K62K4j72J72j73K26m34N96k74K44q7k0
$$ -42 240 -257 -226 49 14 301 -132 -109 -80 -50 -249 13 37 -135 37 -136 90 -344 252 -22 222 135 115
6510A15k79M12j82k37K20Q5j11J18j66j08O9k12K26K81l88L74k53R3r1N7K41J33
$$ 115 -164 248 66 -171 49 134 23 141 -25 -133 -64 -276 -50 231 -157 217 -36 57 -34 23 264 397
6532C97l93j68K09M5J32k91K04R9n84J95K17J49q9k19o1K20N3m5n5j52K66Lk43
$$ 397 4 -164 45 90 222 -69 135 234 -350 -155 62 211 122 -97 -158 62 115 70 15 -137 129 132 -111
6555a11J95j54L98m09l0J56O3k7k10L82l89K37K6l6o7M0J54l32J02j23J25J19
$$ -111 84 -70 328 -81 -111 45 108 81 -129 253 -136 101 127 91 24 64 218 -114 -12 -135 -10 109
6577A09j78m7K13M7P2n4k01K28j39j28j37N84k22N9J90j51j17m47M04P4l16k4
$$ 109 -69 -116 97 144 216 162 -39 189 50 -78 -215 369 147 206 396 245 128 -319 85 159 -157 -181
6599a81J81n0p3L27j76k57p5O18k06q6L3p9R9k49L2j2K05r7k13jK01j32j61O83
$$ -181 0 -50 -123 204 28 -229 -304 314 108 22 55 -24 75 -174 -142 -154 51 -46 -259 -260 -59 -191 -352 331
6623C31k99k11K15K28k3m86L07k02K14p0L34P3m52k81J41J52J44j27j11K29r6
$$ 331 32 -179 36 264 241 -245 62 -140 74 4 338 411 -41 -322 -181 -29 115 -12 -123 106 10
6644A0L96n00PQ6RK89n06K59j03mL4k81L92k29R0j62J48k68L41J91k06j2L14m64
$$ 10 406 -94 -87 -1 8 297 -209 50 -53 -57 -23 -304 88 -141 -51 -213 -65 -333 8 199 -7 -19 295 -169
6668a69j82N09m2R9k67j12J01J99m24L73J21l14J00K32k60O5j02k53K96J67m0
$$ -169 -351 158 116 215 -52 -164 -63 136 -288 85 206 -108 -8 224 -36 29 -73 -326 -30 137 97
6689I7k39mN3k34K87p9P7j4K83m00L99k07l15N96k91j05K53Rj77N5j64J63o8j31
$$ 97 -142 -146 -93 -327 -40 -119 -42 -56 227 -173 226 19 -296 300 9 -96 157 166 -11 44 -120 43 -25 -156
6713a56l10M05J56k49K6J82j66J26k56L15j20%R9j98L21l7k74k5N6J11m2%K29
$$ -156 -466 -61 95 -154 -128 54 -112 14 -242 73 -47 -47 52 -146 175 138 -136 -161 -105 6 -36 -36 193
6736A93j75J81j34J50l52J45On1J05N4M6o8l71L59k58k53K12M60j04o6j61J8k5
$$ 193 18 199 65 215 -137 8 14 -37 68 122 168 100 -271 88 -170 -423 -211 249 145 79 -82 -64 -89
6759h9J09j34J36r0k5J31QM1N7k10j1K68l73J92j47l1JJ22q9J44j15L18k20j15
$$ -89 20 -114 22 -68 -93 38 46 87 144 -66 -77 191 -182 10 -137 -168 -167 -45 -134 10 -105 213 -7 -122
6783a22J58R3m47M80J1k60Q3l8J15j09K27j4q6K04j18j62l25K96n3n0m6K67j34
$$ -122 36 129 -318 162 173 -87 -4 -42 73 -36 191 177 91 295 177 15 -310 -14 -67 -117 -163 104 -30
6806c0J72j38k9K34j41j55J60j20Q9J42Ol08o0M10l42L72n59M17L9R8l32L6k01
$$ -30 142 4 -25 209 68 -87 73 -47 42 184 190 -118 -178 232 -110 262 -297 120 159 257 -75 -39 -240
6829b40K98j57L49k55K90l18r6L49m83K66l79J12L61j55r7O9J08K6o2L15m01K14
$$ -240 58 -99 250 -5 285 -33 -129 220 -263 3 -376 -264 97 -58 -155 -86 22 48 -14 301 -100 114
6851A14j54j11Q7L86l62j79L70j06j30J8L1j14K84k77J36J27j07R8L1l82R0N31
$$ 114 -40 -151 -64 322 -40 -219 151 45 -85 -67 -36 -150 134 -143 -7 120 13 111 142 -240 -150 381
6873C81o22K03J88Q7l74J02J06j69j49K21m8J53r1j35K70m7k11K57K0j01j84K62
$$ 381 -241 -38 150 237 -137 -35 71 -98 -247 -26 -74 79 -12 -147 123 76 -135 122 142 41 -143 119
6895A19n41N86j2l04J52J66p9q4pJ38J29l56o3M59j34rk82J52Q2J1J56j32k27
$$ 119 -422 164 152 -152 0 166 87 3 -4 134 263 -93 -156 303 169 160 -122 30 112 123 279 147 -80
6918h0J03J78l36M1J91L93n68k7J09n21M17r8K43q9l6j0p2L31Qj91l43J99N9J97
$$ -80 23 201 -135 -94 97 490 -78 -105 4 -517 -100 -198 45 -44 -80 -90 -162 169 177 -14 -357 -158 -99 98
6942I8k16K36j05K83n48L21J45j41KK4P1J8L3j5k74n6M6K76j41k4j8J18k54j17
$$ 98 -118 118 13 296 -252 69 214 73 75 99 170 188 221 206 -68 -124 -78 198 57 33 15 133 -121 -238
6966b38L25j05l9l6m1L38nk26L7n0J4j06M5l36M51k92K54L30m08M07l80p2J02
$$ -238 87 -18 -57 -93 -134 204 199 -27 10 -40 -26 -132 -87 -423 28 -264 -10 320 -88 319 -61 -133 -31
6989c1O8J2N27p67J70M2J10k45J12j37l4K39J6j25J83l05L66n6k74J01J41j15
$$ -31 37 49 576 -191 -21 21 131 -114 -2 -139 -173 66 82 -43 140 -165 201 145 -129 -28 113 -2
7011bj3K47j37j95Q1O3L42j93Q6o6k48m4L82n72J90M0J71J19k85O6J83l55o7K54
$$ -2 -15 232 95 -100 -19 44 386 193 279 213 -35 -79 303 -269 -79 -39 132 251 -34 32 215 -140 -207 47
7035D7j14RP4j86K39J49L1n51L15J16l83K20o6J54J0oj02j08K52l51J63J58k2
$$ 47 -67 -58 16 -170 69 218 249 -302 13 129 -254 -34 -100 54 64 58 -44 -152 100 -251 -88 70 48
7058D8o3R1k18J26R0l65j8L25J65J29r5l17k5J11r9K78n43N19l93J5J87Q4j51
$$ 48 -15 76 -142 -16 74 -291 -309 16 181 310 215 -102 -127 -16 -115 163 -380 139 -254 -239 -52 32 -119
7081a19L2k31J79J79k74M01j15k15J8L12r9J96jj29j17L55m41J92k21M2J05j1
$$ -119 -87 -318 -139 40 -234 167 52 -163 -145 167 68 264 263 134 17 372 -69 123 -98 -56 49 38
7103C8j86n1L96j99p8Q8M46l92Oj93K81n1j21J51j82n2J80j28K53k21j36K05K03
$$ 38 -148 -199 197 -2 -80 8 454 62 68 -125 156 105 -16 135 -47 -99 81 -47 206 -15 -151 54 257
7126B57j67N9r0l47L10j06J9m35O67n16N11l10K68o3l38M22l82K15L01L6l31J16
$$ 257 90 149 59 -288 22 -84 -65 -500 167 -349 162 -148 120 57 -281 141 -241 -26 275 311 -20 96
7148I6j59r9l1N6J42q2L17l00l5K10j6o6j33n3K15k07K33j32J34J04l5k41L8J67
$$ 96 -63 -162 -193 -137 5 -77 240 -60 -95 115 99 33 -100 -153 62 -145 88 -44 90 194 159 -82 -44 123
7172A23m6J58m80N3J48k73K7N86p3m7j50j95j91M93j42j76K14P9p2l8K92m31J75
$$ 123 77 235 -245 -192 -44 -317 -290 296 223 176 26 -169 -360 133 -9 -185 29 108 36 -2 290 -141 34
7195C4j05n4M66J2l95q9m2q1J57L6J63j79K37k46j18K10k09L10J26j81j26m4M39
$$ 34 -71 -125 341 353 -42 -131 -173 -254 -97 -61 102 -77 160 -86 -204 6 -203 107 233 52 -74 -118 321
7218C21k17j38N8n4o4K35p6L3Q1k62J51l58K30L23k33q6o9m7J07N7K47k52j7m31
$$ 321 104 -34 24 -30 -94 141 65 98 179 -83 68 -290 -60 263 30 -56 -125 -172 -65 -8 239 -13 -30 -461
7242d61M52L32l46j95j3J0L92J04m47K75j46J66J0k31K7K10j60J54l1J78j84j43
$$ -461 -9 323 -23 -218 -231 -221 171 275 -172 103 -43 123 133 -98 -71 139 -21 133 102 280 96 -47
7264d7L34j43k73Q2j17J96J53n9n5K27l08o5K3j99L73K14l93O4k1K57l17J7K63
$$ -47 287 144 -129 -47 -164 32 185 126 71 298 -10 -75 -52 -251 122 336 -57 7 -14 243 -74 -57 206
7287B06p4j39k66M30k95J13N4k4K12l7L3k34l2j50L29o1K3j87p2K19j98K06M6
$$ 206 132 -7 -273 157 -138 -25 29 5 217 180 213 -21 -53 -203 126 65 88 -99 -171 48 -150 56 102
7310A02q2J27l79K45o8p8m6K94j04k3o2J17l65K75J7Jl4k35L82Q7k85j77K98K00
$$ 102 20 147 -232 13 -55 -133 -179 115 11 -12 -74 43 -322 -47 -30 -29 -63 -298 84 171 -114 -291 7 207
7334B07l13K65k58j2J89j91j58R8M32l24J5j14o7l0K14L80l77M8Pm2J8q3K34J09
$$ 207 -106 159 -99 -111 78 -113 -271 -173 259 -65 -50 -164 -231 -261 -47 333 -44 4 11 -31 -13 -96 138 247
7358B47J31l55j56L23p4Ql75J55P6j52M27j53m7J69j69j68J34R6J26J94j75j20
$$ 247 378 23 -133 190 116 124 -251 -96 -20 -172 255 102 55 224 55 -113 21 117 243 437 262 142
7380A42l82M95m84M09Mn37J47K55lJ7J06k38K82l45J00K54l74L40j00J01j04J45
$$ 142 -240 255 -229 180 184 -353 -206 49 46 63 169 -69 213 -132 -32 222 -152 188 88 189 85 230
7402B30j20p6K4j12K44k92p5M4O8j42R5L60m70M13k49Mm7Q5J08j24P2j24L23l53
$$ 230 110 34 58 -54 190 -102 -177 -133 -65 -207 -112 248 -222 191 -58 -54 -101 -16 92 -32 40 -84 239 -114
7426a14M8L01l94l9L94j79J26n49J70Q1L6J35j44J34q3K4o7R5O8j24r2J12R9p7
$$ -114 -66 235 -159 -198 196 17 143 -406 -236 -155 -119 16 -128 6 -77 -53 -120 -25 43 -81 -173 -61 38 -39
7450c9N2k91J45J78K84l40p8q9L94l61R6K29k94j4K19K93m17q7M9O2l1o8J27P3
$$ -39 13 -278 -133 45 329 -11 -89 -178 216 -145 -49 180 -114 -128 91 384 -33 -120 -71 -9 -40 -108 19 92
7474I2l37L14j48J08j56J86j40k49N06l57O1M02j87K01k14J31j16P8l49J95P7
$$ 92 -245 69 -79 29 -127 59 -81 -330 176 -181 -120 282 95 296 82 213 97 175 -174 21 98
7495I8p6j34K39k81M64k44n5K15m23L10L2j43j22j14M79j08k29K02l55P1O2l2
$$ 98 22 -112 127 -154 310 66 11 226 -197 113 145 2 -120 -234 245 137 -92 110 -245 -174 -112 -144
7517a44J73R7k11M65n83k80R98n91J7N17l93j70j12M71K5n39K16M3k25K84k1o9
$$ -144 29 126 -85 380 -203 -483 515 -76 -59 458 65 -105 -217 254 279 -260 -44 -1 -226 58 37 -32
7539c2J7K64j70j01j90N2J87r9K9j8R1o9l9P5J13n9Lj76K94P8q7J54m91j54K81
$$ -32 -15 249 79 -22 -212 -160 27 -72 -43 -61 30 -39 -78 -3 110 51 54 -122 172 250 163 317 -174 -328 -47
7564d7R6nO0o47L21K58L5j52J47K20k20j82R4l84L44J39N0n61L05q8M9K8J4K11
$$ -47 49 44 104 -543 -222 36 71 -81 66 286 66 -116 -22 -406 -62 77 127 -434 -129 -217 -168 -140 -126 85
7588H5OJ8j85L12j89p3j49M42k83J77j71j14J20R7R1k79J70j25l8J58Nl02j09
$$ 85 91 109 -76 236 47 -26 -175 267 -16 161 -10 -124 -4 93 184 -95 75 -50 -88 70 75 -227 -336
7611c36j2K75J84k12j65L27k18j0Q2J13j59Q4P5j05R3k40or5M89m83N70m59R3
$$ -336 -348 -73 111 -101 -266 61 -157 -167 -85 28 -131 -47 28 -77 16 -224 -230 -325 164 -319 251 -208 -115
7634a15N95n73q4L1P5L30l98M04l88J38p4NJ22k88N08k63J08j76N5j01p9L00j59
$$ -115 480 -93 -177 -146 -71 259 -139 265 -123 15 -59 -54 68 -220 288 25 133 -43 12 -89 -168 132 -27
7657b7K67P3m55K51l03K1l2K61k49R2J11l95L07J9j8O9K7kj20l7K01oL0j77j11
$$ -27 240 313 -142 109 -194 -173 -205 56 -193 -101 10 -385 -78 -59 -77 -8 19 17 -103 -140 61 55 85 -92 -203
7682b03j3L16j96N1J54k32K37j10L14l14J22l59N9L67j52l1M2j9k85L13k39K66
$$ -203 -216 100 -96 -45 109 -123 114 4 318 4 126 -233 -174 193 41 10 52 33 -252 61 -178 88
7704H8o2J56j80k77M17j95J61p1j89K5l24O41k84q5J55Q1j99J43L3J61m7J19k18
$$ 88 26 182 2 -275 142 -53 108 37 -152 -127 -451 190 -94 -179 -24 57 -142 1 34 195 148 267 49
7727D9j04J7K5J67O0k89J17J70j36j0j58J10k67J25k6L03L1m03oL13N5j50q6L9
$$ 49 -55 -38 -13 154 214 -75 42 212 76 66 -92 18 -249 -124 -150 153 184 -219 -225 88 143 -7 -93 -54
7751e4l5l5J69j81L53j03j56ql1K22n26L79m21L58L1K03k59q5L98j67k30L69p8
$$ -54 -89 -124 45 -136 217 114 -42 -50 -81 141 -385 -6 -427 -69 -38 165 -94 -179 219 52 -178 191 113
7774A13q8L5R3k46K52K2k46J50J63m6P8l21J88l35j18M28r7J33k57J70k0k5p3
$$ 113 25 60 153 -93 159 181 -65 85 248 202 280 -41 147 -188 -306 122 25 158 -99 71 51 26 -47
7797d7j7L02k39k6K86j79K13j38j39r9m7P4K37j80J02n8o6j47J18K33m8l48K46
$$ -47 -64 238 -1 -27 259 80 293 155 16 -83 -130 -56 181 1 103 45 -21 -168 -50 183 135 -213 33
7820C3j00mL27j69o5K2p1n0J12O2j81R4l46L39M1J37j62q2K25k47o2q2N0J63K26
$$ 33 -67 -71 256 87 22 44 -27 -77 35 97 -84 10 -336 3 44 181 19 -63 162 -85 -147 -229 -179 -16 210
7845B10k66R2k78L30k83L92m52K65K69o34N31J93k53r2P8Lk06R2J49j58q1n4j27
$$ 210 -56 36 -242 88 -195 197 -255 10 279 -355 176 369 116 24 102 105 -101 -9 140 -18 -99 -153 -280
7868b80L39k11N56j66l00M7M77m36r0J09k87L45P2k92O9L00j94M10n69K56j10
$$ -280 59 -152 404 238 -62 -15 462 26 -64 45 -242 103 175 -117 -48 252 58 468 -101 155 45
7889D5LK1J8l48J77P3K82k45K40k75J49n8l99L69j27J17m4k77N87k17J9p1J61
$$ 45 48 69 87 -261 -84 -11 271 26 266 -9 140 82 -317 52 -75 42 -2 -279 308 91 110 39 200
7912B00l83L01j97MJ83M7j50J15M0O1j35j03M3L3j58K13j34J52J12m7J25k81j3
$$ 200 -183 118 -79 -75 108 155 5 120 160 221 86 -17 26 59 -99 114 -20 132 244 197 322 41 28
7935B8K43l22P8J89m4N9j78J74l22L24J72m73R9J26r0j64J02L35j78L4j06o7L39
$$ 28 271 -51 27 216 172 231 53 227 -95 229 401 -72 27 153 63 -101 1 336 158 192 86 19 358
7958C58k44m03L37j82R6j0j83K7K45K76j99k49O3NJ78k28Q3K7j18J83L2R7l26
$$ 358 114 -289 48 -134 -38 -48 -231 -204 41 317 118 -131 -68 -63 115 -113 -30 -3 -121 62 94 191 -135
7981a35l9K78r6j50J47K68m69K78J15l67K68r2N8oo8j00K04k13K39k16K34k31
$$ -135 -174 104 8 -142 5 273 -196 82 197 -170 98 6 64 58 -10 -110 94 -119 120 -96 138 -93
8003i3l50J49J6L69J13k17K47j24k39JJ44r7j5J04o1Q4q8P9R1K96l58l51M29k07
$$ -93 -443 -294 -278 91 204 -13 234 110 -129 -128 16 -81 -96 8 -53 31 -57 22 113 409 51 -300 129 -78
8027g8K25M7k94J40j51L19l73L17m27L58m3N0q8l4k07J59J90K60l08j33J37l50
$$ -78 147 194 -100 40 -111 208 -165 152 -275 83 40 90 2 -32 -239 -80 110 370 62 -71 66 -284
8049b84K95n7K0J16k29m7K22M7l57OK42k05J58K06m09L26k7k21k00O00q2l6j86
$$ -284 11 -46 -26 90 -139 -186 36 83 -274 -268 -26 -231 -73 133 -276 50 23 -198 -398 202 120 84 -102
8072a02J91j25K23j42m3N0j19K88l44K26J9L9j14J62o9k53K11k89K76j82R3q8
$$ -102 89 -36 187 45 2 52 -67 221 -123 103 122 161 47 209 140 -113 98 -191 85 -97 -4 -92
8094i2K64o9j33J81p8j06O2j5k7R4j64k04J75n9n8K87j45J83J1O6K45m02k25L34
$$ -92 172 103 -30 151 73 -33 29 14 -13 81 -83 -287 -112 -171 -229 58 -87 96 107 173 418 16 -209 125
8118A25K0l41k63N04k33J11J57j46M7J11J31m23k8L62j10K26k64n06O25j93N13
$$ 125 145 -196 -459 45 -188 -77 80 -66 -19 92 223 -200 -228 134 24 250 -14 -520 105 -88 425
8139D25l13k32N0K5K92k16j19J92k5m5J74m10L48l44J78LJ41m40K43o1o4M02k9
$$ 425 112 -120 -70 -45 247 31 -88 104 79 34 208 -202 146 -198 -20 -17 124 -316 -73 -134 -198 204 175
8162A75k82K28K0k31K5m5J75J0o7J1Lk5j96K28j3p3L13m33J14J41Ml8N8k58pl1
$$ 175 -107 121 141 -90 -65 -110 65 75 8 19 22 -3 -199 29 16 -57 256 -177 -63 78 82 44 102 -156 -163 -194
8188a94K2N56l14
$$ -194 -172 384 70
8191G0
$$ Imaginary data points
##PAGE= N=2
##DATA TABLE= (X++(I..I)), XYDATA
0@%%%%%%%%%Qj6J6j6J6k4L2l2M0m8N6o6P4q8J00j11J27j48J70j90K14k44K76l08
$$ 0 0 0 0 0 0 0 0 0 0 8 -8 8 -8 8 -16 16 -16 24 -24 32 -34 40 -48 52 -59 68 -80 90 -100 114 -130 146 -162
33a62L42l82M27m75N26n82O46p17P94q79R72j076J194j327J479j652J850k086
$$ -162 180 -202 225 -250 276 -306 340 -377 417 -462 510 -566 628 -699 780 -872 978 -1108
51a108K371k719L158l726M502n632P429j0743J8857p5072j19297J19187R7801
$$ -1108 1263 -1456 1702 -2024 2478 -3154 4275 -6468 12389 -62683 -181980 -62793 35008
64C5008J995n7278l1094J5178M0682l7003o0220L4203Q5071P839l7163l3902k1225
$$ 35008 37003 -20275 -51369 -36191 4491 -32512 -92732 -58529 26542 34381 -2782 -36684 -57909
77e7909K2368N3088r65k6008J0386Q640j7855J940L159o476K3041J9057l3830
$$ -57909 -35541 17547 16582 -9426 960 9600 -8255 -6315 -3156 -9632 13409 32466 -1364
90a364j7301K4875j915j9180J3604J3898o551n917j8944j1351L9519K1359m6512
$$ -1364 -18665 6210 4295 -14885 -1281 12617 6066 149 -18795 -30146 9373 30732 -15780
103a5780k2964M0342J9379k0760j7702o274K2786L5259k2774n0291J7520M6951
$$ -15780 -38744 1598 20977 217 -17485 -23759 -973 34286 11512 -38779 -21259 25692
115B5692m383k4095r081m714J9097K3845k4509k8592K2002J9161j0494n628r914
$$ 25692 21309 -2786 -11867 -16581 2516 26361 1852 -26740 -4738 14423 3929 -1699 -11613
128a1613j2025K8001K5840l1101k7304J6080J6443Q069L332k4556j4155L3862
$$ -11613 -23638 4363 30203 -898 -28202 -12122 4321 12390 15722 -8834 -22989 10873
140A0873J6469k8935j0399J5174O676R774j301l1437m271L7846P076k5278o467
$$ 10873 27342 -1593 -11992 3182 9858 19632 18331 -13106 -17377 20469 27545 2267 -4200
153d200J234L942J8270o436l1333R158L3439q312k2977k373K790J5090J8583k0686
$$ -4200 -2966 976 19246 12810 -18523 -9365 24074 15762 -7215 -9588 -6798 8292 26875 6189
167F189k8261K1513K4177j3791j1248L268J607J3421N178k6975o388K9492L032
$$ 6189 -22072 -559 23618 9827 -1421 1847 3454 16875 22053 -4922 -11310 18182 21214
180B1214k2115K171P567o837q76k281n813J5525N554l2448q734L3492P545k6908
$$ 21214 -901 1270 8837 2000 1124 -1157 -6970 8555 14109 -18339 -27073 6419 13964 -12944
194a2944j0910Q363J7468J2843k6360l2657K7309M5874j3611l8512o213J9336
$$ -12944 -23854 -15491 1977 14820 -11540 -44197 -16888 28986 15375 -23137 -29350 -10014
206a0014K8916Q973l7941k6371L8283L5367k0198l0656n775J9810L4062j711n0283
$$ -10014 18902 27875 -10066 -36437 1846 37213 17015 -13641 -19416 394 34456 32745 -17538
219a7538j5699M6026K4380k6725k5792j478K0719K2892j9074l6495J3355L5388
$$ -17538 -33237 12789 37169 10444 -15348 -16826 3893 26785 7711 -28784 -15429 19959
231A9959r200k4155L19O457N316N190j1701o745J5867q15j8807R135J7464j1714
$$ 19959 10759 -13396 -13077 -6620 -1304 3886 -7815 -14560 1307 492 -18315 -9180 8284 -3430
245c430j0214P436K728K476L382j3767m910K3235N383k0657n089Q803M657R921
$$ -3430 -13644 -6208 -3480 -1004 2378 -11389 -16299 6936 12319 -8338 -13427 -4624 33 9954
259I954m54k3232j527K6472N137j7215p495J922J1853J6728j3952k9079J1890
$$ 9954 9500 -13732 -15259 11213 16350 -865 -8360 -6438 5415 22143 8191 -20888 -8998
272h998L1089l885k0531o699L433J4543J0810j9289j6855J6976J2426j0685m559
$$ -8998 22091 18206 -2325 -9024 -5591 8952 19762 473 -16382 594 13020 2335 -2224
285b224m10o582Q689J2344j1695j2042N505L338M213P469j3279j4421J7530J6080
$$ -2224 -2634 -9216 -527 11817 122 -11920 -6415 -3077 1136 8605 -4674 -19095 -1565 14515
299A4515j4517j1735O258O547Q220r70j9149j120K4381K784j8860j223P780K289
$$ 14515 -2 -11737 -5479 1068 9288 8318 -10831 -11951 12430 15214 -3646 -4869 2911 5200
313E200M786l873j2546O745J5105q172j1147N776J245L83O891o802j1291R672
$$ 5200 9986 6113 -6433 312 15417 7245 -3902 1874 3119 3502 10393 3591 -7700 1972
327A972Q370j0262k892N568k947N00M053p939j694J0785m557j0853R287Q156j1119
$$ 1972 10342 80 -2812 2756 -191 309 4362 -3577 -5271 5514 957 -9896 -609 7547 -3572
342c572n426M671M101O807l650j8930K222K6483P45k4670o114J4991J3561J001
$$ -3572 -8998 -4327 -226 6581 2931 -15999 -13777 12706 13451 -11219 -17333 -2342 11219 12220
356A2220j9790j5925K2411K5849j6315k5600M228J8153J0008n190k1093n316K5109
$$ 12220 -7570 -23495 -1084 24765 8450 -17150 -12922 5231 15239 10049 -11044 -16360 8749
369H749J2480k0383j3211P822R875O796m550j8361m51K1339L047j5732m639M700
$$ 8749 21229 846 -12365 -4543 5332 12128 7578 -10783 -11234 10105 13152 -2580 -7219 -2519
383b519L962O392n103j3040N625J3164p217p854O025R94l960L739j42k209M458
$$ -2519 1443 7835 2732 -10308 -4683 8481 1264 -6590 -565 429 -3531 208 66 -2143 2315
398B315l723q205R951J1681j3271j0725R472Q985K43n625j1588K485K0460J136
$$ 2315 -1408 -9613 338 12019 -1252 -11977 -2505 6480 6723 1098 -10490 -8005 12455 13591
412A3591k1472m126J4525O827j763p759j0384O991J6379l937j4640O30N779K993
$$ 13591 -7881 -12007 2518 9345 7582 -177 -10561 -3570 12809 8872 -5768 -5138 641 3634
426C634M934n729j2730N385J3881k772q970j508p61N503Q472p722j1944O969Q984
$$ 3634 8568 2839 -9891 -4506 9375 6603 -2367 -3875 -4636 867 9339 1617 -10327 -3358 5626
441E626m030k132p93n250M923Q623o219o991L431J764J654M579n755r831Q980
$$ 5626 1596 -536 -1329 -6579 -1656 6967 748 -6243 -2812 -1048 606 5185 -570 -10401 -1421
456a421J0443o974p746J878L403N829L55j2099k676J4760L732j2904k653O414
$$ -1421 9022 2048 -5698 -3820 -417 5412 5767 -6332 -9008 5752 9484 -3420 -6073 341
470C41K186J452l144p289N114Q866o851o879O844J626m661K537Q10l728K894O13
$$ 341 2527 3979 835 -6454 -1340 7526 675 -6204 640 2266 -2395 142 952 -2776 118 731
486G31n184L498N480p027m806P467J840l042K80l268j707Q993K917j1845k674
$$ 731 -4453 -955 4525 -2502 -7308 159 1999 -1043 -763 -4031 -5738 3255 6172 -5673 -8347
501h347Q464L341k42m225q615M368J5374k791j6242j017J2162N761k981j0830
$$ -8347 117 3458 3216 -1009 -9624 -5256 10118 7327 -8915 -9932 2230 7991 5010 -5820
515e820o156J4249J2983j3583j4448Q201J1907N70o192q757J127J4115K200j3906
$$ -5820 -11976 2273 15256 1673 -12775 -4574 7333 7903 1711 -7046 -5919 8196 10396 -3510
529c510l015R694K323k211p73m054J25P025o52o046K337J109m028L263L401n527
$$ -3510 -6525 3169 5492 3281 2508 -1546 -1421 5604 4952 -1094 1243 2352 -1676 1587 4988 -539
545e39k660M437j195j2L379n175n306O826N064m825k794j269m51Q383L937j1926
$$ -539 -3199 1238 43 31 3410 -1765 -7071 -245 4819 -6 -2800 -4069 -4520 3863 7800 -4126
561d126o171J0287P977m121o194m963M555J3252j521j5899j161J2381L466m798
$$ -4126 -10297 -10 7967 3846 -2348 -7311 -2756 10496 8975 -6924 -8085 4296 7762 2964
575B964n257l425N203Q377m832r068L552M440k029J421K74n856L84O335p86k197
$$ 2964 -2293 -5718 -515 7862 3030 -6038 -2486 1954 -75 1346 1620 -4236 -3852 2483 1697 -500
591e00r4l293J273P935j010r441R43P106M06n67k918m769M522P876m404p666K440
$$ -500 -594 -3887 -2614 5321 4311 -5130 -4187 2919 3325 2758 -160 -4929 -407 7469 3065 -4601 -2161
608b161M074k42J645m578n286N869O572n751n716K195J887K628L15o588l132R109
$$ -2161 1913 1671 3316 -1262 -6548 -679 5893 142 -5574 -3379 -1492 1136 1451 -5137 -8269 840
624H40L037p856j877L518J337R99n23m497J965N396l244l680N120Q01m929J537
$$ 840 3877 -3979 -5856 -2338 -1001 -2 -525 -5022 -3057 2339 -905 -4585 535 1336 -3593 -2056
640b056L302j278j45j204k949N712M638p281n547P268M976l687k984j678J513
$$ -2056 1246 -32 -177 -1381 -4330 1382 6020 -1261 -6808 460 5436 1749 -1235 -2913 -1400
655a400P578m06r872p3Q790J639m128k724j335L116O802l445r554K479P199k55
$$ -1400 6178 5772 -4100 -4173 4617 6256 2128 -596 -1931 1185 7987 4542 -5012 -2533 4666 4411
671D411l586l464k513O238N282p478p332N200N662k161l377k754L66O175Q97p381
$$ 4411 825 -2639 -5152 1086 6368 -1110 -8442 -3242 2420 259 -3118 -5872 -5506 669 1566 -5815
687e815j47O210k59k254J987L21j656K629K66rK715r92m969L663P204l455o079
$$ -5815 -5962 248 -11 -2265 -278 43 -1613 1016 1282 1273 3988 2996 -1973 1690 8894 5439 -640
704f40J445L139L093P0p173l679Q325M665o570n405J657K735L247p73p840k049
$$ -640 805 3944 7037 7107 -66 -3745 4580 9245 2675 -2730 -1073 1662 4909 4136 -3704 -5753
720e753P902K552n162k346r09J800N394l52q454M8P005O48l187o12j158J379M757
$$ -5753 2149 4701 -461 -2807 -3716 -1916 3478 3126 -5328 -5280 1725 2373 -814 -1426 -2584 -1205 3552
737C552k630m215K112K360k430J252J997l901j198L566R40n51o77l477N09O957
$$ 3552 922 -3293 -1181 1179 -1251 1 1998 -1903 -3101 465 1405 854 177 -3300 -2791 4166
753D166J53q345p14O658K102j953l263l194N032O185m690p178K874M950j1j489
$$ 4166 4319 -4026 -4740 1918 4020 2067 -1196 -4390 642 6827 2137 -5041 -2167 2783 2772 1283
769A283l265k108M780L289m929l143K626J184l12J138k867k595M348J428k880
$$ 1283 -1982 -4090 690 3979 -950 -4093 -1467 -283 -595 543 -2324 -4919 -571 857 -2023
784b023m20J131r73J265K161k686j155L213o85r72K822m60l667J821L443r25j570
$$ -2023 -2443 -1312 -2285 -1020 1141 -1545 -2700 513 -172 -1144 1678 1218 -2449 -628 2815 1890 320
801C20j059o73L319K972n319m534N283M458l613l300p47K073M759j752o892N32
$$ 320 -739 -1412 1907 4879 -440 -4974 309 4767 1154 -2146 -2893 -820 3939 2187 -4705 -4173
817d173P340J8m880q35J466K173K360k989l876L458L981k615j939J049l88R71
$$ -4173 3167 3185 -1695 -2530 -1064 1109 3469 480 -3396 62 4043 1428 -511 538 150 1121
833A121K774k998k231K258J464j589O44n26k072J973J935k714j036K044j347r47
$$ 1121 3895 897 -1334 924 2388 799 1443 917 -1155 818 2753 39 -997 1047 -300 -1247
849a247L115o96l403Q22J632L34J131j459m208L262N611k798n815J445L625J896
$$ -1247 1868 1172 -2231 -1409 223 557 1688 229 -3979 -717 4894 2096 -3719 -2274 1351 3247
865C247p71n240j596O837L147n980l754L429K784M57j701l535N17M855L32m519
$$ 3247 2476 -2764 -4360 2477 5624 -356 -4110 -681 2103 2560 859 -2676 -2159 2696 3028 -1491
881a491K15J253k55J685N08l250n48K974j27q17P66j728j037L767J88l204k22
$$ -1491 -1276 -23 -278 1407 1915 -1335 -1883 1091 964 147 913 -815 -1852 1915 2103 -1101 -1323
898a323J668j054J875Q02l849j200L925N88j649j488j331J003M766m26o480n78
$$ -1323 345 -709 1166 1968 -1881 -3081 844 1432 -217 -1705 -3036 -2033 2733 2307 -4173 -4751
914d751N455J682k153k867j425L630M665l686n654K884M348m57j993j284p31L209
$$ -4751 704 2386 233 -2634 -4059 -429 4236 550 -5104 -2220 2128 1671 -322 -1606 -2337 872
930H72J898l222j543K737m1r07J481l26k054N68J835j056P74o78k196J304L145
$$ 872 2770 -452 -1995 742 701 -206 1275 949 -1105 -537 1298 242 1016 338 -1858 -554 2591
947B591j545k889J072J084O5J024j658k505K142L361k342j893K02N95J831J293
$$ 2591 1046 -1843 -771 313 378 1402 -256 -2761 -619 2742 400 -1493 -1291 -696 1135 2428
963B428l787k008M020K467l217k195O32J394K499q01m524N85M985k55l790J83
$$ 2428 -1359 -3367 653 3120 -97 -2292 -1660 -266 2233 1432 -3092 -2507 2478 2223 -1567 -1384
979a384J228P39R34j852j866K519K008k675n45J841l90q96J369k70j115P56o1
$$ -1384 -156 583 1517 -335 -2201 318 2326 -349 -894 947 557 -339 1030 760 -355 401 340
996C40j060K525J78l734N04K974m49j203m93n84P87K689j369l655J657K326q81
$$ 340 -720 1805 1983 -1751 -1247 1727 1278 75 -418 -1002 -215 2474 1105 -2550 -893 1433 552
1013E52l98r43j673K567L256k870l754J958K321K36j011k270n28M023J521m023
$$ 552 154 -789 -2462 105 3361 491 -3263 -1305 1016 1252 241 -2029 -2557 1466 2987 -1036
1029a036j814K999J531r53p27j664R58K683o56k924J131J637j532J73J590j426
$$ -1036 -2850 149 1680 727 0 -1664 -706 1977 1321 -1603 -472 1165 -367 -194 1396 -30
1045c0q78Q33RO93P72k161j846L542J897l173j989J613J265J268n91l853Q7L931
$$ -30 -908 -75 -66 627 1399 -762 -2608 934 2831 -342 -2331 -718 547 1815 1224 -2629 -2542 1389
1063A389R33k872j093L65J074K349r93l799K95L880O10k139j165p31K172K435
$$ 1389 2322 -550 -1643 -1278 -204 2145 1152 -2647 -2352 1528 2138 -1 -1166 -1897 275 2710
1079B710k005l318J901K578j058p12l60m44J315Q32j690m68J748p79j255J962
$$ 2710 705 -2613 -712 1866 808 96 -264 -708 607 1439 -251 -719 1029 250 -1005 957
1095I57P21k329k50J450J45O78r47k475R50L546j136l492O94K159J86L7j936j531
$$ 957 1678 -651 -901 549 694 1372 425 -2050 -1100 2446 1310 -2182 -1488 671 857 894 -1042 -2573
1113b573K701K134k609k116J848J254l2j24j978l72K815P32k351o78R28M87O75
$$ -2573 128 2262 -347 -2463 -615 639 607 483 -1495 -1867 948 1680 -671 -1349 -421 66 741
1130G41l55j821mL200l52k301L79R74m41M34K37j413J341R18j704l31K091r61
$$ 741 386 -1435 -1439 1761 1409 -892 -513 461 20 454 691 -722 619 1537 -167 -498 1593 632
1148F32j946J581J134r97n66j89n04K226M41l146p55K967L99j742n99m20J475
$$ 632 -1314 267 1401 404 -162 -351 -855 1371 1812 -1334 -2089 878 1277 -465 -1064 -1484 -9
1165iJ540j144l342J610K687j174j258r2j64J443J112j946j406J768J544j239
$$ -9 1531 387 -2955 -1345 1342 168 -1090 -1182 -1346 97 1209 -737 -2143 -375 1169 -70
1181g0m12n07k27J792J014j995q38J799K61q34M79o27m78J756N5j626O04M52j308
$$ -70 -482 -989 -1216 576 1590 -405 -1243 556 817 -17 462 -165 -643 1113 1168 -458 146 598 -710
1200g10R97J124r27j291L26O33O17J01j830j349L057J883k427k101J235J069J347
$$ -710 287 1411 484 -807 -481 152 769 870 -960 -2309 748 2631 204 -1897 -662 407 1754
1217A754j249k694N91L188L82k492q30J292P08O82q35j579N69J932o20j593Q09
$$ 1754 505 -2189 -1598 1590 1972 -520 -1350 -58 650 1332 497 -1082 -513 1419 799 -794 15
1234A5j23K19Q55k09j557K65J432o45k71N62j548M56J546j79j276R28p67j73J760
$$ 15 -108 111 966 757 -800 -535 897 252 -19 543 -1005 -549 997 818 -458 470 -297 -470 1290
1253A290l60j866j7J513K61r8q91j159J151K271j197k954Q63K538k06o57j642
$$ 1290 930 -936 -953 560 821 723 -168 -1327 -176 2095 898 -2056 -1193 1345 1139 482 -1160
1270a160j89K416J081k387j876K202J047p08j94q98q0J832K2j551j70J301q04
$$ -1160 -1349 1067 2148 -239 -2115 87 1134 426 232 -666 -746 1086 1108 -443 -613 688 -116
1287a16Q4P49p90p26J152o6p39O98l79p10J050N89j355r2N33m56L13J067j137
$$ -116 -32 717 -73 -799 353 287 -452 246 -133 -843 207 796 -559 -651 -118 -574 -261 806 -331
1306c31j224J305J294j085m04k34L76J268M8k111k88K549M93j638o29K38Q45J133
$$ -331 -1555 -250 1044 -41 -445 -679 -303 965 1013 -1098 -1386 1163 1656 18 -611 -373 472 1605
1324A605j206k128J539K143j609j123J44M51O19L72j419m47J176Q45j728K20O15
$$ 1605 399 -1729 -190 1953 344 -779 -635 -184 435 807 -612 -1059 117 962 -766 -546 69
1341F9o08n6J095p90k82O96l97K2J026q13j263J006Q13l12l07J52r39P98J218
$$ 69 -539 -595 500 -290 -572 124 -273 -251 775 -38 -1301 -295 518 206 -101 51 -888 -90 1128
1360A128j162j099R81N06M6M97j553q20K194J210j938j301R39J075N88o09j994
$$ 1128 -34 -1133 -152 354 400 897 -656 -1476 718 1928 -10 -1311 -372 703 1291 682 -1312
1377a312L90K357j38k014j59J540l1j75j56r98O31J172j144m17R00m07o47P00
$$ -1312 -922 1435 1297 -717 -876 664 633 458 302 -696 -65 1107 -37 -454 446 39 -608 92
1395I2M47p84k77L60J13K25J31j222k96K090J38j589j50J88N90Q92n09j560N94
$$ 92 539 -245 -522 -162 -49 176 307 -915 -1211 879 1017 -572 -722 -534 56 948 439 -1121 -527
1414e27J619k26o85l03p15J408R29j041j869J080J416j22q38r04n8J248J043j626
$$ -527 1092 866 181 -122 -837 571 1500 459 -1410 -330 1086 964 126 -778 -836 412 1455 -171
1432a71j145J360O82m98n16m5j05N93J8o53K86R06j232J94O02L6q83M10O4L61
$$ -171 -1316 44 726 228 -288 -333 -438 155 173 -480 -194 712 -520 -326 276 312 -571 -161 -97 264
1452B64K04m47j231J002J494j401p32N76L51N2K98j150l18J585O4p87n24L30K82
$$ 264 468 21 -1210 -208 1286 -115 -847 -271 80 132 430 -720 -1038 547 611 -176 -700 -370 -88
1471h8N98N9j866K88J888k36j183L25K24L22L34o70p01O52J218p80q57M76L00
$$ -88 510 569 -1297 -1009 879 643 -540 -215 9 331 665 -5 -706 -54 1164 384 -473 3 303
1490C03J78j50k99m59J084k62q38N37M80r79k20P80L0l12K84n50Q2R64n08j013
$$ 303 481 331 32 -427 657 395 -443 94 574 -405 -625 155 185 -127 157 -393 -311 653 145 -868
1510h68M70R65k52m94k56k30Q44R16j352q82J497L44m33o43K3k5P47K76j194j27
$$ -868 -398 567 315 -179 -435 -665 179 1095 -257 -1139 358 702 269 -374 -351 -376 371 647 -547 -674
1530f74N94L17J31k53m79j72J410k53j245J80R66j49Jk83m30K77P97q11j53M66
$$ -674 -80 237 368 115 -364 -536 874 621 -624 -444 522 373 374 91 -339 -62 735 -76 -229 237
1550B37K18p63M86O73j176k12L98J12N08J41j313k00J535L98j635j74N31L27Q79
$$ 237 455 -308 178 851 -325 -537 -139 -27 481 622 -691 -891 644 1042 -593 -767 -236 91 970
1569I70r72j279O78J574m88r15J64k8M20R02p74j327J168L97k98o55K05k81K65
$$ 970 -2 -1281 -603 971 483 -432 -268 -296 124 1026 252 -1075 93 490 192 -463 -258 -539 -274
1588b74J074q83q37P02K95m27M24J20m17K60j74q0K41J56m92k32R18J1q04n2P03
$$ -274 800 -83 -920 -218 77 -350 74 194 -223 37 -137 -217 24 180 -312 -544 374 385 -419 -471 232
1609B32J93m39k86p23J003J067j244p13O59R83l41r0q90L52Q17L24j525K8O53
$$ 232 425 -14 -300 -1023 -20 1047 -197 -910 -251 732 391 301 -589 -237 580 904 -621 -593 60
1628F0K0K97n8p41J06P11j30m91L62q8l56N67j15n01J2R80p67k32O73j65m10N26
$$ 60 80 377 319 -422 -316 395 265 -226 136 48 -308 259 144 -357 -345 635 -132 -364 309 144 -266 260
1650B60l7n69L32j41L0K30K31o55k32O96K93m09j31m40K86R59m06j218L67J355
$$ 260 223 -346 -14 -155 -125 105 336 -319 -551 145 438 29 -102 -542 -256 703 297 -921 -554 801
1670H01k86p79m11K90Q68L53j390J80L84N88q07n0J71Q8J20J96p37J04Q37k41
$$ 801 515 -264 -675 -385 483 836 -554 -374 10 598 -209 -259 -88 0 120 316 -421 -317 520 279
1690B79m36L46j56j83K46K71m96l40N25k80J52K47k78k30M51M4m86K41J29m26
$$ 279 -157 189 33 -150 96 367 -129 -469 56 -224 -72 175 -103 -333 118 162 -324 -83 46 -380
1710c80P03K08m91q26O72J09O34m55p01j43J381R4r03o28L57P29J88p67p32L37
$$ -380 323 531 40 -786 -114 -5 629 174 -527 -670 711 805 -98 -726 -369 360 548 -219 -951 -614
1730f14J502n98o86K06K78L6m7q7m87N47K3k46p1L45j95l0J6L23j90j36k18J79
$$ -614 888 290 -396 -190 88 124 77 -10 -497 50 73 -173 -244 101 -94 -124 -108 215 25 -111 -329 -150
1752a50M70n1q02M41P67j90m54p7j83j9R93n87p41L13P78j01m09k61lN82N97r65
$$ -150 320 269 -533 -92 675 485 31 -46 -229 -248 745 158 -583 -270 508 407 -2 -263 -266 316 913 -52
1774e2j140J238L96k31j48o69K13J121k36q31j93Q46p3m0m22K23n8K2J62m05J62
$$ -52 -1192 46 442 211 63 -606 -393 728 492 -339 -532 314 241 201 -221 2 -56 -34 128 -277 -115
1795a15L73o86M00Ok74LL03Q0K55n0m59j20K18P82r48L3L08l34M18J6q88L17Q24
$$ -115 258 -428 -28 -22 -296 -293 10 90 345 295 -164 -284 -66 716 -232 -199 109 -225 193 209 -679 -362 462
1818D62P2m93j54K8Q5M48l62m79M66M49m24k55j94K66L76J37p17l25P96L24n91
$$ 462 534 41 -113 -85 0 448 86 -393 73 522 98 -157 -351 -85 291 428 -289 -614 182 506 -85
1839h5j79J45j08L06m2k07J0P05n36n39M14J4k56J07M96j49j38j46k13O49L6l99
$$ -85 -264 -119 -227 79 37 -170 -160 545 9 -530 -116 -102 -358 -251 245 96 -42 -188 -401 248 284 -115
1861a15n26K22Q91k33j26m5k71M87L28q86k25Q40M6j67k28l23o7P42Q4q28P3L1
$$ -115 -641 -419 472 239 113 68 -203 284 612 -274 -499 341 387 220 -8 -331 -398 344 428 -400 -327 -296
1883b96K53O21k84r25O35N38p81l59N30L34j57n9j65J11P6j8m73M39L32k22o30
$$ -296 -43 578 294 -631 4 542 -239 -598 -68 266 109 50 -115 -4 72 54 -419 20 352 130 -500
1904e00O06J39j90j19J21J48J85k23o89M12P23j03m46m52L67J67L52n60k68L17
$$ -500 106 245 55 -64 57 205 390 167 -522 -110 613 510 64 -388 -21 146 498 -62 -330 -13
1924a3P30m82l77j9L5L20K21l19o13N46M27k80n4l39K29M34j65n74J4L03j70l1
$$ -13 717 235 -142 -161 -126 194 415 96 -517 29 456 176 122 -217 12 446 281 -293 -279 24 -146 -177
1946a77N48l57l62J84N7J69K73j39n97L06Q18n16o73K13K28K70j72n83NQ22L33
$$ -177 371 14 -348 -164 -107 62 335 196 -401 -95 723 207 -466 -253 -25 245 73 -510 -505 317 650
1967F50j015L5J10M11K9j63l48K26P16m96o03J38O45m99O3q1O4r9N10j03m27N38
$$ 650 -365 -330 -220 191 220 57 -291 -65 651 155 -448 -310 335 -164 -101 -182 -118 -217 293 190 -237 301
1989C01n95L94P7k57j76M60P7k29l55O24k05j65L66n13O8M19l17k20N68M7n58
$$ 301 -294 100 177 -80 -256 204 281 52 -303 321 116 -49 317 -196 -128 291 -26 -246 322 369 -189
2010a89K37M03m37J4j86j04K0P94n94m74N57K47k70jo9p8M25j05n42j17P48j43
$$ -189 48 451 14 28 -158 -262 -242 552 -42 -516 41 288 18 17 -52 -130 295 190 -352 -469 279 136
2032A36k74J04j8p3N47k23o92L25P72n93O7J22l21R7N8J24n48M42p0j63J88L03
$$ 136 -138 -34 -52 -125 422 199 -493 -168 604 11 78 200 -121 -24 34 158 -390 52 -18 -181 7 310
2054C10o48K42M29l06m5M0O5l26L39J41l27j33J62J56K39o75K0l12J092l96m76
$$ 310 -338 -96 333 27 -18 22 87 -239 100 241 -86 -219 -57 99 338 -337 -317 -629 463 67 -409
2075d09K1O4O60k11j90p15R56L05l35o32L90K87n3m8n8l98J30K75j39l1M22o33
$$ -409 -388 -324 336 125 -65 -780 176 481 146 -486 -96 191 138 90 32 -366 -236 39 -100 -131 291 -342
2097c42K50K58l42p1L93q4j66L68m95K09k9J74l7j94L06l57j53P52o12j03K60
$$ -342 -92 166 -176 -247 146 62 -104 264 -231 -22 -51 123 86 -108 198 -159 -312 440 -172 -275 -15
2118a5Q9Q4k3k60J1M41J06p60K36J16R5K8j83J41k9j0m09j68M05M27j73m48L02
$$ -15 74 158 135 -125 -114 327 433 -327 -91 25 120 148 -35 106 77 67 -342 -510 -105 322 149 -299 3
2141Cl79J72N03l96o1K44k84J34K67j14l03L5L64l50K08K08n79J43J44J97j5j62
$$ 3 -376 -204 299 -97 -158 86 -198 -64 203 89 -214 -179 185 -165 43 251 -328 -185 -41 156 141 -21
2163b1n4K85J05k20m66K86N88m72l01J87j39L62O9k17m62O15M13l89l88J70P7
$$ -21 -75 210 315 95 -371 -85 503 31 -270 -83 -222 140 209 -8 -470 145 558 169 -219 -49 28
2184B8J24q9o20J70N41L91n11j49J9M45k80J21m00L16K22p60K10L42j03l82L84
$$ 28 152 63 -557 -387 154 545 34 -115 -96 349 69 190 -210 106 328 -432 -222 120 17 -365 19
2205A9L42k85m7j91j81M31K90l46o7J55J6j04O1l40p5O85j56k69j36q0L60K44
$$ 19 361 76 29 -162 -343 88 378 32 -35 120 136 32 93 -247 -322 363 207 -62 -198 -278 82 326
2227C26l5n47k77O10L36p72L50m0L79Om79l99M63N18n58o0K83k41K98J26k07J29
$$ 326 291 -256 -533 77 413 -359 -9 -49 330 336 -143 -542 -79 439 -119 -179 104 -137 161 287 80 209
2249B09l59N14k64LJ76m93L49j85J44k30J21k7K20L78p60j12M24L47l51m37K17
$$ 209 -150 364 100 103 279 -214 135 -50 94 -136 -15 -42 178 556 -204 -316 108 455 104 -333 -116
2270a16J25K5R7J16p13N97j33Lj01k78K31L33J50m87j26L93l2l6m10J40K38L21
$$ -116 9 34 131 247 -466 131 -2 1 -100 -378 -147 186 336 -151 -277 116 84 48 -362 -222 16 337
2292C37k92p7N1R4r4J6O2R6j66j46J18k36O10o49R7L45J90n71j09P6Q4O81k79
$$ 337 45 -32 19 113 19 35 97 193 27 -119 -1 -237 373 -276 -179 166 356 -215 -324 -248 -164 517 238
2315B38m08j2K28J5k45j26K23J16K65m20k72N76J48m64j40O7L00k63L49m58M5
$$ 238 -170 -182 46 61 -184 -310 -87 29 294 -126 -398 178 326 -138 -278 -211 89 -174 175 -283 -238
2336b38L65K55l01n29M12J57K5l4l43K50O3r6J5j07Q8j44L70l27j96M93r6j34
$$ -238 127 382 81 -448 -36 121 146 112 -231 19 82 -14 1 -106 -18 -162 208 -119 -315 178 82 -52
2358e2k06M45j73l8jJ24L9%j7o74Q42J51l07K8k55Q5J75n8j44Q3K06j33l27K55
$$ -52 -258 187 14 -24 -25 99 138 138 121 -553 289 440 133 161 -94 -9 166 108 -36 47 253 120 -207 48
2382D8J45L7m36o5rJ28M37l92j46Q6R2K45j66K08k28j12K42j13L37m19J08j52
$$ 48 193 230 -206 -271 -280 -152 285 -107 -253 -167 -75 170 4 212 -16 -128 114 1 338 -81 27 -125
2404a25K08J1k22o5P01m89N9J58j23l89N47m72N1M36l26K5J95j43j98k0M24k5
$$ -125 83 94 -128 -193 508 19 78 236 113 -276 271 -201 -150 286 -40 -15 180 37 -161 -181 243 218
2426B18k79k25J37M33k94j59n3o0L72l30J74K77k52J39R2k35J50J17j92k49M16
$$ 218 -61 -286 -149 284 -10 -169 -222 -282 90 -240 -66 211 -41 98 190 -45 105 222 30 -219 197
2447A97l77N9J25N2K34M3l53mN0K98j48l77M65o0l85M30k96p3N37l51j78k89L76
$$ 197 -180 -121 4 56 290 333 -20 -24 26 324 176 -201 264 204 -181 249 -47 -120 417 66 -112 -401 -25
2470b5J46m03L03l77J40K56K74k69k7o1J16q3m3k12N12J68k34m16L20J47k28j14
$$ -25 121 -282 21 -356 -216 40 314 45 18 -43 73 -10 -53 -265 247 415 181 -235 85 232 4 -110
2492a10j2j80J47O31m92j29J07N3J80j04m7%l1r0j47M24Q9m36p3K50l9l4k32J07
$$ -110 -122 -302 -155 476 -16 -145 -38 15 195 91 44 44 13 -77 -224 200 289 -147 -220 30 -9 -43 -275 -168
2516a68K35N1K5o28K74N74kn06j79J17L35K57o88J27K64mk00J00j01J86N3k95
$$ -168 67 118 143 -485 -211 363 361 -145 -324 -207 128 385 -303 -176 88 84 -116 -16 -117 69 122 -173
2538a73k55L69M24m39M9j3J63lo9K1k05L62j91K01%l06l4L3rk7o1K45r4K03j12
$$ -173 -428 -59 365 -74 -25 -38 125 122 53 74 -131 231 40 241 241 -65 -99 -66 -75 -102 -163 82 -12 191 79
2563G9K33j69k58K66j10m7j05J23j41M77K24p03l6L20J47O4k51o54O68K94k41
$$ 79 312 143 -115 151 41 -6 -111 12 -129 348 572 -131 -167 153 300 364 113 -541 127 421 180
2584A80j39Q3J11N1j99j62J48j03L28k13M9j27J4j63K03l14P4K17j05K04L49o63
$$ 180 41 124 235 286 87 -75 73 -30 298 85 134 7 21 -142 61 -253 -179 38 -67 137 486 -177
2606a77o4j7M06k09k32K26o3K88J38p10L95J95l1n0j40Q3j95K71p7l46l2K24K10
$$ -177 -241 -258 148 -61 -293 -67 -130 158 296 -414 -19 176 145 95 -45 38 -157 114 37 -309 -341 -117 93
2629I3j08o0j0J02L97l55m41k3N33J24o15M58l08M53j07j99j71L89k8l03P0J11
$$ 93 -15 -75 -85 17 414 59 -382 -405 128 252 -363 95 -213 240 133 -66 -237 152 124 -179 -109 2
2651BK10p7j03j41K45l4k43k36L86M55m14m56K43J32j81r8PL03L79j62l91K13
$$ 2 212 135 32 -109 136 102 -141 -377 9 464 50 -406 -163 -31 -212 -310 -303 0 379 217 -174 39
2673C9j43N41l79R0k81L50j07q1L7J27Q0j48J39k93k87N91k65o7kL26n10L62j36
$$ 39 -104 437 58 148 -133 217 110 29 66 193 273 125 264 -29 -316 275 10 -57 -59 267 -243 119 -17
2696a7j91r8N32o76J69L63j28O3L47j45p18N27O2m2K18k31l1j57K08m6J88k66
$$ -17 -208 -306 226 -450 -281 82 -46 17 364 219 -499 28 90 48 266 35 4 -153 55 9 197 -69
2718f9j46J55n1M05l48K53J03m73P6J1r2R0K37L05m97k07N47m36K20k59N3J82
$$ -69 -215 -60 -111 294 -54 199 302 -171 -95 -84 -176 -86 151 456 -41 -248 299 -137 83 -176 -123 59
2740E9P0k54L63l09L9K9K56j75j45K59Pl87M36k70k28K87K22j37m74K50K33k04
$$ 59 129 -125 238 -71 -32 -3 253 78 -67 192 199 -188 248 -22 -250 37 259 122 -352 -102 131 -73
2762g3R7J31j66K19j02K3l4k88J00M18j40m12j67P44n06L5K73o9l48M30l9k27
$$ -73 24 155 -11 208 106 129 95 -193 -93 325 185 -227 -394 350 -156 -121 152 83 -265 165 126 -101
2784a01O0K02j59k90O1J22l7L9Q4m8K0j46J46j76K51K2M1l28K83l6L00m52L28
$$ -101 -41 161 2 -288 -227 -105 -142 -103 -19 -67 -47 -193 -47 -223 28 50 91 -237 46 10 310 -142 186
2807A86q4p6j52j05M71k86J63K89n98j0M48l6m35PJ48J24o6M5j16j94M77k69k9
$$ 186 102 26 -126 -231 240 -46 117 406 -192 -202 246 210 -225 -218 -70 54 -12 33 -83 -277 200 -69 -98
2830i8K45l19J49L83l40j46P8L95m83j09J88J93j06M8k4k24J93M91o97N0J72p3
$$ -98 147 -172 -23 360 20 -126 -48 347 -136 -245 -57 136 30 78 54 -170 23 514 -183 -133 39 -34
2852c4p6l2kJ43K31j43J8K7K83n80J28j3q2K65k56j33M25R0j92J40j91L5Q8m35
$$ -34 -110 -142 -144 -1 230 87 105 132 415 -165 -37 -50 -132 133 -123 -256 169 259 67 207 16 51 139 -296
2876b96J75m9L41Q8k45J5L01j16j44l10MK17L98m70J13n5J91m58M96k16P5o1J53
$$ -296 -121 -170 171 259 14 29 330 214 70 -240 -236 -19 379 -91 22 -33 158 -300 196 -20 55 -6 147
2899A47k57j55K82K0K48l25j51l26M02PJ20p8J20o9j42J28j32m2J47K66j61O8
$$ 147 -110 -265 17 37 285 -40 -191 -517 -115 -108 12 -66 54 -15 -157 -29 -161 -203 -56 210 49 117
2921A17k82l3K10p3M20k47k23m9K42k82K9l76L45L94o79M32Q2k86M32j88j19J90
$$ 117 -165 -198 12 -61 359 112 -111 -160 82 -200 -171 -547 -202 192 -487 -55 27 -259 173 -15 -134 56
2943E6N3Q9n51K97j72R0L60k47K9K28j81J38k81K23k82J86L9j92J82j11j30R0
$$ 56 109 198 -353 -56 -228 -138 222 -25 4 232 51 189 -92 131 -151 35 74 -118 64 -47 -177 -87
2965h7M60m70l47O89l76l1J27K35m34K00J27L7l16K69K6k41L14k73l12M13J9J1
$$ -87 373 -97 -444 245 -131 -162 -35 200 -234 -34 93 130 -186 83 109 -132 182 -91 -403 10 29 40
2987D0o4R5J34jJ44m86L18l83K59p6rK11j47jj95LJ37k0j08R4k8K89j93J52j49
$$ 40 -24 71 205 204 348 -138 180 -203 56 -20 -29 182 35 34 -161 -158 -21 -41 -149 -55 -83 206 13 165 16
3012A6k82R0L9K87q0J10l43j08P0J88N7on6j75M90j22m32R0J30J08j94O1O4k62
$$ 16 -266 -176 -137 150 70 180 -163 -271 -201 -13 44 38 -18 -193 297 175 -257 -167 -37 71 -123 -62 2 -260
3036b60K74J50m95L07L21m10J39k94K50J59p8ok25L40k28L8J28kk09J38l7j66
$$ -260 14 164 -331 -24 297 -113 26 -268 -18 141 63 57 -168 172 -56 -18 110 108 -101 37 0 -166
3058a66K03K93l52l4K50j26j93J61m3K09k24N3P9k81P37m53k98K27R0K58j34j28
$$ -166 37 330 -22 -56 194 68 -125 36 -7 202 -22 31 110 -171 566 113 -185 42 132 390 256 128
3080A28j79N0n8N0M5m9l3J21m9R7l77K62R2n69K92J03J81j49R4O3k13J65J0R5
$$ 128 -51 -1 -59 -9 36 -13 -46 75 26 123 -254 8 100 -469 -177 -74 107 -42 52 115 -98 67 77 172
3104A72k36mJ25m3p1o8J94j81J91l6K0j9k53J04l3J96K77o17K47J74k0k81R4R6
$$ 172 -64 -68 57 14 -57 -125 69 -112 79 43 63 44 -209 -105 -138 58 335 -282 -35 139 119 -162 -68 28
3128B8R6p7l61J62j24P99m75l9k07O22l07k15N1J41j84L6r4J58j6j30J39L0n16
$$ 28 124 47 -314 -152 -276 523 48 9 -198 424 117 -98 -47 94 -90 -54 -148 10 -6 -136 3 33 -483
3151d83L09k18M07J76k24K98l27j89J38K94m10J23pL8n2L26l03j68L66k41J77
$$ -483 -174 -392 15 191 -33 265 -62 -251 -113 181 -229 -106 -113 -75 -127 199 -104 -272 94 -147 30
3172C0O0k0Kk39L45j33N0l40N14L7k07j40J6K33l12J40j85L81J90l78j8P8l05
$$ 30 90 70 72 -167 178 45 95 -245 269 306 99 -41 -25 208 -104 36 -149 232 422 44 26 104 -201
3195b01L2J26j83N19j04j18l11K39K88j92j94l23O84m27K96p8J07l18j2L25j30
$$ -201 -169 -43 -226 293 189 71 -240 -1 287 95 -99 -422 262 -165 131 53 160 -158 -170 155 25
3216B5j88K23j41l43N83K2n31J11L49j48R7J15j43L77j34k79l08L66nj63K4m3
$$ 25 -163 60 -81 -424 159 181 -350 -239 110 -38 59 174 31 408 274 -5 -313 53 48 -115 -91 -134
3238a34k5P8K19j83J72n9n2n2N4J2j70K28j52J6j87K98j8N7k62K42k37n5pM67
$$ -134 -159 -81 138 -45 127 68 16 -36 18 30 -140 88 -64 -48 -235 63 45 102 -160 82 -155 -210 -217 250
3262B50j95l80O5J69M24n70J90K33M0l57L72k80l68M11K61k80j95J62J69l75J71
$$ 250 55 -325 -260 -91 333 -237 -47 186 226 -131 241 -39 -407 4 265 -15 -210 -48 121 -254 -83
3283h3M1N5M2m5N7L6Q6l92J62R2j00J72O3l89L8M66k45j32J45k12r1L25k49k4
$$ -83 -42 13 55 10 67 103 189 -203 -41 51 -49 123 186 -203 -165 301 56 -76 69 -143 -234 91 -158 -182
3307a82N7J83k30J36K45k2o3l47J79j08L41k77J60J82j49L7n5k19n0J5L78K04
$$ -182 -125 58 -172 -36 209 187 124 -223 -44 -152 189 -88 72 254 105 142 87 -132 -182 -167 211 415
3329D15l40k84J09L7k2j95K72k94L77p3l45L82k27M17m73K21J80j08P9l42L86
$$ 415 75 -209 -100 -63 -85 -280 -8 -302 75 2 -343 39 -188 229 -244 -23 157 49 128 -214 172
3350A72j75j05m5L21j16J6j61L2mj73J27J45P3p2l13J59K32l14L2K52j58L35k05
$$ 172 -3 -108 -153 168 52 68 -93 -61 -65 -238 -111 34 107 35 -278 -119 113 -201 -169 83 -75 260 55
3373E5k99N66l46oJ38J75k13k18N01l22p1k15J83J54j61R9%j26j47M46k28M3J05
$$ 55 -244 322 -24 -30 108 283 70 -148 353 31 -40 -255 -72 82 -79 20 20 -106 -253 193 -35 8 113
3396A13l37K14k8j52l70N69P4k15O8J34k34K55k33K65k28K79k50K68j43P5o0l14
$$ 113 -224 -10 -38 -190 -560 9 83 -132 -64 70 -164 91 -142 123 -105 174 -76 192 49 124 64 -250
3418b50L06n8O5n76N68R4q9K2j36L03k21k19M10j77k34M18k12K8j89L64k30K74
$$ -250 56 -2 63 -513 55 149 60 82 -54 249 28 -191 219 42 -192 226 14 42 -147 217 -13 261
3440B61k82J23m65K66J58J43n6l64N3K38j06k08L53l18K95J6m5k71L74j01k21
$$ 261 -21 102 -363 -97 61 204 148 -216 -163 75 -31 -239 114 -204 91 107 62 -209 165 64 -157
3461a57N6j3J37j38K81o4j94J82j87J92Nj43mM8j21m7M00l92Q9Q4k96q2M32j47
$$ -157 -101 -114 23 -115 166 102 -92 90 -97 95 100 -43 -47 1 -120 -167 233 -159 -70 14 -282 -364 68 -79
3485g9k3J8r6K60ol53J03L3K41M6n9M2m92M16J04j08j04R9r3n4J40j52K3N32o81
$$ -79 -102 -84 -180 80 74 -279 -176 -143 98 144 85 127 -365 51 155 47 -57 42 -51 -105 35 -117 -94 438 -243
3510b43K37R0j7k53J64K18p1O8k71K40k0o6k51M7p1l9K63j61mmK4K80q6P2m50
$$ -243 -6 84 67 -186 -22 196 125 193 -78 162 142 76 -175 -128 -199 -238 25 -136 -140 -144 -120 160 74 146 -304
3535c04M68m94L41j25Q5J9j9N8O1k06J80O3Lm42L07m8JK88m10M7J14k07O1J58
$$ -304 164 -330 11 -114 -29 -10 -29 29 90 -116 64 127 130 -312 -5 -53 -52 236 -174 -127 -13 -220 -159 -1
3559aJ51jr2K5M3j4mo6O0k68K58J3J16k78m0q9K81k01N5j2kl8K45P8k14J43J7
$$ -1 150 149 57 82 125 111 107 41 101 -167 91 104 220 -58 -98 -187 94 -107 -52 -64 -66 -104 141 219 5 148 165
3586A65l03Q2j25L27k06J55o5J13l10K28Q9k14k45N04l98L33o5N7j64J57m46L22
$$ 165 -138 -56 -181 146 -60 95 30 143 -167 61 150 -64 -309 195 -203 130 65 122 -42 115 -331 -9
3608il8l9M0j3J68j29L9q1q9R0RQ4N7m16K29J50k21o9M4K74j72K8j05Q3J97j88
$$ -9 -47 -86 -46 -59 109 -20 19 -62 -151 -61 -52 32 89 -327 -98 52 -169 -238 -194 80 -92 -64 -169 -86 111 -77
3634g7J65k74R4M18m99O3P3k08J16j99L20n3M01k47j61K74n0k50j21j18K52r7
$$ -77 88 -186 -92 326 -173 -110 -37 -245 -129 -328 -8 -61 340 93 -68 206 156 -94 -215 -333 -81 -178
3656a78R4k17M60j52K1j74J78n9NJ63k83R0p7P0Q1R3l80M37j78j92j6J15O2M65
$$ -178 -84 -301 159 7 28 -146 32 -27 -22 141 -142 -52 -129 -59 22 115 -265 172 -6 -198 -214 -99 -37 428
3680D28l55N2J2k95J73k76L08j00K58j99J17o9l38L54J27n6l3j22J08r3k5j9n7
$$ 428 73 125 137 -158 15 -261 47 -53 205 6 123 54 -284 70 197 141 108 -14 94 1 -24 -43 -100
3703a00M4K37k50q4K24M5r3k52L18l2q8J82p5j11j31N3R7Ol36J47j08L93k10q5
$$ -100 -56 181 -69 -153 71 116 23 -229 89 57 -31 151 76 -35 -166 -113 -16 -10 -346 -199 -307 86 -124 -209
3727b09J05M29m15J05J10R9j01j45O6J96j20m13M08j24l8R9l4j5k6J7l31M69o9
$$ -209 -104 325 -90 15 125 224 123 -22 44 240 120 -293 115 -9 -47 52 18 3 -23 -6 -337 132 63
3750F3j12j01L53m63L90j10k01J03Ol1J3L61r6m4k88J37j97J11P5m5o6o3R3j8
$$ 63 -49 -150 203 -260 130 20 -181 -78 -72 -103 -90 271 175 131 -157 -20 -217 -106 -31 -76 -142 -205 -112 -130
3774a30J92r7L07k25n5K03m23N7K2K14k90K84L2l45Q8J16K66m11j9J72O2J67j47
$$ -130 62 -35 272 47 -8 195 -228 -171 -149 65 -225 59 91 -254 -166 -50 216 -195 -214 -42 20 187 40
3797D0q1J86m0l42K46k00J93j1K34j65j10K8J55jJ08o2m12J13K13q6J27k66q3
$$ 40 -41 145 105 -237 9 -191 2 -9 225 60 -50 -22 133 132 240 178 -234 -121 92 6 133 -133 -216
3820b16J97j11J10K63m4Rr1l86L32P4k58J72K42m5l24j66N41Q6m78LK73p4k22
$$ -216 -19 -130 -20 243 199 208 117 -269 63 137 -121 51 293 248 -76 -242 299 385 -93 -90 183 109 -113
3843a13K85l55L66k19r9J1J60m0j26J59l26O1L11m2k50K10j34j06N57n57J31K93
$$ -113 172 -183 183 -36 -135 -124 36 -4 -130 29 -297 -236 75 33 -217 -7 -141 -247 310 -247 -116 177
3865A77l13L46j04j8j00O6k64L71J3J46j82n9J14j63n2j73J50K00l49M64l96j76
$$ 177 -136 210 106 88 -12 54 -210 161 174 320 138 79 193 30 -22 -195 -45 155 -194 270 -126 -302
3887c02K70j9L41m83p2J40M%j08M08j98J29k64k89N57j37j65J80N5k95M84k95
$$ -302 -32 -51 290 -193 -265 -125 -121 -121 -229 179 -19 110 -154 -443 114 -23 -188 -8 47 -248 236 -59
3909e9J41Q0k48K97l83L28j71J7j54j45L74q5K2rJ09q9P2j81K33k48J37N4m7j35
$$ -59 82 162 -86 211 -172 156 -15 2 -152 -297 77 -8 14 5 114 25 97 -84 149 -99 38 92 45 -90
3933i0L5l8J03P4p1L9l25K70O4q8J55k51K90R2j44j78K71l46j3K00lj32o9J26
$$ -90 -55 -93 10 84 13 52 -273 -3 61 -27 128 -123 167 259 115 -63 208 -138 -151 49 46 -86 -155 -29
3957b9j02L71j22J13j28J6k00J17k0l1o0q3K33k92J55Q7l92K92Q8j52k5J54K77
$$ -29 -131 240 118 231 103 119 -81 36 16 -15 -75 -158 75 -217 -62 25 -367 -75 13 -139 -164 -10 267
3980B67R5m46K16l37M22l04K05m04K70j06OJ44K4J88l63K91l34j15L69n01M77
$$ 267 362 -84 132 -205 217 -87 118 -286 -16 -122 -116 28 52 240 -123 168 -166 -281 88 -413 64
4001F4k53P1J34q6M30n59M05j7l73K67j39J50j52J62j02K76l05j09K53j25K82
$$ 64 -189 -118 16 -70 360 -199 206 189 -184 83 -56 94 -58 104 2 278 -27 -136 117 -8 274
4022B74j34k40J58m33L83J56j90J05j25J62j16j43k45R1M84Mj18j33P9P4j63k17
$$ 274 140 -100 58 -375 8 164 -26 79 -46 116 0 -143 -388 -297 187 191 73 -60 19 93 -70 -287
4044b87M16m4k23M2LP7M3j0j26k9J09J13l60N20q7j42k20K72K56j99l8j45L59
$$ -287 129 85 -138 -96 -93 -16 27 17 -109 -138 -29 84 -276 244 157 15 -205 67 323 124 86 -59 300
4067C00k29k0m8r2n3K36J37k74P5J49j25J93k87j63J70nK10q1K27k94nn7j89J37
$$ 300 71 51 3 -89 -142 94 231 -43 32 181 56 249 -38 -201 -31 -36 174 93 320 26 21 -36 -225 -88
4091h8K01n25L42J18L1m65K00J23l7K33j30K62l65K39k59MJ58R9pl13m1n7m3O19
$$ -88 113 -412 -70 48 79 -386 -186 -63 -100 133 3 265 -100 139 -120 -116 42 141 134 -179 -220 -277 -320 299
4115B99M3p23L23K28m02K45J51J7l99L21k21J85K03j86J91k92pJ19o3k11pJ8M35
$$ 299 342 -381 -58 170 -232 13 164 181 -218 103 -118 67 270 84 275 -17 -24 95 32 -179 -186 -168 267
4138B67j45k6k90K31k56K86R1k37K38n5J03%l70J07j86L02j31J96j56j49r7J24
$$ 267 122 96 -194 37 -219 67 158 -79 159 104 207 207 -163 -56 -242 60 -71 125 -31 -180 -277 -153
4160a53npK19k69J38J88k02j9n8l7M24l02j03R3lJ60J32m48k2K57N0j8M6o3Q4
$$ -153 -158 -165 54 -215 -77 111 -91 -110 -168 -205 219 -83 -186 -93 -96 64 196 -252 -274 -17 33 15 61 -2 82
4185H2k65R5j00K47l6p7k44L02L1l1J10o5J71m19oJ2J27L29l19QL82k00p5rk30
$$ 82 -183 -88 -188 59 23 -54 -298 4 35 4 114 49 220 -199 -205 -193 -66 263 -56 -48 334 134 59 50 -180
4210a80L92l34P5R2k15J40J5J84n31L85l61J65J32p2J66k99L76m31K37J24%Q4
$$ -180 212 -122 -47 45 -170 -30 -15 169 -362 23 -338 -173 -41 -113 53 -246 130 -301 -64 60 60 144
4232A44k32PP3n1N4Q3k99K77j18J07j37L19k01J73k26k42L35lk16o0M46k47J1
$$ 144 -88 -81 -8 -59 -5 78 -221 56 -62 45 -92 227 26 199 -27 -269 66 63 -153 -213 233 -14 -3
4255cO0K40k91j05J31j64K14P5q6J04M1j11m89K43J54J25k48M3J54j60oQ0J91
$$ -3 57 297 6 -99 32 -132 82 157 71 175 216 105 -384 -141 13 138 -110 -67 87 -73 -79 1 192
4278A92J48k68K2j52P3J89l56K78o8J87l89K80j26LJ89r9k86J73M3Q0l48L98j61
$$ 192 340 72 94 -58 15 204 -152 126 58 245 -144 136 10 13 202 103 -183 -10 33 113 -235 163 2
4301BoJ14n53P30l85J96Q8k98L38O4l15l05L25L1J89l46K83j08K15j53j5K8k8
$$ 2 -4 110 -443 287 -98 98 186 -112 226 290 -25 -330 -5 26 215 -131 152 44 259 106 91 119 91
4324I1j84k4L68m49L49l32J69j23J95j57K86k32L86l84j50J27K9J65l21J84J1
$$ 91 -93 -117 251 -198 151 -181 -12 -135 60 -97 189 -43 343 -41 -191 -64 -35 130 -191 -7 4
4345DN3P0M7j37J81l70K36j15q1J83l25M27k81j48O03o34L02p0p9J33m7j2j56
$$ 4 57 127 174 37 218 -152 84 -31 -112 71 -254 173 -108 -256 347 -287 15 -55 -134 -1 -48 -60 -216
4368b16J56Q0J59k3k92L16l37K97r6k24J92k20k8J88J31l08K45m3L4j0N00n04
$$ -216 -60 20 179 156 -136 180 -157 140 44 -180 12 -208 -236 -48 83 -225 20 -23 11 1 501 -3
4390ck92M91j70k76L27k47L3L56j07k04J06J11lm5j46Q9j24K20J5l02J53om44
$$ -3 -295 196 26 -250 77 -170 -137 219 112 -92 14 125 122 77 -69 20 -104 116 131 -171 -18 -24 -468
4413d68M16K05l5l11L52K9m84L76n0K38p22J78K17j6J7r9J36K56l14k23L85j28
$$ -468 -52 153 118 -193 159 188 -296 80 30 268 -454 -276 -59 -75 -58 -157 -21 235 -79 -302 83 -45
4435d5j91RL39j35N3M1j02L4K7K37j62p6k72L87m5k10J13o7q4j11Q4J14oJ93k34
$$ -45 -236 -227 112 -23 30 71 -31 3 30 267 105 29 -243 144 99 -111 2 -65 -149 -260 -176 -62 -68 125 -109
4460a09j16L04J31l52J09K7k5j65K55J87l65J14j20Q7J5k00J35l09K62n7L40R0
$$ -109 -225 79 210 -142 -33 -6 -31 -196 59 246 -119 -5 -125 -38 -23 -223 -88 -397 -135 -192 148 238
4482B38k58n3K43k37l5L37l31K75j48n2L07k02j03k66K48R9k36N01m05n5K03k
$$ 238 -20 -73 170 -67 -102 235 -96 179 31 -21 286 84 -19 -285 -37 62 -174 327 -78 -133 70 68
4504F8l27N47k71J23k14mN1J8J81j31J54l97K92mJ90j24K9m55K96K2n3j38L67
$$ 68 -259 288 17 140 -74 -78 -27 -9 172 41 195 -202 90 86 276 152 181 -274 22 44 -9 -147 220
4527B20j64P7l76L65j92K41j15J86k15k8m1K96j54k31J16j20L26k04J9K66k40
$$ 220 56 133 -243 122 -70 171 56 242 27 -1 -42 254 100 -131 -15 -135 191 -13 6 272 32
4548C2Q3n3k20J11J64j35k49L29k12J00L7K06m3j72K77k44N6j80jQ1Q6j09m0Q9
$$ 32 115 62 -158 -47 117 -18 -267 62 -150 -50 -13 193 150 -22 255 11 67 -113 -114 -33 53 -56 -96 -7
4572gJ95l22J15K5J85k60n5J71q7J78m24J86O6K76L0k82m6K37j01J40j26k60o5
$$ -7 188 -134 -19 6 191 -69 -124 47 -40 138 -286 -100 -34 242 272 -10 -56 181 80 220 94 -166 -231
4595b31M50k61K57k84L00l85K90l1j33J13o4K42j75j96J31j3j29R9J87m91L10
$$ -231 219 -42 215 -69 231 -154 136 105 -28 85 21 263 88 -108 23 10 -119 -20 167 -324 -14
4616a4j58K62Q8k56J79k1M3k28K79r9oR5j27J0k81M90o69L22%K44P5l38n2N1K17
$$ -14 -172 90 178 -78 101 80 123 -105 174 75 69 164 37 47 -234 256 -413 -91 -91 153 228 -110 -162 -111 106
4641A06O3k21JlkJ05k91L30k26J91jj32L94k41Q0J64n71L24j63j18m9K30K3j64
$$ 106 169 -52 -51 -54 -56 49 -242 88 -138 53 52 -80 314 73 153 317 -254 70 -93 -211 -260 -30 -7 -171
4665a71J3J48p5OJ36n4K09j07l91K24J52m9k46L04QK2m07J84K79jm2j60N7j40
$$ -171 -158 -10 -85 -79 57 3 212 105 -286 -62 90 41 -205 99 107 129 -278 -94 185 184 142 -18 39 -101
4689a01J20n4kJ85k50P7J30o2n1K6K8M8L07n61P8Q7p2j21L54j83K52m1j13J1k0
$$ -101 19 -35 -37 148 -102 -25 105 43 -8 18 46 94 401 -160 -82 5 -67 -188 166 -17 235 194 81 92 72
4714G2j75k11M98Q6k57O9K4nk04k3J5J55O1nj38o0k6M1n7j09L80n1Q4p0K20l29
$$ 72 -103 -314 184 270 13 82 106 101 -103 -126 -111 44 105 100 -38 -98 -124 -83 -140 -249 131 80 164 94 314 -15
4740a5JQ3J24j8n18K16Q7n1M2K78j31j70p6K5K8j02J80k4K61k03k38L77J34o9
$$ -15 -14 69 193 175 -343 -127 -40 -91 -49 229 98 -72 -148 -123 -95 -197 -17 -41 220 17 -221 156 290 221
4764B21k70J88O6p8m48L33pl30L88l27K94M3q2j90N4K06ln4K28j12n3k69K32j03
$$ 221 -49 139 205 127 -321 12 5 -325 63 -264 30 73 -9 -199 -145 61 58 4 232 120 67 -202 30 -73
4788g3j9K77j42l64L07j82oK69j80K07j57p2Q3j01Q2p6L50l42N8j00L27J02r1
$$ -73 -92 185 43 -321 -14 -196 -202 67 -113 94 -63 -135 -52 -153 -71 -147 203 -139 -81 -181 146 248 157
4811A57Qk24J08K7K51k64k84L48j41l33M60K25l44J71l6l37K03K03P8j45j86j35
$$ 157 165 -59 49 76 327 63 -221 127 -14 -347 113 338 -6 165 129 -208 -5 198 276 131 -55 -190
4833a90K07l65K18J64L9k92L93q6Rj38J87k25nJ93o3J2k04j18J99Kn1J45K48k56
$$ -190 17 -348 -130 34 73 -219 174 88 97 -41 146 -79 -84 109 46 58 -146 -264 -65 -63 -114 31 279 23
4857B3j97P1O2OJ19L0o6K7j81j69M5N35o1l07k38K48j26K84LNj09O3Q7P4l6r9
$$ 23 -174 -103 -41 -35 84 114 48 75 -106 -275 -230 305 244 -63 -301 -53 -179 105 108 113 4 67 154 228 192 93
4883I3k38L70j53k3l73K30K79n47M03r4J10k28J47J06m4j92K71Kk21N4K14r3M3
$$ 93 -145 225 72 49 -324 -94 185 -362 41 -53 57 -171 -24 82 38 -154 117 119 -102 -48 166 73 116
4906A16K00k36j58J96r0N9k36qL26j20j54qP5Q5p5k10N25J16p61N55m11M39m13
$$ 116 316 80 -78 118 28 87 -149 -157 169 49 -105 -113 -38 47 -28 -238 287 403 -358 197 -214 225 -188
4929a88K15o3P3L12m38PR0p6J34p5o7J55j63K11Q0k08k15K25j65N2K71m65N11
$$ -188 27 -36 37 349 -89 -82 8 -68 66 -9 -76 79 -84 127 207 -1 -216 9 -156 -104 167 -298 213
4952B13k72L33j94J73k12l08J66OL34k9l91M28j57J41k18o3Q5O7o3J12j08k40
$$ 213 -59 274 80 253 41 -267 -101 -95 239 210 -181 247 90 231 13 -50 35 102 39 151 43 -197
4974a97MN4J66N1l83L67l6k42L08r0J08p7j00Q9m9n7K41n40O32k29j20J05k80
$$ -197 -193 -139 27 78 -305 62 26 -216 92 2 110 33 -67 22 -27 -84 157 -383 249 20 -100 5 -275
4997b75J42%J89j60J31O3J74j68k8k0j31J61J78rk41j18K81j79mj6Rm6nL02j29
$$ -275 -133 -133 56 -104 27 90 264 96 68 48 -83 78 256 247 6 -112 169 -10 -14 -30 -21 -67 -72 230 101
5022A01n2J80P9l56Lq5J44l7l10J15J45K22k49J4k0J17O7j34o2K15J13k02j11
$$ 101 49 229 308 -48 -45 -130 14 -23 -333 -218 -73 149 -100 -86 -106 11 78 -56 -118 97 210 8 -103
5045a03n1J33J23l2J33k38J08J38k27p0K32k42J00J51l91J18J89j32M8M42l63
$$ -103 -154 -21 102 70 203 -35 73 211 -16 -86 146 -96 4 155 -236 -118 71 -61 -13 429 66
5066F6J09k37L31M4l62J21l5j96K69j73m29O33L7q6l01N4J51J17j05j20j44L82
$$ 66 175 -62 269 313 -49 72 37 -159 110 -63 -492 141 178 92 -209 -155 -4 113 8 -112 -256 126
5088A26O1q7j95L7k15L63K20m07Q8J86P5j25L4m8L8k47K67k61K22o6j85Q7J30
$$ 126 187 100 -95 -58 -273 90 310 -97 -9 177 252 127 161 113 151 -96 171 -90 132 66 -119 -32 98
5111I8K18n96l6L08k63K28M23l37k61Q3Rk08J37L31j04ql74K00N8l2j57M0M01
$$ 98 316 -280 -316 -8 -271 -43 380 43 -218 -135 -126 -334 -197 134 30 22 -352 -152 -94 -126 -283 -243 158
5134A58m33L09k30M29l34K09K27j06k81J80l49L68q8Lk33K10j05j36N05p35L48
$$ 158 -275 34 -196 233 -101 108 335 229 -52 128 -221 147 59 62 -171 39 -66 -202 303 -432 -84
5155h4L62m83K89M61n03k0l88J44K55J37M0j41J11k1M3j84J54j83j42J90J05k97
$$ -84 278 -205 84 545 42 22 -366 -222 33 170 210 69 180 159 202 18 172 -11 -153 37 142 -155
5177a55K93j72O4qJ21j39j34J02J56m0k70J36J67O7l91K08J6q0K09j96J30j96
$$ -155 138 -34 30 22 143 4 -130 -28 128 88 -182 -46 121 188 -203 5 21 -59 150 -46 84 -112
5199a12K86K01n29J04j06M57O1m78K19k07M02k04n4l12L76jj35l3j56K84O4j72
$$ -112 174 375 -154 -50 -156 301 362 -116 103 -104 298 94 40 -272 104 103 -32 -65 -221 63 127 -45
5221d5J73k21j38R7L26l52nJ61j63J51p6P7q5J06L87k84j96R9l9M0k3J56k90r
$$ -45 128 -93 -231 -134 192 -160 -165 -4 -167 -16 -92 -15 -100 6 393 109 -87 12 -27 13 -10 146 -144 -153
5245a53J63k17J97K6L36l01k55N66l50o2J76R6j17k18l5K57m0o8k42K5J25K39
$$ -153 10 -207 -10 16 352 51 -204 362 12 -50 126 222 105 -113 -148 109 69 1 -241 -216 -91 148
5267A48l05M0M7K22l23J32L12r6l03J74N3k30Q9M6n7J58j93N8l94P45l94k5J13
$$ 148 -157 -117 -70 152 -171 -39 273 177 -126 48 101 -129 -40 6 -51 107 -86 -28 -422 323 -71 -96 17
5290A7k50J45j65L53j13k9L9J62j41q0k93O58j5k34q0j4R4r3J34j39p3J22o9J41
$$ 17 -233 -88 -253 100 -13 -42 -3 159 18 -62 -355 303 288 54 -26 -40 54 -39 95 -44 -117 5 -64 77
5314G7j68qL97l64J85j61l4J45k05J19J59k30J19L54l91j64L66k46n1L88l61j76
$$ 77 -91 -99 298 -66 119 -42 -76 69 -136 -17 142 -88 31 385 -6 -170 196 -50 -101 287 -74 -250
5336b50J48j33L39m68K42N5j21N25L3n59L51k7J05l42J52k3k5Q7k92M8K40J15
$$ -250 -102 -235 104 -364 -122 -67 -188 337 370 -189 162 135 240 -102 50 27 2 89 -203 -155 85 200
5358B00k26K23j53J73n9k35J47k73K40j20J7L83n35j4L88J29l35j11J65O2j54
$$ 200 -26 197 44 217 158 -77 70 -203 37 -83 -66 317 -218 -232 156 285 -50 -161 4 66 -88
5379h8K61k64L31n5l52L49k81J66q3l57K17P6j05K96J32J5m88L22k19N5K46k94
$$ -88 173 -91 240 185 -167 182 -99 67 -16 -373 -156 -80 -185 111 243 258 -230 92 -127 -72 174 -120
5401a20K54L29m49l61L41q3J76K94k16O8p5J21m62J26R4K14J95n76O1j05k7m4
$$ -120 134 463 14 -347 -6 -89 87 381 165 233 158 279 -183 -57 37 251 446 -130 -69 -174 -201 -245
5423b45L07r0J3J20K81n13L28n85O27m24Q5R5j80N32k38P3k06l60L44j78J21J31
$$ -245 62 -28 -15 105 386 -127 201 -384 243 -181 -96 -1 -181 351 113 186 -20 -380 -36 -214 -93 38
5445C8J03J11k78j7K19o7m8j19K18J18m03J49k15M63o52L11K91o02M08O1l2k91
$$ 38 141 252 -26 -43 176 109 61 -58 160 278 -125 24 -191 272 -380 -69 222 -380 28 89 57 -234
5467b34M61n59L94M3j92J39K1n3n5K51j85j20M23l39J45k3l66K02j39R5K0PL22
$$ -234 227 -332 62 105 -87 52 73 20 -35 216 31 -89 334 -5 140 117 -249 -47 -186 -91 -71 -64 258
5490B58j25J56j97o0J15J8k23k22J30J96K12j93O6J61l24J30k71M18j88j02K41
$$ 258 133 289 92 32 147 165 -58 -280 -150 46 258 65 131 292 -32 98 -173 245 57 -45 196
5511A96p2l78K89q7q2J68K77j21j69m31N52m9j94Ok07K27O4m8j42K67j34J40q5
$$ 196 124 -254 35 -52 -134 34 311 190 21 -410 142 93 -101 -95 -302 -75 -11 -59 -201 66 -68 72 -13
5534a3J90k51J04O4J14m20M7K08nK28j66l40R9M9J79m39M80k2j91K36j20L2K02
$$ -13 177 -74 30 94 208 -212 -165 43 38 266 100 -240 -141 -92 87 -352 128 106 -85 151 31 63 265
5557B65k31O7j2k55K01j13j40K28j17J6J72pq1J10J01l45J08N5k09K54R5j58J78
$$ 265 34 101 89 -166 35 -78 -218 10 -107 -91 81 74 -7 103 204 -141 -33 22 -187 67 162 4 182
5580A82q4J84l02j12oJ3L21l45K1R2L57m01o4K25J2M5j42j14J65m14K27M03l89
$$ 182 98 282 -20 -132 -138 -125 196 -149 -128 -36 321 -80 -144 81 93 138 -4 -118 47 -367 -140 263 -126
5603a26M1J83mj71J70Kk01mJ78L16n06J6K5J99p4N2k4L5n3l10L52J22l76M9O4
$$ -126 -85 98 94 -77 93 95 -106 -110 68 384 -122 -106 -81 118 44 96 72 107 54 -256 96 218 -158 -109 -45
5628d5J92OJ25k67n9J35j06O8l3j14K90K1n27L44J36jl67J76K21l82N1M93m49
$$ -45 147 153 278 11 -48 87 -19 49 16 -98 192 213 -314 30 166 165 -202 -26 195 -187 -136 357 -92
5651i2j75J37K0K23n9k67K25M95l84M9k15k8k24J58J44j52K34l05L65k14M4M33
$$ -92 -267 -130 -110 113 54 -213 12 507 123 172 -43 -71 -295 -137 7 -145 89 -216 149 -65 -21 412
5673D12m55J24Po7r3Q0k87P0j6o9K54J98l49K11J08j74J18l2r2o9N8L68m1K9L6
$$ 412 -43 81 88 21 -72 8 -279 -209 -225 -294 -40 158 -191 20 128 -46 72 40 -52 -121 -63 305 264 293 329
5698C29m54N66m77lk29J83j50J87J91J66k30j88N7L5r5K81l83J90r1Jk5N6K64
$$ 329 -125 441 -36 -39 -268 -85 -235 -48 143 309 79 -109 -52 -17 -112 169 -214 -24 -115 -114 -139 -83 181
5721A81k01R2k09j02r5L59J8k93L23Rk20P9J39l65L01n6l3Nl1K8L35o53K71P2
$$ 181 -20 72 -137 -239 -334 25 43 -250 73 82 -138 -59 80 -285 16 -40 -73 -68 -99 -71 264 -389 -118 -46
5745d6O2J40j30j07O1k6J2R9l32K54QKK18l34q4N15l77J25l04J66N4m7J9K19k10
$$ -46 16 156 26 -81 -20 -46 -34 65 -267 -13 -5 -3 215 -119 -203 312 -65 60 -244 -78 -24 -71 -52 167 -43
5770d3J77o1K62l79K49j61K1J35j79J13l05K01q1J51R1j62j09K98j65J40j16K33
$$ -43 134 73 335 -44 205 44 65 200 21 134 -171 30 -51 100 191 29 -80 218 53 193 77 310
5792C10l48J12k57J02N4k9J32K3N4j52P8k57J18j3P1k0K49l92J30LJ24K16m25
$$ 310 -38 74 -183 -81 -27 -56 76 99 153 1 79 -178 -60 -73 -2 -22 227 -165 -35 -32 92 308 -117
5815a17n7K55k65O5j7M0n8K20r9M1j49O4K75k56NK15j53K60k38M0J04k06Pk4J52
$$ -117 -174 81 -184 -119 -136 -96 -154 66 -33 8 -141 -77 198 -58 -53 162 9 269 31 71 175 -31 -24 -48 104
5840A04p4r4J94q8k66L74j98p1K27j30j80J91M0j19K40J78o1k75J39o9k53O6K0
$$ 104 30 -64 130 42 -224 150 -48 -119 108 -22 -202 -11 29 -90 150 328 267 -8 131 62 -191 -125 -105
$$ [...]
8191F0
##END NTUPLES=NMR FID
##END=
