##TITLE=1H_CA-8621-2
 CDCl3, 8 sc, 
 5.7.2019
##JCAMPDX= 6.0         $$ Bruker NMR JCAMP-DX V2.0
##DATA TYPE= NMR FID
##DATA CLASS= NTUPLES
##ORIGIN= UXNMR, Bruker Analytische Messtechnik GmbH
##OWNER= root
$$ XWIN-NMR		Version 3.5
$$ Fri Jul  5 14:22:16 2019 Russian Standard Time (UT+4h)  she@DPX200
##.OBSERVE FREQUENCY= 200.13155
##.OBSERVE NUCLEUS= ^1H
##.DELAY= (6, 6)
##.ACQUISITION MODE= SIMULTANEOUS
##.ACQUISITION SCHEME= undefined
##.AVERAGES= 8
##.DIGITISER RES= 18
##SPECTROMETER/DATA SYSTEM= spect
##.PULSE SEQUENCE= zg30
##.SOLVENT NAME= CDCl3
##.SHIFT REFERENCE= (INTERNAL, CDCl3, 0, 15.7039)
##AUDIT TRAIL= $$ (NUMBER, WHEN, WHO, WHERE, WHAT)
$$ ##TITLE= Audit trail, XWIN-NMR		Version 3.5
$$ ##JCAMPDX= 5.01
$$ ##ORIGIN= Bruker BioSpin GmbH
$$ ##OWNER= she
$$ F:/spectra/data/she/nmr/H-F/1/audita.txt
$$ ##AUDIT TRAIL=  $$ (NUMBER, WHEN, WHO, WHERE, WHAT)
(   1,<2019-07-05 14:21:04.07 +0400>,<she>,<DPX200>,
      <created by zg, POWCHK disabled, PULCHK disabled
       configuration hash MD5:
       00 E9 B6 7A A2 85 ED C7 34 08 36 98 17 FE 4E 26
       data hash MD5: 16K
       F9 B0 AF 55 29 A8 2F 10 CC 02 CC F2 56 2E 5C 57>)
$$ ##END=
$$ 
$$ hash MD5
$$ F0 1B A9 F9 BD 8C A6 C2 36 0E 9C 21 BA CC 00 E6
##$RELAX= 
##$RELAX= 
##$RELAX= 
##$RELAX= 
##$RELAX= 
##$RELAX= 
$$ Bruker specific parameters
$$ --------------------------
##$DU= <F:/spectra>
##$EXPNO= 1
##$NAME= <H-F>
##$PROCNO= 1
##$TYPE= <nmr>
##$USER= <she>
##$AMP= (0..31)
100 100 100 100 100 100 100 100 100 100 100 100 100 100 100 100 100 100 
100 100 100 100 100 100 100 100 100 100 100 100 100 100 
##$AQSEQ= 0
##$AQ_mod= 1
##$AUNM= <au_zg>
##$AUTOPOS= <>
##$BF1= 200.13
##$BF2= 200.13
##$BF3= 200.13
##$BF4= 200.13
##$BF5= 200.13
##$BF6= 200.13
##$BF7= 200.13
##$BF8= 200.13
##$BYTORDA= 1
##$CFDGTYP= 0
##$CFRGTYP= 5
##$CHEMSTR= <none>
##$CNST= (0..31)
1 1 145 1 1 1 1 1 1 1 1 1 1 1 1 1 1 1 1 1 1 1 1 1 1 1 1 1 1 1 1 1 
##$CPDPRG= <>
##$CPDPRG1= <>
##$CPDPRG2= <>
##$CPDPRG3= <>
##$CPDPRG4= <mlev>
##$CPDPRG5= <mlev>
##$CPDPRG6= <mlev>
##$CPDPRG7= <mlev>
##$CPDPRG8= <mlev>
##$CPDPRGB= <>
##$CPDPRGT= <>
##$D= (0..31)
0 1.2 0 0 0 0 0 0 0 0 0 0.03 0 0 0 0 0 0 0 0 0 0 0 0 0 0 0 0 0 0 0 0 
##$DATE= 1562322063
##$DBL= (0..7)
120 120 120 120 120 120 120 120 
##$DBP= (0..7)
150 150 150 150 150 150 150 150 
##$DBP07= 0
##$DBPNAM0= <>
##$DBPNAM1= <>
##$DBPNAM2= <>
##$DBPNAM3= <>
##$DBPNAM4= <>
##$DBPNAM5= <>
##$DBPNAM6= <>
##$DBPNAM7= <>
##$DBPOAL= (0..7)
0.5 0.5 0.5 0.5 0.5 0.5 0.5 0.5 
##$DBPOFFS= (0..7)
0 0 0 0 0 0 0 0 
##$DE= 6
##$DECBNUC= <off>
##$DECIM= 24
##$DECNUC= <off>
##$DECSTAT= 4
##$DIGMOD= 1
##$DIGTYP= 9
##$DL= (0..7)
0 120 120 120 120 120 120 120 
##$DP= (0..7)
150 150 150 150 150 150 150 150 
##$DP07= 0
##$DPNAME0= <>
##$DPNAME1= <>
##$DPNAME2= <>
##$DPNAME3= <>
##$DPNAME4= <>
##$DPNAME5= <>
##$DPNAME6= <>
##$DPNAME7= <>
##$DPOAL= (0..7)
0.5 0.5 0.5 0.5 0.5 0.5 0.5 0.5 
##$DPOFFS= (0..7)
0 0 0 0 0 0 0 0 
##$DQDMODE= 0
##$DR= 18
##$DS= 0
##$DSLIST= <SSSSSSSSSSSSSSS>
##$DSPFIRM= 0
$$ [...]
##$SUBNAM2= <"">
##$SUBNAM3= <"">
##$SUBNAM4= <"">
##$SUBNAM5= <"">
##$SUBNAM6= <"">
##$SUBNAM7= <"">
##$SUBNAM8= <"">
##$SUBNAM9= <"">
##$SW= 24.9336996594482
##$SWIBOX= (0..15)
0 0 2 0 0 0 0 0 0 0 0 0 0 0 0 0 
##$SW_h= 4990.01996007984
##$TD= 16384
##$TD0= 1
##$TE= 0
##$TE2= 300
##$TE3= 300
##$TEG= 300
##$TL= (0..7)
0 120 120 120 120 120 120 120 
##$TP= (0..7)
150 150 150 150 150 150 150 150 
##$TP07= 0
##$TPNAME0= <>
##$TPNAME1= <>
##$TPNAME2= <>
##$TPNAME3= <>
##$TPNAME4= <>
##$TPNAME5= <>
##$TPNAME6= <>
##$TPNAME7= <>
##$TPOAL= (0..7)
0.5 0.5 0.5 0.5 0.5 0.5 0.5 0.5 
##$TPOFFS= (0..7)
0 0 0 0 0 0 0 0 
##$TUNHIN= 0
##$TUNHOUT= 0
##$TUNXOUT= 0
##$USERA1= <user>
##$USERA2= <user>
##$USERA3= <user>
##$USERA4= <user>
##$USERA5= <user>
##$V9= 5
##$VALIST= <valist>
##$VCLIST= <CCCCCCCCCCCCCCC>
##$VD= 0
##$VDLIST= <DDDDDDDDDDDDDDD>
##$VPLIST= <PPPPPPPPPPPPPPP>
##$VTLIST= <TTTTTTTTTTTTTTT>
##$WBST= 1024
##$WBSW= 4
##$XGAIN= (0..3)
0 0 0 0 
##$XL= 0
##$YL= 0
##$YMAX_a= 632050
##$YMIN_a= -798007
##$ZGOPTNS= <>
##$ZL1= 120
##$ZL2= 120
##$ZL3= 120
##$ZL4= 120
##$ABSF1= 10
##$ABSF2= 0
##$ABSG= 5
##$ABSL= 3
##$ALPHA= 0
##$AQORDER= 0
##$ASSFAC= 0
##$ASSFACI= 0
##$ASSFACX= 0
##$ASSWID= 0
##$AUNMP= <proc_1d>
##$AZFE= 0.1
##$AZFW= 0.1
##$BCFW= 1
##$BC_mod= 2
##$BYTORDP= 1
##$COROFFS= 0
##$CY= 11.3945322036743
##$DATMOD= 1
##$DC= 2
##$DFILT= <>
##$DTYPP= 0
##$F1P= 18.9103706918063
##$F2P= -1.10871071338519
##$FCOR= 0.5
##$FTSIZE= 0
##$FT_mod= 4
##$GAMMA= 1
##$GB= 0.15
##$INTBC= 1
##$INTSCL= 1
##$ISEN= 128
##$LB= 0.24
##$LEV0= 0
##$LPBIN= 0
##$MAXI= 10000
##$MC2= 0
##$MEAN= 0
##$ME_mod= 0
##$MI= 1.114404
##$NCOEF= 0
##$NC_proc= 0
##$NLEV= 6
##$NOISF1= 3.799351
##$NOISF2= 2.8
##$NSP= 1
##$NTH_PI= 0
##$NZP= 0
##$OFFSET= 15.70392
##$PC= 1
##$PHC0= -8858.172
##$PHC1= 13.20096
##$PH_mod= 1
##$PKNL= yes
##$PPARMOD= 0
##$PSCAL= 0
##$PSIGN= 0
##$REVERSE= no
##$SF= 200.130013532006
##$SI= 16384
##$SIGF1= 3
##$SIGF2= 2
##$SINO= 400
##$SIOLD= 16384
##$SREGLST= <1H.CDCl3>
##$SSB= 0
##$STSI= 0
##$STSR= 0
##$SW_p= 3612.71676300578
##$SYMM= 0
##$S_DEV= 0
##$TDeff= 0
##$TDoff= 0
##$TI= <>
##$TILT= no
##$TM1= 0
##$TM2= 0
##$TOPLEV= 0
##$USERP1= <user>
##$USERP2= <user>
##$USERP3= <user>
##$USERP4= <user>
##$USERP5= <user>
##$WDW= 1
##$XDIM= 8192
##$YMAX_p= 0
##$YMIN_p= 0
$$ End of Bruker specific parameters
$$ ---------------------------------
##NTUPLES= NMR FID
##VAR_NAME=  TIME,          FID/REAL,        FID/IMAG
##SYMBOL=    X,             R,               I
##VAR_TYPE=  INDEPENDENT,   DEPENDENT,       DEPENDENT
##VAR_FORM=  AFFN,          ASDF,            ASDF
##VAR_DIM=   8192,          8192,            8192
##UNITS=     SECONDS,       ARBITRARY UNITS, ARBITRARY UNITS
##FACTOR=    0.0002004,     1,               1
##FIRST=     0,             0,               0
##LAST=      1.6414764,     0,               0
##MIN=       0,             -798007,         0
##MAX=       1.6414764,     632050,          0
$$ Real data points
##PAGE= N=1
##DATA TABLE= (X++(R..R)), XYDATA
0@%%%qJ6j6K4l2M0n5P1q8J12j37J69k08K46k95L52m13M85n68O57p60Q77j005J148
27F12j310J487j680J895k136K399k686L002l346L723m143M599n098N650o257O926
43C637p667Q496r418J0453j1631J2975j4525J6346j8508K1129k4397K8592l4204
56a8722M2165n4434P6024j25299M36667J31774n80311K30604L47661J45921k64192
67C67858j87409j3385J75203J8702k02820k87930L9917L17423J89240k93305m13981
78b90487n4907K90399J35711j54003j89230Q518R8700K5731j29064j59261o05
89d18498K03900J56005j09244k66280q0910K06599K13490o6295k05412k0162J83245
100b03562J20159o7459j34958l2198J34854J99809L9778j89933j70243J21906
$$ y = [0, 0, 0, 0, -8, 8, -8, 16, -16, 24, -31, 40, -48, 64, -73, 96, -112, 134, -161, 191, -222, 263, -305, 352, -408, 469, -536, 612, -698, 789, -891, 1004, -1132, 1267, -1419, 1583, -1763, 1960, -2183, 2416, -2682, 2968, -3289, 3637, -4030, 4466, -4952, 5501, -6130, 6845, -7680, 8666, -9842, 11287, -13110, 15482, -18722, 23443, -30991, 45033, -80266, 356401, 488175, -92136, 138468, 486129, 632050, 367858, 180449, 167064, 342267, 360969, 158149, -129781, -89864, 227559, 416799, 123494, -290487, -345394, -54995, 80716, -73287, -262517, -253999, -155299, -129568, -258632, -417893, -418498, -214598, -58593, -167837, -434117, -515027, -308428, -94938, -161233, -366645, -386807, -203562, -83403, -150862, -285820, -318018, -183164, 16645, 56423, -133510, -303753, -181847]
110a81847K99138R3908k26901k09300J13060K72162Q0652j52359j56636M455J59076
121I5408J57095n3805k31598p5333K30908K06732j38204k89160l4839K38199J63458
132B68861j07610k02897n4717J07579J13635j9779j48767r0987J28034J79122
142A72474p9595k69148o5933K34499J90507j02232k23715n0352J52286J31832
152I0623n1858j46571l8461J34158J56561l0485k16404j22176J77834K64996j227
163B16990k37378j29354J22525J76115J7646j16711p9892N3048J17100M3652r0304
174I3437j34375m946J64133J27352r3709j81039k2242J16931O4498m0128o2103
185B7809l0150J5119M7831Q156q2386q5617M1053J25762J8357j41819j07289O8502
$$ y = [-181847, 117291, 211199, -15702, -225002, -111942, 160220, 240872, 88513, -68123, -63668, 95408, 252503, 198698, -32900, -108233, 122675, 329407, 191203, -97957, -132796, 105403, 268861, 161251, -41646, -96363, 11216, 124851, 105072, -43695, -134682, -6648, 172474, 92879, -176269, -242202, -7703, 182804, 80572, -143143, -193495, -41209, 90623, 38765, -107806, -146267, -12109, 144452, 113967, -102437, -224613, -46779, 218217, 216990, -20388, -149742, -27217, 148898, 166544, 49833, -30059, 22989, 140089, 183741, 93437, -40938, -45884, 118249, 245601, 151892, -29147, -51389, 65542, 130040, 89912, 27809, -2341, 12778, 60609, 68765, -13621, -99238, -58185, 67577, 85934, -55885, -163174, -94672]
197i4672J10656j6917r2883l7629L3373N6830K2613o9290j06582J8767J55517
208b0217P5421j30843j60433M0407J85401P0718j27845j28539M4932J42356O5279
219E6637p0962j23427k4736J40432J49612n0181j84413m8022J62387J46430n3137
230A00620j49290k5617J22866R6691l7696r1858k9933N9302R5648K7727r2133
241G6327r3882N3039J25397Q895j04112m6554O4608O1118k6462o3386j6943L4176
253G2221L7086P108l7816o6514j2304Q0388N3522p6991r9423K6051R2722J3862
265H9912p1708o2959k21N2254N1387j5784q7260o2208N4281J10637N87j35025
277g6107q1856R2135J23635j8205j15264o2781M1632Q8261L7672o5807r4089J2496
$$ y = [-94672, 15984, -933, -93816, -131445, -98072, -41242, -18629, -87919, -194501, -175734, -20217, 55204, -75639, -236072, -195665, -10264, 60454, -67391, -195930, -150998, -8642, 56637, -14325, -137752, -162488, -22056, 127556, 77375, -107038, -155060, 7327, 153757, 100620, -48670, -74287, 48579, 145270, 107574, 15716, -14217, 45085, 140733, 168460, 76327, -17555, 35484, 160881, 169776, 65664, 19110, 83718, 144836, 118374, 54988, 38045, 72221, 109307, 116415, 78599, 12085, -219, 80169, 133691, 56700, -42723, -16672, 76050, 89912, 18204, -44755, -44976, 7278, 58665, 42881, -44379, -106587, -52306, 58331, 58918, -76107, -157963, -65828, 57807, 39602, -75662, -138443, -96811, -8550, 29122, -36685, -130774, -118278]
289a18278J13935N3206r8621j20982L5629J53831N5906j11437j07193L0980R1460
300b1564L0389m0292m8805O273O8854M0724p1915j02898K3880J40402P3747r0538
312H257j24903R761J07629L8888o1801m3839L4770N9955J8974n2162r0593j4455
324a09519J15809J13115m0230j33257m7941P9077P8046j7775n6025J915M9821
335C3036K4997k5302n2570l8448L6375J04850M7348q4640j00638J5071Q4181L2312
347G6572l4333k8376J5802L0231J643l1853l5468m97N5022O3982j8713r4864l6795
360c7647P3875O1965l9606o0450J1327N3136J8673l6263n2045j2206M6418N6357
372H3534n168p3104n1075M9456Q3343j8087j00535k8310P9605N9326l5344o5922
$$ y = [-118278, -4343, 48863, -49758, -170740, -135111, 18720, 74626, -36811, -144004, -113024, -21564, 8825, -31467, -80272, -73999, -5145, 35579, -36336, -139234, -115354, 25048, 98795, 8257, -116646, -106885, 744, 39632, -22169, -66008, -31238, 28717, 47691, -4471, -95064, -109519, 6290, 119405, 79175, -54082, -102023, -22946, 55100, 37325, -18700, -16785, 33036, 58033, 32731, -19839, -58287, -21912, 82938, 130286, 45646, -54992, -39921, 44260, 76572, 42239, 13863, 29665, 59896, 61539, 29686, -5782, -6279, 48743, 112725, 94012, -852, -37647, 36228, 98193, 58587, -1863, 9464, 62600, 81273, 45010, -7035, -19241, 27177, 83534, 78366, 5262, -45813, 3643, 86986, 68899, -31636, -59946, 19659, 78985, 43641, -22281]
384b2281k2561K8525M3977P512m5093m1927K4684O2619N732p6932n8313M8267
396d5791Q3051k435o5165k5167K2992J2524n498m703m187P571K6502N730m3743
409c8319m4911J8619O3360K4430l9399l4049J6323J6457k0328j1501K4761K0681
421c876R88J111j3567l7739j0604M5739M5438q463l6863j0679J6147M063j1844
434b0149P648K4996O451p899J988r444k9290M023N2231K8440l0002l1730P191
447D454J6997j618n093R592J2941j853o715k55j0408j7250J4547L7768k508l8319
461A2280p511K4184j841k4101J403K1202L216j7095j0809L59l259o527P173R875
475H549j3694j8530J0255J1826k3632j9427K1960J8125k1195j9878J1620J0564
$$ y = [-22281, -44842, -16317, 27660, 35172, -9921, -51848, -27164, 35455, 41187, -35745, -94058, -45791, 37260, 34825, -30340, -55507, -32515, -19991, -25489, -30192, -34379, -26808, -306, 5424, -38319, -83230, -64611, -1251, 23179, -16220, -50269, -33946, -17489, -37817, -49318, -24557, -3876, -2888, -1777, -15344, -53083, -63687, -17948, 27490, 19027, -17836, -28515, -12368, -8305, -20149, -12501, 12495, 18946, 11047, 13035, 3591, -25699, -21676, 30555, 58995, 28993, -2737, 4454, 21451, 19833, 14740, 24332, 37273, 35420, 28705, 28450, 18042, 792, 15339, 53107, 50599, 12280, 4769, 28953, 27112, 3011, 4414, 25616, 28832, 11737, 928, 1287, -1972, -8499, -1326, 8549, -5145, -23675, -13420, -1594, -25226, -44653, -22693, -4568, -25763, -45641, -34021, -23457]
487b3457j3795j3708P932J3315k774r951J335J190q658M097J9754l144k2997Q470
501d2391L2823l811l2619K00L4805J7277j3922j3648N501J3797Q696M430N99q908
515B829l47K7505J9872k6715k8521K7077M2114o166l1598l240J8821J1418n34
528E2515n726q355l239J2435J6835r361l4158o855L8655K0808l5548l3709J4211
541A8508K2976l886j3406r423q645L836J7000q2l0043k2444K0891L6492o873m6644
555b1743j5728L3747K2801j7489j9915r36P086J4528J2160j7635l1944P652M5518
568A8102J8964l6136l8184J6203M5572P066l4024j7596J7006K0168N995r739k8187
581a4790j4740L3081L9105k1222n5438q595M3699K6308l0316m2527Q88L2775J3957
$$ y = [-23457, -37252, -50960, -43028, -29713, -32487, -42438, -41103, -39913, -48571, -44474, -24720, -27864, -50861, -42391, -9568, -13379, -45998, -45798, -10993, 6284, -7638, -21286, -15785, -1988, 6708, 11138, 11737, 2829, 2482, 29987, 49859, 23144, -5377, 21700, 63814, 57648, 26050, 22810, 41631, 53049, 52515, 46789, 38434, 35195, 47630, 64465, 55104, 20946, 14091, 52746, 73554, 38006, 4297, 18508, 41484, 37598, 24192, 14769, 6124, 9960, 26960, 26878, -3165, -25609, -4718, 31774, 24901, -21743, -37471, -3724, 19077, 1588, -18327, -19263, -12177, 2351, 14511, -3124, -35068, -27416, 18102, 37066, 930, -37254, -21051, 24521, 31587, -2437, -20033, -3027, 17141, 23136, 13397, -14790, -29530, 3551, 42656, 21434, -34004, -42599, 1100, 27408, -2908, -45435, -44547, -11772, 2185]
594B185j9837l1030j8742J2454L7886P999n0830m0607L2433M9202j3761n3782
606h6430j6849L5473L6305o461l7294k3655J5552L8867K2200k4253m3012Q991
618h0566O3248K5984m9707m1066L5219O3253J5960l3132l1848J0282M5439L4510
630E7576j0776l4879m193M8048M6136k3473o1180J271P3704M3981l5415n1747
642D9053m539L6898L4912l090l9164k5469K6705M4243o601o3131l9480M1892O4147
655A16376j1564p3804l7620K9228L6744k308l6253l8016J445M1151J6993n1532
667i160o1882J0659O7349K6604n7270o6277R277N8573K1520l5716m1666k687L9117
680d1559L9591j7332o4011j8919O4768O1447k6974p1936j3455O3040N4388k2425
$$ y = [2185, -17652, -48682, -67424, -54970, -17084, -9085, -59915, -100522, -68089, -18887, -32648, -86430, -103279, -67806, -31501, -37962, -75256, -98911, -83359, -44492, -22292, -46545, -89557, -80566, -17318, 8666, -41041, -82107, -46888, 16365, 32325, -807, -32655, -22373, 23066, 57576, 46800, 11921, 7728, 55776, 101912, 78439, 17259, 18530, 92234, 136215, 100800, 49053, 44514, 81412, 116324, 113234, 74070, 48601, 75306, 119549, 112948, 49817, 10337, 52229, 116376, 104812, 31008, -6612, 22616, 59360, 57052, 20799, -17217, -15772, 25379, 42372, -9160, -71042, -60383, 6966, 33570, -23700, -89977, -80700, -22127, -607, -36323, -77989, -80676, -41559, -1968, -19300, -83311, -102230, -37462, 23985, -2989, -74925, -88380, -25340, 29048, 6623]
692F623n9733j2668M8228N1345j149n3350m2314L4180P5874R232p3252m5049M9787
705a2246O9863p082o9664l9280L8806O3503R489n2568n2260P858N9741L4055m7485
718B730o8021J6063P8444K0613o8786o0284K2559O8512L2083l7708n9936j1920
730f5651M8591M7937j4235n7928j7841N9435N6307l4947p6320m524P2110N4411
742F7345j8362n7885k9749L3374O1083J4343m9190m0249L1073O6090P393o8646
754A6620m7533M7682P9111M832o6679n0214J8101N8502L0884l7447o2969k152
766a1262O2597L4022n3469p3806P239Q0126L8586o2877q2002m0O5787M1382k8997
779A7286o5895k8823M5958N8438k1496q1807k5257O9495O4788l2708q7980k6394
$$ y = [6623, -53110, -65778, -17550, 33795, 32646, -20704, -63018, -28838, 47036, 56268, -16984, -62033, -12246, 57617, 50535, -19129, -58409, -19603, 43900, 53389, 821, -51439, -43581, 16160, 50215, 2730, -65291, -49228, 29216, 49829, -18957, -79241, -56682, 11830, 43913, 6205, -53731, -65651, -17060, 30877, 16642, -41286, -59127, 308, 56615, 21668, -54652, -59176, 12934, 67345, 48983, -8902, -38651, -5277, 55806, 70149, 20959, -19290, 11783, 77873, 85266, 16620, -30913, 16769, 95880, 100712, 34033, -16181, 1920, 60422, 91306, 53859, -9110, -11262, 51335, 85357, 31888, -41918, -34679, 45447, 84033, 21156, -60846, -60886, 4901, 46283, 17286, -48609, -77432, -31474, 26964, 5468, -76339, -101596, -32101, 32687, -21, -88001, -114395]
791a14395O5806O6686j3203o5420l5021L4607O4838J4354o0853n2274M2912Q5201
803C3238O690p6819m8720M5366P8312J6599n6685n0566J9880O4432L1554l7710
815B5571n8552K707P2713M5588n0964p5483R447P8509M0555m3264o6273q533N7017
828B9038M9697k1427o5873k5955M8738O2100j2595q0696l8665O1687P2601k0358
840E8292q0913l3514M7327O1909N09o2667m9574K9701P1806J6410o7944o4233
852g2891L0789Q8697K1418p8122o5837L4293P7819J9361n2932n7119Q105O8383
864B1964M1678m6747p6572L248Q3712N1223n2430q4085m2Q1087M7887m3212o7162
877c9451o575N5774M9280k0358p1786k8506O1956O9575k2619q4987l2153O0103
$$ y = [-114395, -48589, 18097, 4894, -60526, -95547, -60940, 3898, 18252, -42601, -94875, -51963, 33238, 39928, -36891, -85611, -40245, 38067, 54666, -2019, -52585, -32705, 31727, 63281, 25571, -32981, -30274, 42439, 88027, 37063, -38420, -28973, 49536, 90091, 46827, -19446, -27979, 29038, 78735, 57308, -8565, -34520, 14218, 76318, 63723, -16973, -55638, 6049, 78650, 58292, -22621, -56135, -8808, 53101, 53610, -9057, -58631, -28930, 42876, 59286, -8658, -72891, -42102, 46595, 68013, -10109, -75946, -41653, 36166, 55527, 2595, -54524, -46419, 21964, 63642, 16895, -59677, -56429, 27283, 78506, 26076, -58009, -58051, 23036, 70923, 27711, -39451, -46026, 9748, 59028, 38670, -33116, -61622, 334, 69909, 47290, -37697, -69850, -9747]
889i747O7574j4951p3819l1867M5903N5740n294n7816m1368L0156O9743J3776
901D8030p1261o0660L5221P9891J5095o5181n5714K3754O6062J9930m7847m9945
913f2625J0849N8515L5042m0196p0124l11P9858M9925m9655p5341Q70O7465M4999
926D9271k8531n9143j2228N0264M8163j7337o2663k4443N6856O9033j6843q3475
938c1076l1626O0959O5666j0689n9492l0941L2115N2544L861n1912l7226L3734
950d083O5077P861o6526n6558L2666P8603J8004n9637m9806J6718M9112J8616
962E0047l2731m2495P394N3469K5819m5219o1901L736O8761M4173l9212o8004
974c6163p082N1398L3227k0891l9863j0089L2656L6756j5386n8113k2305N0853
$$ y = [-9747, 57827, 42876, -30943, -62810, -16907, 38833, 33539, -24277, -65645, -35489, 34254, 48030, -23231, -83891, -48670, 31221, 46316, -18865, -74579, -50825, 15237, 35167, -12680, -62625, -51776, 6739, 41781, 1585, -68539, -68850, 11008, 60933, 11278, -64063, -63193, 4272, 49271, 20740, -38403, -50631, -367, 47796, 30459, -32204, -56647, 209, 69242, 52399, -31076, -62702, -1743, 63923, 53234, -6258, -37199, -5084, 47460, 51321, -591, -37817, -4083, 60994, 68855, 2329, -54229, -21563, 57040, 75044, 15407, -34399, -17681, 31431, 50047, 17316, -25179, -17785, 35684, 61503, 16284, -45617, -41881, 26880, 71053, 31841, -36163, -43245, 8153, 41380, 20489, -19374, -29463, 3193, 39949, 24563, -33550, -55855, -5002]
986e002N7882j2756o5975l3168L8502N2232j841m3876k3468K0911L5567O338l7286
999a1940l7628K0962O0422J4250n5266m8803K0821N7684K0617l6589m1792M294
1011c2968L8669K1260k0028l5487m380L9175L3003k6734n5601l497N5409L7456
1023D6277k5206n0100j4087L3026L6769l103l4613j9060K0175L3009p64m0807
1035a8484k6139L4528N2665m075n5229l1295K4950M3441J3403k5851l1562J598
1047b2050L1211J5455k5260l1864J0539M8203K0827m3240n1485Q960N2125K7017
1059D0438k1029l5778j2690K2442K8337o804l4701r224L6588L3486k0706n3194
1071c2835j5187M4565M5421j0261m3524k0351J8779L0067P162k6143k5141J7617
$$ y = [-5002, 52880, 40124, -25851, -59019, -20517, 31715, 29874, -14002, -37470, -16559, 19008, 25346, -11940, -49568, -28606, 31816, 46066, -9200, -58003, -37182, 20502, 41119, 4530, -37262, -32968, 5701, 26961, 6933, -28554, -32934, 6241, 39244, 12510, -43091, -46588, 8821, 46277, 21071, -29029, -43116, -10090, 26679, 23576, -11037, -30097, -9922, 23087, 22323, -18484, -44623, -10095, 42570, 38495, -16734, -48029, -23079, 20362, 33765, 7914, -23648, -22050, 9161, 24616, -644, -32508, -21969, 26234, 47061, 3821, -47664, -38704, 13421, 40438, 19409, -16369, -29059, -6617, 21720, 14916, -19785, -29009, 7579, 41065, 20359, -32835, -48022, -3457, 41964, 31703, -11821, -32172, -13393, 16674, 23836, -2307, -27448, -9831]
1083i831M0861K305m4366l0831K6173M8992R587l9841l4798J2665L6409J3748
1095C1073k0367k7463j373L2269K3874k4518m2781K919M6231K5074k8652m2665
1107b6379k821L7223K8173j5066l5734j2347K3273L1122j717l8668k3823L0879
1119e885M1923j0545m7825j7971L2038L7019l404l6909k5521J6909L6521R450
1131B5800k9850l1195J0885M2943J2747m0821l5540K3164M6792O551l5925l0285
1143c4734R640L6710J9290k2751l4553J877L7555K3250k5632m0889L630M7542
1155B0935K4608l2141l9718M774L5856K1897j4491l2093j0440K7745K9826j1907
1167B4851l8449j1981L1967L3658j3074m2162j3229L0235K6932r593k7340j2904
$$ y = [-9831, 31030, 33335, -11031, -41862, -15689, 33303, 42890, 3049, -31749, -19084, 17325, 31073, 10706, -16757, -18130, 14139, 38013, 13495, -29286, -26367, 19864, 44938, 16286, -26379, -29200, 8023, 36196, 21130, -14604, -26951, -3678, 27444, 25727, -12941, -36764, -5885, 36038, 25493, -22332, -40303, -8265, 28754, 25350, -11559, -37080, -20171, 16350, 25800, -4050, -35245, -24360, 18583, 31330, -9491, -45031, -21867, 24925, 31476, -4449, -34734, -25094, 11616, 30906, 8155, -26398, -24521, 13034, 36284, 10652, -30237, -26607, 20935, 45543, 13402, -26316, -21542, 14314, 36211, 21720, -10373, -20813, 6932, 36758, 24851, -13598, -25579, 6388, 40046, 26972, -15190, -28419, 1816, 28748, 19155, -8185, -21089]
1179b1089J2533K3552L747k8129k3112J6477L3282J629l3151k3939J5693L1110
1191H603K939k5398j6325R812J8249N452j4171k0485K880L0799J6276k5476l1475
1204c8320O644L4082J6381j8125k4179L175K3423J1101j2925j7600O50K3216K2808
1217C0331j0405l6266j0456L2861K9673j0155k7382o009J7364J4007p485j7446
1229a368j143J8435J6038o394k5785j6874J5721L0345J509k6486j2058J3397R408
1242A4745j0135j2722K341J4021R195q869k0116r992R211J8293N381j5275j5095
1255a9017P843J3651p376j6456L300J6805O417p181j1028o495M378J2450P588
1268D879m951r335n76R708N338p131n091R260Q566m718l877L572Q11j631M167
$$ y = [-21089, -8556, 14996, 18743, -9386, -32498, -16021, 17261, 18890, -14261, -38200, -22507, 8603, 11542, -13856, -30181, -20369, -2120, 3332, -10839, -31324, -28444, 2355, 18631, -6845, -38320, -31676, 2406, 18787, 662, -23517, -20342, 3081, 14182, 1257, -16343, -15693, 7523, 30331, 19926, -16340, -26796, 6065, 35738, 25583, -1799, -7808, 9556, 23563, 16078, -1368, -2511, 15924, 31962, 25568, -217, -17091, -1370, 28975, 30484, 3998, -8060, 5337, 14745, 4610, -8112, -5771, 8250, 17445, 8576, -11540, -21532, -12321, 5972, 11353, -3922, -19017, -11174, 2477, -4899, -21355, -18055, -1250, 5167, -2014, -13042, -19537, -15159, -2709, 4879, -72, -9407, -9983, -275, 5063, -2068, -7159, 2101, 10667, 5949, 2072, 5644, 6455, 4824, 8991]
1283H991M100l552l402L294M960m61m984k089K915n06l891L218O994l792j1464
1298C31k852L249j25J356M984k707j0142n453K472J906k600j205O171M574q854
1313h895j4561j569Q798O698L801J504p592j0107J704O913L43N85R388Q134o837
1328a693j5525m327J4291J5505K09o596O12K223k034j028L92J785J1901J3735
1342B9450o363k3492q426J8234K0187j665j6861o366J0492P997q418j2077J30
1355B822J0322J1230r59j9525j7673R329K1503L19j9358j0169Q846R938n280j4448
1369a3103m566R419P909l515r393q107J803J2169N234j4270j2340J0283J6925
1382a552j677j4218n864P776J0516J984o289m289M148R144O090o025j3825J75
$$ y = [8991, 13091, 9539, 6137, 9431, 14391, 13930, 8946, 6857, 9772, 9266, 5375, 8593, 15587, 11795, 331, -2521, 728, 603, 1959, 6943, 4236, -5906, -11359, -8887, -6981, -9581, -10786, -4615, -41, -8895, -23456, -25025, -16227, -9529, -5728, -4224, -11816, -21923, -20219, -13306, -12963, -12378, -2990, 5144, -1693, -17218, -21545, -7254, 8251, 8460, 1864, 2476, 4699, 2665, 1637, 2029, 3814, 15715, 29450, 23087, -405, -8831, 9403, 29590, 27925, 11064, 4698, 15190, 23187, 14769, 2692, 2822, 13144, 24374, 23415, 3890, -13783, -4454, 17049, 17368, -1990, -12159, -3313, 6625, 1345, -13103, -17669, -8250, -341, -3856, -13249, -21356, -19553, -7384, -2150, -16420, -28760, -18477, -1552, -3229, -17447, -23311, -15535, -5019, -3035, -9324, -13613, -9465, -321, 5769, -256, -14081, -13906]
1396a3906K1715J5171j1508j7580L7J2322R422L24p484n462O192J0944k99j4762
1410E126j1294R992K2847M414k2449j7868P854J5530K280q417q410n22R147M808
1424A3038j3035j6762L769K1001R933j5850k2820m74K0067Q042j3451j1348N719
1437a2171J1195L005r452j5272j151K0512J6824j0817k3398m023J9652J6036q079
1450B861j7939N14J7891R431p774j3271m845J0644J9491M830j9689j5845J1158
1463b543K0381K338j4697r667P564J4199K103j1957j0275K079J2492J0842n772
1476A7087j9894p073J7268J4437j0264j7034p37J2350Q092o830j5436n179J1523
1489a690J4241j871j7985j4535R514K2289J747k3893j2688J5947J8525m381j9691
$$ y = [-13906, 7809, 22980, 11472, -6108, -6071, 6251, 15673, 15997, 8513, 3051, 9243, 20187, 19888, 5126, -6168, 3824, 26671, 31085, 8636, -9232, -1378, 14152, 16432, 8015, -395, -917, 8230, 13038, 3, -16759, -12990, 8011, 17944, 2094, -20726, -21200, -1133, 6909, -6542, -17890, -12171, -976, 2029, -7423, -22695, -23846, -3334, 13490, 2673, -20725, -24748, -5096, 10940, 2861, -15078, -14564, 3327, 12758, 4984, -8287, -13132, -2488, 17003, 21833, 2144, -13701, -2543, 17838, 20176, 5479, -4188, 3376, 17575, 19678, 7721, -2554, -475, 12017, 22859, 17087, -2807, -9880, 7388, 21825, 11561, -5473, -6210, 6140, 14232, 7402, -8034, -13213, -1690, 12551, 10680, -7305, -21840, -12326, 9963, 11710, -12183, -24871, -8924, 9601, 5220, -14471]
1502a4471j0822J0689K1609N614j9526k0685N152K5105J2966j7539k4062N866
1514b0104K8555Q204k2659j8938Q118K2853J2275j1363k3714n767K2297K0465
1526B0222r141k4362n226K2711J8986j2933k6996k460K3888J7347p276k0003j1611
1539a6854J1046K2014K137k2947j4044J6706K3718k811k6936j5987J6570K7019
1551A9631K410k2493j6706O703J9775R402j5516k2437N059K9955J2218k4822k8154
1564b4975N194L0047J6896j5951k5891j488K2213J4928j1216k2877n353K4732
1576F259K5778j1692l7135j0945K9283K7481p772k7745j0889J8208K1721m876
1588A7676k6405j2341J9272K9207J737l2533k6311J6516L6033M022k9269j8494
$$ y = [-14471, -25293, -14604, 7005, 12619, -6907, -27592, -22440, 2665, 15631, -1908, -25970, -20104, 8451, 16655, -6004, -24942, -16824, 6029, 18304, 6941, -16773, -22540, -243, 20222, 11081, -13281, -18507, 4204, 23190, 10257, -16739, -19199, 4689, 22036, 14760, -5243, -16854, -5808, 16206, 18343, -4604, -18648, -1942, 21776, 18965, -7971, -23958, -7388, 19631, 22041, -452, -17158, -10455, 9320, 18722, 3206, -19231, -14172, 15783, 28001, 3179, -24975, -19781, 10266, 27162, 11211, -14680, -16168, 6045, 20973, 9757, -13120, -18473, 6259, 32037, 20345, -16790, -27735, 1548, 29029, 21257, -6488, -17377, 831, 22552, 17676, -8729, -21070, -1798, 27409, 29146, -3387, -29698, -13182, 22851, 26873, -2396, -20890]
1600b0890J4168K4180K186k3992k1924J0372L2133J2403k4246l1367R11L1399
1612E333J8874k1048k8804N664K9687J0443k1864k5876J8K7769K3286j1805l2683
1625b1006j0330K4249K4174q690k9354p441K7841K4473j4641l3363q399K4054
1637h433K7033L99k6273k0632J3432K9417K219k8060j7163K0110L1650R08l2990
1650h383k3590J6156L2405Q884k0111k2797J458K4755J5014j9275k7273O935L4140
1663A8318J4267k3685l0777L49K9890K0736j2763k5743m930J9621J8410p630k6966
1676a0903r724K6908K8446j1076l5088j1251K3153K5887l281k5879j4141J6448
1688e01K4177j058k6642j8920J4684L2623P148l1172k7605J3999L2455N165k5491
$$ y = [-20890, -6722, 17458, 19644, -4348, -26272, -15900, 16233, 28636, 4390, -26977, -26066, 5333, 24207, 3159, -25645, -19981, 9706, 20149, -1715, -27591, -27573, 196, 23482, 11677, -21006, -31336, -7087, 17087, 8397, -20957, -28398, -557, 23916, 9275, -24088, -32487, -8433, 18600, 18999, -7274, -27906, -14474, 14943, 17162, -10898, -28061, -7951, 23699, 24607, -8383, -31973, -15817, 16588, 25472, 5361, -17436, -15978, 8777, 23791, 4516, -22757, -15822, 18318, 32585, 8900, -21877, -21528, 8362, 29098, 16335, -9408, -14338, 5283, 23693, 16063, -10903, -20627, 6281, 34727, 23651, -11437, -22688, 465, 26352, 23071, -2808, -16949, -501, 23676, 22618, -4024, -22944, -8260, 24363, 31511, 339, -27266, -13267, 19188, 24353, -1138]
1701a138k1549R495K7637J0167k3504k8651L412L1270J8977j8304l2728l384L0937
1714B637J9401k0524k8460K682K7314J6582j4021k8771r308K4586K6556o011k9530
1727a6867j2196K0788K4848o719k9396q504K5034K3946p454k6330j3777J4168
1739a2459K7099P001k3154k1536J1482K7743M910k4042j9753J2668K9968P371
1751B7298k4204k3548N821K5554J5393j2504k6605n440K5562K0714j5355k9358
1763a6672k284K7283K0724j3013l0345q014K3179K3083n725k5449j3997J6079
1775e151K6860n67l0669j7104K2493K9458m442l0012j5791J7678K7616K043k5928
1788c516j8657J3049K7084O047k4807k3805J2004L3982P670k9953k4400J3290
$$ y = [-1138, -22687, -13192, 14445, 24612, 1108, -27543, -24131, 7139, 26116, 7812, -24916, -28300, 2637, 22038, 1514, -26946, -24264, 3050, 19632, 5611, -23160, -32468, -7882, 18674, 12663, -16867, -29063, -8275, 16573, 9854, -19542, -28046, -3012, 20934, 13480, -12850, -26627, -12459, 14640, 21641, -1513, -23049, -11567, 16176, 21086, -2956, -22709, -10041, 19927, 27298, 3094, -20454, -14633, 10921, 26314, 13810, -12795, -18235, 7327, 28041, 12686, -16672, -18956, 8327, 29051, 16038, -14307, -22321, 858, 23941, 18216, -7233, -21230, -5151, 21709, 21142, -9527, -26631, -4138, 25320, 20878, -9134, -24925, -7247, 20369, 22412, -3516, -22173, -9124, 17960, 24007, -800, -24605, -12601, 21381, 29051, -902, -25302, -12012]
1800a2012K9671P946k1489k3204M294K7034J2970j9064k6046J209K7646J7870
1812B6825j7766l1080j426K7853J7518j4495k3803m519J7266J7657o029k3556
1824a5555r983J7880K1807l583k5492j5070J5659K5086O9k2980j2971J1703J8327
1837D897K849j5345j5913O389K4400R518k0144k2248O220K7171J3138j7964k2906
1850a9938M366K4853J1595j4946j9750j75K2187J9224j0966k8981n465K7382K2139
1863C1525j2762k7800n453K3893K1238j0229k6866q023J9903K1561l559k4883
1875a455j4719J6603K5557l832k8724j1981J9719K2544l872k4701j4774J2279
1887g356K1630K116j7962j3981O619J7479M137j8507j6584J0937K4243L313k0728
$$ y = [-12012, 17659, 25605, 4116, -19088, -14794, 12240, 25210, 6146, -19900, -18691, 8955, 26825, 9059, -22021, -23447, 4406, 21924, 7429, -16374, -20893, -3627, 14030, 8001, -15555, -25538, -7658, 14149, 10566, -14926, -29996, -14337, 10749, 10818, -12162, -25133, -13430, 4897, 7746, -7599, -23512, -17123, 7277, 16795, -3349, -25597, -19377, 7794, 20932, 2968, -19938, -15572, 9281, 20876, 5930, -13820, -13995, 8192, 27416, 16450, -12531, -17996, 9386, 31525, 18763, -9037, -14490, 9403, 30641, 20412, -6454, -14477, 5426, 26987, 23428, -1455, -16174, 429, 25986, 22154, -6570, -18551, 1168, 23712, 19840, -4861, -19635, -7356, 14274, 16390, -1572, -15553, -8934, 8545, 12682, -5825, -22409, -11472, 12771, 16084, -4644]
1900d644j6654M222J7359J0123p960j3800j476J1667P658p447j4356q58J8729
1913B563J5112j0382k2376n171J4780J5218J387j1325j0547M189J3067J886j3929
1926e528r476J1000J9873K460k1540j8554Q720K2867P317j2729j4784j66J3969
1939C429Q979j0617j7311L810K2370R302j7640k2233K025K3494J3561j3143j9602
1952a3576M51J6025J0016q115j6179k662J7388J4752j0377k1344j897J9461J3454
1965A7397q968j8387k900J5706J2360o400j4071l765R094J0926l48j2950p263
1978i569J0788J3381m690j5027m908R628J1803R35j0228q649J609P805M967k767
1992E078p794j648Q925N453r541j1246L032J2494O909m879j1792p532N739J2001
$$ y = [-4644, -21298, -17076, 283, 10406, 2446, -11354, -12830, -1163, 6495, -952, -15308, -16166, 2563, 17675, 7293, -15083, -20254, -5474, 9744, 11131, -194, -10741, -6552, 6515, 8401, -5528, -15004, -4004, 15869, 18329, -3211, -21765, -13045, 9822, 17139, 4410, -10374, -10540, 3429, 12408, 1791, -15520, -11710, 10660, 19962, 2322, -19911, -17886, 5608, 19169, 6026, -13576, -13125, 2900, 12916, 4801, -11378, -14040, 3348, 18100, 7723, -13621, -15518, 3943, 17397, 8429, -9958, -12858, 2848, 15208, 8808, -5263, -9028, 66, 10992, 10644, -2306, -9569, 1219, 14600, 9910, -5117, -10025, -397, 11406, 12341, 2113, -6536, -4927, 2878, 7845, 5078, -2716, -4364, 4561, 10014, 473, -10773, -7741, 4753, 11662, 6783, -5009, -12541, -6802, 5199]
2006E199K843q830p793L729J0342l47j3849o721J2307J4828k422j4899r656M514
2020a0755J3576O306q519j1507L104J2456K104j2026r808Q233J7449K026j6750
2033d111j1593P815J3466L008q149q366J961J0715M187j0360r808O239J3869L133
2047A2006j1820j0453M640J2685K890q545n586K904N352K323k281n954p29P037
2061D469M305m991n770J098N265K247k878l180K31J865J01R46Q07l207l131L034
2077A211L733k526l805Q94K183O77j102l108j900K192M033M02m543m830J126O958
2093A595J748p710m366O193N990l326o934j583M405O251Q40o898n473L629P371
2108A732J638o025n660L746R051k44r075k528O401M802j364l089j891Q69L466
$$ y = [5199, 8042, -788, -8581, -4852, 5490, 5143, -8706, -15427, -3120, 11708, 9286, -5613, -15269, -10755, 2821, 9127, 608, -10899, -7795, 4661, 6765, -5261, -15069, -6836, 10613, 12639, -4111, -15704, -7889, 5577, 8585, 436, -7930, -5969, 4746, 8933, -1427, -11235, -4996, 8873, 12006, 186, -10267, -5627, 7058, 9948, 1403, -4183, -1279, 4073, 6396, 4115, -1839, -2568, 4469, 8774, 3783, -1987, -889, 4376, 6623, 3745, 565, 796, 2661, 2762, 3708, 4515, 1308, -1823, 1211, 4944, 2418, -1387, -493, 1690, 2367, 1265, -1843, -3743, -1551, 2482, 2884, -1659, -6489, -5363, 1595, 3343, -4367, -8733, -2540, 3450, 124, -6810, -8393, -3988, 2263, 3103, -3795, -9268, -5639, 1732, 3370, -2655, -8315, -4569, 4482, 4238, -4837, -7365, -964, 3838, 2474, -615, -2506, -1637, 1829]
2123A829J067k592j498J902K508m61l204j244L659K186l202k350L875J808m480
2138a97k947L120L061m04k233k270K08K192N40k055j343J283K979K22n486m211
2154g541N257P939k612p940n82N779K601l211l992Q36O624L303m602p828l19P551
2170A263P681j477r483l697Q030O355n388o491L026P262K257n016o643j536O314
2185B457O777m52o092m910J755M799k9m410n5M920M40n040l446M84J542K192K330
2202C262j741m817k553J753K735N60j729r85J086k29k185j081M76J050L419K407
2218A428m983p313K071Q801L444n574n744J376O720K395n479m415L411P233K141
2233E512m946q122J90J1230Q150p621j1562J241J0369N110n478o991J211P610
$$ y = [1829, 2896, 304, -1194, 708, 3216, 2755, -449, -1693, 1966, 4152, 950, -1400, 2475, 4283, -197, -3144, -24, 3037, 2633, 400, -1870, -1662, 530, 1070, -985, -2328, -1045, 1934, 2156, -3330, -7541, -2284, 5655, 3043, -4897, -5479, 300, 2901, -310, -4302, -3466, 3158, 6461, 1859, -5969, -6288, 1263, 8944, 7467, -2016, -5713, 2317, 8672, 3284, -3207, -181, 7081, 9338, 4322, -2321, -3857, 2457, 9234, 8782, 2690, -2220, -465, 4334, 4305, -105, -160, 4760, 5200, 160, -3286, -2802, -1260, 932, 3262, 1521, -3296, -5849, -4096, -1361, -801, -2530, -3515, -2429, -2658, -4843, -5924, -5448, -4398, -979, 1428, -3555, -10868, -8797, 4, 3448, -2126, -7870, -6494, 226, 2621, -2858, -7273, -3862, 3371, 5512, 566, -7556, -7366, 3864, 12014, 4393, -7169, -5928, 4441, 9551, 4073, -2918, -1707, 5903]
2247E903L116o535o476J741P831O001m802j0740k318R361O736n303p025J433N051
2262C974O99m529m031J724O024K881l684o671k929M241P149M90o608k849L545
2277e74J308j968q82P69R35K272J013l607m803m57N826N948q36p485m299L875
2293b965N229L86k805k327K60M566J786n953o156M026J0013K353q499q941K151
2308f876J0373L887o904o065J834N835K374m020p025K53J0184N871q629j1088
2322i996J797J1499N389o316r016L31Q152L801m303o405r1O631O254l430j1055
2337f758k280J0229Q216m308r063k604N433O481j83o167l400L575N336P37n473
2352b29o138K434R909K960q213p556K154P454M024l026o963k270O310N766k614
$$ y = [5903, 9019, 2484, -3992, -2251, 5580, 11581, 6779, -3961, -6279, 3082, 9818, 4515, -2510, -1077, 3974, 4673, 144, -3887, -2163, 3861, 6742, 3058, -3613, -6542, -2301, 4848, 5338, -1270, -4119, -574, 734, -1234, -2116, -1347, -412, 1860, 2873, -734, -5537, -5994, -168, 5780, 4944, -2541, -6840, -2965, 2264, 2650, -155, -2482, -2222, 2344, 4130, -1823, -7979, -3953, 6060, 8413, -86, -9027, -6876, 3497, 7384, 480, -5585, -3751, 2084, 4458, 438, -6587, -6334, 3850, 9721, 1092, -9996, -8199, 3300, 8689, 2373, -6643, -6312, 1840, 5641, 1338, -5067, -5158, 1473, 7727, 4297, -6758, -9038, 1191, 9407, 5099, -3964, -6568, -1135, 5346, 5163, -1004, -4404, -829, 4507, 5244, -229, -6367, -3933, 5976, 8936, 723, -6833, -4679, 2775, 6799, 3773, -3190, -5460, 850, 6616, 4002]
2367D002q061k819P552R498l221j2510m443J0075R705k810r480n441N395R927
2381G369J342j0982p896P143J2859O32j3404r805P552J5271R56j3941r052O618
2395e338J1692K809r967j1111L286J4668M950j2457j2819M358J4990N359j1581
2408a161j3038L515J3973M987r207j0845O08J1732Q539o892j4320r63J4033R481
2422A0442p231j3223j517J1834R985m923j2336k728J0098R876j714j1116p126
2435i679Q234J4115K0j3941p390Q649J2648O74j1417q552N497J2976L088j0338
2449D584j0637K373J3411P280j0736j4784K061J5895O181j1030j2477L95J2425
2462D941P893p645j4459k008J3083J0307p030j6147m646J4221J3168p011j7203
$$ y = [4002, -4059, -6878, 674, 10172, 6951, -5559, -10002, 73, 9778, 6968, -2512, -7953, -2558, 7369, 8711, -2271, -10167, -3024, 9835, 10467, -2937, -12742, -5190, 10081, 11037, -2904, -11956, -5338, 6354, 9163, -804, -11915, -8629, 6039, 10989, -1468, -14287, -9929, 5061, 10420, -1161, -14199, -10684, 3289, 8276, -931, -11776, -11168, 564, 9103, 2211, -12109, -13072, 961, 10442, 3211, -10012, -11529, 305, 10290, 5367, -6969, -9697, 401, 10277, 8563, -2553, -9679, -1445, 12670, 12690, -1251, -8641, 8, 12656, 13330, 1913, -6639, -1142, 11834, 14922, 4584, -6053, -3680, 9731, 17011, 6275, -8509, -6448, 9447, 15628, 4598, -7879, -7484, 4941, 12834, 5189, -9270, -11278, 1805, 12112, 5082, -11065, -15711, -1490, 11678, 4667, -12536]
2475a2536l537J2951J0618m142j3880n854J0640J3547k428j5631p621J0615J5435
2488H177O2j5531r358J0131J4843p35j3086o737P485J2566K540j1815j1055N941
2502f572J5567M382j1725j1743L515J4038N335j0448j0611L739J1688M387p642
2515C910j1160j042J1664R582o293j4319k514J1392R089m967j2308l144J0054
2528e6R115m132j1626m882P708J1602M49j2534r108P912J3523K76j2168p185O414
2543d692J1833K466j0586q968M905J2077M719q642j0834J705J3726P037r700j2428
2557g382K990J3207N853p783j0734p47J0896P832n867j1646j723R874R105m491
2571I384j3922m525J1419J0278n226j2131l843P143Q373j235j0494o181O480J0341
$$ y = [-12536, -16073, -3122, 7496, 3354, -10526, -16380, -5740, 7807, 5379, -10252, -17873, -7258, 8177, 8239, -7292, -16650, -6519, 8324, 7589, -5497, -12234, -4749, 7817, 10357, -1458, -12513, -6572, 8995, 13377, 1652, -10091, -6576, 7462, 12797, 2349, -8262, -4523, 7165, 11552, 3910, -7250, -8292, 3372, 12954, 6661, -7658, -10172, 1220, 10309, 5342, -6966, -10110, -56, 9059, 4927, -6699, -11581, -3873, 7729, 8178, -4356, -13464, -5552, 7971, 8247, -3921, -11106, -4692, 7141, 9607, -979, -9947, -5042, 7035, 11754, 3112, -7722, -6017, 7709, 14746, 5046, -7382, -4392, 8815, 14668, 6885, -3849, -4596, 6300, 14132, 8265, -3381, -5104, 4770, 13875, 9384, -4538, -9063, 2356, 12634, 7408, -4723, -8566, -1423, 6950, 5715, -4779, -10960, -4480, 5861]
2585E861o70j1643q224O071J2107J741j1410q286N294R306J955p013p530J793
2599a0648J0449N494p914j0851J512J1932O895n854j0821m78J0802O824n297q688
2613f643q04Q404Q497k058j1536m973R571J1077j887j0952m723P248R450r23j0333
2628e85n274O752R567O26q922q787L026J1792L881j0016r232M179J0247K110q686
2643F78q783L005J0585M365p850r713J65Q785P139m872j1253q05J1146O304p061
2658A835j0137o2R427P446l409j0445l788Q033Q607j397r600m760P002J0362j704
2673G410j1881m575Q089R374n72q665o461L589R536K476q245p675L723R565K774
2688H462q323r272K920J1034L193p993p599J144P494M985m495r060q73R066O175
$$ y = [5861, 5191, -6452, -14676, -8605, 3502, 5243, -6167, -14453, -9159, 147, 2102, -4911, -12441, -10648, -199, 5295, -2619, -13470, -11958, -26, 6869, 1015, -9806, -10284, 518, 7342, 2045, -6643, -7447, 957, 9454, 7396, -4140, -9113, 458, 11535, 9648, -1304, -6027, 1221, 10671, 9748, -585, -5859, 893, 10460, 11086, 2164, -6623, -3597, 8195, 12076, 2060, -7172, -2993, 7254, 9364, 678, -8105, -5100, 5485, 9850, 2000, -7713, -7548, 1237, 8376, 3504, -7749, -8554, 2592, 8896, 1835, -8302, -8364, 1063, 8509, 5100, -5345, -9133, -1100, 7507, 6110, -3490, -8250, -1248, 9114, 7410, -4471, -9046, -957, 8417, 7845, -820, -7281, -3692, 5844, 8320, 75, -7600, -3877, 5688, 8462, 139, -9133, -6213, 4821, 8014, 21, -7578, -6434, 1060, 6045, 1550, -7510, -8383, 683, 6858]
2703F858n369r733j232Q906P252m225r823j443P895N965k462p149l509N410Q765
2718F106o17r748m732O753R035m87q509n231N084Q678M84p431n050L077P581L293
2734H286o223q395K273J0044L227p436p059K028P391L694m806p304O02P030L941
2749G293l747p237j590O930O680l803q919j475P385M875k881o390k308N019N782
2764E614j535o933l238M478O436M30o861n282M425P337m66o683l628L507N432
2779C033J388m748n451J189O409K853m274n662K71O300L550m606o210J386N876
2794A304K520k735m532k129L580N280n84n769j811M293M168j693n587j790M883
2809f02N337j321n232k220J528M330K438l339m363K173N290J49n484l225L148
$$ y = [6858, 1489, -8244, -9476, -570, 6682, 2457, -7366, -8809, -914, 5051, 2589, -4560, -8069, -2659, 6106, 5489, -4259, -8991, -2238, 6797, 6310, -2199, -7430, -2346, 6332, 6816, -615, -5665, -2588, 4993, 8286, 2063, -6332, -4059, 5985, 9212, 1776, -5283, -3255, 4136, 7830, 3024, -4280, -3678, 3352, 7293, 3546, -3691, -5281, 1649, 8329, 4526, -4393, -5868, 1517, 6392, 3511, -2879, -5187, -168, 5614, 4079, -2854, -6092, -1614, 4822, 5252, -1609, -6891, -2466, 4871, 4405, -2278, -5906, -2399, 3033, 4421, -327, -5778, -4589, 1820, 4673, 399, -5263, -4992, 1308, 4858, 252, -5958, -4572, 1304, 3824, 1089, -3443, -5572, -1992, 3288, 2704, -3065, -4876, -583, 3585, 1892, -3695, -5485, -602, 4735, 3414, -1818, -4038, -2510, 1820, 4258, 919, -3444, -1271, 4019, 4168, -1316, -4541, -1393]
2824a393N851J970m932n280O12M523K877j325l686j569L701L979l617n944O71
2839c562N932L490k926n327k332L590M526l19l929j999J659L393M80m637l467
2854e428M156N642r52n239k579K024L447J760k695l412R77L704J527k594m005
2869c667L49M836L074l942m360J388M083J491k270l074j028L357M409j503n206
2884b063j652K950M094n92m258j872L927L383k426m303j380K735M310J476m145
2899A84m943Q98M693J903l075k237J408L371om667k778L024M304J938j846m541
2915b370k319L324M279j127l183N08L083P68k943l494Q01N013K890j833l600k139
2931b342Q53L699J642k777k172K824K320k339l597k65L073L032J15l369l111Q27
$$ y = [-1393, 4458, 6428, 1496, -3784, -3172, 1351, 4228, 2903, -783, -2352, 1349, 5328, 1711, -4233, -3562, 2370, 5860, 2934, -2393, -4725, -1135, 3391, 3072, -857, -2856, -1197, 2196, 2676, -1961, -5428, -1272, 4370, 3418, -1821, -4400, -2376, 1071, 2831, 136, -3276, -2299, 1405, 2932, 338, -3667, -3318, 1518, 4592, 650, -3710, -2322, 1761, 3252, 982, -2092, -3120, 237, 4646, 3143, -2063, -3715, -765, 3329, 2737, -1521, -3393, 534, 3917, 1491, -2812, -4192, -1457, 2853, 4329, 184, -4759, -3861, 832, 2735, -340, -2577, -1169, 2202, 2196, -2471, -5249, -2225, 2079, 4017, 2171, -2370, -4689, -1365, 2914, 1787, -1396, -888, 2195, 2963, 20, -3474, -2673, 2340, 5230, 3397, -203, -2342, -1489, 2210, 3852, 1075, -1097, 1727, 4047, 1708, -1889, -2154, 919, 3951, 4066, 697, -2414, -1587]
2947a587K637J319q75k573m89L136P92l659k253K244K749J85j580k127o86J962
2963h05J813j038k056l91J527J775q80k800n41K723J297j743j236K32P07R75K20
2980b21j616j489J289K059N97j528j786R1J982N06j720n4J288R9k50q8j027q83
2998b751K068K348o01k341n97R54J195K40k72p1Q60M09o88j5n62m0K215J836j633
3017B554k378N93J859P39j24n00p4O84K65p42n51J98P08J493J62k452j850J492
3035B076K068n30j324l43k22L51K39q33j450N0J083Q24r05k769j075J853J760
3052H53j509j972N2K69K92L27j165j804Q17K523K70k926j752Q90K922J342k704
3069c275j933J439J808O5p83j197J17K648K205k271l661Q76M266K155j950k686
$$ y = [-1587, 1050, 2369, 1494, -1079, -1568, 1568, 2360, -1299, -3552, -1308, 1441, 1626, 46, -2081, -2767, -805, 1008, -30, -2086, -2477, -950, 825, -55, -2855, -3396, -673, 624, -1119, -2355, -2123, -1416, -441, -221, -1837, -3326, -2037, 22, 619, -909, -2695, -2604, -622, -116, -1836, -1890, -602, -503, -753, -841, -1868, -2751, -683, 1665, 1064, -1277, -1874, -920, 275, 515, 243, 172, 1032, 1441, 753, 738, 176, 136, 2351, 4187, 2554, 176, 769, 2628, 3367, 3243, 2743, 2669, 3353, 3618, 2876, 2325, 2523, 3231, 4724, 4886, 2434, 584, 2076, 4144, 3614, 2290, 1947, 1725, 2076, 2315, 1482, 32, 82, 1165, 1989, 1084, -1685, -2760, -907, 853, -656, -2628, -2576, -2307, -2015, -1688, -2853, -4657, -3840, -1317, -1047, -3973, -5725, -4835, -1913, -571, -3275, -5208, -3769, -1961, -1896, -2679, -3876, -3759, -1111, 1094, -1177, -4838, -3962, 304, 2459, 509, -2177]
3085b177o03L156J716j759k161Q28K352J774q41l853j715L492M301j381m083j250
3101b204K571J974r63k422r12K685J974j343k742j859J208M022J392l688l296
3116c603J891K812K40k114j253J318K255Q99k225k474P85L087K494j160l784o32
3132a464L788K770k055k557O80K062J868j69l097j428K647L278q50l448j977K584
3148B632L966m3n081k596K925L206k58k706k816N71L077P18m158l238K183M305
3164B687M88m693m870R01N042J791l666l331P88J943Q26k191l028M94N460J918
3180E59l968n161J49M784L539j119l689l59K530J582j481j495K98L085L607q65
3196A996n202j771L830M292N80k686j869O53K716K67k180r97K032K744P57l107
$$ y = [-2177, -2780, 376, 2092, 333, -1828, -1000, 1352, 3126, 2285, -1568, -3283, 209, 4510, 3129, -954, -2204, 367, 2341, 1378, -1044, -1956, 729, 2703, 1360, -1382, -3241, -2033, 1989, 3381, -307, -3603, -1712, 1100, 1340, -774, -2027, -709, 1546, 2445, 220, -2254, -1469, 1618, 4112, 2952, -832, -1464, 2324, 5094, 3039, 482, 1162, 3224, 5092, 4923, 1826, 398, 3045, 6323, 5473, 2025, 48, 2632, 6598, 6555, 1474, -1122, 1803, 5009, 4751, 2045, -771, -200, 2877, 3595, -563, -3801, -1618, 2687, 3175, -1518, -6388, -5487, -445, 1346, -2320, -5651, -4863, -2920, -2094, -4285, -7313, -6819, -1359, 559, -3409, -8570, -8421, -3637, -98, -1217, -4906, -5265, -2735, -1153, -2634, -4129, -3831, -746, 2861, 1996, -3206, -4977, -1147, 3145, 3725, 1039, -830, -177, 2539, 2806, 626, -371, 1661, 4405, 5162, 2055]
3212B055m151N30N186K555l109l716k43K395J926j320l814l48L508K430k360m263
3228b739j601L456M662j261n573k127M349L674j277l933k024K540M568N7m351
3243a580k506K935M517L12m301l328L529N525K62m920k582K324L865J401k206
3258C247l455J070M178Q93l913l217J962M635J896m273m490K86M044J769j994
3273B638k618j011J824K000j706m697m20M367K522k077m870k405K536L875K9l403
3289c416k078Q80K391N25k559l090J669N039J077m281l783J346M378K875k193
3304a220l934O09L665K039j949k739Q5M384L672k605n394K24N431L157k097l978
3320f50p29L808L358k006m318m39M106L263j387n081k306M576M641k201n402j049
$$ y = [2055, -2096, -1566, 3620, 6175, 3066, -650, -893, 1502, 3428, 2108, -1706, -2054, 1454, 3884, 1524, -2739, -4340, -884, 3778, 2517, -3056, -5183, -834, 2840, 1563, -2370, -4394, -1854, 2714, 2771, -1580, -4086, -1151, 3366, 3678, -623, -3951, -422, 5103, 5365, 445, -2137, 187, 4052, 5453, 3247, -208, 862, 5040, 5933, 2020, -1197, 765, 5400, 7296, 3023, -1467, -1181, 2863, 4632, 2638, 20, -991, 833, 2833, 1127, -3570, -3990, 377, 2899, 822, -4048, -6453, -3917, -42, -13, -3416, -5494, -4614, -2223, -1698, -4257, -7347, -5678, -639, 438, -3843, -7626, -6280, -1902, 973, -1220, -5154, -4545, -880, 1159, -790, -3529, -3444, 940, 4612, 2007, -3387, -3163, 2268, 5425, 3328, -650, -1379, 2429, 5787, 3781, -537, -976, 3130, 6393, 5006, -75, -2381, 2195, 6836, 4635, -767, -1816]
3336a816L268L243q96m242k721K975M105k13m535k613J595M343N76m094l268K189
3352b104L827J94k870k148K83K972K168j898l492Q4L436J981j448k872p23L208
3368E98K167j639k554k62K063K164K48k961k117K140L802o17l534j807J943L402
3384C036O1l503k565K040L417L27l045k886M42L938K249l713m347J116M668J391
3400B626l278l619L25L937K013k269l805JL160K383j219l969r70L915L217k149
3416B99l539k47K968K192p56k618r13K392K334j175k067r82K122K776q5l239j702
3433b240K471K607o1j983j178L25K133P35j736j940P50K477J396j708l303m55
3449a710L110K533j612k821l67J264J681K3k517j912K364L181m28l705k415J912
$$ y = [-1816, 1452, 4695, 3799, -443, -3164, -189, 3916, 3703, -832, -3445, -1850, 2493, 3069, -1025, -4293, -2104, 1723, 1917, -953, -3101, -2818, 154, 2322, 424, -3068, -2984, 452, 2433, 985, -1887, -2610, 598, 2765, 1126, -1428, -1690, 373, 2537, 2785, -176, -2293, -153, 3649, 3032, -502, -2309, -366, 3036, 3097, -406, -2971, -931, 2486, 2813, -232, -3118, -2676, 1262, 3511, -202, -4549, -3433, 1235, 2626, -652, -4271, -3946, -9, 2004, -265, -4070, -4069, -909, 1474, 255, -3714, -4684, -769, 2448, 299, -3240, -3487, -519, 1673, 917, -1701, -2614, -222, 2112, 937, -1130, -2112, 10, 2786, 2701, -538, -2240, 231, 2838, 2777, 794, -384, -59, 2074, 2809, 1073, -867, -117, 2360, 3756, 2048, -1255, -1710, 1400, 3933, 2321, -500, -867, 397, 2078, 2101, -416, -2328, 36, 3217, 2789, -916, -3331, -1419]
3465a419L937P18l095k604J202K677M37j875k202N99L486J437l607l421J397L941
3481A608J183k563l055N58L337J017k526k543R65K893J402j862l752k89L931K345
3497B649k303l505K11K754K300j653l201q12L097K159p07k711j489J712K833M54
3513A788l560j615K385K753k73k123j798P49K515J438j791j808n0K157J542j477
3529H32k655K52L423J360k283k381K50K018K036m83k760r14K130K078j269k740
3545a106p03K793K760j104m069j214K804K705m80k669j784J453K920J6l597j891
3561c166K521L296K7l478k765J508L817L73k866k034J292K207P30j853k571N78
3577b384L485J274k606k325L64K536J425j759k185O75K180Q67j477j512k25J623
$$ y = [-1419, 2518, 3236, 141, -2463, -1261, 1416, 1853, -22, -2224, -1625, 1861, 3298, -309, -3730, -2333, 1608, 2791, 228, -2827, -2269, 1068, 2085, -441, -2984, -2019, 874, 2276, 414, -3338, -3627, 304, 2649, 346, -3159, -2948, -194, 2106, 453, -2748, -3560, -463, 1696, 989, -1722, -3211, -1499, 1334, 1788, -1772, -3387, -1002, 1751, 1478, -645, -2443, -1694, 821, 2259, 468, -1340, -1390, 767, 2309, 832, -1823, -1571, 1852, 3212, 929, -1452, -1202, 816, 2852, 2369, -391, -1305, 825, 2903, 1634, -1106, -1809, 984, 3744, 2640, -1429, -2643, 161, 2866, 2386, -283, -2067, -614, 2306, 2322, -1275, -3166, -645, 2651, 2678, -800, -3565, -2057, 1760, 2133, -733, -2767, -1475, 732, 1462, -391, -2962, -2384, 1101, 2375, -231, -2556, -2192, 344, 1769, 10, -2175, -1500, 680, 1547, 70, -1442, -1667, -44]
3593d4K270q87k897k10K278J530r83j756l98J394J836m36k179p65J090J842N64
3610B249j583k244R60K671K61k218j376J230J497R27j511k093O5K204R34p64k042
3627h33o48J973J781j184k748J84K285J086j294j601q95J127K248m35k123r04
3643a981J344J727j30k091j335J619K099l88k313l70R62R95O53j107j577N73J947
3660F27N41j727j250N50J678P79j597j444N73J469L54m54j161o31J093J476k82
3677E94k150j13J476Q79m47j209p39R12J385m27r14n48K48J221O35r36j497M13
3695a217J831K45j228j090O01J264O71o48j227p9J346R05m39j042p52J251J817
3712B209n39k066J24J320R78k81j144r23J110J619p8j670n15N58J556L41j769
$$ y = [-44, 2226, 1339, -1558, -1768, 510, 2040, 1057, -699, -1097, 297, 2133, 1697, -482, -1247, -157, 1685, 2249, 666, -1578, -618, 2053, 2314, 96, -1280, -50, 1447, 2374, 863, -1230, -1165, 1039, 1973, 1209, -833, -1481, 492, 2273, 1089, -1659, -1475, 810, 1896, 602, -999, -1894, -767, 1481, 1046, -1077, -1981, -637, 1090, 960, -1131, -2466, -847, 1252, 864, -1449, -1819, -857, 138, 791, -316, -1893, -1320, 627, 1168, -559, -1809, -1259, 419, 1198, -399, -1843, -1270, 199, 553, 99, -1062, -1693, -600, 876, 594, -1556, -1669, -193, 686, 239, -970, -1709, -797, 588, 161, -753, -1301, -1053, 168, 803, -133, -1630, -1217, 614, 859, -369, -1459, -858, 406, 1077, 429, -798, -877, 469, 1374, 935, -107, -859, 392, 2209, 1670, -396, -272, 1048, 2026, 1745, 601, -322, 788, 2407, 2329, 659, 144, 702, 2258, 2599, 830]
3729H30j361J140J983m62j570n62M35J216M97j114j505j23J650Q02j166j517j62
3746i89J576Q64j182j590M34J062K61l86j392n17R71J665n83j779n99J073J168
3763E7j45j433l83J017J188p19r96o39O57J225P36j274j414N27J483K98r08o97
3781a420L12J339J91j064r03M29R25Q79n22j290o45J129J641q46j518O9J220N75
3799E01m95r23n12J171J040l02j124j075O28J578O79j478j331R44J321r2j131
3816f01l88N52R02P25j057j264N37J348O60p07j187j48J607R16j113j005M48J177
3834A402J35l95q07o9Q23J508q11j410j56J023R08R7j349l10J022L36m94l76j67
3853I10J80N14N31j082r73M50P64N12q49n68l66M43P30o35p90%K08M01R1j140
$$ y = [830, -531, 609, 2592, 2130, 560, -2, 433, 1649, 2146, 1032, -473, -596, 1054, 1856, 690, -827, -989, 587, 1451, 269, -1321, -887, 175, 436, 50, -1342, -1859, -888, 777, 194, -1585, -2184, -1111, 57, -88, -1521, -1904, -887, 301, -418, -1414, -2053, -1396, -171, 565, -709, -2123, -1596, -113, 185, -723, -1420, -1108, 231, 422, -642, -1545, -1116, -191, 688, 166, -1124, -1769, -640, 1001, 155, -1363, -1294, -74, 501, 6, -917, -1429, -258, 782, 480, -644, -1719, -1091, 487, 1166, -312, -1643, -699, 622, 530, -601, -989, -437, 465, 1190, 133, -1131, -594, 754, 1414, 707, -480, -628, 979, 1895, 782, -223, 225, 1402, 1537, 1142, 335, 266, 1089, 2597, 1786, 376, 220, 1243, 2151, 2248, 899, 589, 1611, 1947, 1453, 1077, 910, 1090, 1604, 2135, 1053, 80, 530, 1294, 1806, 957, 389, 23, 466, 1196, 561, -229, -229, -21, 380, 471, -669]
3873f69j208R85J210l09j425n41M67Q53L60j000r92J83J064M3q13j061J58J800
3891h95P77j626j843R27J819K00p51j266R2J413R04q35j603O07J505J109p81j653
3909a900k27J945J276j127j255L97J067Q69l1r95o93J433R81l70j144n09J129
3926H46J174K49j669o91J167J036m15n86n61P0J208N04j309j083M91J199N95j150
3944A075j252j92J609P64j033j081r6P22J101m93j415q40J651J392p88j687q50
3961a413J497J320Lj979j117J604J561k50j588j075Q09J903L66k235j235J411
3977d18J789k19j688j141R00J699K06k057q85J039J173L40j459j693J018K084
3993F88j6k121r44J169J204R2j330r86L97J665K51j314r63j6J230J163p83j573
$$ y = [-669, -1877, -892, 318, 9, -1416, -1957, -1490, -637, -277, -1277, -2269, -2086, -1022, -979, -1792, -2853, -2695, -895, -118, -1744, -3587, -2660, -841, -641, -1392, -2658, -2566, -1153, -249, -1084, -2687, -2080, -575, 534, -247, -1900, -2127, -182, 1094, -33, -1288, -891, 176, 1045, 1014, 19, -674, 759, 1740, 1370, 226, -283, 846, 2020, 2269, 600, -91, 1076, 2112, 1697, 1111, 550, 620, 1828, 2332, 1023, -60, 431, 1630, 2225, 1075, -177, -369, 1240, 2004, 971, -110, -206, 516, 1617, 1124, -291, -1131, 520, 1912, 1124, -563, -1413, 84, 1404, 1407, -572, -1689, -85, 1476, 1226, -362, -1437, -628, 1275, 1641, -594, -1829, -418, 1371, 1152, -536, -1677, -777, 922, 1128, -929, -1814, -775, 398, 738, -721, -2414, -1396, 688, 672, -1449, -2393, -1224, -20, 72, -1258, -2244, -1847, -182, 69, -1245, -2208, -2224, -994, 169, -614, -2187]
4011b187Q7J541O20q85o00Q9M25J276m23q74k76R04P43K71n58p90L66J231K92
4030A252r36p9N89M09M14l94r06J95J341O32r63r35J45J145O09p96r40LJ361J72
4050B318r45p67r8R57J111p45k172j05J703R66j117j433k26J195O94q38j560K25
4068h37Q74M91l29j327q48R79J484n11j413k33P00L66m19o72K05P18K93o11o72
4087a762J19K46L67K20k55m60N71J08o01K18M36K75P9k92n4q7J28M10Q1L64n00
4108c89n94L48O53K18k89k63l5J47N22k44m99j41Q11O35m96o98q27J176J346m81
4128I00j166k36O74M32M5m71l20N17Q40l30p86k40P15O49j95n56m27M83O74j42
4148A060n53L43J67l3J58m63l75P96P08m08r44K40K07L21O0l54m55M10k43j03
$$ y = [-2187, -2100, -559, 61, -824, -1424, -1335, -910, 366, -57, -931, -1207, -303, 440, 711, 153, -637, -271, 960, 1252, 316, 237, 826, 1235, 1649, 1255, 349, 544, 1885, 2517, 1554, 619, 764, 1909, 2518, 1722, 782, 785, 2146, 2318, 1373, 606, 508, 1465, 2576, 1831, -341, -446, 1257, 2223, 1106, -327, -553, 642, 1336, 498, -1062, -837, 37, 528, 199, -1128, -1976, -997, 487, -24, -1437, -1670, -970, -604, -1023, -1695, -1490, -772, -479, -1090, -1762, -1643, -1397, -1030, -810, -1065, -1525, -954, -846, -1447, -1229, -793, -518, -439, -731, -785, -872, -744, -334, -253, 111, -389, -983, -635, 18, 236, -53, -316, -351, -204, 318, 74, -425, -566, 245, 880, 384, -314, -1141, 35, 1381, 900, -266, -502, 172, 604, 649, 178, -142, 375, 1215, 885, 99, -141, 574, 1223, 1028, 472, 45, 528, 1202, 1060, 507, 850, 1017, 984, 1142, 679, 304, 1100, 1808, 1400, 456, 696, 903, 1224, 1284, 930, 475, 885, 642, 539]
4168E39J57k27m19N12M29n09p79m8K21L36M43n54j118k50N91M98p9o47l02M71
4188g35O96n67j475L01J198P09q53p74m87M79J081J46j097j57P18K85K2q78l00
4207a688J428R79j059j133M01O96L44q2m16l08R90O79q66q49M73R36N90m14j415
4226g14j75J601O06q03n90j37N42M75q1o68k79M54P66l56l84m44K15N79P7l34
4246C50n24K81M9J73J53nl43R8M25k34k02n3K58m5J71m03l2J51L62k21J32k55
4268B86k36L91L70n87l28M28P82o44n26m86L51Q08L05r37o75K75P10R3n02n85
4288g07j33J129K55j191m72M14O40J67m33l44l26P35K53l42l66J98K24J60j12
4307b51n16K00O92j31k74J08J04K1j72K28j23K94O8n1k32JL47j17L89l41r9J19
$$ y = [539, 696, 469, 50, 562, 991, 482, -297, -345, -124, 212, 655, 101, -1017, -1267, -676, -178, -257, -904, -1206, -735, -39, -606, -2081, -1780, -582, 127, -726, -1500, -1987, -1508, -427, -281, -1378, -1535, -817, -532, -510, -1388, -1688, -260, 719, -340, -1473, -1072, -376, -32, -114, -530, -838, 152, 831, -35, -884, -411, 525, 1115, 701, -714, -889, 712, 1318, 515, -75, -212, 330, 805, 724, 56, -223, 231, 997, 641, 257, -187, 28, 607, 684, 350, -174, 107, 156, 329, 482, 477, 134, 232, 657, 423, 221, 168, 426, 381, 552, 149, 117, 268, 630, 409, 541, 286, 50, 441, 811, 224, -104, 324, 1106, 462, -64, -550, -199, 609, 914, -23, -698, -423, 287, 380, -122, -707, -840, 289, 544, -647, -1119, -705, -65, 102, -331, -675, -1001, -266, -13, -355, -721, -523, -299, -139, -251, -767, -567, 125, -6, -280, -172, -68, -47, -219, 9, -114, 180, 248, 197, -35, -34, 313, 196, 585, 244, 145, 264]
4329B64Q0k07j40M91q1m36J3L22j15j29k25J58Q5L63o28j01r7L30J19Q9n20n56
4351i21O71O92n91q10K42N96L30k69n04l48O33L96p6n05J79lM96j83l40l19N38
4372i6P71m09m77J15L59j6J04L3m65K30J41k08n8KJ42N04J60r24p0M82k6rJ29
4395D14k54n11J19L58P4l24j87J66K77M6o44m32O40M44j16l97l75j81N58M51m85
4416c59o26N8R06K57l90n54j55Q85M30n24n51L85M73M38Lj083j87R72Q90p16n84
4437c2L62M42L81l99n93M7J061L68p24m88j33L81O52J52q35l44O18M00o25l79
4457C12K9J98N63k72o92p39M92L00K73m59o95M6N86r8q47k03L56L84r7l59l07
4478a229l54M19L41j94n04j46K89O40K5j008K27P00M18k41m56k53L55R17K26o85
$$ y = [264, 344, 137, -3, 488, 407, -29, -16, 306, 191, 62, -163, -5, 80, 443, -185, -286, -383, -53, 66, 155, -365, -921, -250, 442, -149, -959, -717, -121, 209, -60, -564, -912, -279, 117, 41, -464, -285, -288, 208, 25, -315, -634, -96, 675, 266, -211, -96, 263, 247, 351, 384, -81, 149, 290, 82, 24, 26, 168, 672, 832, -92, -162, 320, 294, 285, 414, 160, -351, -232, 126, 200, -124, -311, -145, 132, 178, -466, -898, -258, 186, 70, -327, -702, -883, -325, 126, -359, -985, -927, -21, 236, -154, -708, -863, 22, 452, -72, -623, -238, 235, 673, 676, -407, -594, 378, 1268, 552, -32, 330, 772, 1153, 754, 161, 208, 1269, 1637, 913, 425, 292, 673, 1325, 1477, 642, 298, 916, 1316, 691, 312, 341, 539, 1102, 830, 138, -601, -109, 191, 464, 5, -690, -644, -58, -156, -1003, -1206, -850, -466, -563, -922, -1229, -1583, -1164, -823, -1017, -1521, -1667, -1378, -738, -713, -1721, -1494, -794, -376, -617, -1073, -1326, -971, -54, 172, -513]
4498e13n88Q58Q68j75l36n71M89J008K42j073k13M46Q50R6l92p86J42J276J7p59
4518H86o67J72Q48J97n44p36N9R46N4p34m55j62P14L59l44j138l18R71M57o38
4538g3l46j85L78L81l83n50j42O69N18j15o90n17L01J178j7p66k46M32N30J70
4558E27l49o09L48J024J21o39o05K27N76Q30q00q19J03J074K46o45p19L3N51O41
4578A116n18r64l93P84N93k12j113m00P12P44n34j125k24P24O38n27m96q07K91
4597a711J096m7r12m48M91Q76J99r11m77O00J002k0r55j6K30P74P09o65p48O24
4617c09J148J15m81n57K72R09N43l88p89K47R99K39l71l74k52P03O87n56r63j14
4637G08R50K48j5j025o17O87P47m50r37m14L21P15J28j239j007Q00Q73l65j004
$$ y = [-513, -1101, -243, 625, 450, 114, -457, 32, 1040, 1282, 209, -4, 442, 1292, 1388, 996, 210, 352, 1628, 1645, 886, 219, 391, 1239, 1436, 892, 156, 215, 1161, 1215, 481, 26, -136, 578, 937, 593, -545, -863, 108, 565, -73, -419, -604, -226, 155, -228, -778, -920, -251, 267, 152, -538, -1055, -754, 424, 407, -359, -605, -173, 357, 527, 178, -431, -83, 941, 1062, 423, -182, 45, 621, 1451, 651, -168, -65, 1009, 1255, 610, -109, -76, 475, 1116, 598, -366, -759, 25, 618, 406, -707, -1107, -395, 349, -185, -1310, -1534, -810, -172, -699, -1195, -2002, -1711, -615, -662, -1574, -2022, -1531, -655, -456, -1367, -1844, -1244, -242, -262, -1217, -1233, -1003, -229, 480, -185, -933, -309, 839, 954, 473, -84, 188, 1097, 1640, 1252, 463, 710, 1709, 1948, 1577, 1203, 951, 1654, 2341, 1785, 822, 708, 1658, 1906, 1891, 866, 249, 936, 1683, 1233, 296, -118, 203, 918, 1046, -193, -1200, -400, 473, 108, -896]
4656h96o37N01N09M39r39q23N96O11Q8n46q08K66R18N19p26r48N02P27K37k02
4676f12n65J16O83Q61q49n09R6Q36N69k30q61q3R31O61n83p40J30M41N69o3r39
4697a41m22Q07J002n25q71j95K50Q65r2r31n10Q00L78K2o70o53R4P35M29p53m40
4718h21J83Q35r6j86j013K36J002K67p70k21L6O30O23j66p34k76Q55P97n86n57
4738C8J02O07M43Q5q32k26N34P03k46l81k07J08Q13Jr59m39N54N59r7o27n00K49
4760B82M48K17p35o16M34M68Q8p77q29K32Q47Q4o07o18J43N41J05j80q54j21R93
4781d55J45m85o84j97N94P43k73r32J79P05J75j16l81k79M92P35j43q59J8N38
4801d80O55n5m80n18M88Q42k32m87j29L65N50K10m67o46J12J036J36o42m74K55
$$ y = [-896, -1533, -1032, -523, -84, -1023, -1846, -1250, -639, -551, -1097, -1905, -1639, -721, -202, -928, -1876, -1374, -647, -410, -612, -1177, -1061, -378, 483, -366, -875, -779, 57, 626, 396, -465, -548, 383, 1044, 461, -279, -149, 292, 861, 798, -141, -563, 244, 1246, 721, -150, -345, -95, 770, 678, -253, -763, 37, 415, 437, -233, -886, -792, -57, 372, -381, -821, -638, 197, 101, -85, -1098, -862, 140, 407, -363, -584, -548, 82, 705, 539, -195, -471, 384, 1181, 595, 38, 140, 747, 1190, 1275, 443, 217, 751, 1454, 1208, 827, 620, 728, 1541, 1542, 583, 144, 698, 1257, 1160, 533, 33, 282, 730, 947, 212, -404, 30, 498, 586, -191, -1020, -788, 59, 143, -464, -1082, -939, -398, -293, -473, -1327, -1448, -455, -310, -795, -1479, -1676, -1082, -339, -612, -1544, -1365, -660, -485, -601, -982, -1261, -769, -34, -177, -1036, -1018, -480, 175, 120, -360, -878, -390, 452, 220, -267, -396, -31, 519, 729, 262, -384, -272, 764, 900, 258, -216, 39]
4821C9Q11K10p33o31M41O85j35j94m28k05N26N17l45o78j23R02L48n99q23K40
4841a75O36K80m29n06MO10K70j9r95j59O94N07k65q88O4O92M69k31o76m10P08
4862A81M99l14l77j63J34N18K85q15n93L56Q02j20m83k47J53O71n7k53p25M02
4882a46L82K55m58n10j28Q03L16m76m81J63M44K64n51m23k52R50L23l87n92O2
4902d42L02M31k5q59j51P64L08l28o11J43M32L18k71o20k51N37P89m50n64m18
4922i66L97O05l8m18k51K54L51J8l12k45K25K67J78k99n20J86Q62P7n85k84M69
4943b9M64j19k74l82K12N43J28k23n13K7P69K28m78m85J82M75J38j52l63k09O94
4964F33L13k78m51M2Q2M94k23n57j02O23J5r9n53kK27J81N8m78k50J97M19r2m30
$$ y = [39, 850, 1060, 327, -304, 137, 822, 687, 493, 65, -140, 386, 903, 558, -120, -243, 659, 1007, 408, -415, -175, 461, 741, 312, -194, -190, 420, 690, 671, -324, -483, 211, 718, 453, -435, -371, 321, 790, 559, -117, -527, 181, 680, 366, -11, -174, -40, 478, 763, -52, -645, -289, 513, 393, -90, -337, -184, 487, 430, 177, -548, -146, 236, 491, 33, -477, -605, 198, 514, 38, -443, -280, 164, 428, -123, -546, -798, 152, 475, 88, -504, -442, -140, 291, 266, -593, -744, 20, 328, 0, -611, -468, -36, 282, 11, -609, -860, -323, 466, 16, -548, -966, -569, 36, -2, -420, -671, -417, -66, -48, -360, -605, -380, -113, 65, -234, -754, -568, 294, 371, -214, -498, -29, 435, 316, 42, -340, -128, 415, 543, 320, -193, -166, 603, 831, 353, -132, 50, 525, 663, 511, 148, -61, 633, 946, 668, 217, 259, 341, 835, 612, 55, -47, 576, 591, 492, -61, -63, 164, 345, 403, -75, -325, -128, 291, 199, -231]
4987b31l38K95M22J66p87m2J69M39j2k49k28J4N15q4l76q6J41L88K76l57n37L99
5009a03L15K23m48k89J09K74K83j08n39J5M64K8j02l49j11L39M72k09o04J79J14
5030d7K85M7m55k73j6N27O9l93k95K93L77j91k25k16L55J05L0l26l8o8K40K60
5052D5l45k82J97M85P5m69r2n1M14L33k20n96L3L96L51j66l63o8L75N71l72k22
5074B9m22N83N12k75l92k26L41O41k61l28j92K70J61J80n55l52O06k3J96l84j45
5095c6L72J58J82n10k94J83J73K23m89k58J03N05q1l23m53N62K33qk74p10J63
5116e79P38K46l61n14r4L95N16n55l30j70O63K01l24m89p1L44N00P9m42n90P08
5137a29K74j96k89k00K91O54N6p53j89L50O76R7m63m09J47N49r8m78k43N99L65
$$ y = [-231, -569, -274, 148, 314, -473, -515, -346, 93, 81, -168, -396, -382, 133, 49, -327, -413, -272, 116, 392, 35, -502, -103, 212, 435, -13, -302, -193, 81, 364, 256, -283, -268, 196, 224, 122, -227, -338, 1, 473, 264, -340, -161, -47, 238, 285, -170, -443, -459, 68, 137, -256, -551, -258, 119, -72, -297, -513, -158, -53, -23, -349, -387, -455, -215, 45, -300, -582, -385, 100, 175, -294, -386, -437, -23, 310, 90, -506, -473, -77, 274, 108, -255, -323, 52, 623, 251, 29, -393, 190, 702, 427, 35, -191, 150, 791, 530, 202, 10, 280, 441, 621, 66, -286, 320, 297, 493, 109, -36, 336, 494, 676, 166, -128, 55, 228, 451, -38, -296, -193, 312, 231, -92, -545, 17, 250, 242, -32, -742, -579, 159, 405, 44, -470, -564, -169, 347, -208, -538, -708, -45, 156, -168, -657, -728, -384, 116, 195, -247, -837, -129, 145, -51, -340, -540, -249, 405, 461, -292, -481, -131, 545, 642, 179, -230, -83, 466, 368, -110, -353, 246, 611]
5158F11j25l77l78K58Q85K21r44n76L63M54K30m32p55O9R73K32q98n29K0P33M39
5179D74m69j077K81P18M72m59o83j3M62M90j86q66p3Q19M15m71m66R6M10L01P
5200A82n96l4O00M82j41o47j05N46N43k80o63J23N43M33j15o99k89O14O65k43
5220I19q54k42N37O82p1p77m38K04R30o4o63m05k24P82J90n48p36L2P95K13p17
5241d55m86J12N64L11n42o44jP36K84l17p76P6P35M99l47p40O1Q17M60k51p26
5262f30j2P36O23n62o08J30O53N99j98p88m39J065O01l29n43l14L81N89J41q90
5282B05k24N02M80k20o13j16P9O58j74m55o35M91M69j38l47l29j58O58K4n06m13
5303g62J35O63M6m93m77K10O49J15m61l44J04M91M76o01k09j39O93L04l55m77
$$ y = [611, 486, 109, -269, -11, 874, 1095, 151, -425, -62, 392, 622, 190, -565, -496, 477, 709, -189, -718, -698, 35, 474, 5, -1072, -791, -73, 399, -60, -743, -756, -294, 196, 10, -856, -929, -110, 305, -166, -632, -536, -126, 175, 182, -414, -448, 152, 634, 493, -154, -259, 287, 830, 550, -113, 10, 553, 986, 871, 172, -117, 497, 1162, 919, 65, -177, 360, 1042, 971, 194, -244, -40, 890, 826, 163, -242, -466, 316, 506, -42, -778, -746, 49, 262, -455, -941, -829, -265, 46, -496, -1140, -1141, -405, -121, -438, -1214, -1138, -403, 96, -251, -991, -930, -113, 347, 96, -630, -642, 94, 717, 155, -453, -323, 330, 929, 731, -57, -496, 569, 1170, 841, 298, -16, 365, 954, 1095, 205, -19, 483, 963, 743, 130, 14, 93, 751, 577, 122, -513, -22, 447, 309, -38, -367, -525, 133, 157, -349, -762, -627, 36, 82, -411, -888, -678, -29, 86, -375, -719, -615, -124, 352, -249, -458, -597, 96, 400, 45, -432]
5323d32J81L82K78K28o05l15O90N35n9o42k40L32L88J58n97l38K45M28M30o70
5343C77o18K76N86l1m29m35L29J83n7j98m92m7N62K17q13m36L95N31L7n87l70
5364a020pO14J92n87r8J51M27J71p0o27m1Q03K62l05k08p4K00L97R7m44m4L60
5386A49J85J01j18l38J28N75K84o52j65K70K28p3j39k31p2M69j76r3l81J82K69
5407D02J51j88q12K18N22J21l89l76j24M03J94l07m56m9L76N52m54l94k44M20
5427d34M39j28l36KK47K94p9m50J84K42L83j91l86j14L09K85L16p03k47L01P38
5448F72j54m83O0J53K63K07n42k71J35N88L8n17j30P4K57K84l57o53K52N12k8
5469C60j97m11j36M02L12j09n36K09J94J22J9n43k07N06K11j67l63m1L63J50o9
$$ y = [-432, -251, 131, 409, 637, 32, -283, 407, 942, 883, 241, 1, 333, 721, 879, 282, -56, 189, 617, 1047, 377, -241, 35, 621, 590, 161, -274, 55, 238, 181, -17, -509, -556, 6, 223, -590, -1026, -631, -100, -63, -650, -1020, -1027, -413, -221, -808, -906, -755, -328, -157, -227, -854, -895, -92, 170, -135, -343, -417, -217, 180, 277, -167, -211, 149, 334, 435, 317, -21, 107, 682, 966, 314, 149, 419, 647, 574, 435, 204, 132, 601, 425, 332, -49, 133, 402, 553, 365, -447, -229, 293, 414, 25, -351, -475, -72, 122, -185, -641, -690, -314, 238, -216, -610, -854, -434, 5, -123, -459, -457, -210, 84, 5, -445, -261, -19, 364, 173, -213, -327, -18, 267, 583, -120, -367, -66, 672, 518, 35, 95, 248, 511, 718, 176, -95, 40, 628, 666, 149, 19, 93, 350, 634, 277, -376, -124, 388, 360, 163, -248, -384, 18, 330, 221, -315, -106, 88, 210, 229, -314, -521, -15, 196, 29, -334, -375, -12, 138, 69]
5490F9k88j66K60M97r7m76k11K31M95J7l93k95J67M63R1n44m28L33O19p4m11m43
5512e84L92N91r5m99l41J28N70L5l76n21M20L72M09o48k41k33Q07O3m29k54K06
5533b28M24rk21m57J81K85M43n38l74J78L95K49j9p54J79N08K18l32j56JR7L36
5555D06P4n84l8N68k6P6k98l89K92L92%o39n0K84K84J84m11q8l5M69Q0m71l25
5578b45K2P33j5l56l95O1O47J71l91k70j52J89M87l36m99R8L63L87n71k84J3N54
5600B11J18l10n33J27M84J04j81m15j76N11L35k57m99k33N68K42k43l01k64L88
5620c24M71m14l58Q4K67L48Pm20m18L32O97k71n07l8K39M12q4l67m42M57N01o9
5642A03k55j63J39M27J53n08k63L03M34K48k92m16M5N28K86m03n07J23L74L18
$$ y = [69, -219, -385, -125, 372, 275, -201, -412, -181, 314, 331, -62, -357, -190, 273, 364, -180, -608, -275, 344, 270, -141, -584, -192, 399, 304, -195, -536, -408, 162, 197, -179, -700, -280, 92, 501, -147, -388, -621, 186, 249, -180, -434, -228, 196, 187, -34, -491, -310, -25, 418, -120, -494, -316, 79, 328, 309, -445, -266, 242, 460, 128, -28, -27, 70, 406, 480, -104, -142, 426, 400, 476, 178, -211, 81, 473, 473, -166, -216, 68, 352, 536, 125, 37, 2, 471, 551, 80, -245, -223, 510, 495, 139, -256, -195, 452, 623, 232, -38, -190, -1, 486, 150, -349, -251, 112, 499, -72, -356, -343, 211, 329, 19, -514, -387, 97, 201, 20, -395, -571, -60, 275, 18, -481, -714, -146, 96, -147, -448, -712, -324, 147, -267, -625, -541, -274, 74, 81, -339, -757, -425, 272, 1, -506, -544, -305, 107, 23, -344, -786, -329, 172, 103, -152, -315, -176, 251, 404, -104, -367, -64, 370, 618, 326, -90, -45, 483, 769, 366, -141, -18, 356, 674]
5662F74l14l61kM72L18l38m28j49M94J86Jl33n58O33L15j59m54j99M29M67j83
5683E11p13k61N95L39j43l75m43K52N45J77o42k59K69L33J1k61m07O0N14P9l07
5704a26l13Q8N05K20j84o02J58M31K9k86n77M24K26L43m62n82J38N39K26l13k95
5725d13M7K14M03k39m43j84K51O00k70m77r6K79O57k95l76k69L49N96j51k36k99
5746c52K7O62Ln97k83L93N19P7o41j23J44P27J64n38l73LP90Q4k85p22J87N66
5768D32J56l44l19O7M65K08l21n93LN34J78k25n02j69P49L57m45p29K41N07K54
5789E04j98n94k54N30N15j32p38j54N45K93R3n85m02L38M81j47l35k98L88K75
5809A25K48n87n01K75N87J88n97j48K01K04K58k39o50J32Q11M4m38l77j90P83
$$ y = [674, 360, -1, -3, 469, 787, 449, 21, -128, 366, 552, 553, 220, -338, 295, 610, 451, -3, -202, 227, 694, 511, -202, -463, 132, 471, 328, -47, -490, -238, 307, 484, -158, -417, -148, 185, 196, -65, -472, -412, 102, 181, -126, -439, -351, 154, 374, 190, -412, -254, 177, 206, -80, -657, -233, -7, 336, -126, -708, -570, -31, 195, -118, -413, -366, -152, 251, 12, -431, -615, -364, 236, -34, -511, -607, -328, 329, 34, -342, -611, -262, 334, 183, -53, -352, -325, 337, 340, -257, -540, -147, 372, 449, -192, -315, -171, 556, 720, 182, -191, -188, 602, 686, 401, -321, -134, 432, 588, 244, -75, -8, 457, 665, 344, -249, -246, 288, 466, 241, -261, -430, 319, 676, 231, -498, -257, 250, 504, 306, -288, -542, -12, 503, 371, -367, -521, 24, 317, 410, -175, -577, -239, 242, 95, -240, -538, -150, 125, 373, -214, -715, -440, 147, 335, -262, -410, -209, -5, 253, 14, -636, -504, 307, 351, -87, -464, -654, 129]
5829A29L03l08p26J79O30R9l15m87O6N24L38l86m43j27M39L46J07q07l33O07O36
5850D71j39o47o2O03K79J03q35j92L65O24k77m65l45M35O91k7o98j58O9Q02Rn16
5872I0k47k8O65L81n65m65M6N50J26k33m17m94Q93L31o63k35j55M82N09r5p53
5893b77l17O13M46l82l31m08N79N36j63o68l16M81N16Lo63l16L22N89R5m48o70
5914g79N94M69O1o73m01L85P90r0n44m38K52M36K27l34n35J60P83J05m47m79p3
5935e31N00M94m59n35J3N39M65l19n07L3L85K38r7o46n4O15M38l61m87o9L00M00
5957C55r3o26K2K04Q11k67o52j23K28M97K60p93k48L99O96Q7o47l69Q6Q55N3n61
5979A74n04L83M89j05k87n25J56Q15J59m25o17J6L83N01k73n37k35M78O75m96
$$ y = [129, 432, 124, -602, -423, 207, 306, -9, -496, -430, 94, 432, 46, -397, -524, -85, 261, 368, -439, -772, -165, 471, 332, -315, -377, 226, 505, 608, -227, -419, -54, 570, 293, -172, -517, -82, 609, 582, -116, -274, -205, 597, 606, 90, -157, -185, 480, 861, 296, -169, -123, 427, 553, 320, -97, -591, 302, 633, -30, -265, -420, 62, 571, 476, -277, -594, 19, 465, 83, -248, -656, -77, 459, 296, -372, -688, -207, 309, 312, -351, -667, -345, 244, 339, -109, -779, -185, 284, 345, -328, -729, -344, 446, 356, -188, -626, -374, 62, 289, -45, -580, -420, 363, 468, 21, -458, -531, -31, 463, 4, -531, -518, 21, 486, 167, -340, -307, 78, 316, 219, -427, -481, 134, 572, 211, -276, -345, -45, 355, 262, -364, -342, -138, 673, 406, -246, -369, -141, 356, 616, -177, -425, -26, 670, 757, 110, -259, -173, 682, 735, 174, -330, 53, 542, 437, 150, -375, -219, 596, 755, 330, -287, -271, 112, 613, 340, -197, -432, 46, 721, 225]
5999B25o96M4K59O96k73n59j58K37P03n34n38J18M3P59J6p71k38M78N24j73m28
6020b66l20J95O93o7o35k22M58L13L09m85o39J10Q72J57n32m19K4P75K66n42m47
6041d02Q3L68K48q6n60j10M74N30l75n31j27N07N92l44k22m77N63M03n0o11j55
6062b82N49J95j56m31k84O35N37l62l95k50L93L63K9n60m91M04P19k75l92l95
6082d49L93N37J22o54n28L31N63L01n39n27J05M68L29m82m70L5N11L09l82n14
6102e41J00L55K74k94l43l7K94M70m77j24j56L65L85n24j85l5M43K96j52m40N1
6123b75j03O94k81n27M6L31K23Q7m98j39L58K08L03o80k13J38O98J14m65l43J28
6144a96M73J55l24m60L4N68L15l73n99K81L65MN1l05j1M86m3l85q2j53L80L38
$$ y = [225, -471, -427, -168, 528, 255, -304, -462, -225, 478, -56, -594, -476, -433, 326, 342, -429, -667, -189, 335, 162, -266, -586, -391, 302, 235, -400, -622, -164, 149, 458, -27, -666, -556, 316, 473, -59, -478, -454, 321, 587, 45, -402, -319, 49, 297, 211, -349, -459, 15, 545, 170, -361, -488, 19, 611, 267, 45, -432, 131, 534, 484, -127, -282, 267, 462, 306, -125, -409, 226, 763, 401, 6, -244, 149, 512, 541, -19, -510, -106, 613, 338, -54, -449, -56, 481, 603, -51, -579, -248, 315, 616, 77, -450, -345, 123, 452, -30, -500, -465, 46, 355, -27, -541, -441, -86, 188, -106, -449, -486, -192, 278, -199, -323, -479, -114, 271, -253, -438, -473, -30, 266, 114, -326, -275, -378, 316, 35, -492, -446, -115, 108, 195, -303, -442, -84, 124, 427, -253, -466, -328, 370, 484, 19, -324, -196, 277, 432, 108, -352, -318, 250, 565, 192, -407, -126, 239, 243, 294, -11, -22, 464, 421, 36, -46, -199, 181, 519]
6166E19k60l58J76K65O3k11l43KL71K82j24k79q6Q5K85j23l87L3O1M82k04m22
6188a73j21M80p1K31l07m82%O13K8j11m38k2L76j49M03o33K8L42j16j45j41o1
6210d69L10J90J01k23l41K28L95q0l62j4L30J37l7m52%K45J09L1l55K5L65J88
6232C21j13n00j0J91M29N7m35k52L23L49r7k19Lq4N02J24n52k70P8L38K60l22
6254A21l32l1L90J60k56q4j27J61Q6Qk92Q7J27J22j71k37J18O5J93r1r2j67J05
6277a37K65l2m91J72L60N0l6l85J42R0N33m86j03j61J58J91K5l2l86K22L20N2
6299C31m41k18J88J83J19J9p60N39J85N0l92j09j04L76J03m7m82J53K97K04j13
6320H1m55j52M75r5j23k26K17L14k35J28k81K0L44J98k29k31O5K66J70J37n04
$$ y = [519, 259, -99, 77, 342, 405, 194, -149, -147, 224, 506, 382, 103, 17, 102, 387, 264, -123, -90, -29, 453, 249, -173, -294, 186, 115, 346, 39, -443, -443, 170, 198, 87, -351, -373, 3, -146, 257, -376, -348, -6, -122, -267, -408, -469, -159, 31, 132, -91, -432, -204, 191, 111, -251, -265, 65, 202, 165, -287, -287, -42, 67, 98, -257, -232, 133, 321, 208, -292, -302, -111, 318, 375, -60, -312, 11, 360, 263, 44, 47, -37, 465, 589, 37, -233, -155, 183, 443, 121, -211, -242, 148, 308, 52, -32, -159, 2, 88, 96, -196, -109, 18, 140, -31, -268, -150, -85, 108, 17, -75, -242, -137, 128, 96, -395, -223, 137, 187, 151, -234, -92, -2, 531, 45, -58, -219, -61, 130, 155, 123, -263, -41, 279, 331, -110, -328, -140, 43, 162, 181, -579, -40, 145, 195, -197, -306, -410, -34, 69, 22, -460, -307, -10, 194, 81, -374, -526, -51, -146, -269, -495, -278, 36, -199, -71, -352, -332, 12, 210, -19, -250, -185, 81, 251, 388, -116]
6341a16N1J70K90o7k67m3K51K78Pn97j07J56L71Q4l51j00j12M23J35n14o6J14
6363a0M68j88k75l40K90L57J15m13r0j36K45K5j84l21P9N48k51k63j19J31K89
6384d3K93m90q8J19L00K10m10k07LO04L5l37j97j50M47K44j10o09K87M01Q4k62
6406A24k97KL43K20q8l06j13L30O7p3l33j20M53J53j17m67L1L02K95k48n72J22
6428b92L20L57k20j77m12L68K77j94m79K6L48K85k79k22l6J64L48R3n63n9J68
6449a79M46J18l79k85K8N87k8l13k27J08L38K55m16j66j1L83K14k72j09L6J71
6470B99rk80j73n7M43J39No89K79N03j81r8m31O8K21K26o4p95J23L02L61k26n20
6493e54J38M41K73j1p57j16L40M15j34m38n2M4P76J08m35m49M21K18j1k82j09
$$ y = [-116, -65, 105, 395, 328, 61, 18, 269, 547, 554, -43, -150, 6, 377, 461, 110, 10, -102, 321, 456, -58, -124, -10, 458, 270, -5, -345, -55, 302, 417, 4, -86, -222, 23, 48, -136, -457, -378, 170, -81, -344, -463, -332, -43, 250, -240, -328, -209, 91, 301, -109, -316, -313, 291, 326, -11, -208, -358, 89, 333, 223, -386, -99, 302, 386, 124, -173, -171, 172, 392, 304, -2, -115, 215, 282, 209, -124, -244, 209, 362, 245, -222, -191, 111, 406, 158, -414, -292, 28, 385, 165, -12, -424, -56, 221, 27, -452, -426, -78, 207, -72, -294, -330, -166, 182, 275, -288, -347, -179, 267, 385, 6, -279, -251, 336, 308, -5, -232, -124, 214, 469, 53, -113, -124, 259, 473, 201, 92, 128, 299, 290, 10, -163, -220, 223, 362, 367, -322, -43, 460, 279, 181, -250, -182, 39, 265, 201, -594, -471, -169, 192, -34, -554, -416, 25, 298, 287, -470, -586, -246, 169, 35, -403, -455, -411, 365, 473, 38, -411, 10, 228, 217, -65, -174]
6514a74l0N45l4j76l97K91K91J15k77k85MM59K01m89m55K72K18L12j89n02P1M91
6536B62L11l25m32k10M16M43j04p31j09L71M38l10k97l6K30M00l6n79k01L81K63
6557A45Q8l21m31K35O31J6n24m68N17K64K35m64m48M19M51j24j95m19k0O71K59
6578E17m15l14J34L82j1j49k62k3K38L45j30n96j66O48L23l18j90k54L05J46J57
6599C67o66J51Q7M59Kn17k08K02L38K5o11j03K15L01L70n79k21K05L76n9k67l14
6621d47K16L03K64m01l47J65N28J9l99k45J95N43J23m57n34K18M60L65m25k69
6641a25JK13M11j17m74j66L30K21n3l62j71K54N70j28n50l07K64N21J52o43k60
6662d19K66M23L31p57j97K00M86K04n99m29J54O79j79k68l15J91K97J88k46m23
$$ y = [-174, -204, 341, 307, 131, -266, 25, 316, 431, 154, -131, -127, 332, 533, 44, -411, -139, 79, 391, 202, -300, -229, 262, 573, 248, -184, -394, 22, 465, 361, -370, -479, -108, 330, 20, -277, -313, -83, 317, 281, -298, -499, -118, 145, 233, -88, -519, -284, 347, 363, -161, -629, -112, 152, 387, -77, -525, -106, 345, 221, 26, -393, -413, 258, 517, 102, -212, -78, 304, 293, 144, -118, -141, 97, 442, 312, -284, -450, 198, 521, 203, 13, -241, 64, 210, 367, -299, -148, -61, 398, 400, -117, -325, -123, 215, 240, -371, -474, -259, 42, 412, -167, -388, -183, 193, 134, -133, -447, -231, 72, 336, -65, -412, -247, 281, 300, -99, -344, -149, 394, 517, 60, -474, -256, 204, 569, 144, -125, -124, 89, 500, 383, -91, -257, 73, 294, 241, -121, -292, -38, 532, 404, -146, -453, -189, 332, 484, -159, -419, -153, 270, 601, -156, -353, -153, 333, 537, -62, -491, -337, 342, 163, -105, -420, -229, 68, 256, 10, -413]
6682d13K2N17L08l61n91J92N61K25l92m91J7L62L88r8o96K42L08L42k72n14J51
6703a93K22K89J90q47j53L60N74j18o37n6J58M28L00p90l45M82M51J07m69l06
6723c53J49M99J75m29m76J88P47j92l68l86K8N72K04m00k68n7L22M93l82l43p4
6744c51M97L14j52n81j08M13N28k38n46n9M41K53M6o24N1L8O04M3p52l13M65N28
6766D97Nq78j38M50N70M6q11j27K91M00Q5l63o17L28N96J18m28m09M4N71J98m55
6788b7m35K37N66j0k82n13mN14M43l52m80j60O02L73k49m40j51L37N36l80m24
6809b99j93M68M30m9n62k31L54N44m1p80j65M38M44K11o53n17M67K13L91n15m14
6830d59L05M03J61l51n41R4N72K45m28n87L27K54N88o26n06L16K11L77k37n07
$$ y = [-413, -391, 126, 434, 73, -518, -326, 235, 460, 68, -423, -406, -44, 344, 246, -450, -208, 100, 442, 170, -344, -193, 29, 318, 508, -339, -492, -132, 442, 324, -313, -369, -211, 217, 517, -273, -618, -136, 315, 422, -47, -353, -204, 295, 470, 41, -435, -247, 500, 308, -60, -446, -418, 154, 358, -42, -310, -367, -45, 448, 66, -277, -351, 146, 460, 308, -273, -381, 32, 560, 322, -224, -283, 158, 411, 457, -167, -116, -78, 526, 569, -183, -496, -31, 497, 502, -376, -514, -64, 506, 552, -259, -386, -95, 305, 390, 27, -590, -262, 334, 452, 24, -385, -341, 230, 428, -27, -462, -225, 341, 331, 49, -464, -468, 46, 489, 137, -343, -503, 99, 472, 223, -217, -368, -31, 505, 125, -299, -492, -24, 406, 357, -205, -436, -82, 462, 421, -359, -524, -86, 358, 569, -84, -601, -134, 79, 470, -45, -459, -154, 249, 410, 59, -482, -388, 184, 429, 1, -586, -259, -5, 583, -43, -549, -233, -22, 355, 118, -389]
6850c89o6N58L51j96o37q1M37K56Qo39q2L25O95m17n20J22J92N25l02m37j02L24
6872g5N39m03k19k26K01L44J71m36m55L74O32P7n16l10QM57K85m27m00K34J98
6893E3K81k50n27N9O61K74m08m34j79O82K19k70m58j64M61N93l64o42n4N37K85
6914C55J6n62q3K54K79M9l96l34R7N58J75p44q0L98K60J06l88k70J74N19k65l13
6936a95j24J1N92P4j61l79o3L93K33l35l36j44N95J89l33n96J67L85K47p6m70
6957c26j27M19L71j81m31j54M05N09l49l57r9J43L33O3m31j48P1N40J12l97l12
6978c46K08L35J48m39j98k1N31N5k11l53j8N12J01j57m30J26M22J65l22j72j33
6999a97M60N9o1l89oM14J00l7n94M6M35J45j97j67n0J29K69r9l72r6M67K72l24
$$ y = [-389, -455, 103, 454, 258, -379, -460, -23, 233, 241, -398, -480, -155, 540, 123, -397, -275, -83, 442, 140, -297, -399, -75, 464, 61, -158, -384, -183, 161, 332, -104, -559, -185, 447, 524, 8, -302, -294, 163, 448, 21, -379, -145, 53, 334, 84, -443, -384, 277, 551, 143, -291, -470, 212, 431, 161, -297, -461, 0, 593, 229, -413, -467, 70, 355, 371, -191, -274, -20, 259, 308, -88, -422, -325, 233, 408, -336, -416, -18, 242, 348, -40, -310, -136, 383, 118, -195, -319, -308, 284, 358, 197, -182, -245, 148, 381, 46, -290, -434, 161, 350, 17, -579, -412, -27, 220, 144, -326, -453, -34, 337, 156, -275, -429, -24, 485, 136, -221, -320, -177, 156, 219, -212, -360, -289, 251, 363, -34, -346, -138, 197, 345, -94, -292, -313, 218, 273, 62, -291, -309, 203, 304, 147, -283, -157, 265, 430, 108, -64, -197, 263, 322, 261, -128, -134, 280, 380, 343, -251, -205, 230, 375, 178, 11, -39, 90, 359, 260, -112, -208, 259, 531, 207]
7022B07l48J68O6K68p9k86j17j99L94O9k11k68P0M49J2n15j56K68L23O9j82k28
7044b26P4K66k4k06k60K02K73O0k17l86L93r3K47j42j13l16M72J34J4m27M2L61
7066A28N2J3l71P2K85q3k6l52jJ71K53J72l51k68K37K87k01j59j49K32L08j0k24
7089A5l33J28J79J10J9k59k4K62J70j91l30K91J00J90m02j13K81J48K3j34j07
7110B3J9N8J06J29l80O9K07J26k59o2MM0J43j21o1m3K9M18r9j99j04J17K4J37
7134C21l33j44J04J65J15l84r7R7K47k3l27L0j32L35r8j69J04r5J66%o3l02J82
7157c01k5K25l89L57lM4N1j39q9J4K50m5k34M2J07J63QMr6r4L46P0j5l87L60l3
7183A91J16j92j96P5J62L04k93K1k11M05J26k52p0q2J44M2j42r2n3J40j30Q2j30
$$ y = [207, -141, 27, 93, 361, 282, -4, -121, -320, 74, 143, -68, -336, -266, 183, 195, -320, -476, -208, 115, 184, 2, -226, -152, 114, 90, -116, -376, -174, 99, 159, -58, -444, -51, -144, 103, -39, -152, -468, 4, 138, 152, -275, -233, 128, 180, 193, -178, -106, 179, 96, 70, -282, -283, -112, 141, 313, -38, -306, -69, 218, 17, -142, -291, -59, 249, 239, 15, -318, -190, -11, 99, 118, -141, -165, 97, 267, 76, -254, 37, 137, 327, -75, -188, 93, 241, 264, 130, 23, 42, 100, 206, 335, -45, 24, 231, 357, 98, 36, 40, 80, 223, 102, 41, -2, 27, 445, 346, 147, 43, 160, 184, 321, -12, -156, -52, 113, 228, -156, -253, -156, 91, 68, -259, -229, -361, -26, -124, -293, -189, -284, -118, -118, -181, -483, -301, -326, -101, -490, -133, -136, -92, -41, -180, -269, -255, -5, -50, -284, -242, -135, 28, 36, 40, -56, -150, 196, 266, 251, -136, 224, 191, 307, 115, -81, -6, 156, 460, 167, 188, -23, 382, 508, 256, 186, 104, 248, 290, 148, 56, 3, 143, 13, 95, -35]
7206c5j13J98l4N9k64o1K35r2M9j40j78L03K85l12r7J03L13j06k75J29j38J05
7228f6K43j98l8j8O2L80k06k38J17M1L11M4m40j40P4J15J75k13q8p5K88J69l51
7251e2l6R4J25M2j61j44N7N4Q4K0k78j38J87J29q8m75K51J39J02j61j32j28L98
7274a11K27m13m7r2K58L96m11p0j58L26L33k67l68J86K06J17J21j61j15K1K10
7295A88Q4k73JK06M3O4l11n0J86K82m0l62l3J37R0K75l65k12K29J99k02q5O4j11
7319DJ80Q9l35k55K40Q0L25l02l99J70K45J68j39m73K08J76J95k23k55R8J42J61
7341A00m6n42J46K02K74Q9l44j61L31K68j90j13j58L32J42Q6m10l14J52L55N2
7362B51k25j04o2M57k34j39j51L85L9m2l01j47O3L63N9k55l97Q4M78M3l02j61
$$ y = [-35, -148, 50, 16, 75, -189, -250, -15, -107, -58, -198, -376, -73, 212, -100, -197, -94, 219, 113, -162, -33, -171, -66, 177, -21, -59, -77, -15, 365, 159, -79, 38, 79, 390, 434, -6, -146, -72, 43, 218, 5, -83, -158, 130, 299, -52, -88, 6, 131, 173, 12, -132, -75, -21, 63, 83, -195, -333, -146, -17, -105, -580, -329, -190, -88, -249, -381, -509, -111, 116, -297, -344, -436, -178, 218, -193, -263, -421, -95, 238, -29, -397, -211, -5, 112, 233, 72, -43, -22, 188, 272, -1, 0, 206, 249, 313, 2, -48, 138, 420, 380, 18, -15, 122, 212, 487, 122, -90, 139, 338, 136, 51, 115, 4, 184, 273, -62, -317, -77, 3, 328, 26, -373, -203, 42, 210, 71, -402, -194, -18, 177, -46, -301, -203, -61, 100, 54, -488, -342, -140, 134, 223, -121, -282, 49, 317, 127, 14, -144, 188, 330, 416, 6, -308, -156, 199, 251, 26, -78, -140, 317, 83, -56, -207, 178, 217, 175, -126, -273, -210, 153, 212, -43, -440, -356, 122, 165, -137, -298]
7384b98k0L17J45j75j52k55L38J86Pj79k70M60J17l1l70k3K13L13o7l68j20L76
7406A44J18ok82k41P9N86k87K1l17J90K71J16l88m83M00M62K4l70j40Q7K47J70
7428D01m66j6o9K34K97l64m69K92L02O4k62k26r1K45M06j59n83J66K15M08k63
7449F2j51k60K74L55k93k90k18N93L87k25l72j28J38M51n6l46l2L2K87P8l59j54
7471b27J32K12M05l95m66K91K30K99l52n37K86J11L40r4m89n9M58K14k24m86J33
7492b18J86L33J2l72j63J86N77l38k68m19O05K43m9m47j99J42N73J67p83p2M9
7513b55O58p0n93q6J91L78L22o47k80M12K81K76o05k86P9M33J27j41o94K14N62
7534B76K94o37m33R6M96L84l96n35J10K26M67m55l46N4L51L55m69j13l6mM14k5
$$ y = [-298, -318, -1, 144, -31, -183, -438, -100, 86, 93, -86, -356, 104, 221, 190, -180, -203, 10, 323, 256, -112, -232, 144, 262, 256, -26, -267, -188, 398, 111, 132, -185, 5, 276, 392, 4, -479, -79, 383, 407, 37, -103, -16, 231, 401, -65, -81, -150, 84, 381, 17, -452, -160, 142, 206, -56, -282, -373, -128, 278, 119, -464, -298, -83, 325, 62, -89, -349, -75, 280, -13, -303, -521, 72, 459, 234, -138, -266, -128, 323, 267, -79, -111, -79, 208, 286, -73, -227, -95, 117, 522, 127, -339, -48, 182, 481, 129, -408, -122, -11, 329, 235, -254, -313, 145, 359, 135, -351, -218, -32, 301, 313, -59, -222, -36, 541, 203, -65, -484, 121, 364, 315, -132, -331, -189, 384, 551, -232, -304, -255, 403, 333, -260, -346, -155, 223, 545, -102, -382, 30, 311, 587, -18, -304, -225, 208, 335, 194, -500, -286, 276, 570, -67, -500, -404, 92, 476, 80, -455, -345, -119, 348, -107, -453, -399, -48, 307, -162, -275, -311, -315, 99, 74]
7556G4m86j84L57P56l82j92l91J73M42%k40k39M6O37l5l64l62L80K86J39m80l18
7578c83L96J81K07l70j96Q7L00L27l43m84J33L97J85j31l47k21L53N03k11m31
7598d8k73L23M97k69n97k71N70P84n40n30l3K95N52o9p08l0pN69R4o38j99K00
7620c28N98m1m43j78R6L00L03l19l34p7R00q1l93m19K72L77K94n18m72K55N81
7641C73Q4m46k32n2M59J38n5m76j07L80L89j86m68k35L10N30r0n37j31L16K68
7662B32k16k67k07M51R9m8j75m42L04K69L27o49j92L40L06P6l38j39m2L22J54
7683A65l43j75P6O24J13l65n10J22M46M50m02m02p1N51K25k66l63J47K84M73l02
7704D77m22J00j26M04K1n50m2M16J53k5l43j89J50J88Q9k48k78Q2N62j87m21k3
$$ y = [74, -412, -596, -239, 517, 135, -57, -448, -275, 167, 167, -73, -312, -266, 371, 336, -28, -390, -10, 276, 415, -65, -383, 13, 194, 401, 31, -165, -78, 222, 549, 206, -278, -145, 252, 437, 306, -41, -262, 91, 594, 383, -48, -321, 2, 499, 230, -367, -638, -68, 716, 176, -354, -387, -92, 460, 391, -317, -347, -354, 215, 309, -329, -528, -328, 270, 229, -214, -392, -296, 4, 307, -12, -346, -423, 477, 396, 3, -416, -144, 233, 527, 9, -463, -208, 373, 457, 11, -221, -273, 186, 324, 269, -207, -314, 66, 455, 269, -199, -434, -124, 406, 316, -221, -352, -36, 232, 16, -251, -458, -7, 92, 44, -131, -573, -269, 0, 327, -322, -514, -174, 132, 208, -130, -269, -311, 11, 165, -178, -353, -277, 347, 460, 95, -415, -293, 153, 603, 201, -201, -272, 279, 504, 238, -125, 22, 306, 779, 477, 55, 155, 29, 433, 454, -96, -138, 278, 431, 406, 63, -126, 24, 212, 301, 53, -225, -143, 419, 232, -189, -212]
7726b12l1L27J66k22n77K71L16J52l10m39%M83K6q6k45j27K88K91j64l90j33L80
7748b36L98k88k42j36M42K61k41l63o2N08K64n2l83j26L08J81J19l45J0l6K92
7769B73L7j86k15K03P1M08n68k78L05M03r8k31l12R4J83K03j06m86K48M7K30k57
7791c2j63k02M55K66m98k7p7K23J45M8j79j90K86J29o8l06j33K98L95k7k29k94
7813a80L51O1k64J6j31j4N24L7n74j9K73J75J19k66r2o8L18K30m32j35N2K43J22
7836C46k45j93j41M99m8k35j93M7m7K15R6m46qJ04L07k49q9j0O6J6%o3k92K87
7860b76L01P1l53j30K0M20k92o8K3K48Q8N9k17j39J98J65J17k95m2L1M08o3n0
7883B24k70N1K85J85k95k38o2L58P6o8j85L6Q1j7J60k70Q8n6J69j6k08k35K93
$$ y = [-212, -243, 84, 250, 28, -549, -278, 38, 190, -120, -559, -559, -76, -50, -136, -381, -508, -220, 71, -93, -483, -616, -236, 162, -126, -368, -504, -62, 199, -42, -405, -467, 41, 305, 253, -130, -256, 52, 233, 352, 7, 17, -19, 273, 310, 124, -91, 112, 183, 591, 23, -255, 50, 453, 355, 124, -188, -94, 89, 292, 186, -300, -52, -5, 225, -32, -195, -397, 58, 324, -174, -201, -278, -55, 90, 138, -41, -231, 55, 184, 116, -190, -323, -25, 370, 343, 114, -180, 171, 232, -32, -16, -147, -161, 363, 400, -174, -193, 80, 255, 374, 108, 16, -52, 266, 496, 64, -71, -19, 224, 346, 101, -92, -233, 266, 218, -17, -210, -163, -210, 5, 101, -345, -353, -249, 58, -191, -280, -290, -224, -208, -208, -271, -563, -276, 25, 96, -257, -387, -367, 53, -239, -307, -284, -36, 52, 111, -106, -245, -47, 118, 235, -60, -102, -71, 337, 274, 224, -46, 5, 290, 475, 180, -58, -120, 238, 314, 246, 61, 97, 178, 161, 321, 51, 139, 83, 252, 236, 28, -207, 86]
7906H6R8r9j36j88L29J89k99o3j68K12j1N4l44M9K02L82l08k10M0J64J55o7j99
7929a32j57J72K10Q8j52j56P8K13J4k27j9J32J14J91j78j47J04q4J90k28j03k2
7951i9K97l1j52j34J00l9P1Q6r0P8j66KJ8n8k18J81r0J10j10K72k31J59k40K97
7975A3l47K90K3k22J84j01Rj48J27M2N2k0J11k68J35m4O5K30N3k58J05j0M5j11
7999d5K75q3j61R8K32j72k48o9L73o0J70k54J27L4k53J4o2K54q5N7p0K7K2J76
8023B97j56k10J43L4q3K8o6nO0K01n3k25q2J57K3m3Mj64J34J15j28n7J85p6p6
8048d3N3o3J3Km6K7r0L04l08q6J12J87k10m8L09j20rN2J5q1J19j02j68KM6L16
8074A83j92j44j52L81k43K6m6m6R4J64N6k89J3J66R8j55J01j66K60k13J32j95
$$ y = [86, 184, 85, -51, -239, 90, 279, -20, -83, -251, -39, -50, 4, -340, -291, -89, 293, -15, -225, -185, -21, 134, 67, -132, -289, -117, 93, 181, 29, -127, -49, 164, 178, -49, -68, 64, 178, 369, 191, 44, 148, 64, 254, 26, -77, -99, 198, 167, 15, -119, -19, -58, 13, 99, 9, 87, -79, -77, -59, -117, -335, -154, -244, -134, -244, 28, -203, -44, -284, 13, -334, -44, -21, -243, -59, -160, -151, -299, -172, -130, -78, -98, 13, -255, -120, -164, -99, 131, 184, -74, 31, 21, 66, -45, 230, 147, -14, 84, 316, 144, -104, -173, 200, 140, 310, 56, 183, 217, -36, -22, -84, 170, 85, 142, 72, 99, 121, 297, 141, -69, 74, 108, 25, 53, -13, -18, 42, 243, 190, -35, -117, 40, 63, 20, 24, -140, -6, 109, -19, -76, 109, 33, -43, 10, -53, -40, -38, -84, -57, -147, 157, -151, -237, -125, 62, -148, -196, 113, -7, -16, 36, 51, -30, 89, -13, -181, -179, -133, 183, -9, -153, -305, 76, -167, -141, -187, -233, -139, 25, 81, -208, -195, -29, 69, -86, 15, -151, 109, -104, 28, -167]
8096a67J89QL5O7k29j10j47L50J47k05J51k48K62n5Q7k77N2J75J60l19L4J82n5
8119H7p1k9o0l5J83Jq6j53k5K43mj78K40k93R3M6P4l2k92K45K92k01j50j67N07
8144B35j02l4j53l2o2K16J56j81j33L00n3j24j27j0P4K63L3j09k94M8J64K25j52
8167A48k01K5p8N26m83k51J51K28KJ67l75Q0J61R2k15j65K4J19j33K66n5j34K7
8190g4J90
$$ y = [-167, 22, 30, 65, 132, -97, -207, -354, -4, 143, -62, 89, -159, 103, 48, 135, -142, -90, 85, 245, -74, -40, 142, 87, 16, -13, -73, -108, 75, 76, -10, -163, -188, 55, 51, -127, 113, -180, -87, -41, 33, 1, -291, -46, 246, 45, -105, -272, 235, 133, 99, -54, -86, -148, 68, 224, 43, -90, 210, 157, 33, -94, -104, -30, 233, 266, 157, -137, -89, 75, 300, 148, -53, -28, -106, 420, -63, -314, -163, 65, 67, 234, -141, -61, 100, 192, -23, -188, -164, -45, -178, 88, 33, -101, -74, 116]
8191A16
$$ Imaginary data points
##PAGE= N=2
##DATA TABLE= (X++(I..I)), XYDATA
0@%%%Qj6QqJ6k3L1m0M8n6P2q9J05j29J59j86K18k59L00l45M02m62N27o02O86p77
29d12Q77r91J113j245J394j555J733j931K146k379K638k924L235l581L968m395
45b309M873n414O029o733P554q520R671j1086J2869j5184J8340k2926L0215m3659
59b6280P6666l03567n44826M00898M29346K4569l44266j65753R4290J98122N398
70a55403j75769j47247J64491L27485Q7002l30744l10708J30828L99868J32063
80A21866k00724j63205Q8411J51104K2575j04707p3533R0582K11233Q5929j65858
91F3673k23232K3040K59345J68382j33837k16451J9122K00135P2135j31995j35864
102c5547K0473J45225J19075o2203k16404j12842J66048K44424k1274k84035j65616
$$ y = [0, 0, 0, 0, 8, -8, 0, -8, 8, -15, 16, -24, 24, -32, 40, -49, 56, -73, 86, -100, 118, -141, 159, -186, 216, -246, 281, -321, 365, -412, 465, -526, 587, -658, 736, -819, 914, -1017, 1129, -1250, 1388, -1536, 1699, -1882, 2086, -2309, 2564, -2850, 3179, -3554, 4000, -4520, 5151, -5935, 6934, -8250, 10090, -12836, 17379, -26280, 50386, -253181, -798007, -397109, 32237, 56806, -287460, -453213, -358923, -160801, -155403, -331172, -478419, -313928, 13557, 100559, -230185, -540893, -410065, -10197, 121866, -78858, -242063, -153652, -2548, 20027, -84680, -158213, -67631, 143602, 229531, 63673, -159559, -136519, 122826, 291208, 157371, -59080, -39958, 160177, 232312, 100317, -35547, -15074, 130151, 249226, 187023, -29381, -142223, 23825, 268249, 246975, -37060, -202676]
113b02676J75174K54868j4766k28178j32768Q1447J72089Q4162j11349k01092
123a23089m649K47570J49107j90432k52982O2737K87231J16939j72959j91770
133g2297K7407J70783J01433n6177j29220l0109J47112J37581j10572k30257J4390
144b9926K67859J35021j80583k26753J4935J90136R3613j10459j53707l492J35147
155A31791Q4702j07080k11558n6262K00228J91750j12351k87165r0982J71758
165h5169J51826o1316j66403o9195P3610R1403j7624j22152j00352M4103J56453
176a04816O5222j42973j69736L3277J60548N6448p2774o2830P468M6790M9801
187a33575M910n6863l2298Q1655J23300k094j29084n3355J23391J30459k6927
$$ y = [-202676, -27502, 227366, 212600, -15578, -148346, -66899, 105190, 189352, 78003, -123089, -127738, 119832, 268939, 78507, -174475, -111738, 175493, 292432, 119473, -72297, -44890, 125893, 227326, 171149, 41929, 11820, 158932, 296513, 185941, -44316, -29926, 237933, 372954, 192371, -34382, -19447, 170689, 264302, 153843, 136, -3356, 131791, 216493, 109413, -102145, -158407, 41821, 233571, 121220, -165945, -256927, -85169, 66657, 5341, -161062, -230257, -156647, -65244, -82868, -205020, -305372, -261269, -104816, -39594, -182567, -352303, -319026, -158478, -102030, -174804, -237634, -230166, -183376, -133575, -128665, -185528, -217826, -136171, -12871, -14965, -144049, -197404, -74013, 56446, 29519]
198B9519r1982l28P6535O0240K572n7686n5100N9820J45399L1491j49262j19000
210f7782R4348J84990J9189j63551j07398Q8064J41741Q401j17473j04643K2906
221a208J37525Q5962j09112j82860m106J77814R9020j16765j61487N724J37216
232F7723O2604q6452j04413q9P8917O5693j9597j02760o4880P6818J16229k0581
244F9212j18030k9498Q6022N8118m2681o2510O526N4623L2480j3482l9906l6492
256c5618J8173Q0215L5110q1424p8422N4866J01082n791q6838m2485L7416O2922
268E9206K6639m0786p7488k5005P4061Q7083l3340j32437m5439J16757J04844
279A14095o1830j31788k9848P9947P9337l751q5432p3443L8491J05495J6705j13793
$$ y = [29519, -62463, -62791, 13744, 73984, 76556, 18870, -36230, 23590, 168989, 200480, 51218, -67782, 26566, 211556, 230745, 67194, -40204, 47860, 189601, 198002, 80529, -24114, -1208, 136317, 222279, 113167, -69693, -73799, 104015, 203035, 86270, -75217, -69493, 67723, 130327, 43875, -60538, -60627, 18290, 83983, 64386, -38374, -103254, -26436, 89793, 69212, -48818, -78316, 7706, 65824, 23143, -39367, -32841, 21782, 54262, 40780, 874, -35618, -17445, 62770, 97880, 16456, -61966, -7100, 93982, 88191, 1353, -41132, -3716, 59206, 85845, 45059, -32429, -57434, 16627, 103710, 70370, -62067, -107506, 9251, 114095, 52265, -79523, -109371, -29424, 49913, 46162, -39270, -112713, -74222, 31273, 47978, -65815]
291f5815r0172P2305J44336R758j41560q9706P2591J08236O749o4076l9823K3830
303e3347O0895J7223p1990o7490O0068J33707K7902j21710j05113N2739J26864
314E9748K4944q0186l9974N0885N3166j0346o0389n3538K8897J15918O8311q6749
326G0687j36168q273J11668P1746m4410o9128N889M9671O831m4091m2959l939
338c2476N2144P6128k87j08686q4893M8840R8604J3130o0380l5295J9447K5046
350A1322j1250l5050j8850K0061M9375L0665m4408q7645j1711Q8163N3586n6930
362a2672o3129K4501N6713K042m8107l7776J5012N5480L6924k9280o9353k3535
374i3180O4759P0410l4276r4206l904R5417M7043n9443o6727N210N1301L8906
$$ y = [-65815, -155987, -83682, 60654, 70412, -71148, -160854, -88263, 19973, 26722, -37354, -77177, -53347, 7548, 24771, -47219, -114709, -54641, 79066, 106968, -14742, -119855, -67116, 59748, 84692, 4506, -35468, 15417, 68583, 58237, -2152, -55690, -26793, 89125, 157436, 70687, -65481, -73754, 37914, 109660, 65250, -3878, 2011, 51682, 58513, 14422, -28537, -32476, 19668, 95796, 95509, -13177, -98070, -49230, 49374, 62504, 2124, -33171, -13724, 11322, 72, -34978, -53828, -33767, 15608, 46273, 1865, -85780, -97491, -9328, 44258, -12672, -75801, -51300, 5413, 7455, -40652, -78428, -63416, -7936, 28988, -292, -69645, -93180, -28421, 41989, 7713, -86493, -90397, 5020, 52063, -7380, -74107, -68897, -17596, 21310]
386B1310q232m5443k4815L7766N4375j0573p1719k9941O9323P7972k3456p7707
398c1140j3955M5349K3710q892l694M172Q217J6072k669l6314k2407L9120O2214
411G9783O714n3072l2766K6676K7848j4226r359K7056J8192j3114j4144j1688
423C7900k0378N982M7527L0478l0548m7768p294K4037P844j2776J704J7193m265
436D9636k2946r409o050j7429P939M1919Q857m8588l7704J2886K2006m703j1598
449a5184L586N654r811j4421m017m052q339J3498K7704j1016m1549n711L0529
462c3129L047k2277K763K3730O71k0053p956Q924N770m80P713R733r482j3931
476d4957J2948J6593j4787j3238K5419K1090k0870j8427J7320J6025j1027j0246
$$ y = [21310, 13078, -32365, -57180, -19414, 34961, 24388, -47331, -77272, -7949, 70023, 46567, -31140, -45095, 254, 23964, 15072, 11378, 15550, 23767, 39839, 37170, 856, -21551, 17569, 79783, 86497, 33425, 659, 27335, 55183, 40957, 31598, 58654, 76846, 63732, 49588, 37900, 17522, 23504, 71031, 101509, 70961, 23193, 15899, 39936, 47780, 35004, 36708, 53901, 49636, 26690, 17281, 11231, -6198, 1741, 43660, 52517, 3929, -33775, -20889, 1117, -3586, -15184, -11598, -5944, -15755, -30176, -34193, -38245, -46584, -33086, -5382, -16398, -57947, -63658, -33129, -30082, -52359, -49596, -25866, -25195, -45248, -53204, -44280, -38510, -38990, -31277, -21544, -31026, -44957, -32009, -15416, -30203, -43441, -18022, 3068, -17802, -36229, -18909, -2884, -13911, -24157]
488b4157J2514J4790m634j1839J391N946l627K479J4791l304k1596N626K8231
501A6611p156l2989K972L5644R445k4877j6680R400J5543L655l954l968n322R74
515g02J9777J0591k6763k2752K9879L8655j5546l7149K377K7373R932p358p727
528B0587l248K819J2419J0499j0795k5251L052L8346J4516l8769k8744K4885K9581
541D9897q513j9550m759J287O587J1784m718k6448j2106K5636K8109j7413m5822
554a6029p459L9251J8628k8630k5506N264J1227N910q56k0341k5080J2172L8313
567F864K442m5685l2191K4974M2378n247m2568j4954K5258J9540o258j7047j7836
580f0330q33L3881K8575k8471m8131Q415N3844K0729l5270l3272J8676M2591J0461
$$ y = [-24157, -11643, 3147, -1487, -13326, -11935, -5989, -9616, -7137, 7654, 4350, -17246, -11620, 16611, 9455, -23534, -20562, 15082, 24527, -350, -17030, -7630, 7913, 11568, 7614, 3646, -1676, -702, 19075, 29666, 2903, -19849, 10030, 48685, 33139, -4010, -1633, 25740, 35672, 28314, 20587, 17339, 20158, 32577, 43076, 32281, 7030, 10082, 48428, 62944, 24175, -4569, 20316, 49897, 41384, 21834, 17075, 18362, 24949, 36733, 32015, 5567, -6539, 19097, 47206, 29793, -16029, -23488, 15763, 34391, 5761, -19745, -14481, -3254, 2656, 1800, -18541, -43621, -31449, 6864, 9306, -36379, -68570, -43596, -1218, -6465, -49033, -63987, -38729, -19189, -25447, -42494, -60330, -61163, -27282, 1293, -27178, -75309, -66894, -13050, 7679, -27591, -60863, -42187, 404, 10865]
593A0865k5083k1182M527K8180L4002J00m3741k1274M6919N0056k0544n0179J342
606f012M9577L0813j9941l8050p890L0476L5642M294l3044l4027J7634N4646P713
619I1831n9423l5467M3619N3602j1875n4167k9460K0290L9328J1372l2887l9912
631c149O3L9368K1386m1643n8246J0793O8183J9091o1545n5575J1864M4880J9606
644A5076k2768m1577j4339L2143L3781k0466n7339j5968N5434N4137k8786p3980
656h4652j5540N4425M1609j4069l7328j8249K0719M2612Q291m7580l8243L6323
668e1682P0660R544o4685m8383L5785O8479R694m7416l2553J8366M3614K2696
680C4119k9605n3719J080O9481M2038m8492p0062O756P0908L6410m4588o0274
$$ y = [10865, -14218, -35400, -30873, -2693, 31309, 31409, -12332, -33606, 13313, 63369, 42825, -7354, -6012, 43565, 74378, 54437, 16387, 8497, 38973, 74615, 78909, 45865, 11838, 29472, 84118, 91831, 32408, -3059, 40560, 94162, 82287, 28120, -1340, 18950, 58278, 69650, 36763, -3149, -3086, 36282, 57668, 16025, -42221, -31428, 36755, 55846, -5699, -61274, -49410, -4530, 15076, -7692, -49269, -63608, -31465, 2316, -18150, -75489, -91457, -36023, 18114, -10672, -84652, -100192, -45767, -4158, -18227, -55555, -73804, -53085, -10473, -2182, -49762, -88005, -51682, 18978, 28522, -36163, -84546, -48761, 19718, 29412, -18004, -50557, -32191, 11423, 34119, 4514, -49205, -48125, 21356, 63394, 14902, -55160, -48404, 22504, 58914, 14326, -45948]
692d5948M905N7576L4346k6556n6001k1227M7914O3112j2768p7227k7195O5308
704F239O1234k8260p1642j5340O0102N7745j3407o0863l1653L4614O2139J7084
716G7992n3616n0919L5584P7782L557p5974l9777N0509P0976P024n6618n0375
728c855J3127N8512L2943l2790n6351l141N9208L5193n2301p1123J4597P6597
740G0616K9070n2405o5635j1548M5067M6054j3487o2424l3366L6879N0301j8070
752B1052p4015l1348N8435O3484k6650q2198l3575M2806N6965O409n2792n1151
764a02578J6654O4884J7769o0706n4747L4014Q2173J6776p4713o2879L5431Q2332
776e590K6268m7417n5319K437O1866M9056l2464o9555K372Q2582M9342n2055p8032
$$ y = [-45948, -41043, 16533, 50879, 24323, -31678, -52905, -4991, 58121, 45353, -31874, -59069, 6239, 67473, 39213, -32429, -47769, 12333, 70078, 56671, -4192, -35845, -1231, 60908, 77992, 24376, -26543, 9041, 86823, 90380, 14406, -25371, 25138, 96114, 103138, 46520, -3855, 9272, 67784, 100727, 67937, 11586, 8445, 67653, 102846, 50545, -20578, -5981, 70616, 99686, 47281, -18354, -29902, 15165, 61219, 47732, -14692, -48058, -11179, 39122, 21052, -52963, -84311, -25876, 37608, 10958, -71240, -104815, -62009, -5044, 1365, -51427, -102578, -85924, -21040, -3271, -63977, -118724, -84710, -2537, 14239, -60474, -123353, -87922, -5590, 20678, -26739, -82058, -79621, -17755, 31301, -1163, -70718, -68346, 14236, 63578, 11523, -66509]
789f6509O243Q4305N3211l9103o9538j1352N4331N4337r299o5232l3916N4987
801A2465P1535j9933q6255k9415O4231O7155j5072p3397l8306L8983O0834N315
813E8140n5161m8574K0589O8069K0755o6665o4024L2195Q1349J6608o4635n7697
825e9051J8054O6310L2417m0901o0812j387O1723M7211l1917p3869j1839P6489
837B2428N9716m2656q0463o158O8635N2411k3588o5897k6550M9727O4194p484
849F4315p4265m1875N2272Q0111o084q9279m7409N7852P5694p954p0716m3120
861e0458L1019O4847J6059o3029o3373K5894Q2777K3289p3914p3007K6250Q6118
873C2472K4991o5783o2567J7579O4594K9354m0812o4266l397P1216N1323m5205
$$ y = [-66509, -60266, 24039, 77250, 38147, -31391, -42743, 11588, 65925, 56626, -8606, -42522, 12465, 84000, 64067, -22188, -51603, 12628, 79783, 64711, -8686, -46992, -8009, 52825, 58140, 2979, -45595, -25006, 43063, 63818, -2847, -66871, -34676, 46673, 63281, -1354, -59051, -40997, 25313, 57730, 16829, -43983, -45370, 16353, 63564, 31647, -42222, -54061, 22428, 82144, 39488, -40975, -47133, 21502, 73913, 50325, -15572, -42122, 7605, 71799, 64315, -9950, -51825, 447, 80558, 74474, -14805, -62214, -4362, 71332, 63378, -7338, -50458, -19439, 45408, 61467, -1562, -64935, -39041, 43736, 67025, -6889, -79896, -53646, 32472, 57463, -8320, -70887, -53308, 11286, 40640, -172, -64438, -67835, 3381, 54704, 9499]
885I499q1390m345P7286N4055l8095p4269q812O3954M7864k5672n9033j7637M8355
898h240N9454q560p4022l7703N7488P5535r637p6191l7311M6478O5292n45n9855
911g817l6801L0965N7064J2063n2871n5139K1876P9061K5278o9513o7174K5786
923c7222P5076K3970n0568n6392O889N6978L1291l6570n8292k697O2876M8060
935F3399m0210q1397p997P7072N2993l7119o6883j2600M7819M4735j3871n4080
947b8139k0828M5968N3092j4814p0050l3117N3939P2847p013p3453l7550L8795
959b0323N2746K583m1845l1890K0850M9668P711n2995m5701K7695P0084K1355
971E9938n8106o1389J5325O3189K3204l6658l8910M932L7264K3562k6210m9542
$$ y = [9499, -71891, -76236, 1050, 55105, 17010, -57259, -66071, -2117, 45747, 20075, -38958, -56595, -8240, 51214, 42654, -31368, -69071, -11583, 63952, 54315, -21876, -59187, -12709, 52583, 52038, -7817, -44618, -13653, 43411, 55474, 2603, -52536, -30660, 48401, 73679, 4166, -63008, -37222, 37854, 61824, 11256, -45136, -38247, 18731, 50022, 13452, -44840, -47537, 15339, 63399, 23189, -58208, -66205, 10867, 63860, 26741, -40142, -52742, -4923, 39812, 25941, -28139, -48967, -2999, 50093, 35279, -34771, -67888, -13949, 58898, 51885, -21568, -59118, -20323, 32423, 35006, -6839, -38729, -17879, 31789, 39500, -13495, -59196, -31501, 38583, 59938, 1832, -59557, -44232, 18957, 42161, 5503, -33407, -28475, 8789, 32351, 6141, -43401]
983d3401j588N8738M2308l4514o6796j1496N5616M7228j9193n0388j2583L3352
995b717L1226p307l7451k1466L1985N2053m698o1565l3020M1240N7772J550m9571
1008a969l4371K0804M3386J0170l0516k9319Q546L8986J8612l5551m6161J3616
1020b3767N9015K1840m3712m7738M703M4300K8541j8164l8470r601K7438K6525
1032C0910j1375l8279j1911M0486M0444k2162n8418j5160M3139M1501m506l7495
1044b826k5812J3128L2525P597k8354k3439J9795M0807L471m9672l8407K8350
1056b2837N6847J0738l9091l5718K561L0001K2621j4595l2690o72L6760J9981
1068C3906l2299m5678L430N2740L2720k9203m9326p613L2068K7421n087k9374
$$ y = [-43401, -44989, 13749, 56057, 21543, -45253, -56749, -1133, 46095, 26902, -23486, -36069, -2717, 28509, 21202, -16249, -37715, -5730, 46323, 41625, -19940, -52960, -11720, 46052, 47602, -1969, -36340, -15536, 27850, 38020, 7504, -21815, -13269, 25717, 44329, 8778, -37383, -23767, 35248, 57088, 13376, -34362, -29659, 14641, 43182, 25018, -13452, -23053, 4385, 30910, 19535, -18744, -30655, 9831, 50275, 28113, -30305, -45465, -2326, 39175, 34669, -2826, -28638, -15510, 17015, 24612, -3742, -27181, -7386, 33421, 36892, -12780, -51187, -22837, 34010, 44748, 5657, -30061, -27500, 2501, 25122, 10527, -22163, -22835, 13925, 33906, 1607, -44071, -40641, 12099, 44819, 15616, -33710, -41323, -9255, 18166, 13079, -16295]
1080a6295j7129K2321L3092r243m5454j6484L8342M2467q500m8107k4971K7524
1092b2437L8862J853k9343k1773J0059L1444J3013k9170l4240J5811M8057J1777
1104C3913l9382l5635J4412M3293J7917k6956l3593J615L2130K3629j2409l6632
1116a7698j0398L6874L4556k1526m7293l263M2804K9204j8444l9811j2881K8738
1128H62L3041l687l5506k1710K1236L7821R3m4243k5531L3779M2692q993m4709
1141a4855k0722K3937L5609N415l1741k8986J2930L7578J0446l2799l2773J5586
1153b0375M6818J1121m2188l4151J9895M0880J0086k6050k8499K084L2302K1695
$$ y = [-16295, -33424, -11103, 21989, 12746, -32708, -49192, -10850, 31617, 23117, -24990, -49961, -22437, 16425, 18278, -11065, -32838, -22779, 8665, 21678, -7492, -41732, -25921, 22136, 33913, -5469, -41104, -26692, 16601, 34518, 7562, -26031, -24416, 7714, 31343, 18934, -17698, -28096, 8778, 43334, 21808, -25485, -28748, 14056, 43260, 24816, -14995, -27876, 862, 33903, 30216, -5290, -27000, -5764, 32057, 32150, -12093, -37624, -3845, 38847, 29854, -14855, -35577, -11640, 23969, 29384, -2357, -31343, -18413, 19165, 29611, -3188, -35961, -20375, 26443, 37564, -4624, -38775, -18880, 22000, 32086, 6036, -22463, -20379, 11923, 33618]
$$ [...]
8191E9
##END NTUPLES=NMR FID
##END=
