##TITLE=1H_CA-8621-1
 DMSO, 8 sc, 
 5.7.2019
##JCAMPDX= 6.0         $$ Bruker NMR JCAMP-DX V2.0
##DATA TYPE= NMR FID
##DATA CLASS= NTUPLES
##ORIGIN= UXNMR, Bruker Analytische Messtechnik GmbH
##OWNER= root
$$ XWIN-NMR		Version 3.5
$$ Fri Jul  5 14:28:43 2019 Russian Standard Time (UT+4h)  she@DPX200
##.OBSERVE FREQUENCY= 200.13155
##.OBSERVE NUCLEUS= ^1H
##.DELAY= (6, 6)
##.ACQUISITION MODE= SIMULTANEOUS
##.ACQUISITION SCHEME= undefined
##.AVERAGES= 8
##.DIGITISER RES= 18
##SPECTROMETER/DATA SYSTEM= spect
##.PULSE SEQUENCE= zg30
##.SOLVENT NAME= DMSO
##.SHIFT REFERENCE= (INTERNAL, DMSO, 0, 15.7039)
##AUDIT TRAIL= $$ (NUMBER, WHEN, WHO, WHERE, WHAT)
$$ ##TITLE= Audit trail, XWIN-NMR		Version 3.5
$$ ##JCAMPDX= 5.01
$$ ##ORIGIN= Bruker BioSpin GmbH
$$ ##OWNER= she
$$ F:/spectra/data/she/nmr/H-F/1/audita.txt
$$ ##AUDIT TRAIL=  $$ (NUMBER, WHEN, WHO, WHERE, WHAT)
(   1,<2019-07-05 14:27:31.28 +0400>,<she>,<DPX200>,
      <created by zg, POWCHK disabled, PULCHK disabled
       configuration hash MD5:
       00 E9 B6 7A A2 85 ED C7 34 08 36 98 17 FE 4E 26
       data hash MD5: 16K
       EF 62 DA C2 42 36 1F 25 6A A0 F5 75 97 E3 68 BC>)
$$ ##END=
$$ 
$$ hash MD5
$$ 3F 74 B0 FA D0 87 29 CB F6 6D 93 51 12 A3 E1 38
##$RELAX= 
##$RELAX= 
##$RELAX= 
##$RELAX= 
##$RELAX= 
##$RELAX= 
$$ Bruker specific parameters
$$ --------------------------
##$DU= <F:/spectra>
##$EXPNO= 1
##$NAME= <H-F>
##$PROCNO= 1
##$TYPE= <nmr>
##$USER= <she>
##$AMP= (0..31)
100 100 100 100 100 100 100 100 100 100 100 100 100 100 100 100 100 100 
100 100 100 100 100 100 100 100 100 100 100 100 100 100 
##$AQSEQ= 0
##$AQ_mod= 1
##$AUNM= <au_zg>
##$AUTOPOS= <>
##$BF1= 200.13
##$BF2= 200.13
##$BF3= 200.13
##$BF4= 200.13
##$BF5= 200.13
##$BF6= 200.13
##$BF7= 200.13
##$BF8= 200.13
##$BYTORDA= 1
##$CFDGTYP= 0
##$CFRGTYP= 5
##$CHEMSTR= <none>
##$CNST= (0..31)
1 1 145 1 1 1 1 1 1 1 1 1 1 1 1 1 1 1 1 1 1 1 1 1 1 1 1 1 1 1 1 1 
##$CPDPRG= <>
##$CPDPRG1= <>
##$CPDPRG2= <>
##$CPDPRG3= <>
##$CPDPRG4= <mlev>
##$CPDPRG5= <mlev>
##$CPDPRG6= <mlev>
##$CPDPRG7= <mlev>
##$CPDPRG8= <mlev>
##$CPDPRGB= <>
##$CPDPRGT= <>
##$D= (0..31)
0 1.2 0 0 0 0 0 0 0 0 0 0.03 0 0 0 0 0 0 0 0 0 0 0 0 0 0 0 0 0 0 0 0 
##$DATE= 1562322450
##$DBL= (0..7)
120 120 120 120 120 120 120 120 
##$DBP= (0..7)
150 150 150 150 150 150 150 150 
##$DBP07= 0
##$DBPNAM0= <>
##$DBPNAM1= <>
##$DBPNAM2= <>
##$DBPNAM3= <>
##$DBPNAM4= <>
##$DBPNAM5= <>
##$DBPNAM6= <>
##$DBPNAM7= <>
##$DBPOAL= (0..7)
0.5 0.5 0.5 0.5 0.5 0.5 0.5 0.5 
##$DBPOFFS= (0..7)
0 0 0 0 0 0 0 0 
##$DE= 6
##$DECBNUC= <off>
##$DECIM= 24
##$DECNUC= <off>
##$DECSTAT= 4
##$DIGMOD= 1
##$DIGTYP= 9
##$DL= (0..7)
0 120 120 120 120 120 120 120 
##$DP= (0..7)
150 150 150 150 150 150 150 150 
##$DP07= 0
##$DPNAME0= <>
##$DPNAME1= <>
##$DPNAME2= <>
##$DPNAME3= <>
##$DPNAME4= <>
##$DPNAME5= <>
##$DPNAME6= <>
##$DPNAME7= <>
##$DPOAL= (0..7)
0.5 0.5 0.5 0.5 0.5 0.5 0.5 0.5 
##$DPOFFS= (0..7)
0 0 0 0 0 0 0 0 
##$DQDMODE= 0
##$DR= 18
##$DS= 0
##$DSLIST= <SSSSSSSSSSSSSSS>
##$DSPFIRM= 0
$$ [...]
##$SUBNAM2= <"">
##$SUBNAM3= <"">
##$SUBNAM4= <"">
##$SUBNAM5= <"">
##$SUBNAM6= <"">
##$SUBNAM7= <"">
##$SUBNAM8= <"">
##$SUBNAM9= <"">
##$SW= 24.9336996594482
##$SWIBOX= (0..15)
0 0 2 0 0 0 0 0 0 0 0 0 0 0 0 0 
##$SW_h= 4990.01996007984
##$TD= 16384
##$TD0= 1
##$TE= 0
##$TE2= 300
##$TE3= 300
##$TEG= 300
##$TL= (0..7)
0 120 120 120 120 120 120 120 
##$TP= (0..7)
150 150 150 150 150 150 150 150 
##$TP07= 0
##$TPNAME0= <>
##$TPNAME1= <>
##$TPNAME2= <>
##$TPNAME3= <>
##$TPNAME4= <>
##$TPNAME5= <>
##$TPNAME6= <>
##$TPNAME7= <>
##$TPOAL= (0..7)
0.5 0.5 0.5 0.5 0.5 0.5 0.5 0.5 
##$TPOFFS= (0..7)
0 0 0 0 0 0 0 0 
##$TUNHIN= 0
##$TUNHOUT= 0
##$TUNXOUT= 0
##$USERA1= <user>
##$USERA2= <user>
##$USERA3= <user>
##$USERA4= <user>
##$USERA5= <user>
##$V9= 5
##$VALIST= <valist>
##$VCLIST= <CCCCCCCCCCCCCCC>
##$VD= 0
##$VDLIST= <DDDDDDDDDDDDDDD>
##$VPLIST= <PPPPPPPPPPPPPPP>
##$VTLIST= <TTTTTTTTTTTTTTT>
##$WBST= 1024
##$WBSW= 4
##$XGAIN= (0..3)
0 0 0 0 
##$XL= 0
##$YL= 0
##$YMAX_a= 138552
##$YMIN_a= -156673
##$ZGOPTNS= <>
##$ZL1= 120
##$ZL2= 120
##$ZL3= 120
##$ZL4= 120
##$ABSF1= 10
##$ABSF2= 0
##$ABSG= 5
##$ABSL= 3
##$ALPHA= 0
##$AQORDER= 0
##$ASSFAC= 0
##$ASSFACI= 0
##$ASSFACX= 0
##$ASSWID= 0
##$AUNMP= <proc_1d>
##$AZFE= 0.1
##$AZFW= 0.1
##$BCFW= 1
##$BC_mod= 2
##$BYTORDP= 1
##$COROFFS= 0
##$CY= 11.3945322036743
##$DATMOD= 1
##$DC= 2
##$DFILT= <>
##$DTYPP= 0
##$F1P= 18.9103706918063
##$F2P= -1.10871071338519
##$FCOR= 0.5
##$FTSIZE= 0
##$FT_mod= 4
##$GAMMA= 1
##$GB= 0.15
##$INTBC= 1
##$INTSCL= 1
##$ISEN= 128
##$LB= 0.24
##$LEV0= 0
##$LPBIN= 0
##$MAXI= 10000
##$MC2= 0
##$MEAN= 0
##$ME_mod= 0
##$MI= 1.114404
##$NCOEF= 0
##$NC_proc= 0
##$NLEV= 6
##$NOISF1= 3.799351
##$NOISF2= 2.8
##$NSP= 1
##$NTH_PI= 0
##$NZP= 0
##$OFFSET= 15.70392
##$PC= 1
##$PHC0= -8863.152
##$PHC1= 17.00096
##$PH_mod= 1
##$PKNL= yes
##$PPARMOD= 0
##$PSCAL= 0
##$PSIGN= 0
##$REVERSE= no
##$SF= 200.130013532006
##$SI= 16384
##$SIGF1= 3
##$SIGF2= 2
##$SINO= 400
##$SIOLD= 16384
##$SREGLST= <1H.CDCl3>
##$SSB= 0
##$STSI= 0
##$STSR= 0
##$SW_p= 3612.71676300578
##$SYMM= 0
##$S_DEV= 0
##$TDeff= 0
##$TDoff= 0
##$TI= <>
##$TILT= no
##$TM1= 0
##$TM2= 0
##$TOPLEV= 0
##$USERP1= <user>
##$USERP2= <user>
##$USERP3= <user>
##$USERP4= <user>
##$USERP5= <user>
##$WDW= 1
##$XDIM= 8192
##$YMAX_p= 0
##$YMIN_p= 0
$$ End of Bruker specific parameters
$$ ---------------------------------
##NTUPLES= NMR FID
##VAR_NAME=  TIME,          FID/REAL,        FID/IMAG
##SYMBOL=    X,             R,               I
##VAR_TYPE=  INDEPENDENT,   DEPENDENT,       DEPENDENT
##VAR_FORM=  AFFN,          ASDF,            ASDF
##VAR_DIM=   8192,          8192,            8192
##UNITS=     SECONDS,       ARBITRARY UNITS, ARBITRARY UNITS
##FACTOR=    0.0002004,     1,               1
##FIRST=     0,             0,               0
##LAST=      1.6414764,     0,               0
##MIN=       0,             -156673,         0
##MAX=       1.6414764,     138552,          0
$$ Real data points
##PAGE= N=1
##DATA TABLE= (X++(R..R)), XYDATA
0@%%%%%%%kJ0j6J6j6J6k4L2m0M8n6O7p6Q9j04J23j46J67j92K21k50K82l19L61
31A91m06M56n12N74o39P11p91Q78r73J078j194J322j464J621j796J995k222K476
49A305k771L119l529M027m648N441o500P999j0292J4291k3281Q0994k4498j47895
63a06238M5489J11496Q7805n4619j21707n8376Q0905Q6516R476o0214o4779k3902
75f8148N3126N9798K861m3494m6723k7266L7867P0811J2054o1329n3429k847N0937
88a5782O1282m095p0489l8612K8645M6433K7400p594m4443k8746K0902L4929K2796
101C2626Q302l2786n1169M430O0712M5740r845o2035n8261L0043R7063L5869o6366
114C4323q0248j0852P0747Q2020j1233r5868n1796M5384P1633K6468l8495o9534
$$ y = [0, 0, 0, 0, 0, 0, 0, 0, -2, 8, -8, 8, -8, 8, -16, 16, -24, 24, -32, 35, -41, 48, -56, 67, -79, 88, -104, 117, -133, 149, -170, 191, -215, 241, -271, 303, -336, 375, -416, 462, -511, 567, -627, 695, -769, 852, -944, 1051, -1171, 1305, -1466, 1653, -1876, 2151, -2497, 2944, -3556, 4443, -5849, 8442, -14839, 66155, 41657, -106238, -60749, 50747, 138552, 83933, -37774, -96150, -15245, 71271, 80747, 20533, -44246, -68148, -15022, 44776, 47637, 4143, -42580, -69846, -31979, 38832, 50886, -10443, -63872, -66719, -15782, 45500, 41405, -29084, -67696, -39051, 7382, 34782, 27188, -17255, -46001, -25099, 9830, 32626, 40928, 8142, -43027, -38597, 22115, 67855, 58010, -4025, -62286, -32243, 64820, 100689, 34323, -45925, -56777, 13970, 95990, 84757, -11111, -62907, -17523, 54110, 80578, 42083, -27451]
126b7451j8407N3974M8455m322l3316l8970j3789L8897M5947n325l8793l2850
138b5950n060L9256M5881j5295n4499k0019K3282L4153J8153k2645m1290r94K9528
151D501J0547l133k573j4141j2297N535R549J2735J4001k0812m2473J663M6061
164I163K9167j5591m6998l3858L1914O6100Q052n7264m3526J1039M9261M0573
176D8032k0267n9939j6987L8541L6805P509k1587l7754q348L6271L0847k667k1257
189I199k7427p761L6318L6920j2832l7530j8190J2841L7265K2021k9850l9821
201a8847P262L1439J3649p500k0804j3811J5164J6619j0942r111R323p04j2500
214g63m168L752J2088J2113j8714l3408O066L5922J2743j9656l0466j4891K6326
$$ y = [-27451, -45858, 8116, 56571, 52249, 18933, -20037, -33826, 5071, 51018, 45693, 6900, -25950, -31010, 8246, 54127, 38832, -15667, -35686, -12404, 21749, 39902, 17257, -24033, -25027, 4501, 15048, 11915, 9342, -4799, -17096, -11561, -2012, 10723, 24724, 3912, -38561, -36898, 9163, 38330, 22739, -24259, -58117, -26203, 39897, 47949, -9315, -52841, -41802, 7459, 48032, 27765, -32174, -49161, -10620, 26185, 33694, 12107, -25647, -33995, 2276, 33123, 30456, 9199, -18228, -25989, 10329, 47249, 34417, -3113, -21303, -8462, 28803, 50824, 20974, -18847, -11585, 19854, 33503, 26003, 5199, -8612, 6552, 23171, 12229, 3118, 12441, 11737, -763, -4931, -1179, 10909, 23022, 4308, -29100, -23034, 12888, 25631, 5975, -24491, -39382, -13056]
227a3056L8633p040m0357j6968J4338K4695J7852j3578l4032o729K3156J8356
239E270N837r652k7210r646K7655K6212k875k0952k2951M06L6263K6321k3206
252A1472l3719j786K3404K6346K106l1557k0133K2040K5274m159j4679q308K194
265a505J4464M280j5181k997J4978j70j3603k852O282R290N878j5042k0150R822
279f506K4267P65j6119j3313m136J4717J9198p731k2068m856O840Q901J1688l877
293G770k1843q378J2552J3374P723p257k6073q975K6464K2727q786k3062j6472
306c0236Q862L2205J1839k8998k4632J0970K3239J1540q975k4171n383K3999J3781
319A4040j2716j0906J069N232Q330J58j1068Q70J2434k420r635K702N640K346
$$ y = [-13056, 25577, 18537, -21820, -38788, -24450, 245, 18097, 4519, -29513, -36242, -13086, 5270, 11107, 1455, -25755, -35401, -7746, 18466, 15591, -5361, -28312, -27906, 8357, 34678, 11472, -22247, -24033, -629, 25717, 27823, -3734, -23867, -1827, 23447, 19288, 4609, -3699, -1505, 12959, 17239, 2058, -939, 14039, 13869, 266, -2586, 3696, 12986, 18864, 3822, -16328, -6506, 17761, 18526, 2407, -10906, -15042, -325, 18873, 11142, -10926, -15782, -8942, -41, 11647, 7770, -14073, -22451, -9899, 3475, 11198, 3941, -22132, -31107, -4643, 18084, 9298, -13764, -30236, -21374, 10831, 22670, -6328, -30960, -19990, 3249, 14789, 5814, -18357, -23740, 259, 14040, 1324, -9582, -8513, -3281, 5049, 5207, -5861, -4991, 7443, 5023, -4612, -1910, 3730, 6076]
333F076K511o707r273Q472J1948m121o553j268l281L430J1406j312r972l521q39
348c004L536J3926J766j9591j1042J0578J4380P198j0023k4396l719K6617J6280
361B2506j4802k1664o764J3350K3497N29k7745j3504J6476J6287P87j0852j4551
374a6450Q90J8291N139j2889n333L381K159M253J202p322k47P166k000l794M798
389g56N12l833L972J610m994J637L970j940J991K448p688k456J1118N029o506
404D114o007l944M772J5817J640j9847r266J2639J4118L176j1815j8605K430K4336
418A3558Q893j7263j5284O60J2348J4556l979k1423n242J5164Q908l298p072q559
432h033O59J2546L169r520l568J459o47N023L536p538m642M788J586L88J885n182
$$ y = [6076, 8587, 1880, -7393, 1079, 13027, 8906, 2353, 1085, -2196, 1234, 12640, 11328, 1356, -2165, -3004, 532, 14458, 16224, -3367, -14409, -3831, 10549, 17747, 7724, -16672, -20391, 6226, 22506, 7704, -13960, -20724, -7374, 16123, 16652, -11093, -24597, -8121, 8166, 8953, -1899, -16450, -15560, 2731, 7870, -5019, -10352, -6971, -4812, -559, 643, -6679, -6926, 240, -1760, -5554, -756, -244, -4077, -105, 1505, -3489, -1852, 2118, 178, 2169, 4617, -3071, -5527, 5591, 10620, 4114, -1893, -5837, -1065, 14752, 16392, -3455, -12721, -82, 14036, 17212, 5397, -13208, -10778, 13558, 22451, 5188, -10096, -9436, 2912, 17468, 13489, -7934, -13176, 1988, 10896, 7598, 526, -8033, -7374, 5172, 8341, -1179, -4747, -3288, -3935, 1088, 4624, -2914, -7556, -2768, -1182, -794, 1091, -4091]
448d091n095P780N604o502m324J630K350N487O45j1399l447J3189O754p367q074
463f860k597O790J3893j084j8221n507J3724J0949j314r942j1837M723J8784L296
477A4797j4751q421L880Q193Q699l355j4285k810J1450M961k086l050p040j414
491e232J0060M788p022m459j217L38P331M117r716o906N722N488P13j788q297
506f080k574J0825N607r721o796L299N178M884k710j1595j710J3442N044q862
520a769p403k01O748R733k701j4755k069J2254O197l131o542p051L537J3268J099
535G214j0615m451K916M391O527r47j0575k771P951M580J30k375p442k076J0236
550B693N858o561o223q24K533Q360K387j1528o029Q136O852j180m500p092L57
$$ y = [-4091, -9186, -1406, 4198, -2304, -6628, -4998, -2648, 2839, 3484, -7915, -11362, 1827, 8581, 1214, -6860, -9457, -2667, 11226, 10142, -8079, -13586, 138, 11087, 9773, -169, -12006, -7283, 11501, 14797, 46, -8375, -4495, 3698, 12397, 9042, -5243, -8053, 3397, 8358, 6272, 3222, -3818, -5232, 4828, 9616, 2594, -1865, -3082, -2744, 4587, 8704, -1012, -7918, -2196, 3292, 4005, 2217, -6080, -8654, 2171, 7778, -1943, -8739, -5440, -262, 4622, 1912, -9683, -11393, 2049, 7093, -1769, -9172, -9373, -2625, 7108, 4407, -10348, -12417, -163, 6034, 2903, -3639, -10690, -7153, 6115, 7214, -3401, -7852, -4936, -545, 5982, 5035, -5540, -8311, -360, 4220, 4350, 1975, -5467, -7543, 2693, 8551, 1990, -4233, -5057, -2524, 5836, 8223, -3305, -9334, -1198, 5654, 4474, -26, -7118, -6761]
565f761J1432L403j1226n717N282N455K569l642r610K72J1819K379q365m815R88
580f537M577O498k249j1093r09Q950L308k162l511n541J222R819J816p740l448
595g000P50K684O718P58j0030l881O990N336N18k952p696j345J1064N322p863
610f27o444M59M690P536j34j1307m227R839N790k960n051m781K096R770J561j0329
626d119l540N674L976J080k591p511M17R468J513o771l022N59K217N999q17q696
642f164j598O515K433l32j993n998l69R073K724o406m032K5K776O750Q04j0094
658e886l922P512N556l67m115p038M19J0877L671q620n596K183M769N470j295
673C618r935k284R303M588l846m163k884J959P975Q22q376k704M673K920J288
$$ y = [-6761, 4671, 8074, -3152, -8869, -3587, 1868, 4437, 795, -8815, -8543, 3276, 5655, -2710, -7525, -6537, -1960, 4538, 2289, -8804, -9713, -763, 2545, 383, -3128, -8669, -7447, 2372, 4188, -3552, -7000, -6250, -3566, 3152, 3910, -6120, -10001, -3011, 2325, 2843, -109, -7805, -9150, 1914, 7236, -627, -7071, -6612, -1922, 5614, 5480, -5827, -10054, -215, 5575, 2615, -2436, -7217, -5121, 4649, 6210, -4119, -7659, -1985, 1991, 3071, 480, -7031, -6614, 2854, 4367, -2404, -5426, -4867, -2650, 3349, 2532, -6164, -7762, -1247, 1186, 854, -1139, -7137, -7506, 1567, 4291, -2115, -6147, -6122, -3346, 3404, 4208, -5886, -9808, -2296, 3260, 2893, -1222, -8260, -7841, 3036, 6707, -1913, -7509, -5326, -557, 4913, 3618, -6317, -8601, 702, 5290, 1444, -2719, -5603, -3644, 4331, 5153, -3223, -5927, -1254, 1666, 2954]
688B954j476o296m47P800K041m996k566m83J461N710O54q047k565N656L032K59
704B691k085o423n23R037L105o904m468L26L535O312l19r831l205P988N233j863
720B606m372n315J317R655K420q642m269L104M004L987j781q224j155Q236L186
735D757l447l102k391J382P145J287p586k477M161K571J690q32o271j050P585
750C422K514m344k583j129J536O028Q04p820k777N167L674P6k431o207K44Q449
766D623K592o953l756P39L257N161p80q625k218P315L686k081l794m577J638Q155
782D382J312p549l687K934L161L510j393p547j047P367K914l558k522k295J264
797b754O725J127p107k442L610K836K058j221o261o47P438K615m230k856p76J796
$$ y = [2954, 1478, -4818, -5265, 2535, 4576, -420, -2986, -3469, -2008, 3702, 4356, -3691, -6256, -600, 2432, 2691, 606, -5817, -6340, 2697, 5802, -1102, -5570, -5244, -1709, 4603, 4284, -5547, -8752, -764, 4469, 2606, -1766, -7081, -5764, 3891, 6311, -2331, -6600, -3496, 508, 4495, 2714, -5510, -6665, 1571, 4757, 1310, -1792, -4183, -2801, 4344, 5631, -1955, -4432, -271, 2300, 3990, 3158, -3113, -4163, 3422, 5936, 1592, -991, -2120, -584, 5444, 6248, -1572, -4349, 818, 4492, 4568, 2137, -4070, -3826, 4623, 7215, 262, -3494, -2755, 502, 5663, 4883, -3742, -5960, 1355, 5041, 2960, -834, -5411, -3773, 4382, 5694, -1855, -5542, -2608, 553, 4063, 2670, -4877, -5924, 1443, 4357, 799, -1723, -4018, -2754, 3971, 5098, -2009, -4451, -841, 1995, 4053, 2832, -3429, -4076, 3362, 5977, 1747, -1109, -1885, -89]
813h9N662P40p616k157N466L219k10k278n151L42P978J738o137l186J360K666
829B347M266j037p533j585O727K814k337k620l921R47P164J035o875k878K377
844a109K757K683j279o757j493O872K709l422k668k132J024O195J021o912k691
859e202L874K899J470j508o045l19O975K277m314k626n12K220N253M1p018j786
875d321N392K809p4k198m558P43P077J327n278k858J365K591L885p66o909j067
891b840N923K543j764k469l265P82O538J064o179k595K413K161K393p12o619j025
907c651O382K281l052k823k225J234N980N75o859k241L454K472R12j475n259j97
923d492O569J796m302k708l42J673M651j2o377j690N028K412l74k067m182P90
$$ y = [-89, 5573, 6313, -1303, -3460, 2006, 5225, 5015, 2737, -2414, -2072, 5906, 7644, 1507, -1679, -319, 2347, 6613, 5576, -1957, -3542, 3185, 5999, 3662, 1042, -2879, -1932, 5232, 6267, -608, -3486, -1109, 1648, 4331, 3052, -3705, -5198, 1674, 4383, 961, -1707, -3839, -2815, 3380, 4401, -2511, -5202, -1328, 1571, 3041, 1533, -4512, -4831, 2144, 4421, 107, -2519, -3031, -811, 4442, 4483, -2535, -4321, 1071, 3880, 3806, 1608, -2950, -2207, 4870, 6197, 919, -1939, -574, 2017, 5902, 5136, -1773, -2840, 3083, 5626, 3862, 1393, -1872, -1090, 5448, 6512, 333, -2262, 151, 2312, 4705, 3993, -2626, -3651, 2731, 5012, 1960, -863, -3088, -1854, 4126, 4701, -2158, -4399, -945, 1527, 2439, 964, -4295, -4492, 2077, 3873, -429, -3137, -3479, -1806, 2845, 2833, -3544, -5234, -206, 2206, 1832, -235, -4417, -3627]
939c627O495J329n296k362J510K092L677o16o376q37N688K397j941k102k776J110
955a635O018R97o022j929K409K490K230j052n913m25O049K030l031k390j584J284
971d74N381J55o046j946L526K062Q73j429n206J13O000J440m360k348k19J697
987g81M324o89o290j399M747J760n28j828m039P19N825J061n171j941J187J887
1003a156L329p68n893p82N391K044j724j959k468J024N531Q96n309j862K616K075
1019I85K161j009n202l29N744J958l022j787j261J487M775K06n551j539L458K234
1035C308O59j436m613J0N869J308l767k101k21J483L762k11n649j336M107J740
1051B912n04j682l672N41N573N10m623j934J113J898K691j151n200q62M973J581
$$ y = [-3627, 2868, 4197, -1099, -3461, -1951, 141, 3818, 3202, -3174, -4011, 1677, 4074, 2133, 31, -2745, -1635, 4383, 5380, -642, -2571, -162, 2328, 4558, 3506, -2407, -2832, 3217, 5247, 2216, -174, -1758, -474, 4907, 5062, -984, -2930, 596, 2658, 3531, 2102, -3104, -2991, 3009, 4449, 89, -2259, -2478, -781, 3543, 2854, -3436, -4835, -88, 1672, 1144, -684, -4723, -4004, 1821, 2882, -2289, -4230, -3043, -1156, 2173, 1405, -4488, -5270, 121, 2165, 441, -1518, -3986, -2962, 2569, 3465, -1844, -3706, -1090, 985, 3146, 2137, -3065, -3394, 2350, 4308, 1286, -501, -1762, -275, 4500, 4706, -845, -2384, 1074, 3308, 3967, 2531, -2082, -2072, 3797, 5105, 1338, -763, -984, 499, 4261, 4050, -1599, -2935, 1172, 2912, 2408, 726, -2946, -2405, 3168, 3678, -945, -2879, -1766, 132, 2823, 1672, -3528, -4390, 583, 2164]
1067B164k135j827k202R49N258K08n149j673K618J799J715j120m755j55N398J441
1083B534k855j689j108J412M638K03n504r44L473J888M87r66m227N54N514J099
1099D509l589j620K93J566L604l72n394o44M127J684p14j582k955O91M975M58
1115E037m151j734J081J660K224o11n319n65M426J456k100j802k209R90M598j56
1131B825m886j539K210J652J212j033m693kM933J271k932j737q18J321M203k65
1147A722m832q83L325J535O13j440l526O90N091Q13l234j389K24J485L725m57
1163C462n057o00M271J509p43j457k653Q24M831L35m262j184J162J494K100p07
1179C325m627m36M424J138j841j925j653J008M057o1m686q74K265J241J096j052
$$ y = [2164, 29, -1798, -4000, -3051, 2207, 2415, -2734, -4407, -1789, 10, 1725, 605, -4150, -4305, 1093, 2534, -321, -2010, -3118, -1706, 2932, 3135, -2369, -3313, 160, 2048, 2535, 1569, -2658, -2104, 3410, 4509, 920, -700, -407, 1159, 4763, 4391, -1003, -1647, 2480, 4164, 3450, 1868, -1087, -396, 4579, 5037, 886, -848, 233, 1893, 4117, 3506, -1813, -2378, 2048, 3504, 1404, -398, -2607, -1617, 2981, 2825, -2061, -3600, -1390, 262, 1474, 441, -4252, -4254, 679, 1950, -982, -2719, -3537, -2216, 1987, 1722, -3110, -3993, -668, 867, 1480, 40, -3486, -2796, 2295, 3108, -126, -1515, -1291, 194, 3919, 3462, -1595, -2195, 2076, 3585, 2842, 1385, -1268, -444, 4387, 4722, 460, -724, 438, 1932, 4032, 3325, -1302, -1738, 2686, 3824, 1983, 58, -1595, -587, 3470, 3409, -1277, -2151, 114, 1355, 2451, 1399]
1195A399m164P1M620Q17k991j272p79J061L780j69m634p17K765J385M09j287l339
1212c045M07M698N99l596r65J28J290K938n91m599l34L524J210o27j356k692Q24
1229b187M540L07l990j088J290J374K142q58m412L0M317R52j616j457j092P87
1245i61M103pm243n46K226J289J038j026l422L19M333N39k408j170o77J133L105
1262C625j76m579o27K705J200K16j307l432M04M316M16l447j376K81J006K421
1278A646n16m397m01L484P58j110j242k240Q49M246k35l859p29J480R47K179j099
1295b39l647K97L821R36j940p39j241R54L858J72m162k87K196J273R61q89l107
1312a783L03M140O07k378j009n62J009L139m10m003m90K689R27J76j186l102N47
$$ y = [1399, -2765, -2694, 1926, 2743, -248, -1520, -2299, -1238, 2542, 2373, -2261, -2978, -213, 1172, 1581, 294, -3045, -2638, 2060, 2659, -937, -1902, -1774, -484, 2454, 1863, -2736, -3070, 454, 1664, 1037, -319, -3011, -2187, 2353, 2660, -1330, -2418, -1128, 246, 2388, 1530, -2882, -2852, 1465, 2417, 801, -656, -1748, -961, 3142, 3135, -1108, -1654, 572, 1861, 2899, 1873, -1549, -1230, 3103, 3642, 1234, 64, -613, 520, 3625, 3449, -1130, -1757, 948, 2148, 2364, 1057, -2375, -1971, 2345, 2761, -686, -2062, -1781, -775, 1646, 1130, -3267, -3668, -184, 574, -536, -1778, -4018, -3169, 1077, 842, -3017, -3746, -2266, -1319, 860, -239, -3886, -3589, 232, 1168, -772, -1511, -2752, -1798, 2060, 2232, -1930, -2217, -21, 1252, 2213, 1324, -1783, -1480, 2660, 3267, 889, -120, -682, 327, 3466, 3056, -947, -1437, 1252, 2179, 2355, 1169, -1933, -1386]
1329a386L919Q9l213j062M56J168K035p83m167j79L388Q09j186j147k038O41L808
1346A152r6l555p72J396J037J512q69l337M4L678O00j496j022q95O53L400k99
1363A131l448l34K026J096O50n61l171J11M010M20k319j001j95Q54K881m18m090
1380b358j58K967J061k13j040k670N76M018L3l015p59M45J141J993o25l585J19
1397b070L098N78r08r00j708N04L400k07l214k90J166P74J500p87l351J77L243
1414A005N13j631j030j061P33L162k34l664l02J669P48Q25p23l101K68L616N00
1431A293k508p89l22R35K728m03l779o3K801P42l11q30k125O12L615k22k429o25
1449a680O33J264J757n03l247PK996M22p13o87j746J037L068j49l238j63J099
$$ y = [-1386, 2533, 2622, -591, -1653, -1197, -29, 2006, 1223, -2944, -3123, 265, 1074, -112, -1259, -3297, -2656, 1152, 1056, -2499, -3271, -1875, -838, 674, -195, -3532, -3488, 190, 790, -706, -1728, -2623, -1970, 1430, 1131, -2317, -2651, -625, 471, 1121, 560, -2611, -2500, 1510, 1930, -389, -1390, -1585, -731, 2150, 1732, -2358, -2516, 451, 1512, 1299, 259, -2411, -1835, 2183, 2216, -799, -1558, -1113, 28, 2021, 1396, -2189, -2070, 1028, 1606, 698, -202, -1910, -1406, 1994, 1787, -1427, -1717, -551, 223, 1723, 936, -2415, -2238, 1005, 1518, -113, -1143, -2204, -1471, 1691, 1457, -2207, -2509, -840, -92, 733, 10, -3091, -2823, 793, 1293, -1215, -2004, -2326, -1391, 1337, 934, -2845, -2908, -107, 635, 324, -506, -2631, -2019, 1596, 1374, -1055, -1680, -1047, 217, 1974, 1471, -1776, -1769, 1227, 1649, 936, 249, -1497, -460, 2608, 2459, -779, -942, 157]
1466A57O57J476q99l079K08L030K18j203r22j072P50K952m68l367l92K021O34
1483G01K73p40l076P63L392p1k223o08j38P18K371o66l133L4K336Q13m37q70k038
1502b599O83L104J45k619l65N21R00J698m97l033kK860N19o96p58j628R00L043
1520B176k11k947l95J206J083J277q98k996L46L014L82j496n55j045Q04K758n38
1537A965l028j47J818N73L30p81k461N23L084n8k088m96n9N52K218q05k957rK251
1556D25M23k87n95k127P64K876o4k708O1L93N73J601l98l118K95K467K19p82m03
1575c85j237M46K444K04k603n67J209O16J334q57k566M05K780L23j545m94o95
1592a188Q28K347l09k650k06J672N05M58p86k106O36K729J7j753o18k1N71J987
$$ y = [157, 814, 2290, 1391, -1688, -1480, 1550, 1768, 565, -357, -1429, -679, 2273, 1805, -1562, -1954, 67, 701, 974, 234, -2842, -2079, 1313, 1242, -981, -1589, -1727, -1009, 1362, 696, -2437, -2403, -67, 746, 309, -561, -2599, -1916, 1188, 1333, -1286, -1651, -1130, -230, 1468, 971, -2062, -2064, 796, 1315, 619, -139, -1767, -867, 2176, 1965, -982, -1377, -171, 912, 2189, 1291, -1705, -1359, 1655, 2037, 541, -14, -1059, -255, 2503, 1965, -1063, -1210, 608, 1181, 1511, 730, -1731, -1208, 1876, 1818, -270, -766, -825, -273, 1945, 1140, -1817, -1826, 425, 848, 561, -34, -2161, -1397, 1479, 1415, -1293, -1232, -839, -266, 1335, 937, -2181, -1886, 581, 800, 18, -385, -1622, -1176, 1268, 1472, -1131, -1698, -489, 127, 1461, 604, -1962, -1557, 1223, 1546, 1, -493, -1188, -360, 1987, 1678, -972, -1178, 494, 999, 1457, 671, -1435, -799, 1930, 1947, 194, -424, -445, 126, 2113]
1610B113m67k961J53J948O53o93m22j687N24K478k08k054l21L68O09J376n70k810
1628a971J45K590J21o61q16j000M27K601l65k533r6J116M27R10o50k233M19K597
1646A028J83j468n23o72R32K184o74k523O1J892J33M61p24j924O67K512j15j811
1664c81j01k67P46J853m26k743J22K031L89k53o71j391K57K699k09k352lN96M95
1683C91J214o00k478L06K226K84r04p23q94M26K170k14k436nQ65O82P23p06j862
1702a535O7K616j99j286l76n97P45J871n26k355Q6J534K83M35r17j592N33K471
1720A258k24j622m30J54O05J673p13k278M38J864L03o06k74j614P05K357l93j717
1738e14j05M73O05R72n10k185M29K092P6q98o15q11N43K122k07k232n8Q69M12
$$ y = [2113, 1646, -1315, -1162, 786, 1439, 746, 324, -1363, -839, 1639, 1431, -623, -944, -576, 33, 1409, 839, -1971, -1826, 764, 885, 224, -592, -1592, -1165, 1436, 1071, -1462, -1558, -442, -15, 895, 245, -1988, -1569, 1028, 1211, -257, -780, -1452, -520, 1664, 990, -1533, -1472, 420, 553, 1014, 290, -1634, -967, 1545, 1430, -381, -482, -749, -3, 1850, 1424, -1319, -1197, 834, 1223, 970, 299, -1092, -835, 1864, 1655, -697, -700, -104, 391, 1605, 1005, -1473, -1167, 1059, 1343, 439, -284, -1178, -752, 1418, 1204, -1232, -1237, -372, 310, 1033, 327, -1535, -1468, 1148, 949, -337, -713, -1310, -565, 1306, 780, -1575, -1489, 45, 328, 763, -154, -1746, -1213, 1258, 1034, -588, -1018, -864, -259, 1414, 701, -1577, -1139, 725, 1028, 422, 148, -1466, -761, 1596, 1203, -514, -619, -146, 459, 1431, 921, -1264, -835, 1257, 1333, 435, -180, -991, -448, 1674, 1467, -765, -823, 46, 458]
1757D58O78n89j842N06J844kj100m98l43O37J557j25k278j57J379K72J23k92j985
1776a757P91K088k54j477l54J88N99J089k65k160J05J762K37l98o00j038M24K365
1794A345j84j962j38L62P55J149p98j901K14K097o2m97m35p86O11J963n30j881
1812f78J05P83M88O65m26k130N66J934K9j350K1n87N95J718p53j932J94J285K30
1831G57P4n62j725P09J979l28j357l36J31M27J435p74j945K41J577Q9l69k97j008
1850a282M47J864m32j663J61M47N68Q10m74j711J71K115k08o81m07p92Q19J667
1868A419q7k237n5J248K73P76p61j687N68J842j61j195j63m34P09J553o45j875
1886i12K11J299P0J58o17j272O32J773k13j580l8J2N57J257p58j845L44J559M3
$$ y = [458, 1136, 547, -1295, -789, 1055, 1053, -47, -545, -888, -251, 1306, 1181, -1097, -1254, 125, 397, 520, 228, -1757, -966, 1122, 868, -609, -963, -775, -176, 913, 648, -1512, -1407, 355, 592, 194, -406, -1444, -1020, 1345, 1161, -801, -939, -577, 178, 1327, 529, -1372, -1158, 939, 877, 380, -55, -841, -230, 1733, 1203, -678, -573, 210, 698, 1363, 937, -1193, -627, 1307, 1336, -14, 7, -580, 15, 1733, 980, -952, -758, 527, 757, 831, 269, -1456, -747, 1232, 904, -453, -789, -658, -231, 1204, 430, -1515, -1274, 303, 392, 23, -274, -1282, -835, 1029, 597, -1066, -905, -458, 110, 920, 446, -1265, -1094, 1021, 813, 132, -275, -1067, -248, 1419, 1332, -905, -960, 288, 561, 1337, 576, -1111, -543, 1299, 1138, -57, -220, -654, 55, 1608, 963, -912, -701, 598, 668, 826, 209, -1063, -431, 1342, 1129, -451, -489, -477, 80, 1337, 579, -1266, -922, 637, 680]
1905F80m54n15o33N04J730k93j654j05M37N04Q70o51j748M76J673k0o96m24n00
1924h19M52J664n95j470K4R01K54M71p86j498N83J711J06j404Mk31L60J405k47
1943H85j747R7J353J45K4o58j192N78J598j22j245l58K32O53R12m16j733L09J377
1962F92K29m69k98j072P08J623n97j269j16N60M85P98o90j598N08J475j18n58
1980B93o29m81N09J595m58j838L05R11K37J96m96j477O29J426Q8j090l90q9M93
1999b66J321n49j672K47J052L10L6m50j219Q85J366m57j017k07K11L65J008l81
2017E83j541K94J335J9j84m22q65L25J695l34j518K2P35K31O13m18j693M02J517
2036G96O0n84l22n55N32J194k13j819J58P00M87L74o87j399P19J394k94j044j46
$$ y = [680, 226, -289, -922, -418, 1312, 1019, -635, -740, -303, 201, 1071, 420, -1328, -852, 821, 801, 105, -319, -819, -367, 1297, 702, -768, -744, 157, 411, 882, 96, -1402, -819, 892, 998, -406, -402, -633, -273, 1132, 885, -862, -765, 588, 733, 757, 99, -1093, -515, 1083, 961, -284, -642, -410, 243, 1155, 739, -994, -685, 692, 921, 452, 154, -918, -210, 1413, 816, -453, -569, -9, 476, 1274, 584, -1014, -506, 969, 851, 293, -336, -817, -308, 1287, 829, -1009, -704, 207, 444, 640, 144, -1333, -704, 722, 810, -280, -670, -759, -266, 1055, 506, -1166, -919, 133, 443, 479, 29, -1190, -305, 1061, 604, -413, -620, -409, -44, 964, 583, -958, -664, 671, 690, 506, 84, -781, -456, 1239, 905, -613, -591, 144, 375, 988, 570, -1123, -721, 796, 856, 272, -50, -605, -73, 1121, 908, -911, -753, -53, 434, 808, 121, -1278, -559, 835, 541, -503, -649]
2055f49m0O35Q30m54j478J47J226J2J33n92r28N36J356j87j077j64K82M98O50
2074G36k42j444N05J110j12m08j01q45M93J392k57j425K4M88L04P28m80j316K69
2093e81J141K84p52l56l37N24R97m64j433M66P73K20K3n32j009M48J379k88q85
2112c82j91J46M00Q02m92j192K09R31nK08n50q38L01J559l23j023j51K86L24R81
2132A000o65j305J04J250J15l93l69p25P33J179j21j597N4N85K51N48m62j315
2150a133P59R84Or29L1k94O13R58o35j244K65Q23L3K07m16r88O02J240m52q35
2170d05R0l6K25J026o33r97L49P58l2K82o22o52J24J597m05j109J10l0M81P72
2190H93m68j194R3J277L3m81l65m84P03J078o36j338J76P08K69K93m99j155O32
$$ y = [-649, -689, -54, 776, 322, -1156, -1009, 217, 229, 362, -230, -1158, -622, 734, 547, -530, -694, -412, 86, 736, 494, -950, -445, 665, 553, 145, 44, -801, -308, 1084, 827, -598, -574, -86, 218, 946, 466, -850, -581, 560, 844, 92, -264, -601, -77, 920, 456, -977, -511, 262, 482, 505, -27, -1036, -588, 791, 503, -382, -573, -427, -27, 775, 283, -909, -700, 231, 226, 434, -116, -954, -653, 906, 583, -440, -591, -305, 19, 1000, 335, -970, -866, 384, 499, 106, -263, -988, -255, 924, 803, -794, -740, -155, 96, 644, 182, -1133, -374, 610, 616, -313, -282, -576, 37, 995, 360, -884, -619, 204, 237, 444, 28, -960, -358, 882, 430, -405, -315, -351, -126, 900, 267, -730, -381, 377, 345, 627, 5, -647, -523, 1074, 669, -440, -330, -360, 121, 893, 425, -769, -676, 601, 634, 153, -212, -696, 7, 1085, 449, -889, -713, -5, 264, 557, 58, -1097, -465]
2209d65J105m98m16j63j2N36O55m86j083K34Q19m2L6j60o76K92J160l34o00j26
2229b24k00K21J263m64j226J9J043qom40p85L47J480l67j187j28M11N56M92p37
2249F0j041N75R02Q2o55j62n43O37R23l40j172L01N75K5L16o54n22K81R52k53
2269B87m47k0k25L02P15m18p82r1R05j54L51l10p56K65J056k40o01j94j15M93
2289B1Q46m11j153J76R50j27J52m43p24N44J311p33j061J31L87M07M30o39j024
2308i60O92J157o60n40K29m10N41P19m68p01N1M92J19K83l31q89M26R25m43m72
2328b40P7k66K24Q21l67j012K83P14J17K5k07j078M33J107l2p41k49j49O60O67
2348G87p25j047M55Q67j8l8p59k72P29Q52n70p99J70L16K78L33l89p11K75P62
$$ y = [-465, 640, 142, -274, -437, -449, 87, 742, 256, -827, -593, 226, 184, 220, 60, -616, -324, 836, 502, -98, -224, -424, -203, 1060, 596, -630, -611, 432, 424, 418, -22, -807, -460, 1020, 653, -534, -662, -251, 305, 797, 60, -981, -406, 496, 578, -77, -239, -782, -145, 778, 438, -734, -433, 142, 167, 483, -171, -693, -412, 540, 287, -160, -180, -405, -103, 612, 194, -588, -679, 226, 72, 423, 113, -643, -378, 678, 438, -163, -357, -472, 21, 867, 456, -697, -521, 429, 302, 454, 11, -713, -169, 1142, 409, -652, -521, -134, 273, 703, 64, -960, -268, 889, 229, -311, -82, -492, 49, 768, 300, -401, -350, 142, 261, 544, 213, -676, -250, 675, 232, -240, -163, -429, -205, 616, 249, -763, -480, 234, 351, 376, 169, -909, -476, 631, 599, -142, -391, -540, 120, 787, 62, -985, -530, 337, 319, 281, -478, -750, -21, 831, 261, -538, -368, -52, 226, 559, 170, -541, -266, 496]
2368D96k10k12q0l85M10N53k42p57J87K75M7L52k50p61K52Q75k63k47j07m58L63
2389a62J070l29j269L23N31J88j65n07o24N80J052n33n59M2K5O05K86n42j124
2408a112P18Q35k0n74L2m51P19O99q72l41J36L96l05N80k77p48N80N83k98j53
2428A27k12k66L34N96k50q34K51L48J35M26n01r56L63J059K6p51j29k93N95O20
2448F88m77r13L58N49K32r6n55n28P37Q55p34q09L62N00J0L73o25p11M92O07k35
2469H0k4M6m21K85M50qo28Q8n0J00L96j80q19M07N74j11j4j07m79K29R24m53p99
2492e14R3M00K30M51p80p13N68Q91j61p69j4j50N93M38o35l93L59M04j05j74k39
2513b20l40O88M58l96o30L34J50J57J80l32o51N16N28m57O9kn65M94N69l74k33
$$ y = [496, 286, 74, -6, -391, 19, 572, 330, -427, -240, 35, 82, 434, 184, -577, -325, 550, 287, 40, -67, -525, -162, 908, 579, -690, -367, 164, 352, 187, -320, -944, -364, 688, 155, -404, -362, -337, 268, 554, 12, -1112, -394, 441, 421, -153, -121, -572, 147, 846, -26, -367, -231, 165, -140, 440, 163, -585, -5, 578, 280, 127, -85, -351, -17, 579, 329, -505, -254, 94, 229, 655, 154, -802, -439, 620, 646, -105, -234, -527, 68, 688, 211, -702, -344, 205, 437, 341, -214, -742, -5, 850, 116, -693, -331, 169, 179, 552, -73, -784, -292, 315, 80, 56, 102, -319, -34, 416, 408, -220, -132, -182, -82, 314, 134, -685, -278, 296, 185, 171, 64, -415, -186, 738, 285, -514, -421, -21, 209, 660, -120, -833, -265, 626, 465, -304, -318, -468, 125, 563, -72, -465, -106, 298, 193, 19, -220, -560, 128, 586, 190, -440, -106, 44, 201, 381, 49, -602, -86, 442, -15, 54, 52, -513, -19, 550, 176, -57]
2534e7k13K23L2L37k17p46K99P05J37m96k03l50J61J098l09j082K38O92K5j0m44
2555a80p00P83P19n22l73k17L85L22L19m73o71P83K9k02J8n1m41N31N27n56j41
2576a11L4O5J35L92l71n44J20M80l5J52k57o99M73Q84k62o92j4K28L55J57m26
2597F4p71O04N88N5n14k44k22O69M81n95p34L02N31m1m5l49n31O75M76j40o36
2618c77K37J43m1N97n21m11M53R1m9L9o6n53K36N66k12k17M6KL8L83j68r32N07
2641b09M31J20r8k82n80N78Q88o67o26K07M8N08O4m23q70P05P59l50j99q8j73
2662b57O31L04p26o23O31J54L4o7l37q8M28K86n02l7Q4k89K44N03k94m27J95L95
2684B42k54L59l17m06M2P31p9o75J49r3J04O89l90r11L34P70O7l02o8m34M51O96
$$ y = [-57, -270, -47, -15, 322, 105, -641, -342, 363, 500, 4, -199, -549, -388, 710, 401, -681, -443, 249, 274, 264, -180, -880, -97, 622, 100, -273, -490, -105, 217, 536, 63, -608, 175, 204, 2, 20, -31, -472, 59, 586, 30, -111, -77, -12, 123, 515, 144, -400, -280, 200, 165, 317, 60, -639, -166, 718, 456, -236, -250, -22, 333, 490, 64, -707, -103, 485, 540, 26, -218, -440, 229, 710, 115, -619, -317, 214, 173, 128, -221, -752, -77, 399, 259, -377, -140, 3, -38, 559, 38, -373, 80, 171, 122, 161, 95, -458, -222, 344, 132, -85, -39, -37, 1, 384, 216, -716, -209, 222, 342, 244, -38, -618, -40, 848, 181, -445, -238, -190, 318, 382, -41, -911, -206, 553, 203, 4, -84, -257, 374, 678, -48, -671, -40, 114, 148, 81, -256, -344, 84, 370, -132, -169, -85, -374, -130, 373, 79, -348, -153, 242, -12, 347, 30, -376, -334, 397, 318, -357, -208, -301, -197, 492, 102, -809, -475, 295, 362, 60, -8, -442, 9, 705]
2706G05l95r56K61N82K2J20o43l68Q07K23l04k12J97k71L12M18o12l22L03K92
2726A59j57m5R5l75K96M98m39l70K74k29M24K47k22m10Q2K64m8L43l39o99P32
2747H1M84j85n53l20M18K52J52l70o14M01Q67k73m07j15j74M40M23n67m40L60
2767a40J88L7J59l70m33N13K98k31q4j4j39j18M48k24j82J18J29%L23k37p07M64
2789b02N34q1m83J62j03L56M53m67o67K62N26l8J1k15o36P20K45k30m99m6L36
2810f2M08R6n63k37N02L18m69L4j72j06O44J7n82j27J91L31n38L83M1o09M21L65
2832B86m01R5j07j51J91K97o8o02K31L06L5J81l46m77L91O12m02j15j23J6J51
2853@M25o01j16K14O29l21j56k26k09M52M85m93n02M60m6J97Q5m91k82M73L17
$$ y = [705, 310, -646, -385, 197, 219, 339, -304, -672, 135, 358, 54, -158, 39, -232, 80, 498, -114, -436, -133, 159, 2, -43, 52, -323, -27, 471, 32, -338, -64, -293, 131, 378, 156, -254, -172, 92, 44, 387, 48, -651, 81, 565, 380, -173, -493, -75, 177, 329, -41, -655, -254, 613, 340, -67, -182, -356, 84, 507, -60, -500, -140, 48, 85, 244, -126, -559, -46, 252, 21, -63, -77, -216, -334, 114, -110, -292, -174, -45, -45, 278, 41, -666, -202, 332, 251, -232, -70, -173, 183, 636, 169, -498, -236, 290, 252, 263, 48, -588, 132, 377, 147, -352, -398, -62, 346, 442, -121, -358, 144, 462, -7, 27, -145, -251, 393, 410, -172, -299, -108, 223, -315, 68, 109, -500, -79, 286, -115, -20, -127, -278, -87, 210, 142, -460, -229, 77, 112, 293, -53, -530, -139, 473, 71, -44, -167, -151, 0, 425, -176, -292, -78, 551, 230, 74, -152, -361, 91, 576, 83, -419, 41, -5, 192, 277, -214, -496, -23, 294]
2874B94k87rO4j99J82M42l33l65L82l6j17K04j76m80K49N13j87k97L89o21M13
2895B5M79l22n18N3L45J46N1l64m35M08N61j29n56p2J33L85L60n31p42P64K48
2916B89k28K02l68j18L00K59l93Kk0J93k59L77m39k47L71J93M3l58J77j69J18
2937g5M74m59j89R7n9R8M70l60m48N31K83k85j88j85l7N67K17m05k87R5M02J03
2959C60l20r1o19P77M11m00l32J34K3J38L08l12m78M66J81j98j79J53k37K07L15
2980C07j11l07N6k4K3M94o59j39K13M03l18J30r2m65L41M52m16m41M12J46K6M30
3002D61l76n20L38L38K1k68k71K11K07J42l15m59L58L94P8k72l10j01N05L56n45
3023b8j33J58k0R7J74l65l03L72K10k28P3j55j86L67L23k88m28K04J21q3M43k66
$$ y = [294, 7, -2, 62, -137, 45, 487, 154, -211, 171, 135, 18, 222, 46, -434, -185, 328, 141, -156, 233, -388, 25, 504, 182, -336, -283, 62, 208, 259, -105, -540, -132, 429, 300, -256, -328, -195, 190, 550, 19, -723, 41, 289, 61, 263, -105, -223, 77, 336, -57, -55, -75, 118, -141, 236, -203, -450, -79, 114, 157, -201, -24, -193, -75, 399, -60, -249, -152, -211, -113, 357, -3, -451, 80, 363, 78, -110, -295, -332, 235, 452, 47, -240, -145, 257, 360, 40, -51, -670, 107, 518, 118, -214, -80, -57, 81, 389, 77, -401, 65, 246, 48, -131, 22, -215, -8, 307, 196, -111, -55, -79, -56, 438, -221, -360, -147, 256, -62, 68, -24, -489, -148, 304, -112, -553, -141, 5, 31, 461, 85, -435, -97, 241, 262, -6, -277, -66, 141, 283, -32, -491, -133, 261, 339, 67, -243, -344, 161, 517, -28, -161, -3, -23, 74, 248, -117, -420, -48, 162, -66, 7, -148, -334, 33, 356, 68, -360, -156, -35, -118, 325, 59]
3045E9l08K07K47k81P6pn05N22L51l77l74J38L71ro8j8o79P31L32o03p5J99O0
3068a1J07J61l70p8K40J52j58J74j20m76M63Q0l20%J54M0L1K59m81OQ0K35j18
3091E0J6j54k70M62L34n40l27M78l4J83l5k02j10mL71k57R4r2k91M06M42m06k96
3114a82K15O6j17M06n67j88M60L75l67j68K09k23K15J86k21m60L63O8l07N10l73
3135a00j58L67J27l72j00L72k83K11J71j05n39M98m4L8R9m36j59M27K46k41j20
3156a01k34K50Q2J32k16l91M65L58m32Q6k21rK70K53l64k25L11J57Rq0k17j26
3178b43K65K87j38l80K47j40J84K19l01l67M78R6l47L57j41m05M12L62m34lj08
3199a00m4Q4L14k90l18K08M07j83j01l1m4Q1L64m66k29L12o3L40j89j94k20L18
$$ y = [59, -249, -42, 205, -76, 0, -7, -512, 10, 361, -16, -390, -252, 119, 110, 42, 24, -655, 76, 408, -195, -270, -71, -11, 96, 257, -113, -191, 49, 201, 43, 217, 97, -379, 84, 164, -156, -156, -2, 38, 69, 328, -153, -147, -67, 168, 50, 66, -88, -358, 104, 438, -102, -429, 49, 15, 198, 163, -39, -149, -153, 218, -39, 55, -37, -328, 78, 520, 114, -182, 33, 99, -18, 388, -179, -367, 93, 468, 101, -67, 142, -81, 134, 320, 99, -361, 2, 70, -237, 273, -100, -258, 109, 236, -136, -236, 136, -147, 64, 235, 130, -409, 89, 45, 83, 182, -254, -413, 14, 260, 19, -101, -335, -85, -3, 129, -87, -478, -13, 345, -87, -1, -222, -231, 39, 292, -72, -297, 14, 171, 180, 100, -117, -243, 22, 309, 171, -209, 38, -102, 82, 301, 0, -367, 111, 207, -140, 217, 76, -329, 83, 445, 11, 8, -100, -144, -60, 254, -36, -354, -146, 261, 78, -23, -54, -98, -17, 347, -119, -348, -36, -99, 241, 52, -142, -362, -44]
3221d4L10k82k26n0O4O8M93k55m16K71rJ41J14p9l69J10L24j33j96O4K2J48J98
3244B68l20k61N14n6j04K24l74k56M21M36n24o9%pJ54J80m18k10L92K02j27k15
3266a50j47J10J70J87j50k88K69k67K45J58l40j64L45J89k05R8j37r7K85kj86
3287g7l18K94K57l6K7q9l06J90K58l69o5J87k45L45K25k72k33K7K31l8j1j98o1
3310b77M96J89n06j49K72M1N6O6p0l18K00J32p0j42o9p9J91K18k83m0L3P9J49
3333A19k4k39j77M61o0J0l07M0j7L85K06l09k71J6K47m2L84l18k34K70J80n02
3355a82q2K71k07M75J04n21o9J97j22K71n1m3k21M60K44n45q5R8L0J5P4k16k11
3378c16K37K96k97J01M5k83L00R6j42n7N4l2N3J54k66j69L05J04r6J09k28k66
$$ y = [-44, 266, -16, -242, -292, -228, -160, 333, 78, -338, -67, -76, 65, 179, 100, -269, -159, 165, 32, -164, -100, -78, 70, 268, -52, -313, 201, 145, 41, 265, -109, -365, 56, 492, -32, -101, -101, -108, 46, 226, -192, -402, -10, 192, 65, -150, -297, -187, -17, 170, 20, -268, 1, -266, -21, 137, -203, -367, -22, 167, -38, 60, -77, -174, 111, 109, -77, -395, -101, 156, 120, 147, 58, -248, -58, 200, -169, -234, -47, -292, 53, 278, 6, -227, -200, 31, -7, -18, -216, -277, 219, 408, -98, -247, 25, 66, 122, 188, 118, -200, 0, 132, 62, -80, -149, -228, -37, 181, -102, -142, -109, -30, 119, 95, -144, -321, 140, 80, 90, -217, -177, -194, 191, 397, 88, -183, -167, 80, 38, 422, 104, -130, 140, 320, -182, -264, 7, -200, 275, 379, -142, -211, -14, -136, 135, 84, 41, -180, 280, 524, -21, -106, -8, 22, 37, 111, -105, -316, -79, 217, -80, 21, 66, -217, 83, 179, 37, -20, 34, 2, 55, 209, -57, -226, 79, 183, 87, 196, -32, -298]
3400b98L74J84j94j49P3n3J79o5j02k03L20J20k37k13J99K9J21K68m67L9J75K4
3422A24l16L79k65l58M31L20l03k07R6L2P0J78k40j72L35J85m58J60j08KJ60K50
3444B95l60k18P5R6J03n2K3l26L19L42k52n9M7l19K04L75k40r9K80j58J39k18
3466cq5j10L17J00j62k78J02J03J97J18l35k04J25J64j60J40k86K2K71K15j90
3487F1l14L82m4r4Q0j15j56K31L02k35j58J5k7J91p6j33l6K5O7J37j74k5k78N37
3511A63P0m63J51OlR2J34l18N6O8R6j99L45l22R4J48p5qj87J20Q2Q2j14k14j08
3536c04K54L23k30J02k18k38N70p1k80R3q3j14M45M1m71j41M55J63j79j61l6M1
3558c9Q9L3j98J18K6j48J91J23k16l07L92J8o6r4P5n0J36J19l19q6K51p4K5K34
$$ y = [-298, 76, 260, 66, -83, -10, -63, 116, 51, -51, -254, 66, 186, -51, -264, -65, -36, 85, 353, -114, -75, 100, 124, -192, 187, -78, -436, -5, 315, 12, -195, -99, -67, 3, 181, -59, -231, 104, 289, -169, -9, -117, -115, 45, 295, -65, -283, -208, -112, -9, -61, -38, -364, -45, 297, 45, -14, 33, -286, -82, 293, 53, -46, 234, 76, 215, -3, -88, -198, 119, 219, 57, -221, -119, -16, 181, 299, -36, -240, -115, 49, -111, 29, -257, -235, 36, 251, 61, -253, 129, 85, -9, 71, -44, -200, 31, 333, 98, -60, -45, -72, 119, 43, -90, -126, -101, -34, 103, -71, -96, -374, 163, 233, -230, -79, -73, -76, 16, 150, -168, -112, -44, 52, -147, 198, -124, -30, 118, 43, 35, -152, -32, 50, 132, 18, -196, -304, -50, 273, 43, 145, -73, -311, 259, 188, -92, 1, -82, -196, 249, 290, -181, -322, 133, 296, 117, -44, -80, -39, 50, 83, -115, 3, 29, -119, 72, 195, -21, -328, 64, 82, 16, -78, -3, -53, 83, 202, -117, -203, 48, -26, -1, 233]
3582B33k11j46NM64m61n4K72j16N1K12k62j18J46j14P9P2K0k75L94L15o74o7K48
3605A3R2k8L7k85j44L54L5R3j86K2k83J65K26j99Q0n8K26k06L18m46k0J73J61
3628A40j61k5Pj49K27J85k99j00J00O4q5P1O0k19L57j16j95J53k71K00n4L24k25
3651a1j90K14O6j27J56rj98o1M24k86k46J74J02n1N40n43q8J69K08l79L03k02
3673c5j4J34J10l16JJ67j65P5K55k97k48L81J00k41K4J00j09L47j21l75K80j99
3695a46J61j00l6J0J25p9J18r5j30L9J99J01n4k61j67L15Q6r5P6r8R7j72K36j49
3719a9k7j39N8J67Oj39k18N14l2J0k91M1m9R1J21k24k1J23N6j35K03j18j37J40
3743a9J35j16O5j48p8K11N1j05k72L10K30j10M1k99j14K92K8l53K43p4K00r0J17
$$ y = [233, 22, -124, -119, 345, -116, -170, 102, -14, 37, 249, -13, -131, 15, -99, -20, 52, 72, -203, 191, 506, -168, -235, 13, 105, 77, 114, -171, -315, 39, 74, 167, -19, 3, -280, -115, 111, -88, -8, -66, 160, -46, 272, -174, -194, -21, 140, -21, -46, -39, -188, 39, 224, -75, -175, -75, -11, -96, -25, 35, -184, 173, 57, -138, 15, -256, -56, -110, 214, -11, -201, 13, 79, -48, 108, 99, -99, -160, 264, -22, -268, -94, 8, -43, 497, -46, -134, 35, 243, -136, 167, -35, -49, 85, 195, -121, -120, 47, -118, -43, 212, -85, -333, 48, 148, -93, -69, 31, -78, 269, 148, -227, 53, -146, 15, -85, -121, -111, 14, -65, 53, -42, -172, -133, 66, 167, 113, -148, -315, 0, 86, -9, 67, -31, 66, -106, 130, -19, -46, -185, -127, 40, 46, -93, -311, 203, 171, 181, -110, -69, -118, -27, 94, -130, -151, -28, 28, -107, 96, -22, -159, -19, 116, 0, 65, -83, -161, 50, 101, -4, -276, 34, 264, 154, 195, -104, -218, 74, 102, -251, -8, -82, 118, 28, 145]
3766A45l46N2J29j10K84l7k34l4K28K10l27o6Q1j77M49k52rj54L66j71n1r3j2
3789a29R7J87J9k80O9r7J7K22J5j53J8M9L61n58K31r7NJ21n6j41m7K38j5j31J66
3814A11kl14K15J70l55JK14o5j08K72l35MK60nJk8j30l6L20J27n48J1K84j58J72
3839G8N0j27j94L03Rj60J0n0q8M40l49j8R0M9n9k0J32q0L8P8j30j56NK18r7L21
3865B93j43k03k49L48J26k06K14l51j4L03J69l73j3K05k47Q0K49k18j27N80l03
3886A20j61J52k27K16k7M8l76K02P0n8J35qk07ll2L35j74n0J94j99R1O3l66J85
3910g7J35l4PJ27l09nJ53Q8j66o0q8K39Q8J49k56m3r5J58J68j38j90J9K16N9j03
3935D2j09R9K0j99M61m58R4R3J56l34K27k43J00L27k11k49O7J17q1K24j58o7o3
$$ y = [145, -201, -149, -20, -130, 154, 117, -117, -151, 77, 287, -40, -106, -25, -202, 247, -5, -14, -168, 198, 27, -24, -117, -129, -32, 155, 174, -106, -37, -134, -117, 105, 120, -33, -15, 34, 395, -163, 68, -29, -24, 97, 41, -100, -147, 91, 76, -55, 111, 109, -205, 10, 180, -175, -174, 40, -25, -133, 139, -196, -192, 68, 63, 64, 36, -94, -130, 190, 317, -231, -220, 64, -94, 78, 128, 1, -193, 110, 119, -41, -31, -81, -169, 271, -78, -96, -6, 43, -16, -36, 96, 16, 54, 132, 2, -154, -149, 69, -28, 293, 150, -53, -302, 46, 172, -34, 180, -171, -185, 118, 287, -86, -99, 106, -141, -61, 188, -30, -157, 423, 120, -41, 111, -116, 100, 73, 121, -255, -53, 17, -41, 94, 86, -121, -124, -156, 179, 5, -45, 149, -50, 41, 104, -262, -77, 58, 24, 31, 158, -151, -156, -3, 85, -81, -141, -229, 10, 98, 247, -9, -52, -147, 11, 179, 41, -149, -130, 86, 145, 42, -67, 32, 52, -147, 314, -144, -50, 43, 199, -135, 92, -151, -51, 276, 65, -184, -117, 0, -81, 143, -15, -82, -145]
3958a45K41K0o8l9O4j76J22J83k16o2L74l05R8J54n03J59K50j84j73J27L2l6R1
3981HK42l68L1R0l5q4K99k99j68L63j27q3o5M4J41pl7K5j72J93r0J32j69N0P8
4006hK53N0l38Np8R4J57r2p1M6k0J75j74k4p7j41L57O3k87P4J58m2j58J84j63
4031e7nN1L1P9J59k77p3P2m4J3J34J0j68K80l68R3J29j33J74j62j4J2%J61J0j59
4057e2j1J67k03P7L0j24J60o2r2J96k92P2J21M3j1j29k16M69k28%J06M6J3o1O4
4082H3k76J83Kj37Q2J40j45J83N5p2O9p3LM4j21P4j53j2K28j15j04J91j79j7L75
4107C08j10m71K29l1O9J82k71J6R0q6M09m19k5k3Q4J10j2k22P2M3o2J44M0j6j18
4132g0K05j15k46K12J39l90K31N1K1m0R8j53J07R5r9j94K92r5k52J04J63j98L30
$$ y = [-145, 96, 116, 48, 9, 73, -103, 19, 202, -14, -76, 298, -7, 91, 245, -258, -99, 151, -33, -206, -79, -47, -83, 8, 250, -118, -87, 3, -32, -116, 183, -116, -284, 79, -48, -131, -196, -152, -11, -18, -55, -30, -202, -9, -99, 33, -136, -86, -8, 245, 295, -43, -38, -116, -22, 135, 43, -28, 18, -2, 173, -1, -25, -102, -243, 114, 177, -110, -36, 122, 80, -78, 106, -57, -62, -11, 20, 99, 258, -19, -92, -20, -64, -51, 83, 93, -75, 205, -163, -70, 59, -74, 100, -62, -76, -64, -64, 97, 107, -52, -63, 104, -99, -22, 8, -116, 44, -18, -110, 86, -206, -134, -13, 30, 19, -110, -326, 143, -85, -85, 21, 67, 80, 19, 83, -193, -10, -8, -145, -63, 77, -68, 115, 170, 98, 167, 94, 97, 141, 20, 94, -59, -71, 157, 42, -62, 129, -50, -67, 308, 198, -273, -44, -75, -6, 176, -95, -79, 11, -75, 334, -85, -110, -133, -49, 61, 49, -173, -101, -58, -120, 24, 64, 48, -70, 135, 20, -226, -14, 125, -265, -34, 17, 38, -2, 96, -57, 50, 145, 46, -148, 144, 49, -203, -99, 64, -134, 196]
4155A96m8k44J87j9R7k16O7l2l9r7K95l59J54N0k0Q1L16l92k16K80oj47j05K14
4179clj37K82k06L8J9l5P2P5k65N0L59j39j39j20J97q7O4R1l31K74j12r6K5K01
4204G4j70P8O7O6j37K23k80n0L22j07p4K2m5l8K2N4p5K3L61l08j29j4L26k42P3
4229D2l2pl7K12m70K30K57k26r8K18n4n7J17P3k63K93k5l53j09L66m6k23J67J64
4253A39j66K25k19p9n6k6J41p9K73k71o5K87N9l81K19J16m9m0L1l39K13j2M4J59
4277A24o2j68J21J39j54j80K00L0j4k7j04K7l4J28j8j32M01l25m7L20j61j77O
4300a07J52j10R7k5j35O4J66Lj51Q4j71nk0K74m9j44K61o5P8j20k39Q2Q8J72L2
4325B12l11J44p3N8o8q8Q0M3K9j00n6J48j66N4J96k05J7J7N6Q8k94j7J81N1O7
$$ y = [196, 148, -96, 91, 72, 169, -47, 20, -12, -51, -148, 147, -212, -58, -8, -28, 53, 369, -23, -239, 41, 35, -112, -217, -3, -6, -143, 139, -67, -29, -10, -45, 27, 102, -163, -113, 246, 107, -32, -152, 45, -42, 22, 113, -218, 56, -56, -152, -127, 74, -96, -18, 49, 115, -22, 201, -79, -129, 193, 86, 12, 34, -11, -49, -27, 27, -48, -25, 336, 28, -101, -115, 211, -31, 42, 10, 3, -34, 178, -292, -62, 195, -31, -129, 89, 35, -22, 95, 168, -95, 198, 173, -180, -289, 77, 31, -192, -25, 139, -27, 198, -21, -100, -156, -182, -41, -120, 153, -118, -183, 104, 163, -218, 1, 117, 68, 28, 59, -280, -67, -79, -35, 124, 62, -106, 15, 154, 0, -180, 20, 50, 36, 9, -95, -68, -102, 26, 8, -124, 277, -48, -95, 225, 64, -113, -107, 45, -65, 32, 7, -128, -64, 102, 105, -46, 38, -133, -138, -158, 116, 67, -77, 184, 119, 197, 77, -162, -80, 8, 180, 212, -99, 45, -28, 30, -38, -126, -46, -3, 26, -74, -130, 18, -148, -94, 102, -103, -86, -69, -13, 75, -219, -236, -55, -4, 63]
4350F3k17J46RO3P4j5l32L16n7j4j80L14l10pJ72J4j10J09j05P2m3J03j63n2L14
4375A64Q1j45j67J39j67K02m6k17J7m4J58J65J08m06K0K03p0j8P8q3m1L87k84
4398C4m5j80J85j04J41J09m9j01P4O1qj23j05qM7n8k4J9K13o2oK34l21%MP1j05
4425a07J33J2k35L21k60J65q7J91j40m3r1j47K66K36p0k41m6L60k29K71k93l2
4447f6J15Q2j27N7O1k65J67K14k02m8K05j38k7N3j89P0N3j00j43J87Q3j71J79
4470E0jP6j74q1RJ94m5l7j01PN5Q6K7P8j60j91M76o9l05L1J0R0j28N0j47J25K7
4497d8ml4k0J76n2J6J4n3J17l0R9k15K12j23k04K47k27J19l9J01l6k8J14j79M8
4522b9J34m0n8q2L9r6J16J7j10J29n0j74L5J90p0MR6M2o0K6m0k1l1K50l19J75
$$ y = [63, -154, -8, 1, 64, 138, 123, -209, 107, 50, 36, -144, 170, -140, -147, 25, 39, -71, 38, -67, 5, -38, 65, -98, -150, 164, 245, 100, -67, 72, -95, 107, 61, -156, -139, -183, -25, 140, 248, -158, -138, 65, -5, -23, 55, -28, -69, 318, 34, -11, -191, -6, -110, 31, 140, 91, -10, 64, 125, 117, -6, -111, -119, -72, -130, -154, -135, 78, 16, 10, 244, -77, -77, -73, -2, -107, 26, 38, -197, 124, -136, 29, -58, 133, -7, -50, -141, -288, -22, 214, 144, -97, -143, 217, -12, 259, -34, -66, 49, 131, 4, 61, 122, -143, 24, 238, 36, -12, 193, 55, 28, 81, -108, -38, 15, -85, -228, -41, 42, -129, 50, 49, 125, -49, -130, -121, 73, 28, -9, -110, -103, -48, 38, 65, 143, -17, -208, 268, 199, -106, -75, -65, 25, -103, -53, -200, -75, -48, -52, -86, -106, 70, 18, 34, 48, -5, 112, 82, 181, -34, 178, 55, -149, 98, -129, -10, -49, 52, 16, -12, 102, -77, -29, 105, 65, 7, -75, -36, -132, -16, 1, -109, 20, -30, -204, -169, 21, -49, -45, 51, 93, 33, 59, 19, -2, -33, 217, -102, 73]
4548G3J59j76r6J2O4j91K38k31O9K99mj43M9k47J81l32M63j92j87J79M8R1k4k3
4572G9k60J08J17j28R2k8j7P2K28p8k40J06j26J36Rl3k03L85k32k25L43k6m2m2
4596eJ88q6O9j8mj22J01m7o5N0m0J21j27Lj55J58K0K35j66k31K78j48L9J02l25
4621a75N5K63k63K24J06l73K61j29k0l1K48k22Q2K8j49n0M5O1K6J1j54J50k65
4644b71L06j40o4P5K37j83J97l36J58P2Q9j27n7J01k77O4L06j42j3o5J47r6N9
4667D0j39j76K59J01k50J25K2nn4J05o9j41K90J9L2l09J68j7Jn0N6j9k5m7rJ13
4693B1K9Q1o1o3P2k79k6L72j20J04k05N5R6p2j9Q2J84k64k85L89J37m00N0J06
4717a6K62j63p0j51l5J47k5j9J50j88Q3L55m03QP0k0j91J07K31j6l84K86j5J08
$$ y = [73, 232, 56, -40, -28, 36, -155, 83, -148, -79, 220, 216, 73, 122, -125, 56, -276, 187, -5, -192, -13, 35, 126, 102, 79, -181, -73, 44, -84, 8, -20, -37, 35, 263, 185, -55, 51, -75, 61, 70, 37, -166, 219, -13, -238, 105, 79, 37, -5, 183, 97, 166, 148, 144, 22, 123, 76, 11, 61, 21, 142, 15, 18, -137, 21, 41, 276, 110, -121, 157, 9, 48, 150, -175, -120, 143, -120, 104, 210, -163, 98, -31, -51, -82, 166, -56, 26, 54, -95, -145, -100, -39, -13, -2, -156, -6, -271, 35, -105, -169, -94, 143, -40, 157, -179, -21, 51, 140, 13, -44, 57, -220, -156, 150, 8, -5, -70, 77, -19, 40, -99, -275, -16, 85, -165, -40, -18, -23, -77, 28, -41, -182, 108, 127, 159, -150, 18, 1, 2, -48, 8, -11, -36, -83, -92, 21, 50, 131, 70, 7, 79, -200, -226, 146, 26, 130, -75, -20, 76, 4, -15, 67, 251, -13, -298, 91, 228, -172, -122, -16, 246, 83, 13, -138, -173, -26, -51, -70, 80, -108, -25, 330, -73, -65, 5, -15, -206, -99, 132, 116, -268, 18, 3, 111]
4741A11j37Q6j86J16J12k64J71J05r7M2K7m3q4q1K84j80L9l3j06J63j20o2J97
4764F0m0r3J54O9k06J31m8n3j33K22J06k83J87J34j97j12J18Qj66J17j39K07J44
4787A87k03R9l9j08J67p3j9j49J81J41L5m69M67j32jpk49J99j5K5J51k33O1o4
4811d8J13O8k72L89l19r1J35no1k67M88M8k36j09L48j63j73K55k65J33qM2l8P3
4835C7n3r4J54P2j96K57r6j38J54j76J39l32L76j93J38r5J42k61K51j73K99j35
4857G7k51J23l1K00j07p1J16j4l6l9l7O3n3O3Q6k06P2lO6K0R8r4o3m4P6j32Q8
4884c3r3lK60L0j14k26N1j4K16O6k70L9L5j68L35o9k12J75J6p3j02J13n5m6K06
4909F4Pj1O8p9J2r6J16r7QM9q0j30J86K4j54M6J38k86L42L8j42j12Q0r8kL23k30
$$ y = [111, -26, 60, -126, -10, 102, -162, 9, 114, 17, 59, 86, 43, -41, -122, 162, -18, 21, -12, -118, 45, -75, -137, 60, 20, -73, 81, 150, -56, 75, 27, -26, -159, 63, 169, -114, 73, 207, 10, -102, 16, 24, -142, -25, -164, 43, 187, -16, 83, 44, -64, 103, 30, 11, -138, 43, 184, 219, -250, 217, 85, 84, 77, -172, 27, 12, 37, 188, -45, 16, -48, 65, 133, -139, 250, -69, -160, -25, -30, -91, -358, 130, 178, -58, -167, 181, 18, -155, 100, -165, -32, -40, 2, -36, 37, -16, -110, 44, 116, -80, 177, 81, -57, 97, -79, 60, -272, 104, -89, 49, -46, 96, -165, 86, -87, 212, 77, -174, -51, -82, 118, 11, -60, 56, 42, 6, -33, -70, -7, -60, 3, 89, -117, -45, -48, 18, 38, 136, 42, -21, -65, 11, -121, -33, -126, -129, 131, 161, 47, -179, -128, -142, 74, 140, -130, -91, -56, -224, 111, 42, -170, 5, 21, -52, -154, -41, -96, -142, 64, 71, 60, 128, 49, 61, -35, 81, -16, -8, 41, -39, -169, 17, 41, -113, -67, 71, -215, 127, 165, 23, -89, -9, -107, -109, 214, -16]
4936a6qJ33J70l18L4q9J31o4J12O2k48J68k7o1j99L83k97j83L95l11N7k2L9O5
4960i4K38j80pj23K30pK10k97O6M1j34q5J77L3n0k42L05J49l47K04j56k1J18j11
4984h3j06J86J83k73K4p4K68j96K01j60O6Q4p1p1j01j27J77K3K58k88P0J0l4K06
5008A72l62J4j2J77K62k41j34J25l7J09j03J45l32K00J13k48L67j72K9j69J33
5029C6k5k11K30j05K4J32J40l51P6K86k12Q3n4k41N6J15P3j02P9J20k66O5j64
5052b16R0K53j81l7M8m9NK17l0o6j61K41k93N7K84k89J30p7O2P4k34K16N8k51
5076a49L79k54o8N9O0k39J51p4J14lJ85k66K31k91J58k1J18q1j09O2Q5j01j15
5099a69K38N2k26J40j19K15j95r6K29J4k00O3P7j11o5J24O6j32K49j42K3j69N2
$$ y = [-16, -24, 109, 279, -39, -5, -94, 37, -27, 85, 147, -101, 67, 40, -21, -220, 163, -134, -317, 78, -233, -176, -198, -159, -94, 144, -36, -43, -166, 64, 57, 267, -30, 36, 77, -57, -142, 35, 68, 18, -224, 81, 230, -117, 87, -69, -90, 28, -83, -189, -3, 180, -93, -69, -143, 125, -71, 130, -30, 36, 120, 49, -22, -123, -250, -73, -50, 208, -80, -10, 0, -34, 172, -190, -176, -188, -11, 251, 10, -124, 1, -36, 73, -30, 115, -217, -17, 96, -152, 215, 43, 72, -97, 36, 11, -200, 30, -75, -51, 81, 221, -130, -54, 232, 20, 103, 49, -192, -136, -21, 52, -50, 29, 149, -117, -52, -216, -126, 127, -54, -91, -43, -92, -87, 130, 100, 34, -127, 114, -179, -122, 162, -127, 3, -74, -12, 62, -172, 44, 102, -149, 230, -24, -92, -33, 27, -212, -61, -135, -21, -24, 161, -105, 126, -165, -7, -28, 90, 9, -100, -38, 47, -54, -169, 69, 121, -105, 35, -84, 131, -64, -160, 69, 83, -117, -54, 23, -88, -153, -29, 37, -95, 154, 12, 35, -134, -82]
5122h2J98j92Q9p1J92k47P0K5N5M3j69L66k27j40J6J38O4k29l7L9j41L51R1k78
5146g6N4N1o3K1lJ76k81K76k23m9K81k38J19j64J23M4k02K6M6J06r0R7J3j06K12
5171A50J7j89n1P0J35k4J0l9j19k01K79l1j02q6M4K53j00l7r3O4lQ9q8J13j28
5196f7J38j91M3l5K07j35j23O8J54r2K0J92J4k13k9R5J31r8j71O8k8R6j02Q9N1
5221H2j42K8J56j2o3R4j20m0O0k19J33K8q8J51k1j55J6j9n1L15k17K7n2J97k35
5246a47J62n1l4k10M45j03j45Q2o7N1J14n7k07J73P6j81j9K65j34P8j2j93P3Q4
5270D3j15J14M9k20r8K40P4r6K27L2l51j1J40j21j21K98nk37J62p7J82J01m8r3
5294F9mJ25l42L20j66J20K6J14j22k02J09j18K46k53K50j39j28J17J20k31m7J48
$$ y = [-82, 116, -76, 13, -58, 134, -113, -43, -18, 37, 80, -89, 277, 50, -90, -74, 64, 128, -101, -138, -99, -240, 111, 202, -76, -22, 29, -34, -13, -16, 160, -121, 155, -68, -117, 164, -74, 45, -119, 4, 48, -154, -128, -82, 24, -66, 31, 44, -62, 150, 167, -22, -73, -3, 132, 108, 118, 79, -40, -241, 38, 7, -95, -181, -137, 116, 16, -21, -114, -50, -53, 36, -52, 61, -67, 71, -120, -77, -112, 95, -40, -163, -95, 59, -33, -13, 179, 193, -20, -49, 46, 177, 79, -92, -24, -52, 44, -58, 31, 82, -60, -32, 124, 112, 49, 143, 23, -17, 43, -176, -43, -15, -103, 48, 27, -128, -112, -131, -182, 133, -84, -57, -109, 88, -147, 15, -36, -70, -280, 165, 62, -83, -1, -68, -17, 97, 40, -167, 6, 82, -99, -118, 147, 13, 91, 79, -114, -41, 43, -72, 42, 91, -129, -227, 13, 87, -9, 218, 250, -101, -112, 28, -93, -214, 84, 79, -158, 4, -73, 109, 210, 162, 69, 65, 190, -152, 168, 2, 122, 148, 262, 140, -62, 47, -71, 175, -78, 172, 33, -95, 22, 142, -89, -136, 12]
5316A2j03JK1J38o8J1j37k6J9J90j57J99l0j80K27p7k08J89J07k34J58M9j0q3
5340Hm2l4k0J65j60m7K03m9L9K1j65P3Q1r0n2Q7j6M8j74Q9N1p1N2j50N1J76n0
5367B4j7l8J65j50N6J09j42j15Qk6M05n52J96M1J3N0J27k22mN5j08O2O7L2j2J6
5393D0J92j97Q4j30J22m3j12p8J14m2P2j76M9R8J56o6k34L15P7k57J79m3M3q4
5417G9Q1n8p8M5J09k34M6K4J0Q1j28J41j56n6J27r0J63j34P5L9r6o5J7J35J10
5442A87q8q3QJ00j49p1K21o6q1j33L64k59J17j59J56M3l6K1j32J67q7J57k61Q4
5466B0J21k42J36k1J29j27N7o4K01j82l02K10L7L7n6o0K41J14k11m1j75J48J80
5489A50k86K2L10l11J11ON4M6k41L27k60j8J25p3J42j19k73L43k21J59%p8m2K26
$$ y = [12, -91, -90, -69, 69, 1, 12, -125, -151, -132, 58, -99, 100, 70, -110, 117, 40, -168, 21, 128, -106, 52, 101, 91, 8, -34, -68, -88, 77, -83, -130, 73, 24, 63, 84, -81, -8, 73, -17, -69, 18, 2, 50, -124, -35, 16, -55, -3, -153, -102, 74, 24, 7, -31, 134, -16, 40, 149, 7, -108, -100, -126, 279, -273, -77, -36, -23, 27, 154, -68, -72, -17, -125, -63, 4, 36, 24, 40, 232, 35, 119, -11, 111, 68, -44, -122, -8, -50, 22, -154, -105, -7, 149, 83, -151, 164, 241, -16, 163, 120, 163, 79, 160, 102, 24, 69, 178, -56, -10, 14, 24, 105, -23, 118, -38, -94, 33, -57, 106, -28, 47, 86, -10, -75, -58, 77, 187, 99, 16, 24, 124, -25, -96, 125, 59, -22, -155, 209, -50, 67, -92, 64, 107, 71, 92, -40, 127, 40, 197, -64, 20, 141, -101, 35, 14, 143, 16, 73, 9, 210, 28, -274, -64, -27, 10, -46, -106, 135, 249, 38, -3, -178, -30, 150, -136, -114, 196, -115, -4, 2, 56, 102, -139, 188, -72, -90, 35, -38, 104, -15, -288, 55, -166, -7, -7, -85, -127, 99]
5513I9j37K3j80J09J01j9R9k26P3K1J9M6j58J83j18j21K53P7q4o2K36j06j54q5
5537a11J83k29J02J85J07j16j6j34O8Q3k78O1m0J51M8r3K6o1m1O9o6J40O8r2k03
5562a89R9N8k08L53Rj49J46r1Ko5n3n4j06K37P8k40K65J81l69j7K81j44j70J53
5586GM6p1m3l6J67j47Q9J04j47J68j58j14P3J92l27K28N7O3M5j28j37J8P9n1N0
5611B7M1R5l77J59R6r1j7J37P7j82Q1j34J59j01K2o6J01j57J29r7j2J7N3J30j
5636H9j61j36K13J43j26q4Q2j66J69j10J14J9k8j1J34k19J48l6n7J84q4k7L4J11
5660A95k42p6J59J19j57oJ94l36J87J2n3p1J31P9j87J66m5m5j39J09j8q8J84j41
5684f9J31J00j43j35K42m4j35J45k18K43q9R4k99rJ46j2J41j48n9O8J07k73J99
$$ y = [99, -38, -15, -195, -86, 15, -4, 95, -131, -58, -37, -18, 28, -130, 53, -65, -186, 67, 144, 60, -2, 234, 128, -26, -111, 72, -157, -55, 130, 237, 121, 105, -29, 39, 122, -156, -95, -135, 16, 64, -29, -3, -64, -105, -36, -102, 38, 106, 14, -189, -90, -32, -240, 113, 122, -27, 119, 28, 30, -35, -88, -142, -248, -11, 67, -173, 92, 273, -96, -113, 168, 24, -146, 7, 53, -18, -61, -97, 70, -77, 12, 116, -31, 137, -21, -135, -62, 130, -197, 31, 88, 151, 196, 68, -69, -51, 28, -23, 27, 68, 163, -214, -55, 41, -50, -67, 70, 147, -35, 46, -88, 71, -30, -8, -74, 27, -130, -1, -98, -110, -93, -40, 90, 89, -72, -208, 5, 148, 22, -62, 20, -146, 23, -87, 27, 46, 18, 7, 141, -78, 70, 34, -23, 161, 77, 50, 84, 195, -47, -123, 36, 155, -2, -8, 186, -150, 37, 49, -4, -75, 56, 135, -52, 114, 69, 24, -115, -6, -24, -112, 72, -69, 62, 162, 19, -116, 126, 82, -53, 92, -126, 117, 28, 122, -177, -186, -40, -52, 89, -59, -118, -50, 57, -216, -17]
5707a7j07J25j6k9J14m7k06J66j00N1J5o4n9J37J60k59K09J36k35r9J52M6l72
5730b99K96M2j56J75M2j60N9J7j27J57l9j14J31K4l4RL8o6o3J6J1O2j37M4P5k3
5756b0q1kM5M5kL3J1j70K2P7J37k06N1MJk0J04J12K9l24J27Q0kP6k45J45r3N5
5784a1j57J73J2j14Pj8J57J88j61m3J20j12o8j7j48J11M6pj07L22k18j16M8J49
5808C6J05j29j10R3Op0K34j87L7Q5m1j62L4L2J09j58j18K23k8J28Lj46q4J9m4
5833a33K27q9j00Q5P8Q2k39Q5K7j93J42j15KK89j09j77L05k96J39lJ69k53L0R0
5857D3q3j46L2J01K8L7r4J02m2N5k27L56l81J95J76j37j64L7J36Q0n7J4j38m5
5881a22J36O0p8j1j25O6K2l8J28j14J3Q8r5P8r3m6p0Q6L9K32j58j5J13p5p3O2
$$ y = [-17, -124, 1, -15, -44, 70, 23, -183, -17, -117, -66, -51, -115, -174, -37, 123, -136, 73, 209, -26, -125, 27, 73, -299, -3, 39, -117, 58, 100, -60, -1, 16, -111, 46, 7, -107, 24, 48, 14, 23, 61, -5, -68, -52, -41, 21, -116, -72, 3, -20, -101, -103, -58, -13, -15, 18, 29, -141, -119, -42, 95, -111, -60, -56, -55, -75, 29, 141, 170, -154, -27, 53, 51, 127, -118, 27, -66, -11, -168, 5, 17, -97, -90, -108, 49, 237, 76, 33, 153, 41, -27, -44, -192, -81, -35, -42, -149, 173, -45, -161, -113, 36, 141, 12, -98, -5, 1, -69, 165, -22, 15, 100, 59, -103, -69, -37, 72, -86, -204, 19, -9, 119, 122, -24, -108, -89, -133, 94, 5, -95, -10, 68, 150, -89, -4, 23, -170, -28, -143, -141, 148, 39, -138, 167, -129, 10, 7, 176, -77, -47, 43, -40, -186, -154, -53, -25, 12, -82, 20, -22, 33, -194, 162, -219, -24, 152, 15, -149, -112, 24, 104, 47, 61, -77, -122, 14, 74, -4, -15, -140, -74, -52, -90, 38, -76, -63, 25, -70, 8, -85, -131, -201, -115, -76, 156, -2, -17, 96, 21, -52, 10]
5907A0k0L9rJ2R1p1k11K49k5o3k3l2O4O6k2k09L08j60j17J76l9j53O2O2r6K04
5933I3p3K3l3J43k78NL6m7K31j99Q0r3K5K21k07%R6R1m0p5l5J6N6L4j03J2m7p3
5961a41K9O5J3j39J06K04j52q4J04K6J45l45K49k05L08j59L2L1j21J3m0J07j52
5984a06l8J81k46R1J64j16J50j12J20j95K69k31K17j55N8q5J08p0K31k8k64J05
6006D8o4J04j13R0j3k5j36Q8J44o2J4j55R1o4j46J13k8K16lPj75J72j39J7J33
6031A14o8pL7l7j03K20l29P7R6m0J82l40J82k0J61q1m1K09k31j37K70j58j15L28
6055A69j89j61J66j08J81l4l07K57j48K60j07K47l08L65l26Rl4j9K69k43J28l07
6077b40K81o3K8q5R8m5o9R6K71m65L00nr6K04r2j73n9K92j73j1NJ25k6j98J44
$$ y = [10, -10, 29, 20, 32, 123, 52, -159, 90, 65, 2, -21, -53, 11, 77, 55, -154, 154, -6, -123, 53, 14, -139, -77, -15, -111, 93, 20, 43, 10, 153, -125, -120, -84, -131, 100, -99, -19, -112, -87, 134, -73, -73, 23, 114, 74, -1, -36, -20, 36, 70, -33, -21, -68, -141, -112, -47, -34, -173, -67, 137, -15, -99, 5, 31, 176, -169, 80, -125, 183, 24, 56, 87, -34, -21, -61, 46, -106, -144, 37, -209, -118, 46, -70, 80, -32, 88, -107, 162, -69, 148, -7, 51, -34, 74, 4, 235, 207, -57, 48, -16, 88, -25, 65, 52, 27, -109, -21, 123, 61, 75, -80, 11, -53, -199, -86, -114, 102, 99, 106, -69, 103, -36, -19, 114, 46, 39, 76, 39, -64, 156, -173, -96, 0, -40, 142, -198, -16, -36, 125, 44, 3, 212, -19, -156, 114, -44, -159, 169, -20, -181, -15, -123, 58, 24, -283, -26, -174, 86, -21, 226, -82, 283, -43, -34, -68, -87, 182, -61, 67, -240, 41, -22, 6, -79, 19, -26, -95, 1, 272, -193, 107, 102, 6, 210, 118, -55, -114, 178, 5, -6, -1, 124, 98, -100, 44]
6102D4J38l01K33k67J32J67j11J17o3j21K46j94j85%O1M7m6Q8P1O6l85L23j16
6125e6M7q9J99k8j19l3J81j15N2n8P2P9q5K1K6q9m8N6K2J51m1j37j80L54k98K14
6151I8j85K57m1j52J2L1J02q8J14k29J62r3l2P6o9K4l6R3j22J98n2P4r6j91J84
6176C9m6p0l3J34J59k85K56p0l4L27n03K64k50O5J53NK4j56o2N1P6j27L7J2pO2
6202B1k9j3j13L1R4N3q9k6J67j48j24K54j00J78k57RJ95K9j64M7j0J50l02N4M67
6227C74l06j69M0J27K8j04Q7j14K4m1n3n1K53q1j2j11PJ34J6J59Lk19j36K27o4
6252A8m0RJ20j0j45K6J47j44K9N9J36j89j45R2O6j25J16N0J12k1j24k6j27q1K35
6277C8m9n9n7Q4kOj10J60m6J54J13l12J72q6J03l7Jp4p6J7N7J82k08J28j31M3
$$ y = [44, 182, -119, 114, -153, -21, 146, 35, 152, 89, -32, 214, 20, -165, -165, -104, -57, -103, -15, 56, 122, -263, 60, -56, -9, -98, 101, 73, -46, -79, 102, -13, 39, -19, 53, 132, 47, 68, 94, 5, -43, 13, 35, 186, 145, 8, -172, 182, -116, 98, -87, 170, 129, -23, -11, 20, 122, 34, 148, -81, 81, -12, -44, 32, -37, -13, -49, 44, -78, 120, 68, 142, 46, -145, 39, -7, -77, -110, 24, 183, -102, 154, 84, 50, 377, -126, 138, -112, -47, 106, 111, 135, -21, -83, -32, 44, -83, -46, -34, -41, 21, -8, -21, -134, -103, -9, 44, -45, -71, 96, -52, -176, 78, -22, 156, -101, -92, 103, 132, -32, 15, 5, 155, -147, -93, 374, 68, -101, -61, 66, 94, -10, 77, -37, -13, -54, -107, -158, 95, 14, 2, -109, -102, 32, 48, 207, 210, -9, -145, 82, 18, -22, -13, 107, 97, -48, -22, 125, -19, 10, 69, 205, 16, -129, -37, 29, -96, 20, 70, 182, 161, 37, 11, -116, -197, 38, -11, -70, -127, -43, -45, -39, -149, 11, -35, 119, 232, -80, 92, 6, 109, 72, 73, -1, -77, -60, -3, 179, -29, 99, -32, 11]
6303A1q2J55m0j05J00N9n6J10l4j78J2qJ05qk22O1K6Q8j03J87Q5r8j27P3J78m07
6329b18L89k69J31onM6J20oj29k30L10j43L7L3m8J21r2o2j35K37q2p1J07j9j62
6354a46JJ64l8kj02J96k18O6O9j31P2K7J9m4P8j20J24J2J2p8N0J8p4J7j15K10
6380F7J2M4J9k04K23j58nr1m1J10n8P3j37J27J21k12M4rm3J78j8K5J06j44j04
6405g5J45j23p8k7N5j0Q9j47R8K28r0rk00R5J64k52o1K49Om4j1J75j43k31J17
6430h0N9p1J64J40l53Q5J97k14L6Lp9J2Q1M7K16k24J5j20J91m4o0J41o9j00j35
6455a62L49j22J55l58j24L00O9j07p2N3P9r7Q9J5j18J15r3J3%J68r1j09K52j10
6479I4j25J26l44K04%R0m0m0KJ79k9j1j87J22n6p0J13p6L91m89K86o4k00L1J10
$$ y = [11, -71, 84, 44, -61, 39, 98, 42, 152, 118, -60, -48, -56, 49, 41, -181, -120, -94, -6, -109, 78, 163, 65, -62, 11, 189, -218, 171, -98, 33, 27, 22, 68, 188, 182, 53, -177, 133, -10, 27, 60, 12, 133, 41, -21, -156, 81, -1, -72, 35, 16, -146, -145, 19, -19, -21, -123, 73, -145, -79, -10, -141, -69, -42, -23, -67, 11, -109, 15, 27, 39, -39, 11, 29, -45, -28, -143, 67, 79, 123, 142, -62, 161, 3, -2, -93, -134, -24, -82, -9, -146, -19, 102, -110, -66, -75, -118, 60, 42, 67, 173, 29, -75, 70, -53, -131, -158, -103, -113, -24, -171, -73, 155, 65, 56, -144, -49, 115, -137, -198, 51, 57, 13, 2, 177, 34, -197, -80, -21, -92, 72, 212, -141, -56, 141, -73, -37, -34, -113, -101, -20, 27, 243, 19, 34, -86, 105, 61, 1, 142, 73, -27, -162, 187, 65, 220, -138, -262, 38, 107, 0, -72, -19, 60, -37, 52, 67, -51, 64, -29, -16, -16, 152, 61, -48, 204, 94, -31, 95, -249, -45, -45, 45, 5, -35, -33, 146, 117, 106, -81, 41, -15, -85, 28, -48, 343, -146, 140, 76, -124, -93, 17]
6504A7m5j24J77q3k0o7Q0J97j26J26k75M6K25j32m8J07j50Q7n7O0m7L7k8j35J70
6529hJ58j43k23L16n4J10p4k68O0Q1K03j35J55m12L98k82J47m0l6k6J43K4j22
6552b8P9N7k51K86k91R4O6l8K0M3n6l2k6J78j32k6J16n5j9M1Kq0l3j9J27m6P3
6579E0l2j1K5k75M26kj62K2pj51L4J8p8K38n7lj6j04P8J25j12J09j82q0K76j04
6605B5j32J66n5j09L81j94K9j71J94q4P5k37J38J23j75L02l63L6J52j85M0J19
6627G5r6J27N1q1L1k01j01K11J4M7k96J78k9K45j32j79J80k20K61L6o0k4j7R3
6651A13k83M27m3qj38j02J36j1j75J60L6j78Q7j14l1J94J0N6q8m8j14P5l5j01
6675a75L50j60m7j39J51q9n7N4L30k33J36j15j12K79l59O0m6N8M8J30l6o7j80
$$ y = [17, -28, -152, 25, -58, -78, -145, -65, 132, 6, 132, -143, -97, 128, -4, -52, 55, -95, -8, -65, -5, -52, -15, -43, -178, -8, 150, 7, -216, 100, 46, 156, 82, -186, -126, -45, 158, 23, 178, -234, 164, -118, 29, -11, -47, -73, 70, 94, -28, 51, 108, -143, 143, -148, -54, 12, -26, -6, 37, -19, -51, -77, 101, -31, -57, 59, 4, -15, 26, 28, -52, -85, -104, 23, -23, 50, 18, 7, 32, -243, 183, 181, 19, 41, 34, -117, -83, -65, -143, 95, 38, 35, 19, -85, -7, 118, 6, 115, -67, -147, 129, 25, -107, 59, 4, -105, 276, 82, 111, -60, 134, 50, 125, -112, 26, 149, -26, 276, -87, -51, 101, -84, -44, 75, -21, 106, 157, 76, 107, -94, -195, 16, 30, 77, -219, -41, -70, 175, 43, -136, 44, -176, 85, 121, 61, 37, 20, 113, -170, 257, 214, 206, 68, -34, 102, 91, -84, 76, 112, -66, 21, -93, -124, 70, 80, 136, 48, 0, -114, -39, -74, -175, 175, 15, -32, -171, -20, -109, -166, -112, 218, -15, 121, 6, -106, 173, -186, -126, -172, -114, -66, 64, 28, -39, -219]
6698b19K34k6O8j17Q4K9j0N5k88R6l9K29J09k12q5Q3p6J25j37N9j25J36M3j48
6722a32K80j17J13k28J81J57l53J99q1qM2j3l7m6O8Q2j42P0K6j59J87l2j85K13
6746H5j53p6M7K25L0j99O6J3m0k7n9o1L24k67J11J63J5l8j42j94jR2O0j22L8p
6772a17pL54m5k75J04j29J03QJ50j39j79K63j49J19j30J15o8j01J67J86k99N2
6794a7r1Q1m6K17r7j3r3K53l48J52M8M7j09J0m2rN0j11N1L6j1N0J39j96q3P7L07
6821B52j84j86J62L1j66K10r2j33J72M6n6j43Q4j73J74L0L9r8P0q7J6p9k3R1J85
6846A42k34Q8K05k45k7jj0l3M3J56j87lJ77j29o5R6J52k01j0J88j55K2m3o8q0
6871b22J32J87k44J82n9J99j18l8J33m3o2j47Q8J04j37R1K00k55J65j73R6k28
$$ y = [-219, 15, -11, 57, -60, 24, 53, 43, 98, -190, -94, -133, 96, 205, -7, -92, -9, -85, 40, -97, -38, -163, -27, 16, -132, 148, 31, 144, -84, 97, 254, -99, 100, 19, 11, 53, 40, 3, -43, 25, 107, -35, 35, 61, -98, 89, 57, -128, 85, -68, -144, -97, 128, 158, -41, 25, 38, -2, -29, -88, -149, 175, -92, 19, 182, 197, 159, 17, -177, -178, -86, -26, -148, -110, -117, -124, 230, 185, -90, 14, -115, -12, -4, 146, 7, -172, 91, -58, 61, -69, 46, -22, -123, 44, 230, -69, -17, -108, -27, -73, 144, 47, 34, -59, 194, -154, -2, 46, 93, -16, -6, -48, -57, -7, -118, -67, -31, -42, 8, 147, -49, -132, -55, 252, 68, -118, 44, 75, -91, 119, 27, -106, 66, 112, 56, -87, -3, -176, -2, 28, 67, -31, 39, -48, -32, -111, -134, -43, 142, -92, -4, 201, -44, -71, -72, -82, -115, -72, 84, -103, -106, 71, -58, -123, -27, 125, -76, -86, 102, -53, -31, -74, -142, -222, -90, 97, -147, 35, -24, 175, 57, 19, 152, 109, 47, -100, -12, 92, -45, 46, 246, -9, 156, -17, 79, -149]
6893a49J86Kj19J76k23J79q2m0M4K14j19j85L25l38L98j73j47K25k51M68l97k
6915hq3J9O1K07r1Rj28K16j93k7L3J3J16k23k1J6J01m9R3j81M5R9O0m3j20J49
6941G0K9np0L9l7q9J39j06P3kjo2N3j22KJ53j88J93p7K2K12m21J67j21L43j31
6967F3j21J81k4n5j32Q6j0J4J02j94j3K17k90M9K58R4l10J27q8K30k37M4j58J29
6991c8J62j95J50l44J16K06j85K40j25P3k3j06L2p7J56j56J01l8j36J41J83j52
7013a5j9J77Rl83P2J31J30j91j53N2P5K83k18kj9K79j10j5k55K23j37pP7N6k27
7038a87K79%q8o1R9r2O8O9j21P9J6J13k06n7J55J74l06J56j59P5j47J20J15K2
7062A16r1k83J47O7K9r5Q5Q4j27J15j59L5Q2j51K34j82J16j32J30m5O2N2m1j12
$$ y = [-149, 37, 39, -80, 96, -127, 52, -30, -70, -26, 188, 69, -116, 209, -129, 269, 96, -51, 174, -77, 391, -6, -8, -91, -72, -11, 196, 105, 114, -14, 202, 9, -18, 15, 28, 144, -79, -100, -84, 17, -32, 61, -120, -75, 24, 84, 41, -79, 70, 99, 94, 24, 63, 26, -63, 76, -30, 43, 41, 40, -22, 31, -91, -89, 64, -124, 69, -8, 14, 226, -195, -28, -149, 194, 63, -58, 123, 99, 44, -88, -2, -12, 2, 104, -90, -103, 114, -176, -127, 131, 225, -85, 42, -46, 184, -53, -9, -167, -38, 124, -71, 79, -265, -149, 57, -128, 112, -13, 60, 37, -69, -37, -114, 42, -114, -13, -51, -187, -46, 137, -15, -34, 143, 152, -231, -159, -28, 102, -89, -242, -190, -115, 168, -50, -52, -71, 208, 98, 83, -172, 51, -86, -93, -16, 40, -187, 92, 92, 4, -57, 42, -50, 18, 87, -34, 45, 61, 174, -32, -89, 66, 240, -66, 90, -69, 6, -141, -21, 94, 116, 25, -258, -111, -44, -15, -110, -25, 59, -68, 47, -112, -77, 5, -146, 88, -94, 22, -110, 20, -25, 37, 89, 48, -64]
7086f4J95l29K96k01J26M3mp3N0k31J72K40k60J77o6Q6k42J29M0j75J57R5r3R6
7110A64j08RJ8j59PKJ33j30J36Jj58J17Q0j4k32r7J96J41K03k89q7q8J47j70J38
7135d0J34k98K60J39p5n9n9n1j6k0J22j1J59k87M6Q1l1j60K75k8j1r3K77k93Q8
7160D9m6P2m5N2N7j33M1j9ro4p9m3L38J3j44j98K15j40R9N5o6j1J59k64Q9j05
7186a27o5J71RPJ74l50J50k5K36k39J44k46N6J83QP3l00JK27r5j39K82k32K05
7210A08j4q4m7K20j69j9k64K92Q1q4r4P9Jj66N0Q9n9k9j38O9J30J03p2l5M1rL
7237a7j9J5J12o8J36n9r1j80J59L8q7j71k7L74j5j6j5L8n1m8j84K61j74R0k9J33
7263A05N2k23J18l2Qk65J08K10j3j21K42j29N7k63P5Q6J2KJ14j52J00q3J11P6
$$ y = [-64, 131, -198, 98, -103, 23, 66, 62, -11, 39, -192, -20, 220, -40, 137, 71, 157, -85, 44, 84, -91, 66, 161, 68, 164, 56, 65, 83, -76, -69, -67, 66, -64, 72, 73, -85, 32, 112, 98, -134, -231, -35, 106, 309, 20, -67, -155, -8, -178, -40, 94, -204, 56, 195, 120, 61, 2, -49, -65, -85, 37, 26, 185, -102, -56, 25, -6, -166, 109, 81, 70, -23, 254, -39, 49, 3, 75, 30, 82, 139, 6, 47, 28, 19, -45, -124, -167, 171, 184, 40, -158, 57, -83, 16, 71, 5, -6, 153, -111, -22, -127, -192, -21, -12, -5, 169, -181, -31, -56, 180, -59, 85, -161, -105, 78, 86, 159, -141, -140, 87, -8, -147, 135, -97, 108, 94, 10, -37, 183, 14, -5, -269, 23, 104, 20, -74, 5, 6, -160, -110, -21, -80, -109, -247, -178, -48, 55, -17, -52, -11, -20, -17, -36, -21, 91, 23, 159, 100, 9, -171, -12, 26, -61, -232, -259, 115, 100, 84, 69, 107, 56, 8, -176, 85, -89, 1, -28, 105, 157, -66, 52, 20, 28, -237, -129, 81, 68, -53, 189, 60, 117, -146, -71, 15, 27, 29, 143, -9, 91, 8, 119, 195]
7287A95l2j49O6j46Q3j5k16J23R7MO3j09rj6j03L14j68P3j42j7J49R6k66J92L9
7312A06J0Lj55p7J79N8k52J1J75%k5l1kl04K73O2l0r2l7J57P1l8l7J36j11q1K5
7339fP2p2K0N1j8J42j73k8J97k28M9J52j79J08r1J31r7k55K02J22j94m0K42j28
7363b1O3O6k6l5M5j16j00R3m8N9r6K47j50RJ04j86J26n9m1J41P8k93N1J23j08
7388g4J95j25R4j20j01J90l47L85r4j19q0K14k9r1K68k78L07k89O4J11k03K87
7410A65j39P5k17m1J63j14O2J76j68k46L14k13K45j71j48L85k09j3R0K5N7J66
7432B44k13l9j07K36k40j11K40J23k8j7j8j25qp1M8K4J51J08j94n5j26j21L27
7455B8M7r8J0j27K37m4M1q2m5J02j05J09j86K85j89mn5L6J40J0j72k0j4J17j8
$$ y = [195, 163, 14, 80, -66, 17, 2, -214, -91, 6, 10, 73, -36, -45, -61, -164, 150, -18, 55, -87, -104, 45, 141, -125, 67, 106, 116, 119, -36, -113, 66, 124, -128, -117, 58, 58, 33, 2, 0, -304, -31, 31, 1, -91, -128, 29, 100, 62, 25, 161, 50, -31, -6, 66, -6, 14, 65, 47, 189, 16, -12, 185, -43, 6, 158, -21, 87, -4, 127, 30, -225, -23, 99, -95, -135, 107, -21, 42, 108, 82, 47, 92, -24, -124, -31, -79, -20, -116, 131, -19, -10, 94, -92, 34, -25, -66, 75, 153, -140, -89, 34, -74, 121, -4, 90, -30, -131, 59, -288, 97, 3, -116, -196, 18, -11, -102, 166, -112, 195, -94, -30, 81, -122, 165, 26, 101, -116, -157, 6, -108, -46, 130, -38, -284, 30, -183, 62, -109, -257, 128, -81, -94, -4, 21, 78, 244, 31, -8, -115, 121, -119, -230, 10, 133, 105, 88, 70, -55, -63, -134, -86, -62, 89, 197, 3, -52, -178, -299, 28, 75, -23, -13, -140, 97, 53, 94, 12, -33, 69, -36, 73, -113, 172, -17, -21, -76, -40, 100, 110, -62, -82, -96, 21, 3]
7480CK16m45rM39l95K37l5J29k91K18o9J5j6m0m9J80j03K2q9R5o7OP9J9j10N5
7506ek21J70J78j43o3L5Q2j4o4Jj62J81J23p6P2l4O0r5J4o6J02j16R2J0p8M7R9
7533A29j34m6Q8j91N2K15j03o2k2J27q9J02l7o1L7q0J62Lk67P7J91j14K22l42
7557a43K31k2j81MJ93l9j08J34m4o1j9R1pp1Q5j8R2l06J93M3j37Q3r1M6k8J30
7583E0k1k2r1P0K0j34K50k51Q9Pll9l4K57k15K4J48r5o0R7J12k74P4Rj6N5J45
7610A52k40J89k02J08J42k40MJ93r7J33r1l4l6J25L1r3J02j9j20j2J7j25L00j48
7634C9j10j21J26oK43k91J07J28j44j94M09k81O2J57k34K28j52n8r9J99j81J62
7656a1l5L9L6J2J23k71J09o3p8J08o0L3J76n0p7k13K44N3j08K44n6j44R3M6l52
$$ y = [3, 219, -226, -235, 204, -191, 46, 11, 140, -151, 67, -2, 13, -3, -43, -92, 88, -15, 7, -82, 13, -54, -48, 31, 50, -60, -5, -226, -56, 122, -21, -84, -49, 33, 19, -45, -44, -206, -25, 98, 22, 94, 60, 120, 25, 39, -27, 75, -41, 51, 61, -17, 30, 129, -5, -51, 37, -154, -102, 113, 10, -52, -74, 53, -36, 66, 29, -32, 5, -75, 87, 90, -177, -100, 91, -23, 199, -143, 88, 66, -115, -111, 82, 43, -65, 69, 25, -36, -55, 36, 29, -42, 43, 25, 117, -189, 4, 47, -90, -7, -98, -52, -80, 50, 29, 7, -84, -14, 6, -128, 122, -129, -40, -33, -36, -75, -109, 148, -67, -43, 105, 10, -50, 47, 159, -115, -41, -32, -48, 7, 152, -88, 101, -101, 7, 149, -91, -87, 106, 9, 142, 51, 17, -19, 106, 137, 44, 146, 127, 7, -5, 12, -113, 187, 39, -71, -192, -66, -72, 171, -120, -13, 115, -29, -223, 186, -95, -33, 124, -110, 118, -34, -92, -191, 8, -173, -11, -46, -7, 29, 41, 164, -107, 2, -61, -139, -31, -91, -58, 118, 68, -9, -222, 22, 75, -33, 211, 155, 11, 104, 150, -202]
7681b02J78j06K01m6j10M3p0J58p6J28j79RJ31o0QK3j81K22r2L9K0r7J26j83J6
7706a00J71R0l55K72l6l4pn5nOJ28J7j79o8J06R6L0j3M9j94J0J72k38J70k5k7
7732a9K0n0J46q2p6K26l23J49J22q7j49K05p6RJ15m5j35%J18k9n5k8N4j69J36
7757b3R6j27K1J9J57l49L20oj90M6M9nm4j51J14N2J2J04j06Pr3J86k30K62k59
7782a38O1Q6K13n6l44L27k14J43j53J73P5l62M3K39Q6k10L0o5K20l13O2K02K3
7805A28k43J54j81J24M4Q1k63P7K01nj42m4J96j53J67j34K99k27ol32L80k33J9
7828i3J93J6j64k12L13k5N6J42l42o6m5L06r7k49M01q2N5k45J40j6j50J26k6K9
7852c5O6Q8j92K0O0Pj00K1K4J20k95K29r0J85j49o0OJ24k11O2K7k2L4J61j58J23
$$ y = [-202, -24, -130, 71, 25, -85, -42, -112, 46, -30, 98, -81, -72, 59, -1, 7, 30, -151, 71, -21, 18, 38, -59, 67, -116, -100, 71, 161, -194, 78, 42, 8, 1, -54, -59, -53, 75, 92, -87, -155, -49, 47, 77, 64, 113, -81, -71, 101, -137, 33, 8, -19, 1, -49, 97, 15, -61, 165, -158, -9, 113, 26, -123, 82, 6, 15, 130, 85, -50, -50, 68, 39, -16, -44, 10, -159, -23, 73, -54, -33, -14, 143, -206, 114, 108, -82, -36, 13, 8, -36, -187, -73, -21, -9, 95, -11, -4, -97, 89, -141, 121, -138, -77, 9, 222, 166, -178, 149, -65, 78, -75, 98, 173, -189, -146, 93, 179, -31, -1, -66, 154, -159, -97, 105, 128, -115, 39, -142, -18, 26, 107, -156, -79, 122, 117, -25, -69, 127, -26, 141, 7, 306, 79, 73, -259, 121, -112, -93, 100, 116, -48, -260, 53, 28, 84, 226, -116, -182, -227, 79, -18, -267, 134, 52, 107, -138, 2, -14, -164, -38, -64, -35, 31, 119, -73, -53, 7, 14, -86, -65, -41, 79, -216, 13, -77, 108, -41, -101, -95, 29, -182, -120, -93, -115, -81, 80, -78, 45]
7878D5K4j37J69j49N3o1J80j47k16J52p3O0J75%j28J62q4l5n6J98j66J61j25j9
7902a7O3R5o1q6k3L3O7j06L4j77L37j03o3J48j36R7k64J69o8O9Q2j76l0o1J09
7927f8P0j24J71r1K20l03pJ72j8j71J66N7p1j39k6K01kr3j26J99j50K08k9n6N2
7952D2j6o6O8o7J95k10P2j23J56o4R5j13n9J05j07R9o4J05M1k74K71j22L9p2P7
7977Hj36K31o3J46m22k6M12n6p7q6N1N9m8j36J68K2K6q9J94l18nO8L5N7P1j14
8003b8mJ56j35J51J1k12JJ22j1N5k08K14k18K64j23j07rJ7K9K48l39J40O7k64
8027a83J38K53k49J44p4r8J99m3q5j45J29L8j46k8R5j52K90j65J66j05R9J7K5
8050A20k70J96J98j84q0j0J5L9j4j69J99k2N4j0R6jl32J69J90l39J45j50K28j37
$$ y = [45, 69, -68, 101, -48, 5, -56, 124, -23, -239, -87, -160, -100, 75, 75, -53, 109, 25, -10, -66, 132, -34, 127, 2, -17, 46, 141, 80, -6, -29, 4, 71, -35, -1, -178, 159, 56, -7, 141, 5, 102, -162, 7, -61, 8, 90, -86, -116, -177, -68, 2, -122, 49, -42, 178, -125, -132, 40, 22, -149, 17, 74, 3, -136, -162, 39, 37, -56, -182, 17, -133, 75, 46, -10, 42, 26, -40, 28, -39, 156, -54, 18, -105, 51, -13, 82, -31, -90, 15, -92, 7, -57, 48, 89, -185, 86, -36, 3, -69, 8, -128, 103, 40, 186, -236, -262, 150, 94, 17, -69, -18, 41, -7, -143, 25, 47, 73, -16, 178, -140, -145, -77, -42, 15, 86, -28, -32, 124, -11, 140, 151, -61, -60, 62, 51, 106, -102, 112, -106, 158, 35, -72, -81, -64, -35, 213, -126, 14, 81, -183, -45, 208, -41, 103, 29, -69, 130, 87, 2, -143, -14, 24, -122, -150, -55, -207, 83, -82, 84, -21, 78, 95, 120, -150, 46, 244, 60, -20, -30, -15, 24, 10, -159, 40, 18, 72, 62, 158, 157, -175, -6, 184, -155, -10, -160, 68, -69]
8074f9J9j0J00K3n9K31m17K1J81j4k00K13j12J37j18P1k5K61o6j20nk29K10P8
8098A01K8j93O8j2L0p2P1kj39n7K55J27l13J21J21k26K55k89P7j76J87Q2l8K6
8122C2nj83J67m7L4J40j04J69j11p9j39J47o2r5k3K00K3j93K17%m8O4m7l0j66
8147a39K58l7j13m8J06O5j84n5K03N4k98J62k8o0K29n9M5j04M0j23k1K00n8n0
8171a5n3R3j23n5l0J44Q0pj06jl7M4R4k16J39K82j48j29J03j94
$$ y = [-69, -50, -60, 40, 63, 4, 235, -182, -161, 20, 6, -194, 19, -93, 44, -74, -3, -28, 233, 167, 47, 42, -187, 23, 101, 129, -64, 4, -8, 22, -50, 21, 19, -120, -177, 78, 205, -108, 13, 134, -92, 163, -126, -49, -225, -38, 44, 6, 32, 27, -156, 11, -36, -2, 138, 34, 203, 92, 13, -126, 21, -41, -136, -159, 41, 64, -129, 88, 88, 40, 104, 57, 27, -139, 119, 82, -31, -79, 27, 92, -92, -147, 56, 110, -188, -26, -54, -114, 115, 56, 101, -3, 37, -86, -107, 93, 35, -15, -68, 25, -98, -153, -183, -39, 41, 34, -72, -73, -110, -66, 28, -188, -49, 233, 85, -44, 59, -135]
8191a35
$$ Imaginary data points
##PAGE= N=2
##DATA TABLE= (X++(I..I)), XYDATA
0@%%%%%%%%%%qJ6j6J6j6K4l2L2m0M8n6O4p2Q7j01J14j28J46j66J86k09K37k66
33a40K97l31L69m10M54n05N61o21O88p61Q42r33J036j151J278j426J601j806K050
52A092k351K729l219L889m861O404r243J6183o3801j03495J02853J09292K5622
65H1094q5968j01566j5628J02000Q0870k3479q0743n0735J1467P5387N5610k7532
77B0777o6004k7828J6273N4294N1849j6410p0667l0820L3802N7380L6651k5439
89C3858p0399k0396N3205N1126M786k8850m3134j3256L9786L9766J664j8085l2870
102b799l0794K3486O1850K0565m0844n9919k5574N0821Q3948J708r0488o4939
114g2979K9569Q2449N0855m5513r9464k3944P6347O8332r954o1255n4979R398
$$ y = [0, 0, 0, 0, 0, 0, 0, 0, 0, 0, 0, -8, 8, -8, 8, -8, 16, -16, 16, -24, 24, -32, 32, -40, 47, -54, 60, -68, 78, -88, 98, -111, 126, -140, 157, -174, 195, -215, 239, -266, 295, -326, 362, -399, 443, -490, 546, -605, 673, -753, 848, -958, 1092, -1259, 1470, -1749, 2140, -2721, 3683, -5560, 10623, -53178, -156673, -53820, 55472, 81094, -4874, -106440, -122068, -20068, 60802, 37323, -43420, -94155, -82688, -7301, 48309, 20777, -45227, -73055, -56782, -2488, 49361, 32951, -37716, -68536, -34734, 22646, 59297, 33858, -36541, -56937, -3732, 47394, 52180, 23330, -19804, -33060, 6726, 46492, 48156, 30071, -2799, -33593, -10107, 51743, 72308, 31464, -28455, -54029, -3208, 80740, 82448, -8040, -72979, -43410, 39039, 89894, 44381, -55083, -79027, -2680, 65652, 55698, -5557, -60536, -51138]
126e1138O8054L8256l1561m6804k1435J1001M4281L3397k4731m8081j5829J9177
138b5413M0930K8190l0316n5606l246M2751L0831j850l1045l3608J0813L9064
150A1495Q453j6332q238p760n763J2744J4236M023K82j9034k9019J4151M9269
163B8507J4298l4550m0896q263M4500N4956j2904o7015k7481L7910N1687J7360
175E8109l7392n4754J425N4510L1232j5639l2882k5538P451M1772K2527k1482
187B9339l0077j4225P984L5657K3674k7814m1720l601K7051K9732M391l7393l4898
200c1900J8278L8068L485k1385k0009n722J7828J6789j3238j4520Q658K753j2094
213a3009r39R582P709K562j6863k3884J4462L7715L157l0180k3072L675L1639
$$ y = [-51138, 16916, 55172, 23611, -23193, -44628, -33627, 10654, 44051, 19320, -28761, -44590, -25413, 15517, 43707, 13391, -42215, -45461, -2710, 28121, 26271, -4774, -38382, -27569, 11495, 19948, 3616, -4622, -12382, -18145, -5401, 8835, 12858, 13140, -5894, -34913, -20762, 28507, 42805, 8255, -32641, -40904, 3596, 58552, 45648, -21367, -48848, -10938, 40749, 58109, 20717, -34037, -32612, 21898, 53130, 37491, 4609, -20929, -13478, 28294, 50821, 29339, -738, -14963, -6979, 28678, 52352, 24538, -17182, -20783, 6268, 36000, 40391, 2998, -31900, -13622, 24446, 27931, 6546, -13463, -19185, -1357, 15432, 2194, -12326, -3668, -915, -13009, -13948, -4366, 3343, 5905, -10958, -34842, -20380, 17335, 20492, -9688, -32760, -29085, 2554]
226B554K9471j7315m2454n117L0579K4283L558k0605k8337M402L2547J5197q234
239B0529j5643j8016J161L1295K0318j6808k5852j0530J2269L2756J3931l2465
251A2945l2676J1167L0570J5516j1615l1661j3160K8057K4220j4011k1535l522
263e705P383J1449J523j5647n304J4581N87j5577q21J0007N412j496j3421j3872
277b0901J3274K3486n630k2082q007O122J5584J2803j2170k3107J286J5977Q353
290D988K984p563j8389j842J9415J2736k594j1780j8051j10K9410J7229j8947
303G486k4514l681J7962K6687K213l2905j9141K1597K5972J236j6737j9448J490
316a1783K6011J0922j8998j3086O849P971M203j764j0399j86J2100k069j1389
$$ y = [2554, 32025, 14710, -27744, -32861, -2282, 22001, 25559, 4954, -23383, -18981, 13566, 28763, 20529, 4886, -13130, -11969, 19326, 39644, 22836, -3016, -13546, -1277, 31479, 45410, 12945, -19731, -8564, 22006, 37522, 25907, -5754, -18914, 9143, 33363, 19352, -2183, -5705, 1678, 13127, 14650, -997, -6301, 8280, 8867, -6710, -7531, 2476, 7888, 6392, -7029, -20901, -7627, 15859, 10229, -11853, -19860, -13738, 1846, 14649, 2479, -20628, -19342, -3365, 4988, 7972, 409, -17980, -19822, -407, 12329, 9735, -2045, -20096, -20206, 9204, 26433, 7486, -17028, -20709, -2747, 23940, 26153, -6752, -25893, -4296, 21676, 22912, 6175, -13273, -11783, 14228, 25150, 6152, -6934, -85, 7886, 12089, 10325, -74, -260, 11840, 9771, -1618]
329a618K925P649p25k137m878o647P937J0896o879j0510Q92J368K492Q121l521
344E365j2449j576N255L842P292j817j8587o656J6330J3806k438j3882j6994L880
358a8629K7516J0761k2721k0595M510J9034J6631o838k7226p561K3750J6387p724
371G295j4360q184O234J8201L084j5995n785Q639M265P90N99o151r53P766j64
386E281n597L690K655m594K015K790m683M37M792k028j259K126m995k454J0209
401H385L409r818n920J393N757J0144k343j9196n862J7492J2027n314j4501j1622
415a5969P280K2965L193k2580j3256R319J4860P513r133j9479j055J9517P937
428A1112r803q586l443M153J1737J463j1782l698N627K014K192K499o976m142
$$ y = [-1618, 1307, 8956, 8231, 6094, 1216, -5431, 2506, 13402, 6523, -3987, -3095, -1727, 765, 8886, 5365, -7084, -8660, -3405, 437, 7729, 5912, -12675, -19331, -3001, 10805, 8367, -5515, -22509, -18629, 8887, 19648, -3073, -23668, -19158, -124, 16507, 9669, -17557, -25118, -1368, 15019, 7295, -7065, -15249, -9015, 9186, 12270, -3725, -9510, -871, 3394, 4184, 4783, -1368, -2321, 5445, 5281, -316, 3374, 6029, 1435, 3450, 6240, 1557, 1994, 6786, 4758, 3499, 5625, 630, -1824, 8385, 11794, 1976, -3944, -2551, 3206, 13350, 11007, -8189, -14051, 3441, 15468, 10154, -4347, -15969, -8689, 14276, 17469, -5111, -18367, -9048, 5812, 13325, 4192, -15287, -16342, 3175, 11112, 1309, -7277, -10720, -6567, 5170, 6633, -5149, -8847, -3220, -1206, 986, 3485, -3491, -7633]
442g633O842L468j972K70k591l626P048N898p368m878M873L371K095o72q599j760
458e234J3223N329j1168p124K807P751Q678m175j6798k229J7129Q488q113j1311
472b747n521P807J6114o14j8136o451R416Q912K730o082j2976j9J3662M155p324
487B926m984k686P81R024L318r478n172L064K590M264J909r044o213Q268O825
502E392k511l964m740m70J0075M501j0716o307P042O271O41l845q576P79J3698
517G270L375j1920n977M711P363N785n021j3117M50J4731M545p892o904k248N482
532F33J1206j232j2945l180P540M669K074k864r477j400J0409L957m646l815l957
547c028k60R413M432r381o763L121M692M739k99j0918m438J0401O820n134o116
$$ y = [-7633, -791, 2677, 705, 975, -1616, -5242, 1806, 7704, 336, -4542, 331, 3702, 5797, 5125, -3474, -5234, 7989, 13318, 2150, -4974, -2167, 5584, 14262, 10087, -6711, -8940, 8189, 16677, 8564, -2747, -8268, -461, 15653, 15039, -3097, -9548, -132, 8780, 11510, 5428, -7548, -7567, 6095, 10250, 2926, -2058, -4744, -3963, 5061, 8379, -1099, -6271, -3207, -617, 3647, 5556, -3488, -9701, -1433, 5392, 2881, -1083, -5823, -6293, 3782, 8283, -2433, -8740, -1698, 4573, 5214, 1369, -7207, -6428, 7270, 10645, -1275, -7252, -2541, 4822, 10607, 5586, -7531, -7081, 7650, 12195, 4303, -2601, -4849, 633, 11839, 10607, -2338, -5518, 2022, 6691, 8765, 5901, -3576, -4976, 5433, 9390, 4744, 929, -3028, -3288, 6125, 10557, 1176, -5587, -2466, 2226, 6965, 6666, -4252, -8690, 1711, 8531, 3397, -2719]
562b719l354K436R685J807j2429m608Q762N864j487m920o408K027J1543J035j0793
577c559l902N218M907L104l198r533N89J0870K364n927l773j657K593Q679M05
592G180r675l075M934L619K965j000r027k489R274N004l503m974m099R86R952
607F072L580j0339o305M322N937L572k681r859k260J0919N491o806n896j063L418
622a898P747Jj1164k829Q367M132k312l673m770J608R176O97q970k478M109K710
638D53K782j794p750n95Q374K649m287k453k765J117P875J881q350l843L838L581
654G13L885j372r168k135R432N064m185n222l421K236R694J930j0661n143N876
669b477N587J780l114q431n99J0324L578p066m695O13K895N877o07q940k048P229
$$ y = [-2719, -6073, -3637, 6048, 7855, -4574, -9182, -420, 5444, 3957, -963, -7371, -5344, 6199, 7234, -3559, -7461, -2243, 2664, 5768, 2570, -6963, -6374, 4496, 6860, 933, -2840, -4497, -1904, 6775, 7180, -2495, -5570, -636, 2983, 5948, 4948, -4079, -6568, 2706, 7710, 4207, -767, -4866, -3880, 6072, 9652, -687, -6992, -2670, 3267, 6839, 4158, -5701, -7961, 2958, 8449, 1643, -4253, -5316, -1898, 5849, 5850, -5314, -8143, 224, 4356, 2044, -1629, -6399, -4791, 4385, 5082, -3888, -6366, -2257, 453, 3235, 1441, -6309, -6904, 1470, 4119, -168, -2621, -5386, -4269, 3606, 5487, -2863, -6706, -2868, 713, 4598, 3226, -5942, -8077, 1355, 6419, 2234, -2988, -6409, -4173, 5521, 7451, -3210, -8353, -2477, 3110, 4890, 1776, -6655, -7254, 3070, 6648, -418, -5113, -4500, -1605, 4272, 3665, -5275, -7323, -94]
685i4K877j906k432m232M86P390J477o923k407K355J944L227l58p381j822P505
701b94K866k828k847l688J214Q179J723q342l912L881M290K904j709q733j411
716h707R732M233n077m912k044L019Q434L71r811l458O121M692O22l044o501K77
732f053Q966K475o363l485P50K195N149m9p819j903N996K787j329j758m450o1
748d952P360K007o429k977J654K111L794l03p659j955P041L240l035l217l251
763f571J451P626J435q366l465M026L607K494k190p414o82Q615L350n317l931
778e332r87K701O751P9q377k440N720L704L14k225n760N5Q113K341n597l012O93
795c259J952N177qp318k098O002K977j032j830m429L62P318J746o127l057J739
$$ y = [-94, 2783, 877, -1555, -5787, -5301, 2089, 3566, -3357, -5764, -3409, -1465, 1762, 1404, -5977, -7799, -294, 2572, -256, -3103, -6791, -5577, 2602, 4325, -4017, -7929, -4048, 242, 3146, 1437, -7296, -8707, 1025, 5258, 181, -4731, -6775, -3756, 4678, 5049, -4762, -8220, -2099, 2593, 3215, 171, -6330, -6053, 2913, 5388, -975, -4460, -3710, -1515, 3634, 3585, -4234, -6137, -141, 2646, 1317, -441, -4891, -4952, 2408, 4415, -2014, -4991, -3337, -1226, 2568, 2265, -5394, -7349, -308, 2932, -103, -3320, -6571, -5120, 2506, 3941, -4425, -7890, -3864, -257, 2237, 47, -7367, -8049, 566, 3916, -1401, -5332, -6319, -3618, 3133, 3212, -5165, -7605, -1885, 1819, 2133, -92, -5852, -5797, 2316, 4657, -940, -3952, -3259, -1307, 3870, 3862, -3456, -5554, 448, 3425, 2393, 563, -3866, -3504, 3814, 5560, -567, -3624, -1885]
811a885K587L690p55p244j504O763K836k951l129k722J392P009N81p656k981M322
827a647K751J719k160o706n0P604K372m953l460m14J974N633J9p301k242M999
843a862L076R6k035n234J40P356K113m960k881M38K178M803P1p013j743N766L150
860C459j036k230l751L38P381J640o010k847K133K811L003n97o853j045O562K501
876E459k699k788k209J171O377L39o863k277L715K755J305j846o016l09O890J827
892D831m320k757j047K027N115q1p111j878M610K520J40j981n108J10O948J738
908C756n114k721O64K162M158k74o801j559N863K401j316k061l550Q45O438J427
924D318n790k421K332K364K941j052o186l48O015K324k778k202j871J271N986
$$ y = [-1885, 702, 4392, 3637, -3607, -5111, 1652, 4488, 1537, -1592, -4314, -2922, 4087, 4668, -2988, -5969, -1647, 1104, 2823, 663, -6043, -6093, 1511, 3883, -1070, -4530, -4944, -2970, 2663, 2682, -4619, -6861, -1862, 1214, 1310, -725, -5959, -5819, 1537, 3650, -1310, -4191, -3753, -1575, 3228, 3299, -3714, -5457, 309, 3459, 2423, 193, -3558, -3220, 4161, 5801, -209, -3056, -923, 1888, 4891, 4294, -2559, -3604, 2958, 5459, 2760, -28, -2237, -1066, 5311, 5650, -1213, -3490, 225, 2980, 4285, 2439, -3577, -3886, 3004, 4831, 511, -2246, -3293, -1266, 3849, 3768, -3343, -5221, -611, 1909, 2049, 68, -5040, -4930, 2018, 3756, -1358, -4079, -3415, -1253, 2905, 2631, -4170, -5729, 134, 2535, 1219, -842, -4392, -3547, 2891, 4318, -1472, -3893, -1561, 803, 3744, 2692, -3494, -3842, 2173, 4497, 1719, -483, -2354, -1083, 4903]
939D903L26o164j894L581K286J238j390n243k70O646J571l963k530n09J536M908
955E032n0o608j561M440K204l36j673m717L32O278J286m883k554P23J726L682
971C321m75o510j209N140K202j572k054l120P38N484R85n503j980K265J901K477
987B090j060n518o35N811K046k676k197j554J390N394L75o036j491L607K278J251
1003C075j563m799J70O334J437l793j997m40J920M177O5o085j223M592J968k84
1019C554j804l932M66O040Q09m479k346Q90J853L293p98n960p80M756J903j577
1035A888k076k989P99N416L17n205j859J901J783J829p21n322o04N385J562k760
1051f56j703j610J230M735J13n654j185L271J756Q02j279m356K34N724J256l630
$$ y = [4903, 5229, -935, -2829, 752, 3038, 4276, 2886, -2357, -2627, 4019, 5590, 1627, -903, -1412, 124, 5032, 4982, -1626, -3187, 1253, 3457, 3121, 1448, -3269, -2937, 3341, 4627, -256, -2810, -2087, -361, 3321, 2846, -3664, -4873, 267, 2469, 897, -1157, -4277, -3539, 1945, 2930, -2573, -4553, -2288, -387, 2090, 1030, -4488, -5123, 688, 2734, 58, -2139, -3693, -2303, 3091, 3466, -2570, -4061, -454, 1824, 3075, 1512, -3287, -3117, 3217, 4654, 861, -1136, -1576, 344, 4521, 4586, -1499, -2722, 1870, 3838, 3554, 1750, -2182, -1716, 4324, 5133, 654, -1692, -802, 1051, 4344, 3546, -2414, -3194, 1562, 3465, 1888, -188, -3177, -2378, 3038, 3355, -1850, -3709, -1808, -25, 1804, 1083, -4239, -4843, 542, 2104, -656, -2359, -3969, -2739, 1996, 2109, -3545, -4730, -1459, 297, 1099, -180, -4536, -4302, 1422, 2678, -952]
1067i52j703j41J585M087k56n642p14M242J983k61j787l415O68N832R32m578j474
1084a594J108J712K942n82n294n63M755J679j552j605k562O79N174K83m780j623
1100a823K207J470J854j204m875m18M997R22k440j998j426R88M360k76n191j144
1116c997K921J573N08j419m135L94M801J118l611j727j04J467L837n29n070j075
1132e048M487J576n10j284l098P88N096R36m124j284J110J956K704n14m821k05
1148b235M610J450j481j384k106Q55M546O30m655j261K000J489J664r72m507j80
1164a537M570J009k376j626j378R86M062r3n018j179L006J223L13j299l635RN000
1181B037O36l442j361j84J470L181o44m761m37L598J384n50j309k787N71M742
$$ y = [-952, -2655, -2796, -1211, 2876, 2620, -3022, -3736, 506, 2489, 2228, 441, -2974, -2306, 3526, 4458, -120, -1594, -486, 1226, 4168, 3586, -1708, -2271, 2484, 4163, 2611, 1006, -1556, -877, 4297, 4580, -200, -1823, 384, 1854, 3708, 2504, -2371, -2789, 2208, 3130, 690, -1308, -2734, -1746, 2614, 2338, -2853, -3997, -1076, 497, 1005, -414, -4549, -4155, 646, 1764, -1847, -3574, -3678, -2211, 1626, 1097, -3973, -5048, -561, 1015, 505, -779, -3877, -3089, 2007, 2943, -1181, -2465, -1355, 601, 3305, 2791, -2030, -2235, 2375, 3825, 2344, 960, -1146, -291, 4255, 4885, 230, -1031, 969, 2458, 4122, 3150, -1357, -1537, 3033, 4042, 1666, 40, -1338, -352, 3710, 3617, -1401, -2580, 426, 1649, 1962, 663, -2972, -2963, 2037, 2673, -769, -2130, -2314, -844, 2337, 1693, -3068, -3505, 93, 1477, 927, -382, -3169, -2598, 2144]
1197B144L36m020j009J190J618K364q06m342l85M429R25j492j142j930Q22M212
1213B914K77m232q73J713J282J784j044m079J68M645Q19k318j463p12J078L890
1229C849k15m682p55L083J352J22r49l359M76M456P56l405j123J24J099L177o98
1246C308m498k98L435J096q48j087k695N98M160R1l673j135R63J050K064q26m290
1263b585l59L934Q00j459j323j983R10L812k1m109r48K061J352J336j224l627
1279c433J06M367Q20k170j185m84J335L433j45m271l12K726J384K93r00k985P79
1296f42M339L55l082o77K51J164K589m51m378p8L194Q05o01j075k584N50L808
1313C487R8l458q70P65Q59J910p94m087k61L579M05j311j418j455O64L762j48
$$ y = [2144, 2480, -1540, -2549, -1359, 259, 2623, 1817, -2525, -2910, 1519, 2444, 952, -190, -2120, -1298, 2914, 3191, -1041, -1914, -201, 1081, 2865, 1821, -2258, -2090, 2555, 3374, 1056, -407, -1119, -41, 3849, 3634, -1048, -1803, 1280, 2632, 2754, 1805, -1554, -1078, 3378, 4134, 729, -394, -270, 829, 4006, 3308, -1190, -1488, 1947, 3043, 2195, 1108, -1587, -989, 3171, 3262, -411, -1546, -583, 467, 2531, 1705, -2585, -2944, 990, 1790, 331, -992, -2975, -2065, 1747, 1726, -2383, -3331, -1270, 82, 1418, 194, -3433, -3327, 1040, 1860, -310, -1495, -1979, -644, 2789, 2644, -1627, -1939, 787, 2171, 2464, 1564, -1421, -642, 3697, 4052, 970, 293, 544, 1708, 4297, 3846, -532, -610, 2584, 3389, 2788, 1713, -871, -321, 3487, 3585, 127, -743, 22, 881, 2791, 1997, -2090, -2351, 1228, 1633, 322, -1096, -2551, -1887, 1875, 1727]
1330A727m078o19J776J004J135j012l237K46M166N26k430q50m50R51L217m56l912
1347b296j28K747J139J18r64k709P38L756K06k719o99O01N84K600o51l755k2K921
1365A467P34n67p05k506O93L667K01l366p56R30J067J804p77l898J29L470O21
1382B208j428j154j301Q43L380l08l681m64J824Q21Q42q80l122M93L551J95k094
1399b75r89l46R36K605l33l741k70K401O10K51r10k552L44L570J51k814m43R2
1417a713Q24K454o22l612k17L193P56n53j023j910N88L608K23l104q91J313J083
1434C97J609r69l166K20L458N95j549r32r85P60L120l18l113m37J635J103L87
1451A815p33k673K59L330N7k234m26o32J095K167l87l300j81K136L50J18q48k396
$$ y = [1727, -2351, -2970, -1194, -190, 945, -67, -3304, -3058, 1108, 1634, -796, -1646, -2096, -1145, 2072, 1616, -2296, -2424, 323, 1462, 1580, 616, -2093, -1355, 2401, 2607, -112, -811, -210, 374, 2974, 2323, -1432, -1454, 1467, 2201, 1634, 929, -1577, -884, 2783, 2984, -382, -1138, -208, 859, 2663, 1886, -2012, -1883, 1587, 2208, 780, -374, -1675, -832, 2548, 2240, -1441, -1905, -81, 740, 1582, 702, -2420, -1927, 1624, 1819, -275, -1264, -1610, -674, 1931, 1598, -2143, -2413, -12, 598, 849, -61, -2613, -2269, 1301, 1452, -1362, -1805, -1713, -889, 1565, 943, -2669, -2886, 307, 1063, 510, -513, -2423, -1835, 1773, 1996, -1108, -1999, -686, 397, 2006, 1037, -2129, -1909, 1549, 2144, 595, -337, -1322, -562, 2558, 2240, -873, -1310, 325, 1428, 1815, 1082, -1591, -1332, 1998, 2055, -179, -605, -1237, -142, 2025, 1638, -1662, -1843, 293, 643, 761, -87, -2483]
1469b483M40L241J68k452p97J53R91J911o77l189m7K607N38n45r80j534P50L129
1487A224j03k963n02J264P74J322n82k960M75L090K55j427o23q62Q62K824k31
1504A837l229j41J729P45O17o13k509L06L128J09j904o83l21P40K601o12l210
1521a410k47K262P82l29q99k199R66K746J17k478n28M16N86J844o90l044j42K903
1539F56J91o74q37j605Q60K668L9k810l58J017O56J030n87k641J60K831K97j394
1557e01n47q75O53K726k83k918j56J735N37O60p80k349M14K925P3j735l12m16
1575a149Q92K439n83l070P4K047P01j58p75j798N05K973j04k311m35N18P35J552
1593B053n78l127M23K390K40q15o00j378N92K662n15k512k67J084Q38P84o90k666
$$ y = [-2483, -2043, 1198, 1366, -1086, -1883, -1730, -739, 1172, 495, -2694, -2741, -134, 404, -141, -1121, -2655, -1905, 1224, 1121, -1842, -2344, -1080, -306, 1016, 434, -2526, -2051, 1039, 1294, -133, -756, -1618, -756, 2068, 1837, -1392, -1533, 196, 941, 1558, 945, -1564, -1258, 1870, 1979, 75, -608, -929, -189, 2412, 1800, -1410, -1657, 605, 1387, 1058, 159, -2040, -1074, 1672, 1789, -689, -1217, -801, -215, 1629, 939, -2105, -2247, 656, 847, 173, -664, -2269, -1409, 1259, 1298, -1512, -1870, -853, -197, 833, 246, -2395, -2235, 596, 893, -501, -1048, -1923, -1270, 1456, 1173, -1745, -1901, -166, 371, 1031, 251, -2098, -1684, 1241, 1314, -421, -733, -1149, -257, 2182, 1599, -1471, -1397, 650, 1351, 1193, 418, -1380, -875, 2098, 1994, -317, -752, -234, 501, 2053, 1475, -1652, -1229, 1161, 1401, 586, -14, -1392, -800, 1862, 1347, -1165, -1432, -348, 490, 1274, 584, -2082]
1611b082M32K585J02j246n14r80O63K376l79k697Q8J384N40M19n99k017L70K665
1629A110J13j841k28p05R56K218o00k744K7K228L64j97m90j581O27K566j18k295
1647e90j01N86N58J226o67k477M38K333K45q46o04j114O15K390l01k583L6R67
1665A11M21J071j043k041J08K329L60j228n84m75M44K139m05k658M4J389M02M54
1683H38p13k167P48K511l2k014j58k90P93J868p49k446K83J913K50j25p19j532
1701a741P32K272l14j785k51M00P95J081m05k449L55K131L14r44l44j214P68K381
1719A782p85j799k76R92N99Q14n96k070M71K138j08j037n74m32N63K110o25k156
1737i89j77J321N94L07n80k005O16K306k20j501n62k13R21J609p65k255J98J921
$$ y = [-2082, -1650, 935, 1037, -209, -723, -1703, -1040, 1336, 957, -1740, -1652, -268, 272, 691, 92, -1925, -1555, 1110, 1223, -618, -846, -1551, -595, 1623, 1023, -1721, -1694, 534, 898, 701, 211, -1370, -743, 1823, 1705, -590, -691, -105, 453, 1679, 1012, -1465, -1027, 1306, 1551, 705, 101, -1013, -398, 1992, 1691, -892, -856, 111, 532, 1603, 560, -1481, -1373, 956, 1316, 88, -496, -971, -527, 1612, 1207, -1451, -1407, -18, 384, 838, 125, -2042, -1294, 1217, 1185, -829, -987, -1277, -484, 1384, 635, -1811, -1528, 385, 635, 510, -209, -1741, -1009, 1263, 949, -836, -1087, -687, 108, 1189, 784, -1665, -1310, 821, 1135, 191, -153, -1367, -599, 1782, 997, -802, -1078, -86, 513, 1327, 731, -1339, -868, 1270, 1162, 125, -449, -881, -318, 1792, 1167, -989, -1166, 155, 749, 1056, 476, -1529, -913, 1393, 1173, -328, -890, -1103, -182, 1427, 662, -1593, -1395, 526]
1755E26k1j27n11j473M77K463l05k023k06O26L95J125m97k281M49K079Qq42l30
1774d68r47N91K096m18k080p6J025N78O93n06k041O31K138k30j042o00k21N86
1792b91J804m51k053J41J434M2L58o77j542M72K276l24j441l58R8N86J510o35
1810I49k244L98J445L25k76r54j022O37J979k22j916k14P04L64J098o87j917M62
1828a091J363J69p55k56q68O39J927n27k083J48R73L44O63l59j922M81J873m7
1846F72p56k99m34N30J616m33j819q5J240M46K74p92j278L70K024j15j458k14
1864e11q3Q03J273p64j801K65J352K38k00o25r22M06J963l00j714j18L16P88P45
1883A111o38j901M67J504L72r63k96o91N60J704n46j814M64N29K56P37o95j472
$$ y = [526, 505, 378, -133, -1606, -1129, 1334, 1029, -994, -1200, -574, -179, 946, 449, -1832, -1383, 696, 704, -138, -468, -1415, -824, 1272, 854, -1226, -1302, -277, 301, 994, 488, -1553, -922, 1216, 986, -56, -656, -877, -291, 1513, 1062, -991, -850, 584, 626, 984, 307, -1235, -763, 1513, 1189, -252, -610, -512, 74, 1584, 949, -1295, -897, 548, 873, 597, -357, -1379, -742, 1237, 1015, -901, -1115, -411, -47, 1051, 364, -1553, -1091, 272, 441, -314, -570, -1438, -799, 1128, 601, -1482, -1334, -361, -17, 646, 287, -1635, -1154, 719, 672, -84, -383, -817, -287, 1329, 896, -923, -1008, 232, 678, 952, 160, -1118, -748, 1276, 1161, -297, -511, -594, 209, 1482, 718, -1083, -818, 534, 772, 572, -53, -975, -569, 1394, 1094, -620, -738, -422, 366, 1111, 473, -1428, -961, 543, 915, -48, -344, -1035, -475, 1229, 683, -1131, -667, -138, 118, 855, 160, -1312]
1901a312M60J788j90r80j61m54N41J628n43j868L82R06L51K07p56j256N59J795
1919A097l03j157j43O2M26J180o34j802M49J277K23j72m89q55J46K115m34j550
1937e64j96N26M15Q26m50j758M07J750p8n68m63m86N17J542m53j778K58O41L34
1956D22N25o02j351N13J455k81p22m68l18O60J392o45j523J97J000K51P8m03j529
1975a349M62J982m21j190j73J42M03J119o65j532J47J518K62l97n26j026O84J684
1993A124j78j540l7M45L72P06l68j465M45J259K32p54m65l64O22J299l65j703
2011g35K91Q75j3M84n56j272O10J329k26p35k09k48L98J345m61j611M4J133J33
2030E76j33l61j242P74J365k50j221m8j50O88R44o97j344L57J165L9l32k53r31
$$ y = [-1312, -852, 936, 746, -234, -395, -849, -308, 1320, 777, -1091, -709, 197, 548, 755, -1, -1257, -698, 1097, 794, -363, -506, -444, -18, 1162, 528, -1274, -825, 452, 675, 503, 14, -841, -695, 1420, 986, -564, -760, -234, 181, 1007, 557, -1201, -794, 956, 878, 310, -153, -639, -122, 1420, 967, -811, -553, 88, 422, 947, 345, -1006, -493, 962, 681, -41, -509, -827, -167, 1225, 580, -943, -746, 254, 505, 583, 180, -1349, -887, 1095, 674, -516, -689, -547, -144, 975, 310, -1222, -1075, 443, 705, 308, -218, -1244, -560, 1124, 946, -594, -631, -186, 186, 892, 524, -941, -496, 763, 995, 241, -224, -588, 34, 1333, 968, -735, -444, 431, 418, 902, 346, -926, -316, 1013, 787, 52, -157, -405, -7, 1338, 877, -734, -690, 443, 576, 443, 82, -1160, -386, 979, 729, -492, -540, -690, -2, 942, 245, -1099, -742, 423, 462, 130, -123, -1054]
2049a054P61J363l99j325O9K89M78O50o68j150L28J418j29o15k91l04L34J363
2067A118n41j099rO84N38J58m49j147L25J527k83o76l80j62M27J195n22j565K78
2086e83J043R3P4o34j001M21J808o09j177R6K7M01J022o99j273K25J359o5l97
2105A31l88o68P05J311n91j180J02L61N73L22n43j179K78J420j17n12q9o96M30
2124c30J220m44r34j60O41K15M38k98j248M57J352j96r31j14j17N01R62n08j346
2143h40K06J040K3K1n90q39N47J464k01j126k43N08J30P60n75j249O12Q61q9m21
2163al44k85M47J211m90j201L35M13N0N93m09j122M22J048qn26l32n64N01J328
2183A066m28j421J41Q18M0K29m26j213P36J355o87o85J88l61N31R60p07j083N57
$$ y = [-1054, -293, 1070, 671, -654, -585, -296, 182, 832, 164, -986, -658, 760, 631, 16, -275, -579, -245, 1118, 577, -522, -531, 153, 691, 849, 400, -747, -422, 1105, 822, 146, -234, -396, 31, 1226, 704, -861, -583, 460, 553, 627, -7, -1008, -587, 1221, 612, -565, -469, -442, -41, 981, 282, -991, -766, 593, 528, 131, -257, -925, -220, 1091, 500, -680, -578, -217, 356, 678, 135, -1044, -766, 654, 537, 25, -64, -760, -330, 890, 446, -488, -648, -7, 208, 646, 348, -900, -443, 909, 713, -218, -332, -449, 52, 1014, 506, -840, -634, 406, 429, 450, -140, -979, -432, 1032, 831, -295, -538, -30, 100, 860, 285, -964, -352, 509, 420, -1, -345, -630, -183, 1028, 538, -663, -328, 85, 135, 728, 319, -803, -381, 667, 659, 133, -199, -763, -262, 1066, 638, -783, -642, 176, 216, 445, 19, -1194, -458, 897, 210, -475, -287, -648, -117, 843, 136, -947, -390]
2202c90O23J44po47n67N74J170l81r48l8M51J31N76l76j116N70Q30k85q7j22p71
2223f66P55P72k75j154J98K08L12O60n37j044M13J035k82l56j79n51N83J084l70
2242F06j389L03N96J63L48n47j152N14J405k44q83j78k5P29M82o10j194O75O96
2261B95K30m67k12n52O18P45l05q96K62J92K10M15k00r02J71Q83j60o4k46o52
2281f35K73J259m27r51J44L52J24O05n67r76M03R99k21l76l22k17N23R43n57j142
2301g66J21Q56K75p0m17q35P01J059o61q51K06J77K90L55l53j049N98O72J9q1
2321B46l40o32N47P40m14m58N0j6K20P43m87r81K06R11J1N0n29n94N89J080l70
2342E72j182K83K51K37N82o65p60M45R85k52o08j75l03P73O83n35j072O25M42
$$ y = [-390, 233, 377, 370, -277, -844, -270, 900, 519, -429, -467, -16, 115, 691, 315, -801, -231, 599, 314, 227, 105, -666, 89, 861, 586, -568, -370, -162, 150, 810, 273, -771, -358, 677, 395, 39, -140, -691, -108, 976, 606, -783, -480, 116, 279, 627, 80, -1072, -558, 847, 603, -280, -458, -483, 246, 728, 118, -1076, -401, 295, 525, 58, -154, -706, -88, 657, 352, -544, -282, -90, 120, 535, 335, -567, -396, 487, 327, 263, 17, -635, -362, 897, 470, -481, -337, 15, 139, 744, 177, -799, -396, 603, 382, 6, -316, -533, -10, 933, 376, -766, -645, 211, 486, 416, -1, -836, -135, 924, 263, -588, -382, -205, 85, 440, 87, -962, -364, 308, 327, 246, -94, -726, -179, 561, 147, -311, -261, -277, -57, 686, 199, -782, -576, 335, 346, 396, -133, -727, -138, 942, 572, -610, -327, -76, 161, 743, 78, -682, -237, 748, 496, -112, -287, -590, 183, 866, 331, -741, -116, 326]
2361C26qJ05o14n04O72O13l27n34Q7J79k01P58j98r54L81M86r4j46o4n69K02J097
2383F93n39p37L37N3K17M55l60j040J69J112r9l51m43k66O28R87m86j315L52P05
2403G2J14L78o20o88O16R00n99m03K6m3M82L39k69p23L47O14j12j60k67m29L03
2424a22P25l35m55Q6o5n3P48k34o00J6O98j25L5l84o13L62J195n25o79p3P3L62
2446C7O43o99q26M58J089k19n45j65k09M89P56m90q25L13N34o6k4m18m52M00P06
2467D87l30n42J65r6L43O21m66o91M53J15m8L16j38q01K77O40m1l26n7k45L45
2488a9Q69p13j009O45N03n5K01l86o95O20Q32m24p84J4N05J85L48o23p74O34R22
2509G96n21m47R4l04O65L74o90n85N38K87j07J06m21k61M55L29j71j63ol99K10
$$ y = [326, 318, 423, -191, -695, -23, 590, 263, -271, -184, -5, -206, 552, 354, -600, -219, 267, 173, 27, -37, -606, -404, 693, 154, -583, -246, -193, 24, 479, 119, -921, -752, 360, 261, -90, -533, -799, -171, 816, 330, -985, -633, 72, 186, 564, -56, -744, -128, 772, 173, -230, -204, -247, 235, 574, 305, -418, -71, 543, 431, 271, 4, -425, -122, 603, 268, -187, -101, -166, -219, 529, 295, -305, -289, 409, 284, 319, -65, -678, -316, 879, 354, -325, -398, -325, 37, 680, -19, -845, -387, 702, 483, -62, -227, -436, 53, 809, 319, -506, -193, 341, 275, 251, -167, -619, -219, 487, 157, -385, -220, -316, 27, 648, 182, -509, -56, 59, 11, 327, 189, -612, -335, 305, 264, -62, -119, -364, -19, 850, 137, -872, -227, 276, 221, 422, 36, -659, -39, 793, 369, -415, -401, 104, 289, 637, 14, -760, -126, 796, 275, -172, -78, -382, 283, 657, -33, -618, -80, 207, 100, 206, -215, -476, -21, 308, 137, -26, -32, -431, -221]
2530b21P99m84n35K17K84k8J08j21p96M26Q24l2p55L5p0L15Q68q22q54N04P83
2551D45Ql51k92l88Q23N35p36o01L30K20L38k0l13o34O51L73j87m05L3r2M10M04
2573E51k96m54J46K84M2r6K15p87RO05k10k9k24j42J51P48k13p59L9L13L05J91
2595C89m35n53L09Q12k05p16o2%O95M03p63o22M97O59l49O2l35j51M36O07n92
2616H6o29M89L67k24N0j74m11L87N11n45J01r1n8O4O23l02n49J55J66J98q0J7
2638A51r29P37M10l4l84j8l95M81P86m42r18K40O06N0p4m61l70M97P65m74p42
2659e18K84L04j11M25n85m32N28N11k72l74J12j60L92J44k35n30N14Q0j4K79p9
2680B63o83M26M43n67R7K57o92L27O60k00o09K19n6J48L82l15p83K90J057j50
$$ y = [-221, 578, 94, -441, -224, 60, 32, 140, 19, -777, -351, 473, 441, -314, -279, -349, -34, 834, 12, -842, -338, 445, 453, 102, -190, -578, 245, 780, 44, -557, -227, -7, 331, 311, -2, -636, 15, 388, 201, -204, -171, -263, 147, 551, 255, -199, -53, 231, 273, 177, 392, -395, -386, 219, 9, -20, -244, -386, -235, 513, 300, -459, -420, -107, 198, 389, -46, -599, -290, 522, 317, -399, -461, -461, 234, 637, -126, -748, -251, 408, 59, 121, -214, -365, 71, 678, 86, -543, -54, 313, 89, 139, -35, -446, -59, 452, -93, 8, -83, -141, -77, 546, 244, -305, -150, 16, 214, 134, 151, -778, -41, 369, 335, -49, -67, -462, 19, 805, 363, -555, -315, 291, 341, 267, -194, -564, -67, 698, 224, -518, -234, 70, -41, 384, -201, -633, -105, 406, 134, -240, -128, -288, 104, 248, 13, -517, -3, 77, 63, 342, 263, -420, 6, 449, -118, -21, 236, -456, -129, 531, 331, -278, -59, -115, 33, 415, 100, -683, -393, 664, 514]
2700E14n35j75q6M92N26p36n99L94N49l44P5j45n85P05N73n22n04K83J67J53k3
2721A77j71k77N30r8k95L84j05n05K77N16l12m06K65L2N4K41j45m85K54K85J9
2742B35r2j43m23M36Q12o49n35J17K27L23j7l24o46O72N15m20l19L0l7L75J87
2763C24m64o33O22L72j93rk3j91K33M36n30k63K09j26K04M78m84j75K67J11l24
2784a59L62R2o28L14M54o8o07J02J28J67L65k45o46J20P78k50j35m05r2L56M92
2805D95n29n25K83M69J73j94l23o13R39L05l55o53N18j91M01K17n65k23L81L92
2825D02k66N3k44k56J90M41n02J08Rj6J51M16k44p21M18K92q1Q6j25n08L72O83
2847F58m65m13J41O2J73M70o88n77M01O54p8l71k02J4K76N97p19l20M62J5J02
$$ y = [514, -21, -196, -282, 210, 736, 0, -599, -205, 344, 0, 75, -70, -655, 50, 623, 101, -403, -120, 47, 200, 177, 6, -271, 259, 161, -134, 250, 145, -360, -83, 433, 121, -285, -20, 12, 66, 307, 162, -323, -69, 216, 235, 143, 0, -423, 13, 825, 176, -359, -242, -15, 308, 291, -33, -679, -7, 508, 88, -231, -201, -238, 137, 324, -140, -773, -151, 221, 28, 19, -4, -195, 38, 474, -56, -319, -110, -236, -32, 446, -38, -213, 54, 165, -159, 203, 295, -333, -19, 435, 367, -240, -138, -10, 157, 522, 277, -369, -249, 529, 279, 144, -261, -353, 3, 495, -34, -559, -276, 193, 366, 172, -151, -764, 175, 480, 125, -528, -10, -201, 200, 417, -148, -371, 10, 402, 136, 189, -55, -311, -121, 320, -182, -74, -65, -81, 70, 486, 242, -479, -61, 231, 150, 236, 111, -397, -25, 658, 193, -220, -79, -17, 156, 626, -62, -639, -238, 416, 338, -33, -235, -221, 55, 652, -67, -387, 75, 90, 192]
2868A92j21k62k10N67L23n04l73M18j31K20K07l11m74M01J56k16P0Q8j39J71K06
2889B78m9n60K89k12L04L86l60m85J43N64p6j4l14l15M87N71p36j09M6J88J12
2910A38J18l76m94O72M63m07k69K9l9L12L53o70j42K96L85k87K3q3k83J49L31
2931B19r6l17J23j18J68K56r0n76L67R7K32J5l84k10J58M55k51k24J64j26K19
2952H1M87m67o30M62M61k74r8m43K89K58M16m96l49K07J03j14L42k16m55N13K29
2973C06l88l13K58j17L53K04l79l18M07J57k05P3k1l11K27L11k58o3j32J0K45
2994D6L98l97o59N99K43K11m24m7l25N56L12l40l74P9K33K78K3l75m51L82M72
3015D40k63j35j69j55M17L88n64k34L84M7n0k0k83r9L67K05m14kP9l0J25M40m70
$$ y = [192, 71, -191, -401, 166, 489, -15, -388, 30, -101, 119, 326, 15, -459, -58, 98, -118, -48, 40, -99, 72, 278, 229, -331, -42, -254, 50, 436, 76, -409, -266, 298, 222, 208, -106, -421, 66, 637, -99, -208, -162, 26, 138, 256, -120, -614, 58, 521, 114, -155, -126, -165, 147, 500, -170, -312, -16, 369, 82, 105, 22, -261, -112, 219, 123, -194, -71, -189, -21, 235, 145, -431, -64, 33, 265, 280, -104, -314, -156, 299, 48, -176, -12, -138, 81, 568, 101, -529, -67, 394, 120, 22, -421, -132, 126, 542, 46, -303, -96, 7, -107, 235, 19, -436, 77, 306, -82, -395, -137, -254, 99, 303, -76, -394, 13, 170, -35, 38, 17, -294, -67, 244, -14, -77, -209, -199, 46, 444, 47, -612, -13, 230, 441, 17, -30, -355, 201, 513, 173, -201, -122, 111, 389, 412, 37, -414, -32, 440, 177, 42, -127, -282, 135, 523, -41, -275, 109, 156, 106, 86, -197, -296, 71, 276, -138, -140, -61, -91, 34, 474, 4]
3038Dk75K80K28j46R3m0m36L45M02k72m40K26k50M31M12o11j95K40K31j6j09l12
3060b10p5L13N36m71k79k7J53J21L50l25l43N01J23l38j19o2%J79L34m27l62L86
$$ y = [4, -271, 9, 237, 91, 184, 144, -292, 53, 455, 183, -257, -31, -281, 150, 562, -49, -244, -4, 227, 211, 102, -210, -285, 28, 564, 93, -186, -213, -60, 61, 411, 86, -257, 244, 367, 29, -90, -152, -152, 27, 361, -66, -428, -42]
$$ [...]
8191B4
##END NTUPLES=NMR FID
##END=
