##TITLE=1H_CA-8620-1
 CDCl3, 8 sc, 
 3.7.2019
##JCAMPDX= 6.0         $$ Bruker NMR JCAMP-DX V2.0
##DATA TYPE= NMR FID
##DATA CLASS= NTUPLES
##ORIGIN= UXNMR, Bruker Analytische Messtechnik GmbH
##OWNER= root
$$ XWIN-NMR		Version 3.5
$$ Wed Jul  3 14:34:20 2019 Russian Standard Time (UT+4h)  she@DPX200
##.OBSERVE FREQUENCY= 200.13155
##.OBSERVE NUCLEUS= ^1H
##.DELAY= (6, 6)
##.ACQUISITION MODE= SIMULTANEOUS
##.ACQUISITION SCHEME= undefined
##.AVERAGES= 8
##.DIGITISER RES= 18
##SPECTROMETER/DATA SYSTEM= spect
##.PULSE SEQUENCE= zg30
##.SOLVENT NAME= THF
##.SHIFT REFERENCE= (INTERNAL, THF, 0, 15.7039)
##AUDIT TRAIL= $$ (NUMBER, WHEN, WHO, WHERE, WHAT)
$$ ##TITLE= Audit trail, XWIN-NMR		Version 3.5
$$ ##JCAMPDX= 5.01
$$ ##ORIGIN= Bruker BioSpin GmbH
$$ ##OWNER= she
$$ F:/spectra/data/she/nmr/H-F/1/audita.txt
$$ ##AUDIT TRAIL=  $$ (NUMBER, WHEN, WHO, WHERE, WHAT)
(   1,<2019-07-03 14:33:10.09 +0400>,<she>,<DPX200>,
      <created by zg, POWCHK disabled, PULCHK disabled
       configuration hash MD5:
       00 E9 B6 7A A2 85 ED C7 34 08 36 98 17 FE 4E 26
       data hash MD5: 16K
       45 9F F9 5E 00 4E 91 00 F4 3D F4 18 8F 71 F0 C7>)
$$ ##END=
$$ 
$$ hash MD5
$$ 9E AF CC DC 10 C6 05 8D 2C DB 05 11 A1 EF 2C 1E
##$RELAX= 
##$RELAX= 
##$RELAX= 
##$RELAX= 
##$RELAX= 
##$RELAX= 
$$ Bruker specific parameters
$$ --------------------------
##$DU= <F:/spectra>
##$EXPNO= 1
##$NAME= <H-F>
##$PROCNO= 1
##$TYPE= <nmr>
##$USER= <she>
##$AMP= (0..31)
100 100 100 100 100 100 100 100 100 100 100 100 100 100 100 100 100 100 
100 100 100 100 100 100 100 100 100 100 100 100 100 100 
##$AQSEQ= 0
##$AQ_mod= 1
##$AUNM= <au_zg>
##$AUTOPOS= <>
##$BF1= 200.13
##$BF2= 200.13
##$BF3= 200.13
##$BF4= 200.13
##$BF5= 200.13
##$BF6= 200.13
##$BF7= 200.13
##$BF8= 200.13
##$BYTORDA= 1
##$CFDGTYP= 0
##$CFRGTYP= 5
##$CHEMSTR= <none>
##$CNST= (0..31)
1 1 145 1 1 1 1 1 1 1 1 1 1 1 1 1 1 1 1 1 1 1 1 1 1 1 1 1 1 1 1 1 
##$CPDPRG= <>
##$CPDPRG1= <>
##$CPDPRG2= <>
##$CPDPRG3= <>
##$CPDPRG4= <mlev>
##$CPDPRG5= <mlev>
##$CPDPRG6= <mlev>
##$CPDPRG7= <mlev>
##$CPDPRG8= <mlev>
##$CPDPRGB= <>
##$CPDPRGT= <>
##$D= (0..31)
0 1.2 0 0 0 0 0 0 0 0 0 0.03 0 0 0 0 0 0 0 0 0 0 0 0 0 0 0 0 0 0 0 0 
##$DATE= 1562149989
##$DBL= (0..7)
120 120 120 120 120 120 120 120 
##$DBP= (0..7)
150 150 150 150 150 150 150 150 
##$DBP07= 0
##$DBPNAM0= <>
##$DBPNAM1= <>
##$DBPNAM2= <>
##$DBPNAM3= <>
##$DBPNAM4= <>
##$DBPNAM5= <>
##$DBPNAM6= <>
##$DBPNAM7= <>
##$DBPOAL= (0..7)
0.5 0.5 0.5 0.5 0.5 0.5 0.5 0.5 
##$DBPOFFS= (0..7)
0 0 0 0 0 0 0 0 
##$DE= 6
##$DECBNUC= <off>
##$DECIM= 24
##$DECNUC= <off>
##$DECSTAT= 4
##$DIGMOD= 1
##$DIGTYP= 9
##$DL= (0..7)
0 120 120 120 120 120 120 120 
##$DP= (0..7)
150 150 150 150 150 150 150 150 
##$DP07= 0
##$DPNAME0= <>
##$DPNAME1= <>
##$DPNAME2= <>
##$DPNAME3= <>
##$DPNAME4= <>
##$DPNAME5= <>
##$DPNAME6= <>
##$DPNAME7= <>
##$DPOAL= (0..7)
0.5 0.5 0.5 0.5 0.5 0.5 0.5 0.5 
##$DPOFFS= (0..7)
0 0 0 0 0 0 0 0 
##$DQDMODE= 0
##$DR= 18
##$DS= 0
##$DSLIST= <SSSSSSSSSSSSSSS>
##$DSPFIRM= 0
$$ [...]
##$SUBNAM2= <"">
##$SUBNAM3= <"">
##$SUBNAM4= <"">
##$SUBNAM5= <"">
##$SUBNAM6= <"">
##$SUBNAM7= <"">
##$SUBNAM8= <"">
##$SUBNAM9= <"">
##$SW= 24.9336996594482
##$SWIBOX= (0..15)
0 0 2 0 0 0 0 0 0 0 0 0 0 0 0 0 
##$SW_h= 4990.01996007984
##$TD= 16384
##$TD0= 1
##$TE= 0
##$TE2= 300
##$TE3= 300
##$TEG= 300
##$TL= (0..7)
0 120 120 120 120 120 120 120 
##$TP= (0..7)
150 150 150 150 150 150 150 150 
##$TP07= 0
##$TPNAME0= <>
##$TPNAME1= <>
##$TPNAME2= <>
##$TPNAME3= <>
##$TPNAME4= <>
##$TPNAME5= <>
##$TPNAME6= <>
##$TPNAME7= <>
##$TPOAL= (0..7)
0.5 0.5 0.5 0.5 0.5 0.5 0.5 0.5 
##$TPOFFS= (0..7)
0 0 0 0 0 0 0 0 
##$TUNHIN= 0
##$TUNHOUT= 0
##$TUNXOUT= 0
##$USERA1= <user>
##$USERA2= <user>
##$USERA3= <user>
##$USERA4= <user>
##$USERA5= <user>
##$V9= 5
##$VALIST= <valist>
##$VCLIST= <CCCCCCCCCCCCCCC>
##$VD= 0
##$VDLIST= <DDDDDDDDDDDDDDD>
##$VPLIST= <PPPPPPPPPPPPPPP>
##$VTLIST= <TTTTTTTTTTTTTTT>
##$WBST= 1024
##$WBSW= 4
##$XGAIN= (0..3)
0 0 0 0 
##$XL= 0
##$YL= 0
##$YMAX_a= 788360
##$YMIN_a= -969024
##$ZGOPTNS= <>
##$ZL1= 120
##$ZL2= 120
##$ZL3= 120
##$ZL4= 120
##$ABSF1= 10
##$ABSF2= 0
##$ABSG= 5
##$ABSL= 3
##$ALPHA= 0
##$AQORDER= 0
##$ASSFAC= 0
##$ASSFACI= 0
##$ASSFACX= 0
##$ASSWID= 0
##$AUNMP= <proc_1d>
##$AZFE= 0.1
##$AZFW= 0.1
##$BCFW= 1
##$BC_mod= 2
##$BYTORDP= 1
##$COROFFS= 0
##$CY= 11.3945322036743
##$DATMOD= 1
##$DC= 2
##$DFILT= <>
##$DTYPP= 0
##$F1P= 18.9103706918063
##$F2P= -1.10871071338519
##$FCOR= 0.5
##$FTSIZE= 0
##$FT_mod= 4
##$GAMMA= 1
##$GB= 0.15
##$INTBC= 1
##$INTSCL= 1
##$ISEN= 128
##$LB= 0.24
##$LEV0= 0
##$LPBIN= 0
##$MAXI= 10000
##$MC2= 0
##$MEAN= 0
##$ME_mod= 0
##$MI= 1.114404
##$NCOEF= 0
##$NC_proc= 0
##$NLEV= 6
##$NOISF1= 3.799351
##$NOISF2= 2.8
##$NSP= 1
##$NTH_PI= 0
##$NZP= 0
##$OFFSET= 15.70392
##$PC= 1
##$PHC0= -8501.635
##$PHC1= 14.20097
##$PH_mod= 1
##$PKNL= yes
##$PPARMOD= 0
##$PSCAL= 0
##$PSIGN= 0
##$REVERSE= no
##$SF= 200.130013532006
##$SI= 16384
##$SIGF1= 3
##$SIGF2= 2
##$SINO= 400
##$SIOLD= 16384
##$SREGLST= <1H.CDCl3>
##$SSB= 0
##$STSI= 0
##$STSR= 0
##$SW_p= 3612.71676300578
##$SYMM= 0
##$S_DEV= 0
##$TDeff= 0
##$TDoff= 0
##$TI= <>
##$TILT= no
##$TM1= 0
##$TM2= 0
##$TOPLEV= 0
##$USERP1= <user>
##$USERP2= <user>
##$USERP3= <user>
##$USERP4= <user>
##$USERP5= <user>
##$WDW= 1
##$XDIM= 8192
##$YMAX_p= 0
##$YMIN_p= 0
$$ End of Bruker specific parameters
$$ ---------------------------------
##NTUPLES= NMR FID
##VAR_NAME=  TIME,          FID/REAL,        FID/IMAG
##SYMBOL=    X,             R,               I
##VAR_TYPE=  INDEPENDENT,   DEPENDENT,       DEPENDENT
##VAR_FORM=  AFFN,          ASDF,            ASDF
##VAR_DIM=   8192,          8192,            8192
##UNITS=     SECONDS,       ARBITRARY UNITS, ARBITRARY UNITS
##FACTOR=    0.0002004,     1,               1
##FIRST=     0,             0,               0
##LAST=      1.6414764,     0,               0
##MIN=       0,             -969024,         0
##MAX=       1.6414764,     788360,          0
$$ Real data points
##PAGE= N=1
##DATA TABLE= (X++(R..R)), XYDATA
$$ [...]
3268A1307J683j6420j1147P437J5110M725j2365j4230L830J6749O513j1850j3481
$$ 11307 12990 -3430 -14577 -7140 7970 12695 330 -13900 -10070 6679 13192 1342 -12139
3281a2139O06J4219J0881q581j6537j325J4604J0876n809j4737n721J1984J4748
$$ -12139 -11533 2686 13567 4986 -11551 -12876 1728 12604 6795 -7942 -13663 -1679 13069
3294A3069l432j6034o138R923J3294P62j4174j0732Q195J5478J407j2281j0509
$$ 13069 9637 -6397 -12535 -2612 10682 11444 -2730 -13462 -5267 10211 11618 -663 -11172
3307a1172L699J4202O990j1467j3845K807J3593P265p213j3647k699J3124J0761
$$ -11172 -7473 6729 13719 2252 -11593 -8786 4807 12072 4859 -8788 -11487 1637 12398
3320A2398o865j3596l462R859J1171j097j3344p498Q729J1902j70j0291q881M001
$$ 12398 5533 -8063 -11525 -1666 9505 8408 -4936 -12434 -3705 8197 8027 -2264 -11145 -7144
3334g144J2656M658j0049j0192K497J0815N891n622j1456j486J0930P973m489
$$ -7144 5512 10170 121 -10071 -7574 3241 9132 3510 -7946 -9432 1498 9471 4982
3347D982r346l965O649R484n47j0333n246O006Q237K061p162p614J645R659L948
$$ 4982 -4364 -8329 -1680 7804 7257 -3076 -8322 -2316 5921 7982 820 -6794 -5149 4510 8458
3362H458o734p173M10O557N911k588r319j952O645N632j629o020m336L376Q018
$$ 8458 1724 -5449 -5039 1518 7429 4841 -4478 -6430 215 5847 4218 -1802 -6138 -2762 5256
3377E256N06o766m806K156N632L111l657o984L54P224L173l410n192k215M238
$$ 5256 5762 -1004 -5810 -3654 1978 5089 1432 -5552 -5198 2026 5199 1789 -3403 -5618 -1380
3392a380O049j210o475k238L914M757Q21m823n496K799O437R55m340m096R41N055
$$ -1380 4669 3459 -3016 -5254 -1340 3417 4238 -585 -6081 -3282 3155 4110 -230 -4326 -3385 1670
3408A670L850l859o273O35N447L061k006m923k423N436N442k479o113j706L374
$$ 1670 5520 1661 -4612 -3977 1470 4531 2525 -2398 -4821 615 6057 3578 -2535 -4241 -867
3423h67N224L95n929m442M319N811j51n112m226J645O342K539n448n392K191N395
$$ -867 4357 4752 -1177 -5619 -1300 4511 4360 -752 -4978 -3333 3009 5548 100 -5292 -3101 2294
3439B294K593l141o858m47O961M227m028o208j08M859N330k282p531k249O537
$$ 2294 4887 1746 -5112 -5559 1402 5629 1601 -4607 -4715 144 5474 3192 -4339 -6588 -51
3454e1N263j729o095l581M447P246m70p623l582M320N888J441n852n474K858P898
$$ -51 5212 3483 -2612 -6193 -1746 5500 5030 -2593 -6175 -1855 4033 5474 -378 -5852 -2994 4904
3470D904P56o246m635J271O847M089n220p185J251O991L160l893o097j331O343
$$ 4904 5660 -586 -5221 -3950 2897 6986 1766 -5419 -4168 2823 5983 2090 -4007 -5338 1005
3485A005N793l791p956k0N800M966k353o929l322O530O125k392o077k881L582
$$ 1005 6798 3007 -4949 -4969 831 5797 3444 -3485 -6807 -277 5848 3456 -2621 -5502 -1920
3500a920O488L70p566m040N109O240j80o105m374K659P867J478p524n299L407
$$ -1920 4568 4938 -2628 -6668 -1559 4681 4501 -1604 -5978 -3319 4548 6026 -1498 -6797 -3390
3515c390P055K185n350o699J685Q316K914o258o454Q10P337N419m802q895l5Q690
$$ -3390 3665 5850 500 -6199 -4514 3802 6716 458 -5996 -5186 2151 7570 2768 -6127 -6162 2528
3531B528M725m023p418k621O805Q251l018r284k770O695P136q53q931n417N880
$$ 2528 7253 3230 -4188 -6809 -4 8247 5229 -4055 -6825 -130 7006 6153 -2778 -8195 -2315
3546b315R370o7q074o049L213R152K943p933q303K894R678L321n967q457o89R610
$$ -2315 7055 6988 -1086 -7135 -3922 5230 8173 240 -8063 -5169 4509 7830 1863 -6594 -7283 2327
3562B327N899n644r243o78P724P245k408r694l949P373Q029k199p824m506M463
$$ 2327 8226 2582 -6661 -7339 385 7630 5222 -4472 -8421 -1048 6981 4782 -3042 -7548 -3085
3577c085R032J209r146n922M630P844J884o207o960J406R107L561o304o631o7
$$ -3085 5947 7156 -1990 -7912 -3282 4562 6446 239 -6721 -5315 3792 7353 1049 -5582 -5649
3592e649P045N077l387q400j167Q136M787l216o266l362M977P678j795p793l026
$$ -5649 1396 6473 3086 -5314 -6481 1655 6442 3226 -3040 -6402 -1425 6253 4458 -3335 -6361
3607f361N128N891J22n671n642L560P258N69n909m327J972O195L309n056o896
$$ -6361 -1233 4658 4780 -891 -6533 -2973 4285 4854 -1055 -5382 -3410 2785 6094 1038 -5858
3622e858J379O658L053l501n927j011O151N005l243o514j287M926M750o06o278
$$ -5858 -4479 2179 5232 1731 -4196 -5207 944 5949 2706 -3808 -5095 -169 4581 3975 -2303
3637b303l599M719O537j143n281l646J569O533K523o113n003K455N853K130l618
$$ -2303 -5902 -1183 5354 4211 -1070 -4716 -3147 3386 5909 -204 -5207 -2752 3101 5231 1613
3652A613n640r23O549L984l637n456r10M218N423r30o926k957M412N413m31m681
$$ 1613 -4027 -4950 1599 5583 1946 -3510 -4420 -202 5221 4291 -2635 -5592 -1180 4233 3802 -879
3668h79m019K012O869J284n763m884K259N270K927l421o073j3O186L421l162m816
$$ -879 -4898 -2886 3983 5267 -496 -5380 -3121 2149 5076 1655 -4418 -4431 1755 5176 2014 -2802
3684b802j914M221N613j150o857j941M318M088M75m859m547K768O665P02m841
$$ -2802 -4716 -495 5118 3968 -2889 -4830 -512 3576 4051 -808 -5355 -2587 4078 4780 -61
3699f1m002J103M986L596m002o086P52N590K844k656m668k009M558N064k166n931
$$ -61 -4063 -2960 2026 5622 1620 -4466 -3714 1876 4720 2064 -2604 -4613 -55 5009 2843 -3088
3715c088j433L493M715M84n178m511L491N594j73m785l022J036N754K295m422
$$ -3088 -4521 -1028 3687 4171 -1007 -5518 -2027 3567 3394 -1391 -4413 -3377 2377 4672 250
3730B50n717K010M993K260l137m719j146N993M130l693n047n47M289M373j237
$$ 250 -5467 -3457 1536 3796 659 -4060 -5206 787 4917 1224 -3823 -4370 -81 4292 3055
3745C055o133k445N548M769j002n045l535K918O093Q53o079m014L177N781J123
$$ 3055 -3078 -5523 25 4794 3792 -1253 -4788 -1870 4223 5076 -1003 -5017 -1840 3941 5064
3760E064l940n655R70O863K373m682m916J06M955M702k351p576j098O005M020
$$ 5064 1124 -4531 -3561 3302 5675 993 -3923 -3817 1138 5840 3489 -4087 -5185 820 4840
3775D840j727n390l107L920O455o14o718k904L633M748J699n048n438K353O918
$$ 4840 3113 -2277 -5384 -1464 4991 4377 -2341 -5245 -1612 3136 4835 -213 -5651 -3298 3620
3790C620J246m376m930J61N338M132l407n878l2N627K778j388n049k808N094M951
$$ 3620 4866 490 -4440 -4279 1059 5191 1784 -4094 -4126 1501 4279 2891 -2158 -4966 128 5079
3806E079j946n317j542L134M107R03m905l765L023M715k01l458k996R79M762K110
$$ 5079 3133 -2184 -3726 -592 3515 4418 -487 -4252 -1229 3486 3285 -173 -3169 -2190 2572 4682
3822D682m297m208J607L633J918k054m533K12L985K750k961l389PK012L412j144
$$ 4682 385 -3823 -2216 1417 3335 1281 -3252 -3040 945 3695 734 -2655 -2648 -636 2776 1632
3838A632m158q50L642K253j290l001j739J918M017m1m602r52K266K853P04l080
$$ 1632 -2526 -3376 266 2519 1229 -1772 -3511 -1593 2424 2383 -2219 -3171 -905 1948 2652 -428
3854d28l012J671M534p1l554j527Q76L137K006k779m114J187M191P11j880k901
$$ -428 -3440 -1769 2765 2694 -860 -2387 -1511 1626 3632 853 -3261 -2074 2117 2828 948 -1953
3870a953m02L125L240k491l936m8K897K385m82l769j998L212L643j191l675j609
$$ -1953 -2355 770 4010 1519 -2417 -2465 432 2817 2335 -1434 -3432 -220 3423 2232 -1443 -3052
3886c052J678L641J050m313k598K184L433K54k232l139L17M308J662l110l353
$$ -3052 -1374 2267 3317 -996 -3594 -1410 2023 2277 45 -3094 -2777 1531 3193 83 -3270
3901c270J234K985K235j825m191r02M274K682j855l038j076K120L752m35m712
$$ -3270 -2036 949 3184 1359 -2832 -3734 540 3222 1367 -1671 -2747 -627 3125 2690 -2022
3916b022j324K831K872M43k947l288J495N089M19l964k521J052L398K478k721
$$ -2022 -3346 -515 2357 2800 -147 -3435 -1940 3149 3568 -396 -2917 -1865 1533 4011 1290
3931A290m229L51M604J481k323l425r18L821L751j832n035j029L599L305o12m303
$$ 1290 -2939 -2588 2016 3497 1174 -2251 -3169 652 4403 2571 -2464 -3493 106 3411 2799 -1504
3947a504k841L200M893q96l896k629J693M462J081m313m262K334M737J675k938
$$ -1504 -4345 -1145 3748 2852 -1044 -3673 -1980 2482 3563 -750 -5012 -2678 2059 3734 796
3962G96m658j35N172L374l278n005j95L883M211j413n668j817M453M311j104m727
$$ 796 -3862 -3997 1175 4549 1271 -3734 -3929 -46 4165 2752 -2916 -4733 -280 4031 2927 -1800
3978a800k799K781N719R82n903l788K993M710J819l664n303O63O014L109m277
$$ -1800 -4599 -1818 3901 4883 -1020 -4808 -1815 2895 4714 1050 -4253 -3590 2424 5533 1256
3993A256m837m69M575M200j756o212j811N262M356j307n354l047L368N826ln602
$$ 1256 -3581 -4050 525 4725 2969 -3243 -5054 208 4564 3257 -2097 -5144 -1776 4050 4047 -1555
4009a555l380K901M863J367l714n164J215N646J952l465m170l63M621M027k485
$$ -1555 -4935 -2034 2829 4196 482 -4682 -3467 2179 4131 666 -3504 -3867 754 4781 2296
4024B296n368o07L984L432r96m427k583L546N044r41m403k351J921M079J019l627
$$ 2296 -3072 -3679 305 3737 2741 -1686 -4269 -723 4321 3380 -1023 -3374 -1453 2626 3645 18
4040A8l909J668M532Q69k751l388j75M103K587k757l465L32K821K250j045l787
$$ 18 -3891 -2223 2309 3178 427 -2961 -3136 967 3554 797 -2668 -2336 485 2735 1690 -2097
4056b097j751L768K997j414k871j274J208L275Q70l828k098J918K615N53j527
$$ -2097 -3848 -80 2917 1503 -1368 -2642 -1434 1841 2711 -1117 -3215 -1297 1318 1871 344
4071C44k729N93L189J565k990j733L04J798J777p59l054l52K952J046r84j578
$$ 344 -2385 -1792 1397 2962 -28 -1761 -1457 341 2118 1359 -1695 -2047 905 1951 967 -611
4087f11j057R09K735N0k986o67J508J312O20j553k040L91K610L06j434j001l2
$$ -611 -1668 -759 1976 2026 -960 -1627 -119 1193 1813 260 -1780 -1389 1221 1527 93 -908 -940
4104i40P31K022r84k167L81J280N87k15r69q51P04J713n78j507m5M41O18R91j023
$$ -940 -209 1813 829 -1338 -957 323 910 695 -274 -1125 -421 1292 714 -793 -838 -397 221 1212 189
4123A89j343N22J556m40m89m87k85Q65J356r67j110L78N97r8J10q81o22J305R42
$$ 189 -1154 -632 924 484 -5 -492 -777 88 1444 477 -633 -255 342 244 354 -527 -1149 156 1098
4142A098n95o36p8K3N57N46j442o49J515L56l9o63l33n2J101M00j739o20J129
$$ 1098 503 -133 -211 -188 369 915 -527 -1176 339 695 656 -7 -340 -392 709 1109 -630 -1250 -121
4161a21Q74J89p87j306K27J843nj576l39L16J002R60r60j923O67J631L59j147
$$ -121 753 942 155 -1151 -924 919 914 -662 -1001 -685 317 1277 317 -1606 -939 692 1051 -96
4179i6j139m66J583K167j239k718K21J856J091k11k429j128K211K736j017k510
$$ -96 -1235 -1701 -118 2049 810 -1908 -1687 169 1260 1049 -1380 -2508 -297 2439 1422 -1088
4195a088j079J401K342Q00k804k216J606K962K94j994k294J08L369K099k715l010
$$ -1088 -2167 -766 1576 2376 -428 -2644 -1038 1924 2218 224 -2070 -1962 1407 3506 791 -2219
4211b219L04L013J629o11l884j321L916K730j634l450j178J518M213L03m288k512
$$ -2219 -1915 1098 2727 2116 -1768 -3089 827 3557 1923 -1527 -2705 -1187 3026 3329 -959 -3471
4227c471K479L604k1k540l652R95N261J117l786l194O92L377K559k074m647n02
$$ -3471 -992 2612 2591 51 -3601 -2606 2655 3772 -14 -3208 -2516 861 3420 1346 -3301 -3803
4243c803N125K707k405m019j148L116M454j479n141j523L655M002n13l624l875
$$ -3803 1322 4029 1624 -2395 -3543 -427 4027 2548 -2593 -4116 -461 3541 3028 -596 -4471
4258d471K703N437Q9m186l248J699M585J971m095m657J669M726J569k514m359
$$ -4471 -1768 3669 3758 -428 -3676 -1977 2608 4579 484 -4173 -2504 2222 3791 1277 -3082
4273c082l81M490L561k709n168m07L872L517j110m812k311M008M426j374m164
$$ -3082 -3463 1027 4588 1879 -3289 -3696 176 3693 2583 -2229 -4540 -532 3894 2520 -1644
4288a644k299K404M305N89m226l295K407M460L15l141l901Q33M868J961l103l951
$$ -1644 -3943 -1539 2766 3355 -871 -4166 -1759 2701 3016 -125 -4026 -3193 1675 3636 533 -3418
4304c418N72L428K478j154m863o89M254K662j685l174j300J995L882n95m205j441
$$ -3418 -2846 582 3060 1906 -2957 -3646 608 3270 1585 -1589 -2889 -894 2988 2393 -1812 -3253
4320c253K806K745K15k655k777J419L774K71k838k123J197K010J782j762l067
$$ -3253 -447 2298 2513 -142 -2919 -1500 2274 2545 -293 -2416 -1219 791 2573 811 -2256
4335b256M91L200N20j288j883p24J978K311j548k512J92J506R27L00j888j235
$$ -2256 -1765 1435 1955 667 -1216 -1940 38 2349 801 -1711 -1519 -13 914 1214 -674 -1909
4351a909J494K040r79j526j60K38J579L13j277j140J077J366l63m03q38k27J381
$$ -1909 -415 1625 646 -880 -1040 -802 777 1090 -187 -1327 -250 1116 753 350 -488 -715 666
4368F66L91j105n46P97l2R9N11r74n96J090K82l73m21K37k89Q05j3n73J45L86
$$ 666 1057 -48 -594 203 171 270 781 -193 -789 301 583 210 -211 26 -263 542 529 -44 101 487
4388D87n52n5L39J8m13K96N7l61P40o00p25P22L51m94j97K95m35N19P53q22n22
$$ 487 -65 -120 219 237 -176 120 177 -184 556 -44 -769 -47 304 -190 -387 -92 -527 -8 745 -77 -599
4409e99J22M48K50K10r41m20P53R87o39n94k54M08Q04J01r47q82J550N94m35n82
$$ -599 -477 -29 221 431 -510 -930 -177 810 171 -423 -677 -269 535 636 -311 -1193 357 951 516 -66
4429f6q13K72J064N77j351o34Q88O51L64n51j432Q1K018M64k029m15N02P35J110
$$ -66 -879 -607 457 1034 -317 -951 -63 588 952 401 -1031 -950 1068 1532 -497 -912 -410 325 1435
4448A435o21k079r2K073L69j082p20n39J097J733j333j506j20J653O77N4j510
$$ 1435 814 -1265 -1357 716 1085 3 -717 -1256 -159 1574 241 -1265 -1385 268 945 999 -511
4465e11j493J930J769j061k114M1J146J276M36j964j280J810J824j023j322j108
$$ -511 -2004 -74 1695 634 -1480 -1439 -293 983 1419 -545 -1825 -15 1809 786 -536 -1644
4481a644O71K387N16k271j511J821J514j62j368j189L23K456O67k535j297J114
$$ -1644 -973 1414 1930 -341 -1852 -31 1483 1321 -47 -1236 -913 1543 2210 -325 -1622 -508
4497e08J824Q01j424k701L96K803R36j967j524l31K014K013j289l418M22K805
$$ -508 1316 2117 693 -2008 -1612 1191 2127 160 -1364 -1695 319 2332 1043 -2375 -1953 852
4513H52R69j005k248p02K108K378j384k963o58K372K091l5l016j772K710K897
$$ 852 1821 816 -1432 -2134 -26 2352 968 -1995 -2653 -281 1810 1775 -1241 -3013 -303 2594
4529B594q67k817j410J603K708J083l242k457K288K585M04k382k541R46L450R83
$$ 2594 1727 -1090 -2500 -897 1811 2894 -348 -2805 -517 2068 2472 90 -2451 -1505 1945 2928
4545B928l009k569J189K999J336k107l303L19L535J767k592k525m0K272K942j947
$$ 2928 -81 -2650 -1461 1538 2874 767 -2536 -2217 1318 3085 493 -2032 -2072 200 3142 1195
4561A195l837o1L235K211j543k294j567K339L639j550l741r93K838K428j73l184
$$ 1195 -2642 -2703 532 2743 1200 -1094 -2661 -322 3317 1767 -1974 -2967 -129 2299 2126 -1058
4577a058k098K352L735r60l371j276J559L268R55l239l086K029L604K41k184l250
$$ -1058 -3156 -804 2931 1971 -1400 -2676 -1117 2151 3106 -133 -3219 -1190 2414 2655 471 -2779
4593b779M26L882J927k931l089P71L094J804j711l924k72L563K335k075k678m52
$$ -2779 -2353 1529 3456 525 -2564 -1793 1301 3105 1394 -2530 -2802 761 3096 1021 -1657 -2109
4609b109K222K553p01m148q72L117K593j077k516k015J885L533j39l591j269J869
$$ -2109 113 2666 1965 -2183 -3055 62 2655 1578 -938 -2953 -1068 2465 2326 -1265 -2534 -665
4625f65K105P64k134k801Q40L479R24k522k080N13K356J934k026k746M66K565
$$ -665 1440 2204 70 -2731 -1891 1588 2512 -10 -2090 -1577 779 2713 687 -2059 -1593 972
4641I72O95j103j721n65J896K260j723j837K0J318J140k4j938r53J267J863r10
$$ 972 1667 564 -1157 -1722 174 2434 711 -1126 -1106 212 1352 1328 -610 -1563 -296 1567 657
4658F57j064l8k44J700K87j933p94J684P47m53m45o39K03J124j93j137r6Q94l74
$$ 657 -407 -445 -689 1011 1298 -635 -1429 255 1002 549 104 -535 -332 792 599 -538 -634 260 -114
4677a14N82j60r15M82Q80o34p25P2O62P9K37m18p68J119L60p78q45P77M27L01
$$ -114 468 308 -607 -125 755 121 -604 -532 130 209 446 28 -740 379 739 -39 -884 -107 320 621
4697F21m17j073L18J554n63j004l55J041L45N68r90j293M20J619J07j160n46K07
$$ 621 204 -869 -551 1003 440 -564 -919 122 467 1035 45 -1248 -828 791 898 -262 -808 -601
4715f01J048J253j175k021M77J796N79j088j609j61K017J723j831k230N34J672
$$ -601 447 1700 525 -1496 -1019 777 1356 268 -1341 -1502 515 2238 407 -1823 -1289 383
4731C83J439j089k319o03K121K427j118k427o54J066K640O8l093j631K139K443
$$ 383 1822 733 -1586 -2189 -68 2359 1241 -1186 -1840 -774 1866 1934 -1159 -2790 -651 1792
4747A792J46k243k436J247L278O08k997j931J315K210J333j677l042N15L321R97
$$ 1792 1938 -305 -2741 -1494 1784 2392 -605 -2536 -1221 989 2322 645 -2397 -1882 1439 2436
4763B436j948j939l91K353J930q64l319m26K728J750o22k793j472K288K907j088
$$ 2436 488 -1451 -1842 511 2441 1577 -1742 -2168 560 2310 1688 -1105 -2577 -289 2618 1530
4779A530k652r71J641K175J75k595j642J608K703m68k109j314N55K499R45k393
$$ 1530 -1122 -2093 -452 1723 1898 -697 -2339 -731 1972 1504 -605 -1919 -1364 1135 2080 -313
4795c13j976J363J919R06j706j929L56K106J231k323j463J055J267R29r85k172
$$ -313 -2289 -926 993 1899 193 -1736 -1380 726 1957 -366 -1829 -774 493 1422 437 -1735
4811a735L03K452O00j713j217M95J338J431j073k324J17K555N89j532j297l70
$$ -1735 -1432 1020 1620 -93 -1310 -815 523 1954 881 -1443 -1326 1229 1818 286 -1011 -1381
4827a381K066J503j642j894J05J868J073p48k129n64K013K231k069k019J77J570
$$ -1381 685 2188 546 -1348 -1243 625 1698 950 -1179 -1743 270 2501 432 -1587 -1410 160
4843A60J670p78k640q18K541J717j361j707j134J859K576j074k455j163K339J982
$$ 160 1830 1052 -1588 -2406 135 1852 491 -1216 -2350 -491 2085 1011 -1444 -2607 -268 1714
4859A714k56k204j762J734K714N7l153j244J885K391K84k149k486J184L610j2
$$ 1714 1458 -746 -2508 -774 1940 1997 -1156 -2400 -515 1876 2160 11 -2475 -1291 2319 2307
4875B307k650j972J096K809R62k196l015J238K999Q14j996k429J21K854K287k582
$$ 2307 -343 -2315 -1219 1590 2552 356 -2659 -1421 1578 2392 396 -2033 -1912 942 3229 647
4891F47k803J70K522J692r57l388m71K926K476j377l251p91K118K617j96l455
$$ 647 -2156 -1986 536 2228 1271 -2117 -2588 338 2814 1437 -1814 -2605 -487 2130 1934 -1521
4907a521j447K715K486k52k491k398J423L324N50k831k091J045K761R37j805k916
$$ -1521 -2968 -253 2233 1981 -510 -2908 -1485 1839 2389 -442 -2533 -1488 1273 2210 405 -2511
4923b511L41L446J413k552j995K83K541J448j172k986%K520J164j026j882q59
$$ -2511 -2170 1276 2689 137 -1858 -1575 966 2414 1242 -1744 -1744 776 1940 914 -968 -1827
4939a827K199J842p81k569k08J572J187l51j544j282J836J661q82j557n22M64
$$ -1827 372 2214 1433 -1136 -1344 228 1415 1064 -480 -1762 74 1735 853 -704 -1226 -762
4955g62J365M67j513q48J100J285o76p80m12L26Q73K69j508q3Q97Q74n51r35m47
$$ -762 603 1070 -443 -1291 -191 1094 418 -362 -774 -448 425 694 -814 -897 0 874 323 -612 -1059
4974a059N79J587q86q10k51J558M05q50p75n00J103J180o40j467r2J241J050m99
$$ -1059 -480 1107 221 -589 -840 718 1123 273 -502 -1002 101 1281 641 -826 -918 323 1373 874
4992H74j574o21J175J845q92j876j75J181J783n03j764r59J516J420l65j654r04
$$ 874 -700 -1321 -146 1699 807 -1069 -1244 -63 1720 1217 -547 -1506 10 1430 1065 -589 -1493
5009a493N76K522k7k341j384J257K062K08j755j795P69L089J37k633j270J173
$$ -1493 -917 1605 1578 -763 -2147 -890 1172 1380 -375 -2170 -1401 1688 1825 -808 -2078 -905
5025i05J872P08j521k498Q16K659P13j619j831NK006K064j743k817M30K247J750
$$ -905 967 1675 154 -2344 -1528 1131 1844 225 -1606 -1601 405 2469 726 -2091 -1661 586 2336
5042B336q96k651r30K631K174j418k732l85K071K328n61l275j309K521K550p27
$$ 2336 1440 -1211 -2141 490 2664 1246 -1486 -1871 200 2528 1967 -1308 -2617 -96 2454 1727
5058A727k505j325J270K732N5k514j873J488K056P60j943k208R86K551J333k926
$$ 1727 -778 -2103 -833 1899 1954 -560 -2433 -945 1111 1871 -72 -2280 -1294 1257 2590 -336
5074c36j906M97K247J615j753k358N3L110P52j677j829j51K082K012j235k668
$$ -336 -2242 -1745 502 2117 364 -1994 -1941 1169 1921 244 -1585 -1736 346 2358 1123 -1545
5090a545L31J458J026j35k175o25J848J808j017j702q44J693J392k86j867j033
$$ -1545 -1214 244 1270 1135 -1040 -1665 183 1991 974 -728 -1572 121 1513 1227 -640 -1673
5106a673J641J291q19j102j92Q08J471j96k169m66J264J159m46j166o64Q24J719
$$ -1673 -32 1259 440 -662 -854 -46 1425 1229 -940 -1406 -142 1017 571 -595 -1259 -435 1284
5123A284j91k144m64J668Q30o2j530r98J431J731l23j957o72Q88J542L79j948
$$ 1284 1093 -1051 -1515 153 983 921 -609 -1607 -176 1555 1232 -725 -1397 -509 1033 1412 -536
5140e36j571J511K230k11j718j526J255J590Q15k059j664J141K391k1j421j866
$$ -536 -2107 -596 1634 1423 -295 -1821 -566 1024 1839 -220 -1884 -743 1648 1627 206 -1660
5156a660J25K622J009k074j786N26K211J133j114k482n46K555J449j465j895k14
$$ -1660 -1535 1087 2096 22 -1764 -1238 973 2106 992 -1490 -2036 519 1968 503 -1392 -1606
5172a606K036J494j133k841J25K161J569n89k324n28J610K012r89k208p34J679
$$ -1606 430 1924 791 -2050 -1925 236 1805 1216 -1108 -1636 -26 1986 997 -1211 -1945 -266
5188b66J849j2k343j406J517K581k99k626r87J046K558N50k710j676J686K387
$$ -266 1583 1571 -772 -2178 -661 1920 1621 -1005 -1992 -946 1612 2162 -548 -2224 -538 1849
5204A849J01k194j843O70L023P86k447j884Q06K239J056j667k445k7L187J104
$$ 1849 1950 -244 -2087 -1417 1606 2392 -55 -1939 -1133 1106 2162 495 -1950 -1977 1210 2314
5220B314j877k156j1K744J002j228k571l01K577J629j310k202n33K114J825p41
$$ 2314 437 -1719 -1730 1014 2016 788 -1783 -2084 493 2122 812 -1390 -1923 191 2016 1275
5236A275k944l97J903K017n28k286j176J939K336r53k117n94J258J470L64j954
$$ 1275 -1669 -2066 -163 1854 1326 -960 -2136 -197 2139 1186 -931 -1525 -267 1203 1567 -387
5252c87j709J259K305l95j566j022M83K355K2j768j239J199J655n9j475j266O90
$$ -387 -2096 -837 1468 1073 -493 -1515 -1032 1323 1345 -423 -1662 -463 1192 1133 -342 -1608 -918
5269i18J755N94j406j556J036J511L59j427j639P31K337n0j406j270O78J214J003
$$ -918 837 1431 25 -1531 -495 1016 1375 -52 -1691 -960 1377 1327 -79 -1349 -671 543 1546
5286A546j519j628M30K010L57j124j506N7K045J407j625k249N87J786Q57r51j800
$$ 1546 27 -1601 -1171 839 1196 72 -1434 -1377 668 2075 450 -1799 -1212 574 1431 480 -1320
5303a320j93K052J504j763j671j11J605J466o48k000p03K144J439r16j943p10
$$ -1320 -1513 539 2043 280 -1391 -1502 103 1569 921 -1079 -1782 362 1801 885 -1058 -1768
5319a768J526K122m65k505r35K136J482m65j720j142J482K272m59k045j420J550
$$ -1768 -242 1880 1415 -1090 -2025 111 1593 1128 -592 -1734 -252 2020 1561 -484 -1904 -354
5335c54J634j85j461j887J472K306J77k058j205N74K243N32k085j988P04K729
$$ -354 1280 1095 -366 -2253 -781 1525 1702 -356 -1561 -987 1256 1788 -297 -2285 -1581 1148
5351A148N53j331k158K17K389J003j949j819N26K092J394j427k349k78K374J715
$$ 1148 1701 370 -1788 -1571 818 1821 -128 -1947 -1421 671 2065 638 -1711 -1989 385 2100
5367B100j593k311N5J926J831p17k533p02K634J361p63k045j121J656K535m32
$$ 2100 507 -1804 -1749 177 2008 1291 -1242 -1944 690 2051 1288 -757 -1878 -222 2313 1881
5383A881l016q44J720K110l85k123j474J214K435K88k497r26J018J977M54j899
$$ 1881 -1135 -1979 -259 1851 1466 -657 -2131 -917 1518 1806 -691 -1617 -599 1378 1832 -67
5399f7k142J103K260M05j719j187K67J867R17j485j972N04J883Q04j031j586k52
$$ -67 -2209 -1106 1154 1559 -160 -1347 -1080 787 1704 219 -1753 -1249 634 1438 407 -1179 -1431
5416a431K235Q38j593j341J87J311R67p42j533k12J663R31j315r36k37J454J203
$$ -1431 804 1642 49 -1292 -1105 206 1173 431 -1102 -1314 349 1280 -35 -971 -1208 246 1449
5433A449o93j873l09J885R18j181j149m06J438J467o27j910p8J568N38n19j541
$$ 1449 756 -1117 -1426 459 1377 196 -953 -1359 79 1546 919 -991 -1069 499 1037 518 -1023
5450a023k08J471J403j224j600J49J151J299o79j662r33J766J503p31j504m37
$$ -1023 -1231 240 1643 419 -1181 -1032 119 1418 739 -923 -1856 -90 1413 682 -822 -1259
5466a259Q60J921l93k247r92K008J569m82j573j118R66K365l75k163j121J571
$$ -1259 -399 1522 1129 -1118 -2110 -102 1467 985 -588 -1706 -740 1625 1250 -913 -2034 -463
5482d63K035M5k105j584J412K251L36k283j804J146K102Q13j813k155J044K241
$$ -463 1572 1617 -488 -2072 -660 1591 1927 -356 -2160 -1014 1088 1901 88 -2067 -1023 1218
5498A218Q12k040j707K93K557J289k179k043J43K691J432j700k603k9K776J443
$$ 1218 2030 -10 -1717 -1424 1133 2422 243 -1800 -1657 1034 2466 766 -1837 -1866 910 2353
5514B353j538k456l47K162J925r39k817r13K836K228j316k367q47J630K236O1
$$ 2353 815 -1641 -1988 174 2099 1160 -1657 -2570 266 2494 1178 -1189 -2036 -406 1830 1891
5530A891l261j222K110K524k21k471j823J225L263J78k933j636R71K939M56j941
$$ 1891 -1370 -2592 -482 2042 1821 -650 -2473 -1248 2015 2193 -740 -2376 -1405 1534 1990 49
5546D9k266Q11K829R26j938k518M56K823J394j763k946L10K599J177r59k603n39
$$ 49 -2217 -1406 1423 2349 411 -2107 -1651 1172 2566 803 -2143 -1833 766 1943 984 -1619 -2158
5563b158K444J873j205k611j89K061J638m45k553p87K034J851r74j828p36J334
$$ -2158 286 2159 954 -1657 -1846 215 1853 1408 -1145 -1932 102 1953 979 -849 -1585 -251
5579b51J842j28k336r49J312K139m75j662j348J027K181pk182j108J519J674K02
$$ -251 1591 1463 -873 -1822 -510 1629 1154 -508 -1856 -829 1352 1345 -837 -1945 -426 1248 1450
5596A450k001j374J213K057j04j904q20Q67J706N06j926j357J008J693J59j416
$$ 1450 -551 -1925 -712 1345 1241 -663 -1483 -616 1090 1596 -330 -1687 -679 1014 1173 -243
5612b43j101M53K060O59j969j680J308J470O72j527j535L61K319N04j792j522
$$ -243 -1344 -891 1169 1828 -141 -1821 -513 957 1629 102 -1433 -1072 1247 1751 -41 -1563
5628a563L19J603J108r75k020K38J896J346j640j673j40J654J706j061k082j32
$$ -1563 -1244 359 1467 492 -1528 -1290 606 1952 312 -1361 -1501 153 1859 798 -1284 -1416
5644a416J668J445o54k426o29J849K086q95k262l23J325J878n81j891j084J698
$$ -1416 252 1697 1043 -1383 -2012 -163 1923 1028 -1234 -1557 -232 1646 1065 -826 -1910 -212
5660b12K054p71k052n53J104J952L88k272j467J179K129N2j628j477O86K175P25
$$ -212 1842 1071 -981 -1534 -430 1522 1910 -362 -1829 -650 1479 1531 -97 -1574 -888 1287 2012
5677B012k258j635O96K262O27j463j802J78K470P04j711j856L55J821J177j024
$$ 2012 -246 -1881 -1185 1077 1704 241 -1561 -1383 1087 1791 80 -1776 -1421 400 1577 553
5693E53j922L8K155Q06j490j267o28J864J478j121j665k07J684J095m03j820p65
$$ 553 -1369 -1331 824 1630 140 -1127 -1755 109 1587 466 -1199 -1406 278 1373 970 -850 -1615
5710a615J320J542n14j696l50J287J261k37j815n42J303J327n13j350k95O64J384
$$ -1615 -295 1247 733 -963 -1313 -26 1235 998 -817 -1359 -56 1271 758 -592 -887 -223 1161
5727A161j7j714n23J058Q93j36j194q30Q10J686l86j449n13P85J121J20j544m81
$$ 1161 1144 -570 -1093 -35 858 722 -472 -1302 -492 1194 808 -641 -1154 -369 752 872 -672 -1153
5745a153J092J153m00j411m32R17J014O2j110j348J499J342l02j376p44M35K025
$$ -1153 -61 1092 692 -719 -1151 -234 780 842 -268 -1616 -117 1225 923 -453 -1197 -762 1263
5762A263k86j556r90J185J677k62j024j507P27K129L30j780j173N10K166L44j552
$$ 1263 977 -579 -1569 -384 1293 1031 7 -1500 -773 1356 1686 -94 -1267 -757 1409 1753 201
5779B01k110O59K380Q50j743j959M54K001J932j671k735O2K369J236q91k675j61
$$ 201 -1909 -1250 1130 1980 237 -1722 -1268 733 2665 994 -1741 -1679 690 1926 1035 -1640 -1801
5796a801J975K119j328k911j56K402J596p39k343j149K192K211o22k365j093J589
$$ -1801 174 2293 965 -1946 -2102 300 1896 1157 -1186 -2335 -143 2068 1446 -919 -2012 -423
5812d23J797M57k586j737J776K673P8k603j714J355K546N51k452j793Q86K554
$$ -423 1374 1831 -755 -2492 -716 1957 2035 -568 -2282 -927 1619 2170 -282 -2075 -1189 1365
5828A365P90k030k208K41L273Q01j786k405M81K527J347j384l064J27K463J733
$$ 1365 2155 125 -2083 -1842 1431 2232 446 -1959 -1478 1049 2396 1012 -2052 -1925 538 2271
5844B271j206k355q68K319K055q72k871n43K055K082o10k564j123J671K465l10
$$ 2271 1065 -1290 -2158 161 2216 1344 -1527 -2070 -15 2067 1457 -1107 -2230 -559 1906 1596
5860A596k730j092J607K256j38k163j583J187K717K7k033j711J028K326M45k200
$$ 1596 -1134 -2226 -619 1637 1499 -664 -2247 -1060 1657 1684 -349 -2060 -1032 1294 1739 -461
5876d61j521J131K270J36j498j742K61K499Q75j692j933L26K051J273j578k092
$$ -461 -1982 -851 1419 1555 57 -1685 -1424 1075 1950 258 -1675 -1349 702 1975 397 -1695
5892a695p8K468J150j474j469k99J856J358j006k190q2J996R75p76j829n17J461
$$ -1695 -1773 695 1845 371 -1098 -1397 459 1817 811 -1379 -1461 535 1510 734 -1095 -1612 -151
5909a51J959r39j996l58J736J128m09j593j503J884K050j110j840n97J478J814
$$ -151 1808 869 -1127 -1485 251 1379 970 -623 -2126 -242 1808 698 -1142 -1739 -261 1553
5925A553n58j796q19J527J629o14j614j015J332J832K7j988r40Q97K031m07j317
$$ 1553 995 -801 -1620 -93 1536 922 -692 -1707 -375 1457 1484 -504 -1444 -547 1484 1077 -240
5942b40j258O56K359j65j454j280P93J583O52j334j695O67J784J57r98j382J87
$$ -240 -1498 -842 1517 1352 -102 -1382 -589 994 1646 312 -1383 -716 1068 1225 227 -1155 -968
5959i68J496J165j300j939L46K077M18q15j659q8J574R53q97j309k63J204J166
$$ -968 528 1693 393 -1546 -1200 877 1295 480 -1179 -1267 307 1260 363 -946 -1209 -5 1161
5976A161o80j496m82J571J263o62j659n6J036R05j98j665l17J321Q88j74j184
$$ 1161 481 -1015 -1497 74 1337 675 -984 -1040 -4 901 703 -962 -1279 42 930 756 -428
5993d28q87Q97J801l19j683l13R49J019n2j532m00O40J663n48j406m17P33R89
$$ -428 -1315 -418 1383 1064 -619 -932 17 1036 984 -548 -948 -308 1355 807 -599 -1016 -283 706
6011G06M28j389j273J079J461j70j155q69Q34J266J33j582p52J009J212k7r10
$$ 706 1134 -255 -1528 -449 1012 842 -313 -1182 -348 918 1051 -531 -1283 -274 938 911 1
6028Aj217L42J472M76j393r46Q33Q99Q68j241j158K57J782J47j531q13N46J463
$$ 1 -1216 -874 598 1074 -319 -1265 -432 467 1335 94 -1064 -807 975 1122 -409 -1222 -676 787
6046G87M48j114j832J124J477J07r42j205M92J192R07j155j712M93J655N34p98
$$ 787 1235 121 -1711 -587 890 997 55 -1150 -658 534 1441 286 -1426 -933 722 1256 458
6063D58j439m54K032J084j601j235q7J483J572j015j933l30K098J295j242j704
$$ 458 -981 -1435 597 1681 80 -1155 -1242 241 1813 798 -1135 -1465 633 1928 686 -1018
6079a018l81J723J246l74k567o69K471J083k74k256m49J156K192k7k507j328J725
$$ -1018 -1399 324 1570 1196 -1371 -2040 431 1514 1240 -1016 -1465 -309 1883 1856 -651 -1979 -254
6096b54J747K6j737j773R88K490L42k247j547R99K262O79j893k268J005K505N77
$$ -254 1493 1519 -218 -1991 -1003 1487 1829 -418 -1965 -966 1296 1975 82 -2186 -1181 1324 1901
6113A901j698j893R9K575J437k013k273N11K052J353j247k394l89K462J843j422
$$ 1901 203 -1690 -1591 984 2421 408 -1865 -1354 698 2051 804 -1590 -1979 483 2326 904
6129I04k465m89K009K271q66k833n56J707K378q79j998j174J680K133l28k271
$$ 904 -1561 -2050 -41 2230 1364 -1469 -2025 -318 2060 1181 -817 -1991 -311 1822 1494 -777
6145g77j389J544K081M87k490j470P64K867J37k035j643N77K544J023k078j805
$$ -777 -2166 -622 1459 1946 -544 -2014 -1250 1617 1754 -281 -1924 -1347 1197 2220 142 -1663
6161a663M23K314J004j978j895M69J691J610j342k256L47K070J162j152j972o48
$$ -1663 -1240 1074 2078 100 -1795 -1326 365 1975 633 -1623 -1276 794 1956 804 -1168 -1816
6177a816K167J644j090k255k53J585J236j19j998q92J577J717l94j548j197J265
$$ -1816 351 1995 905 -1350 -1603 -18 1218 1099 -899 -1791 -214 1503 1109 -439 -1636 -371
6193c71J683J4k053q28J083J670J24j749r51P01J673K61j550j028M84J795M31
$$ -371 1312 1326 -727 -1555 -472 1198 1322 -427 -1378 -677 996 1257 -293 -1321 -837 958 1389
6210A389j436j165P16J325K37j231j126O09J016J345j370j812O51J472O06r81
$$ 1389 -47 -1212 -496 829 1066 -165 -1291 -682 334 1679 309 -1503 -852 620 1226 245
6226B45j250K1J634P35j080j552O02J136M60o30j416P5J360O20o08j234k45J381
$$ 245 -1005 -984 650 1385 305 -1247 -645 491 951 321 -1095 -1020 340 960 352 -882 -1127 254
6244B54O30m64j280J9J120P37n26j221R6P64R47q10j003l08J341O53k29j429l08
$$ 254 884 420 -860 -841 279 1016 490 -731 -635 129 1076 266 -737 -1045 296 949 720 -709 -1017
6263a017J088R41k78j138j83M66J046j04j163m50Q39J084m64j407J0M88J036M07
$$ -1017 71 1012 734 -404 -587 -121 925 821 -342 -792 47 1131 667 -740 -730 -242 794 1201
6281A201j627n49P84Q30K03j218p69O05J325L34j375q54J064O37K05q28j146Q46
$$ 1201 -426 -975 -191 639 842 -376 -1145 -540 785 1119 -256 -1110 -46 591 796 -32 -1178 -332
6299c32J289j05j006r78P52J193J55q46j216P85P64M93r45j164O74R55M64j042
$$ -332 957 852 -154 -1132 -380 813 968 122 -1094 -309 455 948 3 -1161 -487 468 932 -110
6317a10r66M59Q79M86n88q70j70J541M96r26q56l20J140O10k02j537K6R73J315
$$ -110 -1076 -617 262 748 160 -710 -880 661 1157 231 -625 -945 195 805 603 -934 -908 65 1380
6336A380j320p35k7J261N21j61j717k21J403O20l57j455j06Q94J504n54j881j9
$$ 1380 60 -675 -702 559 1080 919 -798 -1019 384 1004 647 -808 -914 -20 1484 930 -951 -970
6354i70Q85J379n47j725k95J127J383n37j432n07J158J232k58j710n21J077J686
$$ -970 -85 1294 747 -978 -1273 -146 1237 700 -732 -1239 -81 1151 893 -817 -1338 -261 1425
6371A425m90j311j049J367J214J2j520j142R15J882K6j939j059J066J697M84j736
$$ 1425 935 -376 -1425 -58 1156 1168 -352 -1494 -579 1303 1329 -610 -1669 -603 1094 1578 -158
6388a58j475R13J563Q61j724j550N91J939M97j365j690O18J557J182j257k109
$$ -158 -1633 -720 843 1704 -20 -1570 -979 960 1457 92 -1598 -980 577 1759 502 -1607
6404a607q4K444J037j203j788n08K084J872j285k187o55J728J608k09k124j063
$$ -1607 -1691 753 1790 587 -1201 -1709 375 2247 962 -1225 -1880 -152 1456 1247 -877 -1940
6420a940J814K022m91k287j025J330K179K11k391j685J387K547K77k315j540O15
$$ -1940 -126 1896 1405 -882 -1907 -577 1602 1813 -578 -2263 -876 1671 1948 -367 -1907 -1292
6436a292K717N48j850k353Q61K479J193j851k222L20K307J250j765j957L83J701
$$ -1292 1425 1973 123 -2230 -1369 1110 2303 452 -1770 -1450 857 2107 342 -1615 -1232 469
6452D69J505q93k477l84K185J240n90k295j99J637J493K2k751n99J570J439K6
$$ 469 1974 1081 -1396 -1780 405 1645 1055 -1240 -1439 198 1691 1713 -1038 -1637 -67 1372 1398
6469A398k014j222J317J928r7j982j129J111J744M22j421j673Q15J959K06j090
$$ 1398 -616 -1838 -521 1407 1310 -672 -1801 -690 1054 1476 55 -1618 -803 1156 1362 272
6485B72j865N55K106M21j016j730J06J926M87j067j253l27J684J227j189j153
$$ 272 -1593 -1038 1068 1489 473 -1257 -1151 775 1262 195 -1058 -1385 299 1526 337 -816
6501h16k5R17J178o01j418l96J640O13n97j074l17R56J127m52j346l34O78R43
$$ -816 -841 76 1254 653 -765 -1161 479 1092 495 -579 -896 60 1187 735 -611 -945 -267 676
6519F76o0j142l17P08J028r8j366k46N97R97m15p55k82P51P60j14r72n71O80Q20
$$ 676 616 -526 -843 -135 893 795 -571 -817 -220 777 362 -393 -675 76 836 722 -250 -821 -141 679
6539F79J4j062o64J395J81qr50m73M23Q95J58q67q67J211N30r2p09n46M13J249
$$ 679 693 -369 -1033 362 543 535 -415 -888 -465 430 588 -279 -1146 65 595 503 -206 -752 -339 910
6559I10k59q88m32O04M52N34r11r90N11J245p0r81k97M50N85J91n34r02R94L61
$$ 910 651 -237 -669 -65 387 921 10 -980 -469 776 706 -275 -572 -122 463 654 120 -782 212 573
6579E73J94p25q29M45R59M45r93r30J90R08P26p24j112K8J345L52q36o41k18J297
$$ 573 767 42 -787 -342 617 1062 69 -861 -671 237 963 239 -873 -845 500 852 16 -625 -843 454
6599D54J62k55j211k07J502P56r73p36j8Q68R88r62j246K54P21P36k35j041o53
$$ 454 616 361 -850 -1057 445 1201 228 -508 -526 342 1330 368 -878 -624 97 833 598 -443 -1096
6618a096Q36J493p67j323q8J087O83j24q43j021J173J364o60j195m62Q74P59M6
$$ -1096 -260 1233 466 -857 -945 142 825 701 -142 -1163 10 1374 714 -481 -943 -69 690 736
6636G36j113q20J429R70n89p87r94P88J256L31j513r38Q58J390q8j150j203O34
$$ 736 -377 -1197 232 1202 613 -174 -1168 -380 876 1207 -306 -1244 -386 1004 916 -234 -1437 -803
6654h03J750p9j245p73L67J183N80j089r86M41J337N91j465p08p4J509Q62q98
$$ -803 947 868 -377 -1150 -783 400 980 -109 -1095 -654 683 1274 -191 -899 -973 536 1398 500
6672E00j828N49J411Q61j033j430k36J529J045j062j314l06J730R47n46j674n48
$$ 500 -1328 -779 632 1493 460 -970 -1206 323 1368 306 -1008 -1314 416 1363 817 -857 -1405
6689a405J665J407r59j823j61J150J513k79j813q45R36K114j84j722j038Q02J861
$$ -1405 260 1667 708 -1115 -1276 -126 1387 1108 -705 -1550 -614 1500 1316 -406 -1444 -642 1219
6706A219J40j724j337J087J616L36j518j344N98K077L75j748j046K84J639Q41
$$ 1219 1359 -365 -1702 -615 1001 1337 -181 -1525 -927 1150 1525 -223 -1269 -985 654 1495
6722A495j237j738M57J797R96j665j340j42J837J536j558j751O2J362J729j145
$$ 1495 258 -1480 -1023 774 1770 105 -1235 -1377 460 1996 438 -1313 -1251 111 1840 695
6738F95j675r58J929J732q46j518p32J178J465N3j833j096J053K070k87j674j358
$$ 695 -980 -1938 -9 1723 877 -641 -1373 -195 1270 1323 -510 -1606 -553 1517 1230 -444 -1802
6755a802R91K192K6j732j365J001J614N56j631j268J82K120L13j250j225K10J638
$$ -1802 -811 1381 1407 -325 -1690 -689 925 1481 -150 -1418 -1236 884 1197 -53 -1278 -1068 570
6772E70P18q97j793L98J410J232j109j158n94J821R61q26j436k37J021P78K5j971
$$ 570 1288 391 -1402 -1004 406 1638 529 -629 -1223 598 1559 733 -703 -940 81 859 884 -1087
6790a087k60J145J361j11j573m26M67J212j2j329j81L08J740j95j279o68L32J288
$$ -1087 -1347 -202 1159 1048 -525 -951 -484 728 716 -613 -794 -486 1254 1059 -220 -888 -556 732
6808G32M07j518o48O57P35L87o49q53MJ475P1p95p40K12Q86M82o04r99M5P88P57
$$ 732 1139 -379 -1027 -370 365 752 103 -750 -746 729 800 5 -735 -523 363 845 241 -758 -713 75 832
6829H32p42o75J96P74L63n73r55L42P54J21k89p50QP77M93n58m33K42K53O96n04
$$ 832 90 -585 -389 385 748 175 -780 -438 316 437 148 -602 -594 183 676 118 -315 -73 180 876 372
6850C72n34j13N39R8P7r04J66O79Q3n51p15K54J213j67m44l63j23N76L35n66o66
$$ 372 -162 -275 264 362 439 -465 -299 380 463 -88 -803 -549 664 497 53 -310 -433 143 478 -88 -754
6871g54L67J003L42r97l38k93J029J51o64n81L65O05J92q3q42j59J052L89o98
$$ -754 -387 616 958 -39 -377 -670 359 510 -154 -735 -370 235 427 344 -498 -657 395 784 86
6890H6o75OO25P20n00r46J73Q92M25l01j101L4O10Q68o15q31k91R60R16q85n37
$$ 86 -589 -583 42 762 262 -684 -511 381 806 505 -596 -562 48 916 301 -530 -821 139 1055 170 -367
6911c67n33N63J199J48j491o05R22J009l10j007p07R01R79l9q40o30L66J269J68
$$ -367 -900 -337 862 1010 -481 -1086 -164 845 535 -472 -1179 -278 701 662 -178 -808 -442 827 995
6930I95j284r82N59J524k3q98p16l6J339P33j169r76K90R74O96p59j300N7J503
$$ 995 -289 -1271 -712 812 789 -109 -825 -861 478 1211 42 -934 -644 330 1026 267 -1033 -976 527
6949E27R37j087j540R4J628M67k64j720m08J626Q23m57j473k06Q71J447l09j869
$$ 527 1464 377 -1163 -1069 559 1026 762 -958 -1366 260 1083 626 -847 -1053 -182 1265 956 -913
6967i13n2Q95J057M9j456q45R53J463k08j628n50J037J101J89j475r63Q82J344
$$ -913 -965 -70 987 1036 -420 -1265 -312 1151 943 -685 -1235 -198 903 1092 -383 -1346 -464 880
6985H80J11r09j359P85J431K02j189j569N78J767J65o69j427K89J693N17j194
$$ 880 991 82 -1277 -492 939 1141 -48 -1617 -1039 728 893 224 -1203 -914 779 1296 102
7002A02r66k06J358J127q70j810P3J591J017o26k081q5J567J068n10j637j61J047
$$ 102 -864 -1070 288 1415 545 -1265 -1192 399 1416 790 -1291 -1376 191 1259 749 -888 -1049 -2
7020bR24j18j386o22J313J314o66j302q31J207J254K7j442j078J003J406K31j494
$$ -2 922 804 -582 -1204 109 1423 757 -545 -1376 -169 1085 1112 -330 -1408 -405 1001 1232 -262
7038b62r90N26J343L96j194j055O97J201O54j050j399L6J678M06q27j221k3J273
$$ -262 -1252 -726 617 1013 -181 -1236 -539 662 1316 266 -1133 -1097 581 987 160 -1061 -1084 189
7056A89J028q19j259k38J268J111q86j305m6J004R61j90j691l98J013J242k98
$$ 189 1217 398 -861 -1099 169 1280 394 -911 -957 47 1008 818 -873 -1271 -258 984 686
7073F86j290n39O64J131K01j354p50R52P22N98j225q76O93J292j18q50q31L71
$$ 686 -604 -1143 -479 652 853 -501 -1251 -299 423 1021 -204 -1080 -387 905 787 -63 -894 -523
7091e23Q37M54m23j280M47R83O08j041r54K82J088N2l23j011L12O00O93q53n45
$$ -523 314 768 345 -935 -488 495 1103 62 -892 -610 478 530 207 -804 -492 108 801 -52 -597
7110e97l4R27M19o11p21K33K07P09k84n93k8J97P23l00n51l69P27L53J63q09k59
$$ -597 -631 296 715 104 -617 -384 -177 532 248 -345 -373 -176 547 247 -304 -673 54 407 570 -239 -498
7131d98N91N08l75p65J85M55M68j73q00K28P6L45j18n35K77N2M98m87k79m5N05
$$ -498 93 601 226 -539 -354 101 569 396 -404 -176 -100 245 127 -408 -131 -79 419 -68 -347 -392 113
7152A13L03m37j78k32O66J33l71l60j27N20N23m00p74K43O03j6l1j75m19L75Q08
$$ 113 416 -21 -199 -431 235 368 -3 -363 -490 30 553 153 -621 -378 225 209 178 3 -416 -41 767
7173G67m69p62%P49j2O2j021L8P21N44m12r15M26K97O44j99n34p07R78K75J46
$$ 767 298 -464 -464 285 273 335 -686 -648 73 617 205 -710 -284 13 657 458 -76 -783 195 470 616
7194F16j206L7J59P36m3n68q17Q55Q95k93n98o10R26P37j67q22n92M51Q74J49
$$ 616 -590 -553 -394 342 299 -269 -1086 -231 664 371 -227 -837 89 826 659 -163 -755 -304 570 719
7214G19q17q18K87J196K71q79p26K72Q61M46m73j169J60J276K83m26r69l87R78
$$ 719 -98 -916 -629 567 838 -41 -767 -495 366 812 339 -830 -670 606 889 463 -506 -893 85
7233H5P44o44o46k08J121N82m96j229j46Q65J043k31j329m73P25J184j80j106
$$ 85 829 185 -461 -669 452 1034 538 -691 -837 28 1071 840 -489 -962 -237 947 767 -339
7251c39p81R01J015k3j043o88L72J374o2r16o39L24J113M91j090r46L01J066O05
$$ -339 -1120 -219 796 773 -270 -958 -586 788 726 -190 -829 -505 608 1099 9 -937 -636 430 1035
7270A035j086j038K95J130P69o42j529N24J178O93j186j045K96Q95Q52q38j148
$$ 1035 -51 -1089 -794 336 1105 463 -1066 -542 636 1329 143 -902 -606 289 1141 303 -845
7287h45J85J051P83n46j447j18Q82J189n72j209k84N60J492k68j246p58R60J369
$$ -845 -660 391 1174 628 -819 -937 -55 1134 562 -647 -931 -371 1121 853 -393 -1151 -191 1178
7305A178l77j575k78Q01J215J45j353q89R33J069j89m71j105K53J476J99j129
$$ 1178 801 -774 -1052 -251 964 1109 -244 -1133 -200 869 680 209 -896 -643 833 1032 -97
7322i7j061P39R62N66n93j329n9J608M14q16j090n10J532O73k90j255m45J239
$$ -97 -1158 -419 543 1109 516 -813 -872 736 1150 334 -756 -1266 266 939 649 -606 -1051 188
7340A88Q13k85j318j28P75R74j80j360l81J084P26l15r15p28R55Q31K9j173r63
$$ 188 1001 716 -602 -730 45 1019 839 -521 -902 182 908 593 -322 -1050 -95 736 765 -408 -1371
7359a371J069Q23J62n07j164N59P96L60p57p64K53J032M79j153p52K18Q27Q17
$$ -1371 -302 521 683 176 -988 -429 367 727 -30 -794 -541 491 970 -183 -935 -717 110 927
7377I27p32q39k15R41P49o09j028N79K48Q16m42o41l09P20L89k18l72o45Q79K38
$$ 927 195 -644 -859 82 831 222 -806 -227 21 837 395 -246 -555 165 554 336 -36 -681 198 436
7397D36R2p79n11N15P53j20l97n99N68O18l43k43j59j58O21k3l70j44J93K90l3
$$ 436 528 -251 -762 -247 506 386 -11 -610 -42 576 233 -10 -169 -327 294 271 -99 -243 -50 240 207
7418B07j45l02J69L07j21j70l59K20J23M43o46j46J45P39J59p99j95L41P6K84
$$ 207 62 -240 -71 236 115 -55 -414 -194 -71 372 -274 -420 -275 464 623 -176 -371 -30 46 330
7438C30l90O7J32J08k78j15J18K7J31K26m42k62N65j1ol41j76q3Q25j92l85l88
$$ 330 -60 7 139 247 -31 -146 -28 -1 130 356 -86 -348 217 206 200 -141 -317 -400 425 233 -152 -540
7460e40P15L11k00j17m37M27K13J19o49k14J50O06Nl66n08J35Q26k2q61k40M28
$$ -540 175 486 286 169 -268 159 372 491 -158 -372 -222 384 389 23 -485 -350 476 454 -407 -647 -219
7481b19O76l2m75n43M22O05K06q16k99p9O12N66m63p68K2R67j22k69m88KP39R05
$$ -219 457 425 -50 -593 -171 434 640 -176 -475 -554 58 624 161 -607 -585 382 260 -9 -497 -495 244 1149
7503A149j016r29J90R41K03o5r22j36O90Q72p83n44j10L51Q31m40p99j31N09R40
$$ 1149 133 -796 -606 335 538 473 -449 -585 105 977 194 -350 -460 -109 722 282 -517 -648 -139 801
7523H01m39p90j95O42Q84l00j321k81J221L58O0j166n36J008Q67k0o84j068P00
$$ 801 362 -428 -623 19 903 603 -718 -999 222 580 640 -526 -1062 -54 813 793 109 -959 -259
7542b59R80j21o52q79M54J063j76m91o06k27J226M74p51q48L36Q62M89n22j284
$$ -259 721 600 -52 -931 -477 586 410 -81 -687 -914 312 786 35 -813 -477 385 874 352 -932
7561i32K24J008O18r40p54Q8N43R16j04j169n26J263R16m95q91p84R85J017l51
$$ -932 -708 300 918 -22 -776 -688 -145 771 667 -502 -1028 235 1151 656 -235 -1019 -34 983 632
7580F32q39p42R12P66j82q55p14R41R08M7q89q12M04J068L91j087r50L15J206
$$ 632 -207 -949 -37 729 547 -308 -1022 -81 827 874 -15 -827 -423 645 1036 -51 -1001 -686 520
7599E20L22o87j105J11J162M58o39p62p3J032M34k56j252p3J101N21k08j197m18
$$ 520 842 155 -950 -839 323 781 142 -620 -693 339 773 517 -735 -808 293 814 606 -591 -1009
7618a009Q35J093j2j491l37R46N20J60q71m27L57R98j73q44m35N39Q97j00o96
$$ -1009 -174 919 907 -584 -921 25 545 705 -166 -593 -236 762 589 -255 -690 -151 746 646 -50
7637e0p86M64J292k29p60o75M83P91j86j93j019N13R25K23q16n49j43J148K68
$$ -50 -836 -372 920 691 -69 -744 -261 530 344 151 -868 -355 570 793 -23 -572 -715 433 701
7656G01o82o54J81N81M69k48o98l25Q11O33m96m29n98Q03K95J16p12p62J054P91
$$ 701 19 -635 -454 127 596 348 -350 -675 136 769 273 -156 -754 49 344 460 -252 -1014 40 831
7676H31o02m45l69N01M33J85p24o57O61N94m9m34n89M36O28J30n15m75K72L45
$$ 831 229 -216 -585 -84 349 534 -190 -847 -186 408 359 -75 -664 -228 400 530 15 -460 -188 157
7696A57O35p72m03K68K72L48m66n36K01M06M81n81o89K34N37L06m70k90qM74L47
$$ 157 792 20 -383 -115 157 505 39 -497 -296 110 591 10 -679 -445 92 398 -72 -362 -370 104 451
7717D51n25m3O2J68L23n25k39JN48k10n2j93J16L8M66k27m35L57J32k24R0m73
$$ 451 -74 -117 -55 113 436 -89 -328 -327 221 11 -41 -234 -118 -80 386 159 -276 81 213 -11 79 -394
7739c94O31j9K6l96K1J24P7p1O0j08L61k36L29l36l15L63J97o5l66j32k25R60
$$ -394 237 218 244 -152 -131 -7 70 -1 59 -49 312 76 405 69 -246 117 314 249 -117 -249 -474 486
7761D86J25p93l1j05N08K63m98m82M82N15J1q85l0j3P17k46l7p81K11Q50O9l44
$$ 486 611 -182 -213 -318 190 453 -45 -527 -45 470 481 -404 -434 -447 270 24 -13 -794 -583 267 336 -8
7783hl04J83K42M13m79o25J42O70M47o34o16LP42N41o72q01K60P83J77p4p89j05
$$ -8 -312 -129 113 526 47 -578 -436 234 681 47 -569 -566 176 717 45 -756 -496 287 464 390 -399 -504
7805e04M45O78J7q56k09M61N62l4o96m39J83R24N1o30q70M74R67L4o85o57L89
$$ -504 -59 619 636 -220 -429 32 594 560 -136 -575 -392 532 583 -47 -917 -443 524 558 -127 -784 -395
7826c95R25J50o18r09J56J234M44q13r67J73R56O72p88j059M89P36K17m91n33
$$ -395 530 680 62 -847 -691 543 987 174 -793 -620 336 1008 220 -839 -350 386 603 112 -421
7845d21j44Q35M19l04j110J00L20J157m98r47q9M42J125m27q41k23M05O95N06
$$ -421 -565 270 689 385 -725 -625 -305 852 354 -593 -682 -240 885 458 -383 -606 -201 494 1000
7864A000j382l38M51P15J91q37n27J98P14P85j147r64P11O75N32o56j143L43R60
$$ 1000 -382 -720 -269 446 637 -200 -727 -529 185 970 -177 -1141 -430 245 777 121 -1022 -679 281
7883B81M54o56p90j73J128N46k92j030k19R80N24m76n61k20M76R26m36o07l87
$$ 281 735 79 -711 -884 244 790 498 -532 -751 229 753 277 -284 -504 -28 898 462 -145 -532
7902e32K28Q95J63r91n68O72P81j54o24o62O18N60J38j009j7R7J049J96j072m15
$$ -532 -304 591 754 -237 -805 -133 648 494 -130 -792 -174 386 524 -485 -502 -405 644 840 -232 -647
7922f47N7Q10N27p89o25M02L60K81m62m95o9J138ol68m61k34O72N30k63q66j12
$$ -647 -590 220 747 -42 -667 -265 95 376 -86 -581 -650 488 482 114 -347 -581 91 621 358 -508 -620
7943f20N05Q17n23r21L73K58O85j38p70k66M77O76l06l58n05O41M42j27m32l44
$$ -620 -115 702 179 -742 -369 -111 574 436 -334 -600 -123 553 247 -111 -616 25 467 340 -92 -436
7963d36kP82K1m26l48M66M79L2m01n83M01K48J00k82m88K59L76J93k75o31J20
$$ -436 -438 344 365 -61 -409 57 536 568 167 -416 -15 233 333 51 -437 -178 198 391 116 -515 -395
7984c95M20L49p7m55k21L12L35j74l28q2L65M72m10k09j09J67K51j90l29K43K49
$$ -395 25 374 297 -158 -379 -67 268 94 -234 -316 49 521 111 -98 -207 -40 211 21 -308 -65 184
8005A84k03R3k36q2j03N59K8m58j1O33j75J50m83J28K81k97K23k31M1j58N54j66
$$ 184 -19 74 -162 -244 -347 212 240 -218 -229 404 229 379 -104 24 305 8 231 0 41 -117 437 271
8027B71l15j04J49K31j97J32l07mL90k94j03p2K95r3k05J3K03P5nj36m09M46K2
$$ 271 -44 -148 1 232 35 167 -140 -144 246 -48 -151 -223 72 -21 -226 -213 -10 65 60 -76 -485 -39 -17
8050a7K6j36P9K1J40L90q51L35L2K45J18k80j19k12M73K81m78m53JO28L68m64
$$ -17 9 -127 -48 -27 113 503 -348 -13 19 264 382 102 -17 -229 244 525 47 -406 -405 223 591 127
8072A27q20M71L50L15l47n7l44K99N32j11p23k14Q10K48j77l93o02P20M86j84
$$ 127 -693 -222 128 443 96 39 -305 -6 526 415 -308 -522 288 536 359 -34 -636 84 570 386
8092C86p01k73L64N37L19j061n71R46M53K78q56j91Q8P00K94o13o75K78O58J79
$$ 386 -315 -588 -224 313 632 -429 -1000 -54 399 677 -179 -370 -282 418 712 99 -576 -298 360 539
8112E39l23n73O3O13M03n21r98J09Q96O11k42r42j02Q50J22l63q84J09M42P20
$$ 539 216 -357 -294 319 722 201 -797 -688 208 819 577 -365 -467 383 505 142 -742 -633 -191 529
8132E29m03n14KK90N52l05j77l10K36P34m4q24k01J61N75M29r26m82M87O18N15
$$ 529 126 -388 -386 -96 456 151 -26 -336 -100 634 590 -234 -435 -274 301 730 -196 -678 -191 427 942
8153I42j313m51N06N15O54q61o46K65Q11K12l80p75l5Q90O96j119k61k33P77N76
$$ 942 -371 -822 -316 199 853 -8 -654 -389 422 634 254 -521 -556 334 1030 -89 -350 -583 194 770
8173G70o96p71Q7P09L81Np97l86M38J020l31o29l30N71L98O1m58q32
$$ 770 74 -697 -610 99 480 485 -312 -698 -260 760 429 -200 -530 41 439 500 42 -790
8191g90
$$ Imaginary data points
##PAGE= N=2
##DATA TABLE= (X++(I..I)), XYDATA
0@%%%Qj6QqK4l2L4m8O2p2Q9j07J25j53J87k16K54l04L49m02M74n42O13p07Q06
$$ 0 0 0 0 8 -8 0 -8 16 -16 18 -30 32 -40 49 -58 67 -86 101 -115 139 -165 184 -218 256 -286 327 -380 426
28D26r06J027j162J300j455J634j822K025k256K506k777L083l419L779m182M636
$$ 426 -480 547 -615 685 -770 864 -958 1067 -1189 1317 -1460 1623 -1796 1983 -2199 2437
44B437n134N693o329P048p873Q837r970J1326j2995J5100j7840K1590k7061L5796
$$ 2437 -2697 2996 -3333 3715 -4158 4679 -5291 6035 -6960 8140 -9700 11890 -15171 20625
58B0625n2002R2058l67687o62018O97748P68448l9851p61993l88749L72209O09760
$$ 20625 -31377 60681 -307006 -969024 -271276 497172 457321 -304672 -693421 -321212 288548
69B88548R756n00190l40455K59921N12472J76165m35403n38393Q0012O99446M29797
$$ 288548 298304 -201886 -542341 -282420 230052 406217 -29186 -567579 -487567 211879 641676
80F41676l96056p18132q9168O57114N36616k90511o36791o5978N37100L45512
$$ 641676 245620 -472512 -561680 95434 632050 341539 -295252 -361230 175870 521382
90E21382k65126m66378m5209M31723L63985j61660m76269k22670K87083M82007
$$ 521382 256256 -210122 -255331 176392 540377 378717 -97552 -320222 -33139 448868
100D48868J08769m43451m49904J44235N23442J65437l96271l84856J56187M58797
$$ 448868 557637 114186 -335718 -191483 331959 497396 101125 -283731 -127544 331253
110C31253P7805m43564l34281K34292M46961P0653l60164l47266N8408L68486
$$ 331253 409058 -34506 -368787 -134495 312466 383119 22955 -324311 -265903 102583
120A02583K10936j89576l22965o9358K36400K35054q5872l10303q3134K93072
$$ 102583 313519 123943 -199022 -268380 -31980 203074 117202 -193101 -276235 16837
130A6837K45670j66426l61748p3522L21884L00697j20549l62622j09270K33832
$$ 16837 262507 96081 -265667 -339189 -17305 283392 162843 -199779 -309049 -75217
140g5217K20866l9035j97398j04978J05515J63812j0472j66086r2085R6260J75343
$$ -75217 145649 106614 -90784 -195762 -90247 73565 63093 -102993 -195078 -98818 76525
151G6525L9596j84942j94544O9477K44115Q5426j61562j79490J7375J70606Q0655
$$ 76525 116121 -68821 -263365 -193888 50227 135653 -25909 -205399 -188024 -17418 63237
162F3237j18090j18376O0716J23846N809r5766p1551L6955J11978N1499p1031
$$ 63237 -54853 -173229 -112513 11333 17142 -78624 -150175 -113220 -1242 50257 -20774
173b0774q6946l074O5769P0993Q724o5636l4305N6722M5416l6419m0992K7127
$$ -20774 -107720 -110794 -45025 25968 34692 -30944 -65249 -8527 36889 470 -40522 -13395
185a3395O7059K7989n7665o8624L6144Q9887N600o0839k0403L4698L2726j2995
$$ -13395 53664 81653 23988 -44636 -8492 81395 86995 26156 5753 40451 73177 60182
197F0182m7084k502O6828L3311n3554n9073R24M1893M8424j81o4026m0308L9168
$$ 60182 13098 10596 77424 110735 57181 -1892 -968 40925 89349 89168 25142 -15166 24002
210B4002N0258p148n3314l9496L8332P8661j3423j04924l5365Q3156P6322k6172
$$ 24002 74260 67112 13798 -25698 12634 91295 77872 -27052 -62417 20739 97061 70889
222G0889r3201m6510O7163Q3577k7516q6387j1537O0468M4375k0215p0578l4952
$$ 70889 -22312 -68822 -1659 81918 54402 -31985 -43522 16946 61321 41106 -29472 -64424
234f4424O4389P7406k0791q5753m2337M8701R0389J0294j08424p2605Q1296J09046
$$ -64424 -35 77371 56580 -29173 -71510 -22809 67580 77874 -30550 -103155 -21859 87187
246H7187k5556j21346n5355R0126J24946k7133j59059o5307J14297J25243k0814
$$ 87187 61631 -59715 -115070 -24944 100002 72869 -86190 -151497 -37200 88043 67229
257F7229j37605q8925Q2118J55337N582j61313j09586Q3117J71857M3091j64198
$$ 67229 -70376 -159301 -77183 78154 83736 -77577 -187163 -104046 67811 110902 -53296
268e3296j72006P2261K31628O8378j86736j93973N0986K39532J15520j77095k29733
$$ -53296 -225302 -153041 78587 146965 -39771 -233744 -182758 56774 172294 -4801 -234534
279b34534M2222K51259J23625j54336k35747j3289K47143J91318j25946k71895
$$ -234534 -192312 58947 182572 28236 -207511 -220800 26343 217661 91715 -180180
289a80180n5399K30686K28390o6601k92129j26241K29060K76001m8865k97172
$$ -180180 -235579 -4893 223497 156896 -135233 -261474 -32414 243587 194722 -102450
299a02450j50501J95736K98466K935l08327j99127J79828L09905M1290k68095
$$ -102450 -252951 -57215 241251 244186 -64141 -263268 -83440 226465 267755 -340
309c40k34817J07430L19973J03404k53439k64848O9203L09597J55047k12556l13651
$$ -340 -235157 -127727 192246 295650 42211 -222637 -153434 156163 311210 98654 -214997
320b14997J6346L35267J95016k03362l26205k7044L10314K43308j54436l47441
$$ -214997 -198651 136616 331632 128270 -197935 -224979 85335 328643 174207 -173234
330a73234o6949K90926K52287j09974l28438j25473K53879L01987o2919l44123
$$ -173234 -240183 50743 303030 193056 -135382 -260855 -6976 295011 232092 -112031
340a12031j67060K21141L20751L321l34515k34978J88975L54775L8387l18010
$$ -112031 -279091 -57950 262801 266122 -68393 -303371 -114396 240379 278766 -39244
350c9244k51966J37955L48089R3430k97553k87917J07176L45266J29535k45653
$$ -39244 -291210 -153255 194834 288264 -9289 -297206 -190030 155236 284771 39118
360C9118l09990K5508L37297J98631k10355l33113k0025L08270K35881j47247
$$ 39118 -270872 -245364 91933 290564 80209 -252904 -272929 35341 271222 123975
370A23975l47144p8575K97413K62672j19970l31951j14660K47610K92519n2445
$$ 123975 -223169 -301744 -4331 258341 138371 -193580 -308240 -60630 231889 179444
380A79444l29579j62770K09753K92250K344k83541k05932J45674L10710N5247
$$ 179444 -150135 -312905 -103152 189098 191442 -92099 -298031 -152357 158353 213600
390B13600k67293k25803J06293K94114J02917k28122k60019O4834K98831J28532
$$ 213600 -53693 -279496 -173203 120911 223828 -4294 -264313 -199479 99352 227884
400B27884j93116k50167R991K56695J69453j43347k57190k0815K30956J76057
$$ 227884 34768 -215399 -205408 51287 220740 77393 -179797 -200612 30344 206401
410B06401r4622k40825p2340K02282K06548o8735k37445q5983J66856K03944j8760
$$ 206401 111779 -129046 -201386 896 207444 138709 -98736 -184719 -17863 186081 167321
421A67321k18477j21986J40954K01911m890j85080j20379R4573J91297L3965j70174
$$ 167321 -51156 -173142 -32188 169723 164833 -20247 -140626 -46053 145244 179209 9035
432I035j37784P5564J74370M9654j30622j46856L1888J73369P4826j20273j41824
$$ 9035 -128749 -53185 121185 170839 40217 -106639 -74751 98618 173444 53171 -88653
443h8653J6346J39992Q3603q2577j43914n809J34965Q3525o8639j22440k7496
$$ -88653 -72307 67685 151288 68711 -75203 -81012 53953 137478 68839 -53601 -81097
454h1097R8439J00099l7633j23548l8636Q4584Q6525j3542r5192o0728N5460R3724
$$ -81097 17342 117441 79808 -43740 -82376 2208 88733 75191 -20001 -80729 -25269 68455
466F8455k592q6128n0481L5985P1919K0612o2635o5833K1144O5216J7758l7120
$$ 68455 65863 -20265 -70746 -34761 37158 57770 -4865 -70698 -49554 15662 33420 -3700
478c700m4458p522M0411L5618k1286m2217p145J8209J9581P392j9451k4485N540
$$ -3700 -48158 -55680 -15269 20349 -937 -43154 -50299 -32090 -12509 -5117 -24568 -49053 -43513
491d3513J9344P468M49j3045k5247J185L1669J7755j2149k7586k0291K0218M9014
$$ -43513 -24169 -16701 -16252 -29297 -54544 -53359 -21690 -3935 -16084 -43670 -63961 -43743 5271
504E271N809n0629l6377K3269N5471K7974m1564o6885P162P9802M1824m7359p3021
$$ 5271 11080 -39549 -75926 -52657 2814 30788 -10776 -77661 -70499 9303 51127 3768 -69253
517f9253j0342P6842P6735l2636j02920k6610Q4726Q5573j6008j02395n9387P5540
$$ -69253 -79595 -2753 73982 41346 -61574 -88184 -3458 82115 66107 -36288 -95675 -20135
529b0135J17782j866j14182p1643O0766J21251K9310j12041j06600N2746J42306
$$ -20135 97647 95781 -18401 -90044 -29278 91973 121283 9242 -97358 -44612 97694
540I7694M1108j06356j17456K1701J44178P7001j02670j42954J1532J44773R0609
$$ 97694 138802 32446 -85010 -63309 80869 157870 55200 -87754 -76222 68551 159160
551A59160p9026j54243k5795J47650J17463p5651j62488l7270J32364J35351m3599
$$ 159160 80134 -74109 -99904 47746 165209 89558 -72930 -110200 22164 157515 113916
562A13916j77548p1693J33392J51658l2031j70680r2537J07979J73440n88j80691
$$ 113916 -63632 -135325 -1933 149725 117694 -52986 -145523 -37544 135896 135308 -45383
573d5383j13783R9772J73094K1324j62582j42257P4098J96838M7400j65076j54533
$$ -45383 -159166 -59394 113700 135024 -27558 -169815 -95717 101121 148521 -16555 -171088
584a71088N1841J88748Q1750j42055j82483K8715J98698R7592j26071j83681n490
$$ -171088 -119247 69501 151251 9196 -173287 -144572 54126 151718 25647 -158034 -163524
595a63524J87217J34428j08606k04679k3040J83487J48729p5860k06993o7507
$$ -163524 23693 158121 49515 -155164 -178204 5283 154012 78152 -128841 -196348
605a96348J70638J79703n6165k08999q3454J47221J89082j7320k09478j18944
$$ -196348 -25710 153993 97828 -111171 -194625 -47404 141678 124358 -85120 -204064
615b04064J37454K04002p76j96291j36545J02606K16670M1412j93479j64073Q3587
$$ -204064 -66610 137392 136616 -59675 -196220 -93614 123056 164468 -29011 -193084 -109497
626a09497K13393O5716j64854j83255M9091K22898R3086j60640j91818K8128K07743
$$ -109497 103896 169612 4758 -178497 -129406 93492 186578 25938 -165880 -137752 69991
637F9991J20756j29885k12001l910K10162J38039j09375k07249l7686J84056J66082
$$ 69991 190747 60862 -151139 -155049 55113 193152 83777 -123472 -161158 22898 188980
648A88980p9352k17940n8043J74749J72469n0980k10845r6364J55022J99918k8497
$$ 188980 109628 -108312 -166355 8394 180863 129883 -80962 -177326 -22304 177614 149117
659A49117k12503j09658J30090J99847J0954j99016j44158J08518K09727L0553
$$ 149117 -63386 -173044 -42954 156893 167847 -31169 -175327 -66809 142918 173471
669A73471j80850j55109P1622K11819P1151j70972j82337N0443K07643R3055j38997
$$ 173471 -7379 -162488 -90866 120953 192104 21132 -161205 -110762 96881 189936 50939
680E0939j94454P994K05132J24196j23787k00979j7185J81661J46088q3632k10185
$$ 50939 -143515 -135521 69611 193807 70020 -130959 -148144 33517 179605 95973 -114212
691a14212n4241J74099J62858o0126j99768q5686J38505J84162j9286j98604j08955
$$ -114212 -168453 5646 168504 108378 -91390 -177076 -38571 145591 126305 -72299 -181254
702a81254J18144J80878J2219j71890j36824Q0443J90561M2278j54870j42114
$$ -181254 -63110 117768 129987 -41903 -178727 -98284 92277 134555 -20315 -162429
712a62429M8403J72730P6850j22717j61286J8480J66863Q9544r3639j48977j5041
$$ -162429 -114026 58704 135554 12837 -148449 -129969 36894 126438 32799 -116178 -131219
723a31219J40552J12767o6863j49860l2100J16073J11319k8090j30772o2813R2444
$$ -131219 9333 122100 55237 -94623 -126723 -10650 100669 72579 -58193 -121006 -28562
734b8562J18550j1774j14834o6451N9142J09311J9884r7409p9988M4654R9317
$$ -28562 89988 78214 -36620 -103071 -43929 65382 85266 -12143 -92131 -47477 51840
745E1840K3995p0193p5107J2940Q6422M3334n5229o9089N202O1085M2333k5591
$$ 51840 75835 5642 -69465 -56525 29897 73231 18002 -51087 -45885 15200 57533 31942
757C1942o3411j5064N3854M4723j7670m5783j8432K7248M2950J999m0608k2088
$$ 31942 -31469 -46533 7321 52044 34374 -11409 -29841 -2593 40357 42356 1748 -20340
769b0340K0422K6833Q077j2908k2719l437K1467J3215o942j1554j0342j374J8926
$$ -20340 82 26915 34992 22084 -635 -4072 17395 30610 23668 12114 1772 398 19324
782A9324J5087j2645k0707p110R013K1617Q549k6742k8502J0124L1428J4927j8670
$$ 19324 34411 21766 1059 -6051 2962 24579 33128 6386 -22116 -11992 19436 34363 15693
795A5693l9701j2693M0653L8414k2827n2090j5031L8918M9542n125o4682l7025
$$ 15693 -24008 -36701 3952 42366 19539 -32551 -47582 -8664 40878 35753 -28929 -65954
807f5954M4405O3508o00o1099m8969K8509P9437K3089p1509o7217K5872Q2560
$$ -65954 -21549 41959 41359 -19740 -68709 -40200 39237 62326 -9183 -76400 -50528 32032
819C2032L7785n8479q6426N173R8258N6307o0993r3963q128Q8901P6212m2331
$$ 32032 69817 11338 -75088 -69915 28343 84650 23657 -70306 -78434 10467 86679 44348
831D4348j10975k5128R4734Q5549l2353j09840n0759Q1184J11257j3236j22207
$$ 44348 -66627 -91755 2979 88528 56175 -53665 -104424 -23240 88017 74781 -47426
842d7426o3767P4570J13954Q672j14040r0732O1412J29891K0077j11096r4311
$$ -47426 -111193 -36623 77331 86003 -28037 -118769 -57357 72534 92611 -18485 -112796
853a12796M3217J28344M7957j03853j17634L1062J33889N9086q6671j20563L641
$$ -112796 -69579 58765 106722 2869 -114765 -83703 50186 109272 22601 -97962 -94321
864i4321J31227Q3555q0307j31280m525J23262R1730n8449j36132k9772J24771
$$ -94321 36906 120461 40154 -91126 -95651 27611 119341 60892 -75240 -105012 19759
875A9759J07859n2566j35972m3194J04587J20613k4858j41113o2541J01427J24483
$$ 19759 127618 75052 -60920 -104114 473 121086 96228 -44885 -107426 -5999 118484
886A18484j6409j32567p8875Q3582J40483L314j40422r1184P7150J38926K2326
$$ 118484 102075 -30492 -109367 -25785 114698 118012 -22410 -113594 -36444 102482 124808
897A24808j27593j14483N6719J52534L7967j24845j19222M0521J48196O2346j16072
$$ 124808 -2785 -117268 -60549 91985 129952 5107 -114115 -73594 74602 136948 20876
908B0876j43342K6705J58486P5842j03415j48222j485J52902J04361r0764j62613
$$ 20876 -122466 -95761 62725 138567 35152 -113070 -114555 38347 142708 51944 -110669
919a10669j6041J46723J14120o5487j65082m6426J42266J37912n3157j71102o4363
$$ -110669 -126710 20013 134133 68646 -96436 -142862 -596 137316 84159 -86943 -151306
930a51306J22719J54029j8529j72859r4263J12997J63339k303j59498j11003Q4195
$$ -151306 -28587 125442 106913 -65946 -160209 -47212 116127 113824 -45674 -156677 -72482
941g2482J73491K9238j56414j29208O7684J69773N4297j32407j50893L3228J75452
$$ -72482 101009 130247 -26167 -155375 -87691 82082 136379 3972 -146921 -113693 61759
952F1759Q0824j17974j54406Q987J59252J03501r3329j68945j3958J58285J16172
$$ 61759 142583 24609 -129797 -120810 38442 141943 48614 -120331 -134289 23996 140168
963A40168p2334j63394m4433J35799J39883m5161j66810o3451J16967J41396j2983
$$ 140168 67834 -95560 -139993 -4194 135689 90528 -76282 -139733 -22766 118630 105647
974A05647j51690r1659R7188J54889K311j46785j00767P2914J54666L6253j34015
$$ 105647 -46043 -137702 -40514 114375 116686 -30099 -130866 -57952 96714 132967 -1048
985a048j23014N3085J50776M9738j07486j24427J8608J41548P4491r3114j29322
$$ -1048 -124062 -70977 79799 129537 22051 -102376 -83768 57780 132271 39157 -90165
996i0165M892J25983Q4128o4820j34525k5698J20113J01238m8173j25761m2032
$$ -90165 -85273 40710 124838 60018 -74507 -100205 19908 121146 72973 -52788 -94820
1007i4820Q9821J05492j8958j18420n5597P7464R8396n119r6574o7231M9872J03260
$$ -94820 -4999 100493 81535 -36885 -92482 -15018 83378 78259 -18315 -85546 -35674 67586
1019F7586J6009r1056p3199L3353Q9980L5397o4395q1440J2031Q3020L7078n1606
$$ 67586 83595 -7461 -80660 -47307 42673 78070 13675 -67765 -55734 27286 64364 12758
1031A2758o5769o21O3959M6524l5351o8508p655N4526M2256j6682n3671k6040
$$ 12758 -53011 -53632 10327 56851 21500 -47008 -54663 -137 42119 25437 -28234 -54274
1043e4274L6749M9886n755m4816k1746K0319L3431O884l1050k5914J7524L1099
$$ -54274 -17525 32361 26606 -18210 -39956 -19637 13794 20678 -10372 -36286 -18762 12337
1055A2337K289j9941j7397m17J9828J5201r890j6133j662M865Q649Q415n025j3199
$$ 12337 14626 -5315 -22712 -23129 -3301 11900 2010 -14123 -15785 -10920 -2271 6144 1119 -12080
1069a2080r78O113N287N433l815j3574K59J6874Q039p875j5352r963J4917K7995
$$ -12080 -13058 -6945 -1658 3775 -40 -13614 -13355 3519 11558 3683 -11669 -21632 -6715 21280
1083B1280q62l0805j7184J8035K9913R597k8111l3114J1958M3017J2522l1762
$$ 21280 20418 -10387 -27571 -9536 20377 29974 1863 -31251 -19293 23724 36246 4484
1095D484l1977O151M1970K6600l1829n0168L249N1346L2348k4713n3696j5260
$$ 4484 -27493 -21342 20628 47228 15399 -34769 -31520 19826 52174 27461 -26235 -41495
1107d1495N1036M9780k3128o3223j6962M7159N2921r446o6960l4794N1123O5833
$$ -41495 9541 59321 36193 -27030 -43992 3167 56088 46642 -20318 -55112 -3989 61844
1119F1844j0071p0559m1210M0065P5310R740p5030n7190L8742P8222J4819o6558
$$ 61844 51773 -18786 -59996 -19931 55379 65119 -9911 -67101 -28359 49863 64682 -1876
1131a876o6735K3413Q9744L0809p2546p5894J9931Q7147M3883o0717r1816L447
$$ -1876 -68611 -45198 44546 75355 2809 -73085 -53154 33993 77876 17159 -74657 -71210
1143g1210R6774N6755n7529r1460r641Q6567P2554m4819j05050k0172R0996P8257
$$ -71210 25564 82319 24790 -66670 -76311 10256 82810 37991 -67059 -87231 3765 82022
1155H2022l3244j02317m1246Q0773R7706k1121j10454n0414P2532J01179l45j06068
$$ 82022 48778 -53539 -94785 -14012 83694 62573 -47881 -98295 -25763 75416 75071 -30997
1167c0997p2217O4189J13136P050j03800p7809M7170J15778L2560j00070r7559
$$ -30997 -103214 -39025 74111 81161 -22639 -100448 -53278 62500 95060 -5010 -102569
1178a02569L8206J17954M2787q5884j05653J4332J21903O5042q2086j15199M300
$$ -102569 -64363 53591 96378 10494 -95159 -80827 41076 106118 24032 -91167 -86867
1189h6867J14767P6948o2894j25379j7850J18613R2097n4748j24806l2879J01429
$$ -86867 27900 104848 41954 -83425 -101275 17338 109435 54687 -70119 -102998 -1569
1200a569J07659l2899j32631n0816R8852J13959j7482j23869p2348Q0016J29558
$$ -1569 106090 73191 -59440 -110256 -11404 102555 85073 -38796 -111144 -31128 98430
1211I8430J671j27792q2609O8191J28437K3252j14318j03835N0150J36012L6465
$$ 98430 100101 -27691 -110300 -42109 86328 109580 -4738 -108573 -58423 77589 114054
1222A14054j06425j07740K9006J29229O2444r2206j24012J2319J26288P1046p2621
$$ 114054 7629 -100111 -71105 58124 120568 28362 -95650 -83331 42957 114003 41382
1233D1382j23437j4065J18686R2265o0567j28754k5787J04420R8085l5388j27232
$$ 41382 -82055 -96120 22566 114831 54264 -74490 -100277 4143 102228 66840 -60392
1244f0392m8787R6476J09342k3101j18027o0784P3007J13358K717j15005p4823
$$ -60392 -109179 -12703 96639 73538 -44489 -105273 -32266 81092 83809 -31196 -106019
1255a06019O4484J12826J4969r9389q6221M1516J17700L3002r5023r0996L0552
$$ -106019 -41535 71291 86260 -13129 -99350 -57834 59866 92868 -2155 -93151 -62599
1266f2599J07657M7827p5075j01065J0862J07436N4772o4882r4984l882R3019
$$ -62599 45058 92885 17810 -83255 -72393 35043 89815 24933 -70051 -73933 19086
1277A9086O9964m8692j02988j6133Q7198P1345l2673r4006l4753P3526Q4175k1711
$$ 19086 89050 40358 -62630 -78763 8435 79780 47107 -46899 -81652 -8126 76049 54338
1289E4338r3596l8764N9849P8473l127q3093n2878N1559Q2586K730p4715n3445
$$ 54338 -39258 -78022 -18173 60300 57173 -25920 -78798 -27239 55347 58077 -16638 -70083
1301g0083L1492P8106K2186o5541o2093K4795P2060K5924m8251o1571N354O9004
$$ -70083 -38591 39515 61701 -3840 -65933 -41138 30922 56846 8595 -52976 -47622 21382
1313B1382L6787m4376n9034L008N6385L9475k7136o0750j0532N2734M1423k0854
$$ 21382 58169 13793 -45241 -42233 14152 53627 26491 -34259 -44791 7943 49366 28512
1325B8512m8689j6524L5428M4384p314m9163k0401L1574L6004j598l5095k6490
$$ 28512 -20177 -36701 -1273 43111 35797 -13366 -33767 -2193 33811 32213 -2882 -29372
1337b9372J9221M0774K950l5068k2668J1890K8035J2014k0757k6859O154K5909
$$ -29372 -10151 30623 33573 -1495 -24163 -12273 15762 27776 7019 -19840 -13686 12223
1349A2223P372j4237j6150l321J4578J4992p389j7487k022J0118P915J881q519
$$ 12223 19595 5358 -10792 -14113 465 15457 8068 -9419 -11441 -1323 6592 8473 -46
1362d6j1232K983J0206K887j794l155p804J71J1135M524o551p688m740N983J5719
$$ -46 -11278 -8295 1911 4798 3004 -151 -7955 -7784 3351 7875 1324 -6364 -11104 -5121 10598
1377A0598J293j9388j0583J1664J6895M638j6830k2448N327L0713J1166k1520
$$ 10598 11891 -7497 -18080 -6416 10479 15117 -1713 -24161 -18834 11879 23045 1525
1389A525k5018o61K6919K3457j5646l9028n093L5971K8090j3799m0432j8338L4016
$$ 1525 -23493 -24154 2765 26222 10576 -28452 -33545 2426 30516 16717 -23715 -42053 -8037
1402h037M4691r177n1854k2733L4183M8219L385n1046m0655L0294O0634P723n2529
$$ -8037 36654 27477 -24377 -47110 -12927 35292 38677 -12369 -53024 -22730 37904 45627 -6902
1415f902m4871K0752O5278K6026n3986o3163J5963P1287L4286m5482p0074k809
$$ -6902 -51773 -31021 34257 60283 6297 -56866 -40903 30384 64670 19188 -50886 -53695
1427e3695P5503N2615m3908p9703r712P0186O0968k7815q7477k8477P2628P4728
$$ -53695 21808 74423 30515 -49188 -58900 11286 72254 44439 -43038 -71515 1113 75841
1439G5841k1900q6747m2674N6435Q7553J69r1735n8176N2342R0453J2208q1031
$$ 75841 53941 -32806 -75480 -19045 68508 68677 -23058 -81234 -28892 61561 73769 -7262
1451g262p3899L4460J01006K9171q2534q0710K3994R6658M7042o6627r5988L958
$$ -7262 -81161 -46701 54305 83476 942 -79768 -55774 40884 87926 21299 -74689 -70731
1463g0731R9347N8374n4832r4672j3872Q8076P6931m1447j05287k5463Q4733Q1523
$$ -70731 28616 86990 32158 -62514 -76386 11690 88621 47174 -58113 -83576 1157 82680
1475H2680k5285j01304m6583P4691R6712j3151j01909n4163N8737R5310Q926r3887
$$ 82680 57395 -43909 -90492 -15801 80911 67760 -34149 -88312 -29575 65735 74661 -19226
1487a9226p0611N0232J00563J5911q5143p6625L0585J01861L7583q0475q8434
$$ -19226 -89837 -39605 60958 76869 -8274 -84899 -54314 47547 85130 4655 -83779
1498h3779K1971R8728M6213o4352r2629J682R6665N8680n7616r1459n842Q4787
$$ -83779 -61808 36920 83133 18781 -73848 -72166 24499 83179 25563 -65896 -71738 13049
1510A3049O6690m0015r7556k2542Q2358P4399k9122r1156l5936O6766Q4310j3442
$$ 13049 79739 39724 -57832 -80374 1984 76383 47261 -43895 -79831 -13065 71245 57803
1522E7803r2889m4840O0696Q0612j404q1355n5835M7527Q8223P459q0350n8372
$$ 57803 -35086 -79926 -19230 61382 59978 -21377 -77212 -29685 58538 65997 -14353 -72725
1534g2725L5587Q2099K4979o7842p0861K4115Q4193K9319n9030o8866R297P7936
$$ -72725 -37138 44961 69940 2098 -68763 -44648 39545 68864 9834 -59032 -49735 28201
1546B8201M3658n2905p5321O007P4241M4094m0348p3652j0967O9603N4940l3802
$$ 28201 71859 18954 -56367 -50360 23881 67975 27627 -46025 -56992 12611 67551 33749
1558C3749p2435j5268N7635N6563j8652p2758k7886N6632O0095j5487o6367l1905
$$ 33749 -38686 -53954 3681 60244 41592 -31166 -59052 -2420 57675 42188 -24179 -56084
1570e6084M3791O4860l466o9338l8395M0801O1169M481n6622m5732K7000O5389
$$ -56084 -12293 52567 49101 -20237 -58632 -17831 43338 47819 -8803 -54535 -27535 37854
1582C7854J1675n5994m5418K0955N8145K2421m5047n5375J2774O1781K4801m0641
$$ 37854 49529 -6465 -51883 -30928 27217 49638 4591 -50784 -38010 23771 48572 7931
1594G931n1091J250N3432L6742l0943n5668l126M8476L4502k0109m9843j6343
$$ 7931 -43160 -41910 11522 48264 17321 -38347 -41473 7003 41505 21396 -28447 -44790
1606d4790M2830M3851j5820m9719j7374L3279M1718j691m6436k8695K9093M3202
$$ -44790 -1960 41891 26071 -23648 -41022 -7743 33975 32284 -14152 -42847 -13754 29448
1618B9448J219l6416k7624J4152L9803J2324l4153l1441J2600L4269J4596k0711
$$ 29448 30667 -5749 -33373 -19221 20582 32906 -1247 -32688 -20088 14181 28777 8066
1630H066l2494j957L3231K0955j8217k7855n082K0674K3093m217k7011j1070J7841
$$ 8066 -24428 -26385 6846 27801 9584 -18271 -23353 -2679 20414 16197 -10814 -21884 -4043
1643d043J8180j405j5524j4082N085K0931P603j4198j4015L33J0480J3158r42
$$ -4043 14137 12732 -2792 -16874 -11789 9142 16745 2547 -11468 -11135 -655 12503 11561
1656A1561j6523q085R084J2080L807n617j3639m377J4062J2405n206j3705q193
$$ 11561 -4962 -13047 -3963 8117 11924 6307 -7332 -11709 2353 14758 9552 -4153 -12346
1669a2346P066K0180O066k0678j8812P654K1789J1875j2738k6402n124K6968K2384
$$ -12346 -5280 14900 20966 288 -18524 -10870 10919 22794 10056 -16346 -21470 5498 27882
1682B7882j2629k9000j1369K0341L0917j389l7438k0577K4691L6091J601l4728
$$ 27882 15253 -13747 -25116 -4775 26142 24753 -12685 -33262 -8571 27520 29121 -5607
1694e607l1925J5138M6454J4129l8384l7499R594M4269K5019k9697m9752O5N0569
$$ -5607 -37532 -22394 24060 38189 -195 -37694 -28100 16169 41188 11491 -38261 -38196 12373
1707A2373L2160k7780n0811j0543M8303M6380k0976o2704j8720M8824N0514r421
$$ 12373 44533 16753 -34058 -44601 3702 50082 29106 -33598 -52318 -3494 47020 37599
1719C7599n9272l3665M0826O1710k532o1616l9107L2864O3386J3379n9439n4284
$$ 37599 -21673 -55338 -14512 47198 44666 -16950 -56057 -23193 40193 53572 -5867 -60151
1731f0151K6237P2106K0475n4993o0447J0766P1824L8949m9737o9283M089O8104
$$ -60151 -33914 38192 58667 3674 -56773 -46007 25817 64766 15029 -54254 -50165 17939
1743A7939M3332l6035p2850j3148O7959N7165l0828p4576k2612N8013O6009j3014
$$ 17939 61271 25236 -47614 -60762 7197 64362 33534 -41042 -63654 -5641 60368 47354
1755D7354p8511l8722N3932P1937m147p0923m7314L9500P7217R584p1761n5074
$$ 47354 -31157 -69879 -15947 55990 51843 -19080 -66394 -26894 50323 59907 -11854 -66928
1767f6928L3950P5399K1590o0521o6452J8482P9944L2231n6248o7761O647P2256
$$ -66928 -32978 42421 64011 3490 -62962 -44480 35464 67695 11447 -56314 -49667 22589
1779B2589M5280m3385p5765l276P1705M8375l6259p2292j6256O3890O1138k6995
$$ 22589 67869 24484 -51281 -54557 17148 65523 29264 -43028 -59284 4606 65744 38749
1791C8749p6240k2422N6614N9615j2490p0720l6327M9584O6882o558o6933l8609
$$ 38749 -37491 -59913 -3299 56316 43826 -26894 -63221 -13637 53245 46687 -20246 -58855
1803e8855L7786O6001P255o4881m9597L4230O8418J2505n6170n2218J9741O7561
$$ -58855 -21069 44932 52187 -12694 -62291 -28061 40357 52862 -3308 -55526 -35785 31776
1815C1776K4247n3970n5328J5927O2643K8325m0939n9574L026O3355L6081l8613
$$ 31776 56023 2053 -53275 -37348 25295 53620 12681 -46893 -43867 19488 55569 16956
1827A6956n9438l211N5523M4524k6796o4548j2620N5607M5173k2149n8929k0352
$$ 16956 -42482 -45693 9830 54354 27558 -36990 -49610 5997 51170 29021 -29908 -50260
1839e0260M6554N3490j3576o1895k4729M1739N1206l341n5330l6779L4142N8767
$$ -50260 -3706 49784 36208 -25687 -50416 -8677 42529 39188 -16142 -52921 -18779 39988
1851C9988K970n3639l8375K4862N5146J4218m8629m6286K0528N7028J6604m1025
$$ 39988 42958 -10681 -49056 -24194 30952 45170 -3459 -49745 -29217 27811 44415 3390
1863C390m6039P654N3246K7806l6442m9627L141M8307L1259k3988m9796r978M5627
$$ 3390 -42649 -34995 18251 46057 9615 -40012 -36871 11436 42695 18707 -31089 -41067 4560
1876D560L7244k0987m6666j2256L5677L9554q377m7395k0423L2982L8493m503
$$ 4560 41804 20817 -25849 -38105 -2428 37126 28749 -18646 -39069 -6087 32406 27903
1888B7903l8053k4558K0867M1097N043l6803k6691J6221L4091J0503k6951l0438
$$ 27903 -10150 -34708 -13841 27256 32299 -4504 -31195 -14974 19117 29620 2669 -27769
1900b7769P887L6579J2828k5049k6862K367K7651J8750j6057k9968r06K5636J6328
$$ -27769 -19882 16697 29525 4476 -22386 -20019 7632 26382 10325 -19643 -20549 5087 21415
1913B1415j0249k2517r078J8404K0981o545k2710o999J3937J6512R69j6990j4256
$$ 21415 11166 -11351 -20429 -2025 18956 12411 -10299 -17298 -3361 13151 14120 -2870 -17126
1926a7126R665J7739J315j2112r775J802J2200Q461q496j2061R49Q335N391l01
$$ -17126 -7461 10278 11593 -519 -10294 -8492 3708 12169 3673 -8388 -7439 896 6287 5986
1940E986q376o338O430R329l57n895n376k709O953Q988k644r486l500L371Q259
$$ 5986 -2390 -8728 -2298 7031 6674 779 -4597 -7306 -353 8635 5991 -3495 -6995 -3624 4635
1955D635N554p946j2729J456J3286O458n358j2679n916J2025J6269m692j9298
$$ 4635 10189 2243 -10486 -9030 4256 10714 5356 -7323 -13239 -1214 15055 10363 -8935
1968h935q332J1398J8095M774j9171j9159R515K4724O313j9102k0641K588K7012
$$ -8935 -17267 -5869 12226 17000 -2171 -21330 -11815 12909 19222 120 -20521 -17933 9079
1981I079J6659j9771k8474J823K7553J9237j3640l2065r271L0140K8929j1792
$$ 9079 25738 5967 -22507 -20684 6869 26106 12466 -19599 -28870 1270 30199 18407
1993A8407l5277j2788K4895L3009k298l9263k1814K6459L7954K3l6325k7655J7566
$$ 18407 -16870 -29658 -4763 28246 25948 -13315 -35129 -8670 29284 29307 -7018 -34673 -17107
2006a7107M3348J0297l9586l3958J5445M3121J6865l1986m1392N838M6872K3676
$$ -17107 26241 36538 -3048 -37006 -21561 21560 38425 6439 -34953 -29115 17757 41433
2018D1433l1771m3447N82M3494L2961k4118n1268p502M5452L5766j8639m8476
$$ 41433 9662 -33785 -33203 10291 43252 19134 -32134 -39636 5816 41582 22943 -25533
2030b5533j7527L9210M5747j1154n3004k2178L5596M6204k069n0293l3423L1339
$$ -25533 -43060 -3850 41897 30743 -22261 -44439 -8843 37361 35292 -15001 -48424 -17085
2042a7085N4369L619m9792l7318K1888N4180J6026m7064m6287J8057N6573K0281
$$ -17085 37284 40903 -8889 -46207 -24319 29861 45887 -1177 -47464 -29407 27166 47447
2054D7447m0586m9439N850N6665L1575l8043n5725J468N4154L7745k7436n9695
$$ 47447 6861 -42578 -36728 19937 51512 13469 -42256 -40788 13366 51111 23675 -36020
2066c6020j1717N3738M5238k3934n8486j7166M5831N1322j2342o2708k6619M4315
$$ -36020 -47737 6001 51239 27305 -31181 -48347 -2516 48806 36464 -26244 -52863 -8548
2078h548N3534n149n6519l6269L3144O1247N663n7588m1500K7021N7694J5743
$$ -8548 44986 39837 -16682 -52951 -19807 41440 47103 -10485 -51985 -24964 32730 48473
2090D8473m9067n0532J8013O2448K2479m5832n1998P473N7262L3917l6812n7977
$$ 48473 -594 -51126 -33113 29335 51814 5982 -46016 -38543 18719 52636 15824 -42153
2102d2153q07N6023L7161k7163n6066j3291M8598M6841k0344n7335j7781M2629
$$ -42153 -42960 13063 50224 23061 -33005 -46296 2302 49143 28799 -28536 -46317 -3688
2114c688M7545p973n5397k9780L7212N2401k675n0141l2234K5469N2164R230m7580
$$ -3688 43857 35884 -19513 -49293 -12081 40320 37645 -12496 -44730 -19261 32903 42133 -5447
2127e447l9387K2060M9999J2704l8475m1264J0295N0455K1880l6219m3670N365
$$ -5447 -44834 -22774 27225 39929 1454 -39810 -29515 20940 42820 6601 -37069 -31704
2139c1704M3939K6939k5124m5167l604M3056K9742k1699m1928r276L4832L4997
$$ -31704 12235 39174 14050 -31117 -34721 8335 38077 16378 -25550 -34826 6 35003
2151C5003j2651m3972j3438L2494L3296o576l7238k1289K3959L7905r51l5618
$$ 35003 22352 -21620 -35058 -2564 30732 24156 -13082 -34371 -10412 27493 26542 -9076
2163i076k1113J8385L2985O439k9680k7577J3308L4775Q051k4727k5116N443K9403
$$ -9076 -30189 -11804 21181 27620 -2060 -29637 -16329 18446 26497 1770 -23346 -17903 11500
2176A1500J5390k0626k7672L041K5758J4096j2595k3896m622K2649J8309j1415
$$ 11500 26890 6264 -21408 -18367 7391 21487 8892 -15004 -19626 3023 21332 9917
2188I917k2938m467J6220J6731k924k0164j0025J5108J6182l522j4506r465P557
$$ 9917 -13021 -17488 -1268 15463 12539 -7625 -17650 -2542 13640 10118 -4388 -13853 -6296
2201f296J5071K954j4572r043P344J1081K188p588j0027J464J1797M284p788n571
$$ -6296 8775 11729 -2843 -11886 -4542 6539 8727 1139 -8888 -7424 4373 8657 869 -4702
2215d702R27M636N200k454p196j120O386K359j809j690k865J220M422Q3l581o15
$$ -4702 -3775 861 6061 3607 -3589 -4709 1677 4036 2227 537 -2328 -1108 3314 3397 -184 -799
2231g99k66j21L298K082l458k523M36P59K890Q65n116l183M740M856r64m479m270
$$ -799 -1065 -1186 2112 4194 736 -1787 -1351 -592 2298 3163 -1953 -5136 -396 4460 3496 -983 -5253
2248e253O66Q481L436q867p144L651P714M713m698j0739j211J1497O740p332r996
$$ -5253 -4587 3894 7330 -1537 -8681 -5030 2684 7397 2699 -8040 -9251 2246 8986 1654 -8342
2263h342q76R805J1008m637j7032l722J4625J1875m754j5270p922J1883J8658
$$ -8342 -9218 587 11595 6958 -10074 -13796 829 12704 7950 -7320 -15242 -3359 15299
2276A5299k533k0224q893J2610J6822J326j8593j5017J1810K4039J682k1616j6361
$$ 15299 12766 -7458 -16351 -3741 13081 14407 -4186 -19203 -7393 16646 18328 -3288 -19649
2289a9649Q520K3959R447k1416k3504Q469K7658R812j9551k4355J236K9106J7118
$$ -19649 -11129 12830 22277 861 -22643 -14174 13484 23296 3745 -20610 -19374 9732 26850
2302B6850j9840k9768J079K8917K0328j3949l3857q677L0645K7808j2733l4492
$$ 26850 7010 -22758 -21679 7238 27566 13617 -20240 -28917 1728 29536 16803 -17689
2314a7689j1754K6084L2034n231l8513j8468K6479L4779j426l5388k5163J9514
$$ -17689 -29443 -3359 28675 23444 -15069 -33537 -7058 27721 26295 -9093 -34256 -14742
2326a4742M1289O418l8144l0250J5924M0274J4628l1689l8474Q680M5034J9458
$$ -14742 26547 32965 -5179 -35429 -19505 20769 35397 3708 -34766 -26086 18948 38406
2338C8406l0650l9900J717M1924K9359k4782m6836m539M2868L2398j7971m6081
$$ 38406 7756 -32144 -30427 11497 40856 16074 -30762 -35301 7567 39965 21994 -24087
2350b4087j5518L7630M2094j2372m8378j9652L3349M3194k216m7904l0395K9687
$$ -24087 -39605 -1975 40119 27747 -20631 -40283 -6934 36260 34044 -13860 -44255 -14568
2362a4568M9048K475m4773l3987J9855M9643J4088m2410m1373J5678M8612J9101
$$ -14568 34480 36955 -7818 -41805 -21950 27693 41781 -629 -42002 -26324 22288 41389
2374D1389l4146m4225L824M9224K8059l1323m7163j924M3593L4179j9857m9686
$$ 41389 7243 -36982 -33158 16066 44125 12802 -34361 -36285 7308 41487 21630 -28056
2386b8056j2204M2139L8624j5789m6335j8801L3464M3747n281m7645k5000K9803
$$ -28056 -40260 1879 40503 24714 -21621 -40422 -6958 36789 31508 -16137 -41137 -11334
2398a1334M2841K283m0688l2636J9370M6702J0053l8177l3501J2639M1509J7797
$$ -11334 31507 33790 -6898 -39534 -20164 26538 36591 -1586 -35087 -22448 19061 36858
2410C6858l1305l9621O551M2656K0652k5654l7689k286L7126K7958j9482m0469
$$ 36858 5553 -34068 -27517 15139 35791 10137 -27552 -29838 7288 35246 15764 -24705
2422b4705n759L2735K7678j1105l5783j4075K7605L1989q085l4787j5464K1399
$$ -24705 -30464 2271 29949 18844 -16939 -31014 -3409 28580 20495 -14292 -29756 -8357
2434h357L1506J510l2233k1749J8114L1191L104k6154k1668R785K9912R683k4119
$$ -8357 23149 24659 -7574 -29323 -11209 19982 23086 -3068 -24736 -14951 14961 24644 525
2447E25k2992Q473K5878R756j6478k4138J174K6205J3856j5040k1911j358J9075
$$ 525 -22467 -13994 11884 21640 5162 -18976 -17802 8403 22259 7219 -14692 -16050 3025
2460C025J6268q544k2950m737J9352J4962p393j8272o813J3305J7026l536j9028
$$ 3025 19293 10749 -12201 -16938 2414 17376 9983 -8289 -15102 -1797 15229 11693 -7335
2473g335o981J1616J3342J059j3425j1234P233J5330K31j2492p660M922J1373
$$ -7335 -14316 -2700 10642 11701 -1724 -12958 -5725 9605 9836 -2656 -10316 -5394 5979
2486E979M750j0208j0886M728J1220J711o792p082k77R004O356o515p820J738
$$ 5979 10729 521 -10365 -5637 5583 7294 502 -6580 -6857 2147 8503 1988 -5832 -4094
2500d094N692L530k191o460k703O795N749l192n334j301K486M440M80m880k907
$$ -4094 1598 5128 2937 -3523 -6226 569 6318 3126 -2208 -3509 -1023 3417 3897 -983 -3890
2515c890L801K609m92n81l080j029L670K230k875j894J61jL098K163m137l312
$$ -3890 -89 2520 2028 1447 -1633 -2662 1008 3238 363 -1531 -1370 -1371 1727 3890 -247 -3559
2531c559J730K090J475M2l344k940L549M374j019l813l380O40O505L712o025o850
$$ -3559 -1829 261 1736 1778 -1566 -4506 -957 3417 2398 -1415 -4795 -4155 2350 6062 37 -6813
2547f813K311P247L729l708r069k384R698Q144n442r612k506P569J0176q05j4108
$$ -6813 -4502 2745 6474 2766 -6303 -8687 1011 9155 3713 -5899 -8405 -836 9340 8535 -5573
2562e573o984J0956J2252r43j2560r819O557J7564K854j6418j2640P233J6544
$$ -5573 -12557 -1601 10651 9708 -2852 -12671 -6114 11450 14304 -2114 -14754 -7521 9023
2575I023O357j3025j7512L173K1179Q751j4508j8504J54J9325J5227j0940k4112
$$ 9023 15380 2355 -15157 -11984 9195 17946 3438 -15066 -14912 4413 19640 8700 -15412
2588a5412k984K1354J6767q472k3387r550J9310K3525n728k6468j1381J7441K3763
$$ -15412 -18396 2958 19725 11253 -12134 -21684 -2374 21151 15423 -11045 -22426 -4985 18778
2601A8778O85k6211j9147J5968K8883L568k5337k0763Q837K9534J1751k4593k7260
$$ 18778 19463 -6748 -25895 -9927 18956 22524 -2813 -23576 -14739 14795 26546 1953 -25307
2614b5307P361L0482J4228j8764k9711j344L1162K1298j8040l2058m412K7759
$$ -25307 -17946 12536 26764 8000 -21711 -23055 8107 29405 11365 -20693 -25105 2654
2626B654K5279r549l4609j2537K7592K8550p372l2960j6450K1280L3582K35l4943
$$ 2654 27933 18384 -16225 -28762 -1170 27380 20008 -12952 -29402 -8122 25460 25695 -9248
2639i248k1661J9287L3130N195k9785k7179J1807L6929J1268k8908k9503Q015
$$ -9248 -30909 -11622 21508 26703 -3082 -30261 -18454 18475 29743 835 -28668 -20653
2651b0653L3395J7508k3481l4310J773L6135K0611k0071l3061n725L0885K7221
$$ -20653 12742 30250 6769 -27541 -25768 10367 30978 10907 -22154 -27879 3006 30227
2663C0227j4059l6353q586K8417K7832p110l3467j7338K4301L2417l198l3382
$$ 30227 16168 -20185 -28771 -354 27478 20368 -13099 -30437 -6136 26281 23083 -10299
2675a0299j8684J8155L2453O124l0957k5522J4120L3196P686k5343k6064O582
$$ -10299 -28983 -10828 21625 27749 -3208 -28730 -14610 18586 26272 929 -25135 -18553
2687a8553L2026J4891k3231k8699L685K8477J6799j5844k9604m133K8322K1485
$$ -18553 13473 28364 5133 -23566 -19881 8596 25395 9551 -20053 -24186 4136 25621
2699B5621j3663k7932p169K1795K3153o529k9119j0707K1171K3495m358k4156
$$ 25621 11958 -15974 -23143 -1348 21805 15276 -13843 -24550 -3379 20116 15758 -8398
2711h398j4478J4625K5475N40k4100j4818J2488K1898N134j8814j9345Q071K3929
$$ -8398 -22876 -8251 17224 17764 -6336 -21154 -8666 13232 18366 -448 -19793 -11722 12207
2724A2207N734j7843j6348M463K0545J0672j4475k0279K447J9960J0083j0987
$$ 12207 17941 98 -16250 -11787 8758 19430 4955 -15324 -12877 7083 17166 6179
2736F179j7557k188J7223J3951r475j9211j905J4388J2375m545j6692p446J4057
$$ 6179 -11378 -13566 3657 17608 8133 -11078 -12983 1405 13780 9235 -7457 -14903 -846
2749h46J4882m481j5942o743Q767J4422P23j5058r750R714J3524K05j1174j0014
$$ -846 14036 9555 -6387 -13130 -4363 10059 10782 -4276 -14026 -4312 9212 9417 -1757 -11771
2763a1771M010J4139M671j1696j0382L841J1220N679o776j2343K49J2489O113
$$ -11771 -7761 6378 11049 -647 -11029 -7188 4032 9711 2935 -9408 -9159 3330 9443
2776I443p201q797j097Q067Q475l412j0863k665P969O282j104o438n695M528Q656
$$ 9443 2242 -6555 -7652 415 8890 5478 -5385 -8050 -81 6201 5097 -1341 -7036 -2508 6148
2791F148J93p904m151K549N883L109m224p263J509P171J759l161m100k387L604
$$ 6148 6341 -1563 -5714 -3165 2718 5827 1603 -5660 -4151 3020 4779 1618 -2482 -4869 -1265
2806a265N811j091n394j716K259L488J760k973n650R30O007J593k585l430k235
$$ -1265 4546 3455 -1939 -3655 -1396 2092 3852 879 -4771 -3841 2166 3759 1174 -2256 -4491
2821d491L467N736j296n896j985K298M225L007l831o730J409O815K372l535n291
$$ -4491 -1024 4712 3416 -2480 -4465 -2167 2058 5065 1234 -5496 -4087 2728 5100 1565 -3726
2836c726k191O119P043k996q565j999O051O523j05q728o484N766J0538K29q666
$$ -3726 -5917 202 7245 4249 -4316 -6315 -264 6259 6154 -2574 -9058 -3292 7246 7475 -1191
2851a191o540K282J0544M748r293j0819L638J1925M938p510j1356j478J3180R274
$$ -1191 -7731 -5449 5095 9843 550 -10269 -6631 5294 10232 2722 -8634 -10112 3068 12342
2865A2342p984j4140j004J1937J0420l434j5638n873J2780J3265m670j4188p313
$$ 12342 4358 -9782 -10786 1151 11571 8137 -7501 -13374 -594 12671 8001 -6187 -13500
2878a3500R456J6519Q71j7767j1243J0222J6437K311j4162j4569N530K0455O197
$$ -13500 -4044 12475 13346 -4421 -15664 -5442 10995 13306 -856 -15425 -9895 10560 16757
2891A6757j6103j5496L988J7684J0612j2500k0011N22K0494J2470j0991j9693
$$ 16757 654 -14842 -10854 6830 17442 4942 -15069 -14547 5947 18417 7426 -12267
2903a2267m560J7448J7819p481k2845o087J7207J7696l224k1103j2842J4458K2352
$$ -12267 -16827 621 18440 10959 -11886 -17973 -766 16930 13706 -7397 -20239 -5781 16571
2916A6571j171k1789j3148J0944K1911N361k0442j8960Q974K3270O816j7310j9001
$$ 16571 15400 -6389 -19537 -8593 13318 18679 -1763 -20723 -11749 11521 18337 1027 -17974
2929a7974L264K3354J2302j6638k1987J725K1655J3814j0973k3405l937K2270
$$ -17974 -14710 8644 20946 4308 -17679 -15954 5701 19515 8542 -14863 -18800 3470
2941C470J7640j0611k2858n843J7359J9840m724k4115r974J7273K0856k829k1467
$$ 3470 21110 10499 -12359 -18202 -843 18997 14273 -9842 -19816 -2543 18313 15484 -5983
2954e983j3358J2141K3389K209k2714j5220J1144K1635N523j8383j9594O749K4190
$$ -5983 -19341 -7200 16189 18398 -4316 -19536 -8392 13243 18766 383 -19211 -12462 11728
2967A1728P566j7917j8524L262K1202J2990j4289k2829R0K1965J3414j0671k0873
$$ 11728 19294 1377 -17147 -13885 7317 20307 6018 -16811 -16721 5244 18658 7987 -12886
2980a2886n085J8659J8491q044k3340o508J6912J7999k777k1463j1836J4909K1173
$$ -12886 -17971 688 19179 11135 -12205 -18713 -1801 16198 13421 -8042 -19878 -4969 16204
2993A6204j546k0188j2712R659K0493N450j8874j6611Q413K0432N950j4384j7737
$$ 16204 14658 -5530 -18242 -8583 11910 17360 -1514 -18125 -9712 10720 16670 2286 -15451
3006a5451K354K0234J1342j3930j8436P65J7159J2517p972j9689m369J6768J4406
$$ -15451 -13097 7137 18479 4549 -13887 -13122 4037 16554 8582 -11107 -15476 1292 15698
3019A5698o612j6541o627J1583J6307j783j8148r050J1125J4992Q09j3147j2078
$$ 15698 9086 -7455 -14082 -2499 13808 12025 -6123 -15173 -4048 10944 11753 -1394 -13472
3032a3472O077J6326L903j3242j1574L659J2998P525q858j3698P09J3424P139
$$ -13472 -7395 8931 12834 -408 -11982 -8323 4675 12200 3342 -10356 -9647 3777 10916
3045A0916o721j1514k986J0049J0517l824j2230l037Q116Q101o46r161o796N791
$$ 10916 4195 -7319 -10305 -256 10261 6437 -5793 -8830 -714 7387 6741 -2420 -9216 -3425
3059c425J0155N55q307n668K241Q191M307o972p921K000P993L407l493o325k310
$$ -3425 6730 7285 -1022 -6690 -4449 3742 8049 1077 -6844 -4844 3149 6556 3063 -3262 -5572
3074e572O071O092l211o620j186L222N367R43n586n072L644N725K82l635m083
$$ -5572 499 6591 3380 -3240 -4426 -1204 4163 5106 -480 -5552 -1908 3817 4099 464 -3619
3089c619m47N593M088m143m973J96L164L490j55m898l509M049N029k91m041l421
$$ -3619 -4066 1527 5615 1472 -3501 -3305 -141 3349 3194 -1704 -5213 -1164 3865 3574 -467 -3888
3105c888M10N590L141n324n003J394M845L414j461o461k967O165N501k594n224
$$ -3888 -3478 2112 5253 -71 -5074 -3680 1165 4579 3118 -3343 -6310 -145 5356 2762 -2462
3120b462k633K595P006J494p139n628L809O770J807m119p194K23Q728M407o379
$$ -2462 -5095 -2500 4506 6000 -1139 -6767 -2958 3812 5619 1500 -5694 -5471 3257 7664 1285
3135A285o558m93O225O475k455r110k881Q300O259k080p691n161N065R324J70
$$ 1285 -5273 -5766 459 6934 4479 -4631 -7512 788 7047 4967 -2724 -7885 -2820 6504 6674
3150F674r635m941N236Q015J431p089q314L341J0290K038p523o376J580Q138N037
$$ 6674 -2961 -7902 -2666 5349 6780 -309 -8623 -5282 5008 7046 -477 -6853 -5273 2865 7902
3165G902o088r405J015R551L960m989p408j560Q276P664n516r588k29P496O090
$$ 7902 1814 -7591 -6576 2975 6935 1946 -5462 -7022 1254 8918 3402 -6186 -6415 1081 7171
3180G171k061r271l243Q201Q089m145q719k832N546Q886n01j0221n497Q033Q325
$$ 7171 5110 -4161 -7404 797 8886 4741 -3978 -6810 -1264 7622 7121 -3100 -8597 -564 7761
3195G761j468q644o183N156J0587J297j0929o594N874R824J678q867r442L592
$$ 7761 6293 -2351 -8534 -3378 7209 8506 -2423 -9017 -3143 6681 8359 -508 -9950 -6358
3209f358J2933K948j0161q905K487J1474O449q937j2809J555J3413O829p568j1909
$$ -6358 6575 9523 -638 -9543 -7056 4418 10867 1930 -10879 -9324 4089 10918 3350 -8559
3223h559j970J2518J0960p265j4956k236J2225J1110l323j4842o659J1665J4718
$$ -8559 -10529 1989 12949 5684 -9272 -11508 717 11827 8504 -6338 -12997 -1332 13386
3236A3386l521j4994p303Q346J4878J822j4681j1834Q550J5340K616j2934j2787
$$ 13386 9865 -5129 -12432 -4086 10792 12614 -2067 -13901 -5351 9989 12605 -329 -13116
3249a3116L842J7184P006j3048j4453K800J4788Q555q682j6219k079J6071J1201
$$ -13116 -9274 7910 14916 1868 -12585 -9785 5003 13558 4876 -11343 -13422 2649 13850
3262A3850p831j5532l714J2085J3879l457j7723o768J2672J4178j542j4813r751
$$ 13850 6019 -9513 -13227 -1142 12737 9280 -8443 -15211 -2539 11639 10097 -4716 -14467
3275a4467Q580J6663J810j5832j0631O877J5014N333j1841j4623M087J6516O108
$$ -14467 -5887 10776 12586 -3246 -13877 -7000 8014 13347 1506 -13117 -9030 7486 13594
3288A3594j0618j3460RJ4358J0921q476j6327j291J3691J0346m614j4981n643
$$ 13594 2976 -10484 -10475 3883 14804 6328 -9999 -11290 2401 12747 8133 -6848 -12491
3301a2491J1511J3861l454j5185o297Q454J2979J477j3758j0692P459J4532K490
$$ -12491 -980 12881 9427 -5758 -12055 -3601 9378 10855 -2903 -13595 -6136 8396 10886
3314A0886j1188j1104K216J4203O912j0109j3109J865J2055Q170n497j3328l543
$$ 10886 -302 -11406 -9190 5013 11925 1816 -11293 -9428 2627 10797 5300 -8028 -11571
3327a1571J1918J0311m490j1826m681P864J1597P20j2755p762P394J0568K218
$$ -11571 347 10658 6168 -5658 -10339 -2475 9122 9842 -2913 -10675 -3281 7287 9505
3340I505q669r424K315J1909N108q417r056N80Q432O873l761j0666k866Q790P542
$$ 9505 836 -8588 -6273 5636 10744 2327 -6729 -6149 2283 9156 5395 -5271 -8137 653 8195
3355H195k363q371n164M515R536J017q985n574L313P370L289n316q200M52P935
$$ 8195 5832 -2539 -7703 -3188 6348 7365 -1620 -7194 -3881 3489 6778 1462 -6738 -6286 1649
3370A649M167m051o198j615N073O581j408p603l372N141N170J162n424n317K631
$$ 1649 5816 1765 -4433 -6048 -975 5606 4198 -3405 -6777 -1636 3534 4696 -728 -6045 -3414
3385c414P212J523n363m730Q59M898M587l113o765j59N812L461j534n329l327
$$ -3414 3798 5321 -42 -4772 -3913 985 5572 2459 -4306 -4465 1347 4808 3274 -2055 -5382
3400e382L976O992j271n931k127K582M781J435m862n133K224O250J545m381m070
$$ -5382 -1406 5586 4315 -1616 -3743 -1161 3620 5055 193 -4940 -2716 3534 5079 698 -3372
3415c372m60N745M139m240o571N16N121L703j639n642l013N547N407k617n584
$$ -3372 -3832 1913 6052 1812 -4759 -4243 878 4581 2942 -2700 -5713 -166 5241 2624 -2960
3430b960k508L522O061P32o763m385M338O029J23n259n074K062P534K540o498
$$ -2960 -5468 -1946 4115 4847 -1916 -6301 -1963 4066 4189 -1070 -6144 -4082 3452 5992 -506
3445e06m886J974N470K909l396o887K75P597L852m317o048o98N028N892k129q040
$$ -506 -5392 -3418 2052 4961 1565 -5322 -5047 2550 6402 2085 -3963 -4661 367 6259 4130 -3910
3461c910j728O387N237k027n977l459M065P525j200p623k880L799O117J776o735
$$ -3910 -5638 749 5986 3959 -2018 -5477 -1412 6113 4913 -2710 -5590 -1791 4326 6102 -633
3476f33n385K811P517R23n836m608R71O785L757n859o296J635O963K406l822o118
$$ -633 -6018 -3207 4310 5233 -603 -5211 -4240 2545 6302 443 -5853 -4218 2745 5151 1329 -4789
3492d789r87P043N280m715o641k47N546M521j817p092k479O717N934k839o695
$$ -4789 -5776 1267 6547 1832 -4809 -5056 490 5011 3194 -3898 -6377 340 6274 3435 -3260
3507c260k311M550O853p12q104l595N990O301o10o400m754L377Q372K86p520n064
$$ -3260 -5571 -1021 5832 5120 -2984 -6579 -589 5712 5102 -1298 -6052 -2675 5697 5983 -1537 -6601
3523f601M170O884K568o599p249K263R236K595o648o799P66P952N586n478r461
$$ -6601 -2431 4453 7021 422 -6827 -4564 4672 7267 619 -6180 -5414 2538 8124 2646 -6815
3538f815N32Q614M611l880q361k666Q116Q159l484r649l000O190P821J90r232
$$ -6815 -6283 2331 6942 3062 -5299 -7965 151 8310 4826 -4823 -7823 -1633 6188 6378 -2854
3553b854o275N953R664L89q354o341K777R526L453q405p803K935Q695M351n429
$$ -2854 -9129 -3176 6488 6877 -1477 -7818 -5041 4485 7938 -467 -8270 -5335 3360 7711 2282
3568B282q723j010R192O281n173q371r94O583P338j986r708l699P121P439j377
$$ 2282 -6441 -7451 1741 8022 2849 -5522 -6516 67 7405 5419 -4289 -7988 -867 6572 5195
3583E195p513m690M113Q879J002q255n692L678P254K405n222p332J239Q729L003
$$ 5195 -2318 -7008 -2895 5984 6986 -1269 -6961 -3283 3971 6376 1154 -6178 -4939 3790 6793
3598F793n915o077J03O448M950l258p801q76O534M776k381o372l002M678P226
$$ 6793 878 -5199 -5096 1352 6302 3044 -4757 -5633 901 5677 3296 -3076 -6078 -1400 5826
3613E826j920o831k353M181N744N21o142n101L582O817M24m940m379R63O329L572
$$ 5826 3906 -2925 -5278 -1097 4647 5168 -974 -6075 -2493 4324 4748 -192 -4571 -3608 2721 6293
3629F293n077o443J486N840K740k454n859j564N825N375l453o067j737M465N201
$$ 6293 1216 -5227 -3741 2099 4839 2385 -3474 -5038 787 6162 2709 -3358 -5095 -630 4571
3644D571j64o174m111M499N975m62m631m385J513O496K549n517n095J459N227
$$ 4571 4407 -1767 -5878 -1379 4596 4134 -497 -4882 -3369 3127 5676 159 -4936 -3477 1750
3659A750L111k800o301j278O251M783l042n346j840L374O086n65o503l282M258
$$ 1750 4861 2061 -4240 -5518 733 5516 2474 -2872 -4712 -1338 4748 4183 -2320 -5602 -1344
3674a344M966P31m619m572J207P044J627n054m607J083N061L844k658o224o07
$$ -1344 3622 4353 -266 -4838 -3631 3413 5040 -14 -4621 -3538 1523 5367 2709 -3515 -4122
3689d122M984L798k348m620k673M146N635n05o414k520L058M622J026m524m923
$$ -4122 862 4660 2312 -2308 -4981 -835 4800 4295 -2119 -4639 -1581 3041 4067 -457 -5380
3704e380K337O299J091m231m354K47M712L890l591n678N0N519L079j641n301k273
$$ -5380 -3043 3256 4347 116 -4238 -3991 721 4611 1020 -4658 -4608 911 3990 2349 -2952 -5225
3720e225M425N469j954n900j345L168M977N36n713l628L142O131j40m399l684
$$ -5225 -800 4669 2715 -3185 -4530 -1362 3615 4151 -1562 -5190 -2048 4083 3943 -456 -4140
3735d140J508N937K510n149n076J586N253K326k476n831p73O365M208l642n317
$$ -4140 -2632 3305 5815 666 -4410 -2824 2429 4755 2279 -3552 -4325 2040 6248 2606 -2711
3750b711j202M071M974r74o733k593M692N497p77n533l612K253O709R74o059m466
$$ -2711 -3913 158 5132 4158 -2575 -5168 -476 5021 4244 -1289 -4901 -2648 4061 5035 -1024 -5490
3766e490L149M942K319m210o347J292O660K437l640n305p79N528M871k466o956
$$ -5490 -2341 2601 4920 710 -5637 -4345 2315 4752 1112 -4193 -4972 556 5427 2961 -3995
3781c995j078N113M087q71n148l560M005O620q80n845l306K726N310J550m375
$$ -3995 -5073 40 4127 3256 -1892 -5452 -1447 5173 4293 -1552 -4858 -2132 3178 4728 353
$$ [...]
8191b10
##END NTUPLES=NMR FID
##END=
