##TITLE=1H_CA-8619
 CDCl3, 8 sc, 
 1.7.2019
##JCAMPDX= 6.0         $$ Bruker NMR JCAMP-DX V2.0
##DATA TYPE= NMR FID
##DATA CLASS= NTUPLES
##ORIGIN= UXNMR, Bruker Analytische Messtechnik GmbH
##OWNER= root
$$ XWIN-NMR		Version 3.5
$$ Mon Jul  1 13:56:30 2019 Russian Standard Time (UT+4h)  she@DPX200
##.OBSERVE FREQUENCY= 200.13155
##.OBSERVE NUCLEUS= ^1H
##.DELAY= (6, 6)
##.ACQUISITION MODE= SIMULTANEOUS
##.ACQUISITION SCHEME= undefined
##.AVERAGES= 8
##.DIGITISER RES= 18
##SPECTROMETER/DATA SYSTEM= spect
##.PULSE SEQUENCE= zg30
##.SOLVENT NAME= CDCl3
##.SHIFT REFERENCE= (INTERNAL, CDCl3, 0, 15.7039)
##AUDIT TRAIL= $$ (NUMBER, WHEN, WHO, WHERE, WHAT)
$$ ##TITLE= Audit trail, XWIN-NMR		Version 3.5
$$ ##JCAMPDX= 5.01
$$ ##ORIGIN= Bruker BioSpin GmbH
$$ ##OWNER= she
$$ F:/spectra/data/she/nmr/H-F/1/audita.txt
$$ ##AUDIT TRAIL=  $$ (NUMBER, WHEN, WHO, WHERE, WHAT)
(   1,<2019-07-01 13:55:19.29 +0400>,<she>,<DPX200>,
      <created by zg, POWCHK disabled, PULCHK disabled
       configuration hash MD5:
       00 E9 B6 7A A2 85 ED C7 34 08 36 98 17 FE 4E 26
       data hash MD5: 16K
       25 1E E1 A7 9A BE 9A B7 F5 D5 1D 88 DA 32 42 6E>)
$$ ##END=
$$ 
$$ hash MD5
$$ F7 19 80 07 4B 06 68 98 51 7A 22 D4 21 4E B0 E1
##$RELAX= 
##$RELAX= 
##$RELAX= 
##$RELAX= 
##$RELAX= 
##$RELAX= 
$$ Bruker specific parameters
$$ --------------------------
##$DU= <F:/spectra>
##$EXPNO= 1
##$NAME= <H-F>
##$PROCNO= 1
##$TYPE= <nmr>
##$USER= <she>
##$AMP= (0..31)
100 100 100 100 100 100 100 100 100 100 100 100 100 100 100 100 100 100 
100 100 100 100 100 100 100 100 100 100 100 100 100 100 
##$AQSEQ= 0
##$AQ_mod= 1
##$AUNM= <au_zg>
##$AUTOPOS= <>
##$BF1= 200.13
##$BF2= 200.13
##$BF3= 200.13
##$BF4= 200.13
##$BF5= 200.13
##$BF6= 200.13
##$BF7= 200.13
##$BF8= 200.13
##$BYTORDA= 1
##$CFDGTYP= 0
##$CFRGTYP= 5
##$CHEMSTR= <none>
##$CNST= (0..31)
1 1 145 1 1 1 1 1 1 1 1 1 1 1 1 1 1 1 1 1 1 1 1 1 1 1 1 1 1 1 1 1 
##$CPDPRG= <>
##$CPDPRG1= <>
##$CPDPRG2= <>
##$CPDPRG3= <>
##$CPDPRG4= <mlev>
##$CPDPRG5= <mlev>
##$CPDPRG6= <mlev>
##$CPDPRG7= <mlev>
##$CPDPRG8= <mlev>
##$CPDPRGB= <>
##$CPDPRGT= <>
##$D= (0..31)
0 1.2 0 0 0 0 0 0 0 0 0 0.03 0 0 0 0 0 0 0 0 0 0 0 0 0 0 0 0 0 0 0 0 
##$DATE= 1561974918
##$DBL= (0..7)
120 120 120 120 120 120 120 120 
##$DBP= (0..7)
150 150 150 150 150 150 150 150 
##$DBP07= 0
##$DBPNAM0= <>
##$DBPNAM1= <>
##$DBPNAM2= <>
##$DBPNAM3= <>
##$DBPNAM4= <>
##$DBPNAM5= <>
##$DBPNAM6= <>
##$DBPNAM7= <>
##$DBPOAL= (0..7)
0.5 0.5 0.5 0.5 0.5 0.5 0.5 0.5 
##$DBPOFFS= (0..7)
0 0 0 0 0 0 0 0 
##$DE= 6
##$DECBNUC= <off>
##$DECIM= 24
##$DECNUC= <off>
##$DECSTAT= 4
##$DIGMOD= 1
##$DIGTYP= 9
##$DL= (0..7)
0 120 120 120 120 120 120 120 
##$DP= (0..7)
150 150 150 150 150 150 150 150 
##$DP07= 0
##$DPNAME0= <>
##$DPNAME1= <>
##$DPNAME2= <>
##$DPNAME3= <>
##$DPNAME4= <>
##$DPNAME5= <>
##$DPNAME6= <>
##$DPNAME7= <>
##$DPOAL= (0..7)
0.5 0.5 0.5 0.5 0.5 0.5 0.5 0.5 
##$DPOFFS= (0..7)
0 0 0 0 0 0 0 0 
##$DQDMODE= 0
##$DR= 18
##$DS= 0
##$DSLIST= <SSSSSSSSSSSSSSS>
##$DSPFIRM= 0
$$ [...]
##$SUBNAM2= <"">
##$SUBNAM3= <"">
##$SUBNAM4= <"">
##$SUBNAM5= <"">
##$SUBNAM6= <"">
##$SUBNAM7= <"">
##$SUBNAM8= <"">
##$SUBNAM9= <"">
##$SW= 24.9336996594482
##$SWIBOX= (0..15)
0 0 2 0 0 0 0 0 0 0 0 0 0 0 0 0 
##$SW_h= 4990.01996007984
##$TD= 16384
##$TD0= 1
##$TE= 0
##$TE2= 300
##$TE3= 300
##$TEG= 300
##$TL= (0..7)
0 120 120 120 120 120 120 120 
##$TP= (0..7)
150 150 150 150 150 150 150 150 
##$TP07= 0
##$TPNAME0= <>
##$TPNAME1= <>
##$TPNAME2= <>
##$TPNAME3= <>
##$TPNAME4= <>
##$TPNAME5= <>
##$TPNAME6= <>
##$TPNAME7= <>
##$TPOAL= (0..7)
0.5 0.5 0.5 0.5 0.5 0.5 0.5 0.5 
##$TPOFFS= (0..7)
0 0 0 0 0 0 0 0 
##$TUNHIN= 0
##$TUNHOUT= 0
##$TUNXOUT= 0
##$USERA1= <user>
##$USERA2= <user>
##$USERA3= <user>
##$USERA4= <user>
##$USERA5= <user>
##$V9= 5
##$VALIST= <valist>
##$VCLIST= <CCCCCCCCCCCCCCC>
##$VD= 0
##$VDLIST= <DDDDDDDDDDDDDDD>
##$VPLIST= <PPPPPPPPPPPPPPP>
##$VTLIST= <TTTTTTTTTTTTTTT>
##$WBST= 1024
##$WBSW= 4
##$XGAIN= (0..3)
0 0 0 0 
##$XL= 0
##$YL= 0
##$YMAX_a= 629053
##$YMIN_a= -303152
##$ZGOPTNS= <>
##$ZL1= 120
##$ZL2= 120
##$ZL3= 120
##$ZL4= 120
##$ABSF1= 10
##$ABSF2= 0
##$ABSG= 5
##$ABSL= 3
##$ALPHA= 0
##$AQORDER= 0
##$ASSFAC= 0
##$ASSFACI= 0
##$ASSFACX= 0
##$ASSWID= 0
##$AUNMP= <proc_1d>
##$AZFE= 0.1
##$AZFW= 0.1
##$BCFW= 1
##$BC_mod= 2
##$BYTORDP= 1
##$COROFFS= 0
##$CY= 11.3945322036743
##$DATMOD= 1
##$DC= 2
##$DFILT= <>
##$DTYPP= 0
##$F1P= 18.9103706918063
##$F2P= -1.10871071338519
##$FCOR= 0.5
##$FTSIZE= 0
##$FT_mod= 4
##$GAMMA= 1
##$GB= 0.15
##$INTBC= 1
##$INTSCL= 1
##$ISEN= 128
##$LB= 0.24
##$LEV0= 0
##$LPBIN= 0
##$MAXI= 10000
##$MC2= 0
##$MEAN= 0
##$ME_mod= 0
##$MI= 1.114404
##$NCOEF= 0
##$NC_proc= 0
##$NLEV= 6
##$NOISF1= 3.799351
##$NOISF2= 2.8
##$NSP= 1
##$NTH_PI= 0
##$NZP= 0
##$OFFSET= 15.70392
##$PC= 1
##$PHC0= -8653.089
##$PHC1= 9.600971
##$PH_mod= 1
##$PKNL= yes
##$PPARMOD= 0
##$PSCAL= 0
##$PSIGN= 0
##$REVERSE= no
##$SF= 200.130013532006
##$SI= 16384
##$SIGF1= 3
##$SIGF2= 2
##$SINO= 400
##$SIOLD= 16384
##$SREGLST= <1H.CDCl3>
##$SSB= 0
##$STSI= 0
##$STSR= 0
##$SW_p= 3612.71676300578
##$SYMM= 0
##$S_DEV= 0
##$TDeff= 0
##$TDoff= 0
##$TI= <>
##$TILT= no
##$TM1= 0
##$TM2= 0
##$TOPLEV= 0
##$USERP1= <user>
##$USERP2= <user>
##$USERP3= <user>
##$USERP4= <user>
##$USERP5= <user>
##$WDW= 1
##$XDIM= 8192
##$YMAX_p= 0
##$YMIN_p= 0
$$ End of Bruker specific parameters
$$ ---------------------------------
##NTUPLES= NMR FID
##VAR_NAME=  TIME,          FID/REAL,        FID/IMAG
##SYMBOL=    X,             R,               I
##VAR_TYPE=  INDEPENDENT,   DEPENDENT,       DEPENDENT
##VAR_FORM=  AFFN,          ASDF,            ASDF
##VAR_DIM=   8192,          8192,            8192
##UNITS=     SECONDS,       ARBITRARY UNITS, ARBITRARY UNITS
##FACTOR=    0.0002004,     1,               1
##FIRST=     0,             0,               0
##LAST=      1.6414764,     0,               0
##MIN=       0,             -303152,         0
##MAX=       1.6414764,     629053,          0
$$ Real data points
##PAGE= N=1
##DATA TABLE= (X++(R..R)), XYDATA
$$ [...]
$$ plain form
3333 -387 6575 8708 2040 -7649 -9126 -988 6879 6927 2093 -3809 -7998 -4664 5278 9566 3104 -4684
3349 -4684 -6576 -4617 499 7188 8367 169 -8537 -7623 261 6693 6769 1880 -4976 -8910 -3805 6416
3365 6416 9925 2758 -5559 -8142 -5021 2772 9801 6911 -4128 -10224 -5698 2736 8147 7144 -356
3380 -356 -8981 -9168 488 9373 8085 -734 -6808 -6463 -2363 4203 8736 4438 -5631 -9271 -3647
3395 -3647 4134 8074 6337 -1376 -9444 -8245 1493 9206 7751 -247 -7630 -8303 -1248 7618 9606
3410 9606 1619 -7928 -8965 -1946 5511 8495 5560 -3442 -10839 -6858 4437 10218 5662 -2954 -8423
3425 -8423 -6869 1239 8327 7206 -726 -7320 -7035 -1063 5382 7226 3091 -4334 -8386 -4111 3897
3440 3897 7755 4915 -1919 -8248 -7738 1703 9801 7056 -1875 -7509 -6279 -203 5964 7055 1303
$$ packed form
3333c87O962K133o668r689j477Q138P867M8m834n902m189L334R942M288o462p788
3349d684j892J959N116O689J179q198q706R14P884O432P6m889o856l934N105J0221
3365F416L509p167q317k583L121P793P029k890j1039o096M526Q434N411j003p500
3380c56q625j87R656Q885j288q819o074L45M100O566M533m298j0069l640N624
3395c647P781L940j737p713q068J199R738P713j455p998p383o73P055Q866J988
3410I606p987r547j037P019P457K984k935r002p397L981J1295N781m556q616n469
3425h423J554Q108P088j121p932o594K85N972O445J844m135p425m052M275Q008
3440C897L858k840o834o329N10R441Q098k745q931n634J230O076O167J091n752
$$ plain form
3455 1303 -5923 -7396 -1262 5977 7083 1829 -4375 -7041 -3801 3727 7889 3889 -2835 -5569 -3872
3470 -3872 734 5224 4972 -653 -5273 -4251 268 3934 4510 1605 -3222 -5678 -2970 3327 6554
3485 6554 2829 -3378 -5493 -2921 1790 5335 4016 -1864 -5823 -3806 1197 4428 3706 -384 -4013
3500 -4013 -3733 12 3339 3738 557 -3454 -4152 -890 3033 4195 1753 -2371 -3860 -1479 1125 2392
3516 2392 2316 759 -2132 -3096 -592 2375 2927 876 -2357 -3450 -1016 2337 3383 1865 -1523 -3863
3532 -3863 -2229 1627 3241 1693 -969 -2544 -1636 537 1677 1205 409 -1228 -2004 -827 1221 1421
3548 1421 572 -364 -1459 -1182 123 793 822 718 -475 -1826 -1472 464 2012 1916 486 -1668 -2369 -770
3566 -770 1396 2302 1354 -1154 -2192 -522 1241 1372 946 -281 -1853 -1826 498 2101 1648 732 -933
$$ packed form
3455A303p226j473O134P239J106n254o204k666L240P528M162m000o724k734J697
3470c872M606M490k52n625m620J022M519L666N76k905m827k456K708O297L227
3485F554l725o207k115K572M711L545j319n880l959K017N003L231p22m090l629
3500d013K80L745L327L99l181m011o98L262L923J162k442m124j489K381K604J267
3516B392p6j557k891r64K504K967N52k051l233j093K434L353J046j518l388k340
3532c863J634L856J614j548k662j575R08K173J140m72p96j637p76J177K048K00
3548A421q49r36j095K77J305O70K9j04j193j351L54J936J548r6j430k154p01J599
3566g70K166R06r48k508j038J670J763J31m26j227j572K7K324J603m53r16j665
$$ plain form
3583 -933 -2151 -1751 215 2054 2686 808 -2337 -3231 -850 2342 3295 896 -2845 -3672 -759 2519
3599 2519 3059 2116 -1430 -4616 -3063 2362 4892 2267 -2037 -4102 -2902 657 3817 3716 325 -3422
3615 -3422 -3936 -1064 2789 3935 2070 -1840 -4826 -2519 2748 4776 2420 -1335 -4426 -4710 -8
3630 -8 5973 5770 30 -5214 -5498 -1272 4088 5964 2642 -3878 -7019 -2435 4784 6491 1898 -3490
3646 -3490 -5934 -3970 2322 7154 4670 -2331 -6187 -4713 166 5350 5960 572 -5694 -6245 -961
3661 -961 4380 5736 2523 -2925 -6501 -4445 2842 7910 4214 -3424 -6798 -4325 1218 6760 7154
3676 7154 -425 -8229 -7318 427 6933 7110 1347 -5768 -7532 -2041 5687 7342 1764 -4857 -6513
3691 -6513 -2794 3281 7632 5110 -3264 -8576 -4613 2618 6087 5224 829 -5768 -7834 -1394 6718
$$ packed form
3583i33j218M00J966J839O32j878l145q94K381L192R53k399l741q27K913L278
3599B519N40r43l546l186J553N425K530k625m304k065J200L559L160j01l391l747
3615c422n14K872L853J146j865l910k986K307N267K028k356l755l091k84M702
3630hN981k03n740n244k84M226N360J876l322o520l141M584P219J707m593n388
3646c490k444J964O292M832k484p001l856J474M879N184O10n388o266n51N284
3661i61N341J356l213n448l576K056P287N068l696p638l374K473N543N542L94
3676G154p579p804R11P745O506J77n763p115j764N491P728J655n578o621j656
3691f513L719O075M351k522q374n312L963P231L469q63m395o597k066O440Q112
$$ plain form
3706 6718 7511 1167 -5693 -7307 -2686 4543 8133 3906 -4916 -8950 -3875 4083 7514 5033 -1934
3721 -1934 -8585 -7268 2411 8909 6110 -1237 -6624 -6986 -1151 6662 8181 1042 -6782 -7117 -758
3736 -758 5079 6435 3030 -3512 -8208 -5019 4128 8578 4711 -2026 -6377 -6621 -748 7119 7811 180
3752 180 -6813 -6776 -1244 5242 7874 3029 -5801 -9340 -3005 6198 8340 2928 -3712 -7334 -5451 1797
3768 1797 8412 5973 -2726 -7451 -4671 513 5058 6324 1528 -5894 -6938 -890 5092 5782 1928
3783 1928 -3450 -6253 -3728 2991 7690 4213 -3143 -6294 -4229 330 5377 6750 905 -6601 -6019
3798 -6019 870 4976 4263 1163 -3426 -6051 -2074 4959 6774 1359 -4530 -5341 -2222 2089 5216
3813 5216 4135 -1710 -5764 -3082 1968 3371 2324 673 -2707 -4625 -1097 3960 3928 99 -2449
$$ packed form
3706F718P93o344o860j614M621P229L590m227q822m034N075P958L431k481o967
3721a934o651J317R679O498k799p347n387l62N835P813J519p139p824l35O359
3736g58N837J356l405o542m696L189R147M450l867o737m351k44N873P867O92p631
3752A80o993L7N532O486K632m845q830l539O335R203K142n412o640l622J883P248
3768A797O615k439q699m725K780N184M545J266m796p422j044O048N982O90l854
3783A928n378k803K525O719M699l477p356l151K065M559N047J373n845p506N82
3798f019O889M106p13l100m589k625L977P033J815n415n889q11L119M311L127
3813E216j081n845m054K682N050J403j047j651l380j918L528N057l2l829k548
$$ plain form
3828 -2449 -3391 -2430 1450 4971 3237 -2547 -5340 -2310 2141 3481 2614 369 -3449 -4489 57 4388
3844 4388 2807 -1110 -1917 -1861 -883 2227 3489 226 -3073 -2399 168 1479 1961 2067 37 -2843 -2687
3861 -2687 554 2458 983 -172 116 -1282 -1902 1018 2778 169 -2048 -1136 -447 -34 1731 2405
3877 2405 -391 -3177 -2058 1123 1835 1013 -75 -729 -1929 -929 1594 1614 -763 -918 680 -311 -1725
3894 -1725 312 1950 -46 -1318 -100 349 -538 405 1922 560 -2265 -2261 290 1967 1646 1205 -333
3911 -333 -2605 -2402 1254 2853 691 -663 -304 -1199 -1150 1532 2622 -297 -2721 -1466 267 1109 1777
3928 1777 1845 -561 -3366 -2364 1167 2773 1772 379 -1285 -3417 -2227 2618 4510 773 -2961
3943 -2961 -3045 -1627 1114 4085 3019 -2306 -5123 -2119 2583 3879 2477 -475 -3978 -4412 -276 4814
$$ packed form
3828b449r42R61L880L521j734n784k793L030M451J340q67k245l818j040M546M331
3844D388j581l917q07N6R78L110J262l263l299O74K567J311M82J06k030k880J56
3861b687L241J904j475j155K88j398o20K920J760k609k217R12O89M13J765O74
3877B405k796k786J119L181P12q22j088o54j200J000K523K0k377j55J598r91j414
3894a725K037J638j996j272J218M49q87R43J517j362k825MK551J677l21m41j538
3911c33k272K03L656J599k162j354L59q95M9K682J090k919k424J255J733Q42O68
3928A777O8k406k805J002L531J606j001j393j664k132J190M845J892l737l734
3943b961q4J418K741K971j066n325k817L004M702J296j402k952l503m34M136N090
$$ plain form
3959 4814 4714 -8 -3302 -3159 -1647 1328 4646 3077 -2549 -4934 -1646 2176 3739 3411 -172 -5026
3975 -5026 -5404 489 5792 5208 18 -4160 -5014 -2271 3152 6364 2590 -4275 -5953 -1792 2902 4879
3991 4879 3514 -1934 -6739 -4335 3064 6263 3140 -1665 -4778 -4502 -223 5069 5609 563 -5099
4006 -5099 -5181 -933 3082 4961 3250 -2354 -6452 -3268 3506 5652 2728 -1752 -5296 -4900 1249 7335
4022 7335 5768 -1476 -6558 -5393 -64 5350 6462 1709 -5279 -7198 -1006 5614 5686 904 -3638
4037 -3638 -5773 -3339 3327 7510 3657 -3628 -6622 -4010 1271 6056 5946 -268 -6642 -6263 183
4052 183 5475 5580 1164 -4040 -6454 -3325 4131 7757 2947 -4449 -6780 -3644 2447 7409 5754
4067 5754 -2752 -8458 -5360 2470 6860 5700 -111 -5931 -6662 -935 5902 6500 770 -5155 -5420 -1499
$$ packed form
3959D814j00m722l294J43J512K975L318j569n626k385L288L822J563l28l583m854
3975e026l78N893N303n84n190m178q54K743N423L212l774o865j678M161M694J977
3991D879j365n448m805K404P399L199l123m805l113K76M279N292N40n046n662
4006e099q2M248M015J879j711n604m098L184O774K146k924m480l544L96O149O086
4022G335j567p244n082J165N329N414J112m753o988j919O192O620P2m782m542
4037c638k135K434O666M183l853p285k994K612N281M785j10o214o374L79O446
4052A83N292J05m416n204k414L129P456L626m810p396k331L136O091M962j655
4067E754q506n706L098P830M390j160n811n820p31N727O837N98n730n925k65L921
$$ plain form
4083 -1499 3526 6466 3532 -3757 -7164 -3173 2711 5828 5085 -81 -6134 -6531 6 6197 5785 138
4099 138 -4895 -5706 -1534 4285 6423 2375 -4483 -6799 -2360 3659 5800 3753 -2203 -6869 -4705
4114 -4705 2681 6633 3816 -1502 -4921 -4594 -234 4663 4968 449 -4174 -4291 -815 3081 4135 2023
4130 2023 -2367 -5388 -2801 3150 5336 2645 -1596 -4416 -4229 104 5101 4786 -404 -4227 -3890 -301
4146 -301 3622 4163 853 -3657 -4564 -887 3743 4375 980 -2637 -3970 -2431 1646 4466 2420 -1790
4162 -1790 -3457 -2228 217 2561 3160 278 -2979 -2993 -337 2325 2556 886 -1486 -2815 -1698 1144
4178 1144 3227 1979 -1325 -2989 -2178 188 2887 3280 7 -2988 -2306 46 1603 1870 641 -1358
4194 -1358 -2097 -332 1918 2110 214 -1552 -1715 -382 825 1478 1325 -84 -1426 -835 -76 7 842
$$ packed form
4083a499N025K940k934p289l407L991N884L117p43n166o053l97O537O191m12n647
4099A38n033q11M172N819K138m048o858k316M439O019K141k047n956m666K164
4114d705P386L952k817n318l419L27M360M897L05m519m623j17L476L896J054k112
4130B023m390l021K587N951K186k691m241k820J87M333M997l15n190l823L37L589
4146c01L923N41l310m510r07L677M630O32l395l617j333J539M077K820k046m210
4162a790j667J229K445K344N99k882l257j4K656K662K31j670k372j329J117K842
4178A144K083j248l304j664Q11K366K699L93l273k995O82K352J557K67j229j999
4194a358p39J765K250J92j896j766j63J333J207O53j53j409j342N91P59Q3Q35
$$ plain form
4211 842 1294 -20 -1385 -992 259 837 757 -89 -1119 -1078 165 973 938 -54 -932 -885 -278 212 1079 953
4231 953 -285 -1479 -699 320 332 530 819 79 -741 -656 -305 457 945 578 -408 -934 -519 672 1508
4250 1508 755 -1047 -1947 -1205 495 2327 2288 -389 -2642 -2095 220 1811 1924 472 -1731 -1991 -322
4267 -322 1599 1728 609 -1298 -2122 -1011 883 2150 2053 -171 -2702 -2760 -193 2271 3006 1014 -2565
4284 -2565 -3488 -1139 2084 3350 1851 -1522 -4038 -2410 1670 3947 2584 -1295 -4143 -3008 1272
4299 1272 4252 3459 -422 -4066 -4139 -355 3734 4133 1283 -2432 -4185 -1893 2199 3926 2141 -1535
4315 -1535 -3968 -2849 1273 4469 3407 -760 -4223 -4395 -504 4287 4848 1141 -3741 -5273 -2032
4330 -2032 3457 5287 2012 -3033 -5183 -2547 2604 5344 2738 -2210 -4830 -3390 1208 5160 3999
$$ packed form
4211H42M52j314j365L93J251N78q0q46j030M1J243Q08l5r92q78M7O07M90Q67j26
4231I53j238j194P80J019J2J98K89p40q20Q5L51P62M88l67r86n26M15J191Q36
4250A508p53j802r00P42J700J832l9k677k253N47K315J591J13j452k203k60J669
4267c22J921J29j119j907q24J111J894J267r7k224k531n8K567K464P35j992l579
4284b565r23K349L223J266j499l373k516J628M080K277j363l879k848J135M280
4299A272K980p93l881l644p3L784M089L99k850l715j753K292M092J727j785l676
4315a535k433J119M122L196j062m167l463j72L891M791N61l707m882j532L241
4330b032N489J830l275n045k150K636N151K740k606m948k620J440M598L952j161
$$ plain form
4345 3999 -1196 -4844 -3997 62 4153 4800 871 -3936 -4768 -1595 3098 4960 2166 -2465 -4452 -2601
4361 -2601 1756 5123 3458 -2056 -5548 -3782 1356 5465 5086 -329 -5525 -5334 -137 4679 5337 1214
4377 1214 -4145 -5455 -1405 3979 5545 1802 -4079 -5848 -2094 3233 5423 3262 -2123 -5896 -3810
4392 -3810 1501 5026 4094 -41 -4728 -5397 -530 4693 5345 1395 -3796 -5604 -2188 3323 5692 2851
4408 2851 -2936 -6113 -3234 2795 6046 3808 -1551 -5937 -5296 1121 6264 5198 -462 -4741 -4936
4423 -4936 -919 4175 5345 1091 -3974 -5247 -1425 3599 5085 2299 -2616 -5090 -3648 1807 5462
4438 5462 3646 -1048 -4211 -4341 -724 4107 5074 783 -4087 -4841 -1230 3459 5228 1973 -3297 -5379
4454 -5379 -2471 2795 5291 2505 -2462 -4698 -3012 1266 4821 3991 -902 -4453 -3396 238 3069
$$ packed form
4345C999n195l648Q47M059M091O47l929m807q32L173M693J862k794m631j987J851
4361b601M357L367j665n514l492J766N138M109l79n415n196J91N197M816O58m123
4377A214n359j310M050N384J566l743n881j769L754N327K190k161n385l773K086
4392c810N311L525r32m135m687o69M867N223O52l950n191j808L416N511K369k841
4408B851n787l177K879O029L251k238n359m386O41O417N143j066n660m279j95
4423d936M017N094J170m254n065j273L822N024J486k786m915k474J442N455L655
4438E462j816m694l163j30L617M831R67m291m870p54L611M689J769l255n270k082
4454e379K908N266K496k786m967k236J686M278L555q30m893l551J057L634K831
$$ plain form
4469 3069 3730 729 -3081 -3591 -496 2628 3162 1151 -1882 -3555 -2008 1519 4078 2951 -1235 -3842
4485 -3842 -2659 221 2836 3399 616 -3140 -3485 10 2718 2638 517 -2333 -3470 -1123 2538 3540
4501 3540 1057 -2420 -3195 -1240 1251 2500 1807 -834 -2906 -1823 990 1982 1107 330 -945 -1997
4517 -1997 -1044 1454 2084 600 -1103 -1590 -1018 700 2122 1462 -592 -2402 -1742 610 1947 1573 450
4534 450 -1223 -2048 -451 1653 1114 -413 -838 -617 -474 682 1266 529 -1017 -1383 -392 445 746 756
4552 756 246 -424 -1038 -388 373 206 207 593 -56 -1163 -747 934 968 160 -197 -793 -979 268 1470 787
4572 787 -896 -1262 -272 424 566 932 485 -594 -1460 -626 872 927 774 645 -495 -1800 -877 1275
4590 1275 1549 337 -435 -1117 -1229 510 2184 1523 -1030 -2643 -1631 743 2260 2089 210 -2184
$$ packed form
4469C069O61l001l810n10L095L124N34k011l033j673J547L527K559j127m186k607
4485c842J183K880K615N63k783l756l45L495K708q0k121k850j137K347L661J002
4501C540k483l477p75J955K491J249o93k641k072J083K813R92q75p77j275j052
4517a997R53K498O30j484j703m87N72J718J422o60k054j810O60K352J337l74j123
4534D50j673q25J597K104n39j527m25K21J43J156N84p37j546l66R91Q37L01J0
4552G56n10o70o14O50P61j67JL86o49j107M16J681L4q08l57n96j86J247J202o83
4572G87j683l66R90O96J42L66m47j079q66Q34J498N5j53j29j140j305R23K152
4590A275K74j212p72o82j12J739J674o61k553j613J012K374J517j71j879k394
$$ plain form
4606 -2184 -2896 -252 2654 2075 -23 -1351 -1957 -1372 1286 2778 1244 -1448 -2449 -1446 511 2238
4622 2238 2159 -101 -2663 -2831 -250 2536 2805 657 -1903 -3182 -2044 1947 4201 1958 -2074 -3243
4638 -3243 -1884 818 3438 3027 -854 -4133 -2850 1211 3825 3031 -257 -3387 -3799 -607 3365 4113
4654 4113 735 -2836 -3180 -1350 1293 3493 2436 -1704 -4129 -2267 1493 3420 2982 -132 -3895
4669 -3895 -4106 -177 4011 4227 429 -3469 -4141 -1275 2766 4816 2222 -3134 -5106 -1764 2595 4246
4685 4246 2698 -1401 -4848 -3288 2082 4846 2864 -1223 -3859 -3471 -2 3966 4298 724 -3736
4700 -3736 -4392 -931 2912 4062 2084 -1885 -4723 -2667 2473 4680 2383 -1614 -4249 -3914 614
4715 614 5144 4678 -705 -5016 -4489 -140 4107 4572 837 -3801 -5075 -1485 3923 4868 1303 -2899
$$ packed form
4606b184p12K644K906n79k098j328o06N85K658J492j534k692j001J003J957J727
4622B238p9k260k562j68K581K786K69k148k560j279J138L991K254k243m032j169
4638c243J359K702K620m11l881l279J283M061K614p94l288l130m12L192L972P48
4654D113l378l571l44J830K643K200j057m140k425J862L760J927m38l114l763
4669c895k11L929M188K16l798l898o72K866M041K050k594n356j972L342M359J651
4685D246j548m099l447J560N370K764j982m087k636L88L469L968L32l574m460
4700c736o56L461L843J150j978l969k838K056N140K207k297l997k635L35M528
4715F14M530m66n383m311N27M349M247M65l735m638j274L590N408R45l565m202
$$ plain form
4731 -2899 -4617 -2792 2186 5422 2973 -2259 -4711 -2874 991 4045 3971 -30 -4242 -4377 -326 3865
4747 3865 4431 1171 -2797 -4531 -2386 2728 5244 2349 -2842 -4715 -2571 1668 4769 3966 -1192
4762 -1192 -5461 -3877 1153 4774 4079 27 -3865 -4270 -652 3613 4335 728 -3344 -3956 -1331 2176
4778 2176 4250 2575 -2150 -4860 -2654 1727 3726 2788 -116 -3509 -3959 -150 3709 3633 371 -3051
4794 -3051 -3798 -1244 2619 4086 1897 -2405 -4335 -1680 2179 3676 2269 -1143 -3982 -3180 1514
4809 1514 4412 2630 -911 -2994 -2602 -118 2604 3121 474 -2326 -2582 -311 1861 2415 1135 -1158
4825 -1158 -2945 -1972 1451 3209 1579 -718 -1954 -2383 -544 2374 2754 -20 -2389 -2307 -258 1857
4841 1857 2338 563 -1886 -2708 -792 1814 2429 457 -1185 -1610 -1095 470 2026 1338 -933 -1945
$$ packed form
4731b899j718J825M978L236k449n232k452J837L865L054p4m001m212j35M051M191
4747C865N66l260l968j734K145N114K516k895n191j873K144M239L101q03n158
4762a192m269J584N030L621o95m052l892m05L618M265P22l607m072o12K625L507
4778B176K074j675m725k710K206M381J999r38k904l393m50L809L859p6l262l422
4794c051p47K554L863J467k189m302j930K655L859J497j407l412k839Q02M694
4809A514K898j782l541k083L92K484K722N17k647k800k56K271K172N54j280k293
4825a158j787R73L423J758j630k297j236m29J839K918L80k774k369Q2K049K115
4841A857M81j775k449q22J916K606O15j972j642m25N15J565J556o88k271j012
$$ plain form
4857 -1945 -745 169 953 1336 443 -1156 -1301 -331 540 1164 805 -285 -1226 -996 403 1636 1030 -576
4875 -576 -1271 -739 -257 648 1540 615 -1096 -1302 -108 712 811 350 -465 -1074 -344 820 827 226 -271 -405
4895 -405 -350 -419 -71 627 606 -182 -354 -216 -485 40 1090 828 -589 -999 -539 210 1100 1226 -5 -1300
4915 -1300 -1128 -29 1097 998 -5 -825 -927 -379 610 1354 741 -697 -1151 -856 -78 1015 1710 521
4933 521 -1184 -1584 -599 677 1602 1221 -609 -2038 -1564 588 2450 1868 -675 -2300 -1928 44 2147
4950 2147 2448 262 -2395 -2391 -273 1586 2378 1035 -1591 -2910 -1138 1597 2678 1645 -899 -2601
4966 -2601 -1892 406 2476 2287 58 -2535 -2371 -145 2171 2767 1275 -1931 -3464 -1525 1765 3272
4982 3272 2082 -1159 -3649 -2539 1227 3721 2656 -976 -3652 -2935 659 3543 3075 74 -3352
$$ packed form
4857a945J200R14P84L83q93j599j45R70Q71O24l59j090r41K30J399J233o06j606
4875e76o95N32M82R05Q92r25j711k06J194Q20R9m61q15o09P30J164Po01m97j34
4895d05N5o9L48O98k1p88j72J38k69N25J050k62j417m10M60P49Q90J26j231j295
4915a300J72J099J126r9j003q20j02N48R89P44o13j438m54K95P78J093O95j189
4933E21j705m00R85J276R25l81j830j429M74K152J862n82k543j625L72J972K103
4950B147L01k186k657MK118J859P92j343k626j319J772K735J081j033k544j702
4966b601P09K298K070j89k229k593J64K226K316N96j492l206j533J939L290J507
4982C272j190l241k490J110L766K494j065l632k676P17L594K884m68l001l426
$$ plain form
4997 -3352 -3600 -511 2989 3161 793 -2145 -3520 -1706 1823 3670 1764 -1681 -3684 -2493 769
5012 769 3631 2967 -435 -3520 -3494 -296 3279 3631 463 -2887 -3922 -1314 2985 4462 1584 -2690
5028 -2690 -4105 -2044 1924 4415 2673 -1820 -4106 -2566 1381 4234 3059 -925 -3902 -3259 232
5043 232 3566 3787 444 -3189 -3758 -1088 2516 3886 1694 -2436 -4125 -2000 1709 3920 2817 -1317
5059 -1317 -4335 -3331 764 4110 3801 -156 -3942 -3971 -253 3700 4138 673 -3606 -4421 -858 3254
5075 3254 4481 1702 -2661 -4495 -2014 2331 4061 2441 -1304 -4088 -2786 980 3762 3162 -146
5090 -146 -3508 -3703 -396 3225 3931 1302 -2566 -4179 -1676 2497 4185 1926 -2082 -4278 -2679 1768
5106 1768 4294 2781 -1108 -3929 -3414 396 3895 3365 -196 -3221 -3496 -391 3111 3572 895 -2835
$$ packed form
4997c352k48L089L500J72k368k938j375J814L529J847j906l445k003J191L262
5012G69K862o64l402l085K6L198L575L52l168l350j035K608M299J477k878m274
5028b690j415K061L968K491j742m493k286J540L947K853j175l984k977O43L491
5043B32L334K21l343l633n69K670L604J370k192m130j689K125L709K211j103m134
5059a317l018J004M095L346l09l957l786k9L718L953M38l465m279q15L563M112
5075C254J227k779m363j834K481M345J730j620l745k784J302L766K782o00l308
5090a46l362j95L307L621P06k629l868j613K503M173J688k259m008k196J599M447
5106A768K526j513l889k821N15L810L499n30l561l025k75L105L502M61k677l730
$$ plain form
5122 -2835 -3686 -1482 2268 3755 1686 -1689 -3352 -2120 859 3177 2408 -685 -2777 -2460 -170 2756
5138 2756 3334 607 -2670 -3245 -1068 2188 3414 1421 -1872 -3243 -1573 1453 3274 1801 -1362
5153 -1362 -3261 -1812 885 2866 2291 -542 -2746 -1909 275 2021 1940 346 -1848 -2177 -418 1509
5169 1509 1916 806 -1195 -2190 -1223 571 2031 1513 -381 -2039 -1487 202 1495 1696 205 -1952
5185 -1952 -2194 -170 1902 1846 479 -1395 -1934 -620 1174 1653 710 -735 -1590 -835 808 1414 887
5202 887 -284 -1482 -1019 494 1206 670 117 -351 -981 -488 497 1048 505 -238 -768 -845 96 805 868 131
5222 131 -853 -1077 -282 622 854 375 -382 -1120 -648 668 936 59 -421 -545 -545 -178 531 507 191 -15 -559
5243 -559 -638 -270 206 835 642 -310 -799 -405 233 700 966 45 -1292 -1194 401 1626 1037 150 -900
$$ packed form
5122b835q51K204L750J487k069l375j663J232K979K318p69l093k092L17K290K926
5138B756N78k727l277n75K177L256J226j993l293j371J670L026J821j473l163
5153a362j899J449K697J981n75k833k204Q37K184J746q1j594k194l29J759J927
5169A509M07j110k001r95R67J794J460n18j894j658N52J689J293K01j491k157
5185a952k42K024K072n6j367j874n39J314J794M79r43j445q55P55J643O06n27
5202H87j171j198M63J513P12n36n53m68o30M93R85N51n43p43n30p7R41P09O3p37
5222A31r84k24P95R04K32m79p57p38M72J316K68q77m80j24%L67P09k4l16k06n44
5243e59p9L68M76O29j93r52m89L94O38M67K66r21j337R8J595J225n89q87j050
$$ plain form
5262 -900 -1329 -448 1082 1471 501 -835 -1212 -729 525 1343 1071 -164 -1648 -1327 183 1339 1108 400
5280 400 -684 -1676 -941 1095 2011 1026 -912 -2078 -1826 499 2278 1864 -396 -2390 -2203 43 2053
5297 2053 1984 280 -1994 -2599 -468 2246 2545 348 -1799 -2412 -1185 1174 2816 1664 -1035 -2481
5313 -2481 -1729 312 2271 2176 47 -2309 -2495 -238 2291 2643 647 -1779 -2821 -1510 1561 3551
5329 3551 1780 -1736 -3199 -1958 865 3394 2667 -885 -3700 -2759 644 3206 2662 -115 -2768 -2931
5345 -2931 -428 2441 3165 619 -2414 -3032 -981 1793 3258 2110 -1547 -3919 -2101 1312 3201
5360 3201 2366 -73 -2673 -2893 -3 2895 3268 252 -2768 -3090 -811 2498 3783 1687 -2434 -4305
5376 -4305 -1732 2271 3754 1943 -1587 -3752 -2369 1634 3939 2308 -1165 -3331 -2679 339 3087
$$ packed form
5262i00m29Q81J530L89r70j336l77M83J254Q18k72j235j484L21J510J156k31p08
5280D00j084r92P35K036R16r85j938j166K52K325J779m14k260j994J87K246K010
5297B053o9j704k274o05K131K714K99k197k147o13J227K359J642j152k699j446
5313b481P52K041J959r5k129k356j86K257K529L52j996k426j042J311L071J990
5329C551j771l516j463J241K823K529p27l552k815R41L403K562n44k777k653j63
5345b931K503K869P24k546l033o18K051K774J465j148l657k372J818L413J889
5360C201q35k439k600k20K890K898L73l016l020l22K279L309J285k096m121j871
5376d305K573M003J483j811l530k165J383M003K305j631l473k166O52L018K748
$$ plain form
5391 3087 3134 200 -2941 -3332 -541 2699 3228 1067 -2051 -3753 -1936 2041 3900 2113 -1467 -3568
5407 -3568 -2768 514 3695 3113 -484 -3436 -3200 259 3413 3436 372 -3111 -3832 -962 3088 4048 1215
5424 1215 -2456 -3604 -1740 1599 3947 2250 -1702 -3505 -2064 1011 2992 2696 -226 -3118 -2980
5439 -2980 -148 2621 3125 610 -2173 -3158 -1437 1859 3809 1845 -2003 -3626 -1820 1136 3145
5454 3145 2558 -672 -3547 -2706 745 3163 2554 -396 -2806 -2848 -183 2707 3253 411 -2549 -3085 -795
5471 -795 1702 2650 1598 -1022 -2827 -1618 1146 2257 1513 -283 -2253 -2332 46 2587 2475 301
5487 301 -2195 -2439 -640 1757 2674 1207 -1588 -2928 -1120 1648 2239 1078 -941 -2221 -1644 814
5503 814 2351 1260 -680 -1726 -1387 72 1748 1594 -41 -1775 -1722 -184 1286 1469 490 -580 -1417
$$ packed form
5391C087M7k934l141l91K791L240N29k161l118j702J817L977J859j787l580k101
5407c568Q00L282L181n82l597k952K36L459L154K3l064l483p21K870M050R60k833
5424A215l671j148J864L339K348j697l952j803J441L075J981k96k922k892J38
5439b980K832K769N04k515k783r85J721L296J950j964l848j623J806K956K009
5454C145n87l230k875Q41L451K418o09k950k410m2K665K890N46k842k960n36K290
5471g95K497R48j052k620j805J209K764J111p44j796j970p9K378K541j12k174
5487C01k496k44J799K397R17j467k795j340J808K768N91j161k019j280N77K458
5503H14J537j091j940j046L39J459J676j54j635j734N3J538J470J83r79j070q37
$$ plain form
5520 -1417 -1135 426 1499 892 -432 -809 -883 -144 1192 1474 -16 -1480 -1309 64 1157 1399 524
5537 524 -922 -1439 -538 782 1296 231 -672 -640 -394 148 887 735 -553 -952 -288 294 297 561 266 -405
5557 -405 -616 -316 179 379 381 60 -352 -747 -383 456 809 275 -311 -443 -564 -118 565 627 -302 -729 -187
5578 -187 365 303 437 35 -456 -579 -108 159 560 586 252 -337 -919 -831 295 1084 416 -208 -501 -695 -171
5599 -171 1010 1223 -95 -1224 -984 -33 1007 1383 451 -1159 -1705 -535 1061 1380 497 -869 -1372
5616 -1372 -1025 247 1466 1310 -428 -1470 -1071 -159 939 1593 454 -1250 -1732 -619 1108 1793 1264
5633 1264 -740 -2222 -1738 385 2389 1961 -144 -2119 -1916 -29 2070 2280 373 -2238 -2153 -23
5649 -23 1960 2112 602 -1620 -2654 -1125 1386 2488 1405 -790 -2369 -1658 375 2028 1983 51
$$ packed form
5520a417K82J561J073o07j324l77p4P39J336K82j490j464J71J373J093K42q75
5537E24j446n17R01J320N14j065r03L2K46N42P39j52j288l99O64N82LK64k95o71
5557d05k11L00M95K00Kl21m12l95L64Q39L53n34n86j32j21M46O83O2r29m27N42
5578a87N52o2J34m02m91j23M71K67M01K6l34n89n82Q8J126P89o68o24k93j94N24
5599a71J181K13j318j129K40R51J040L76r32j610n46J170J596L19q83j366n03
5616a372L47J272J219j56j738j042L99R12J098O54j139j704m82J113J727O85n29
5633A264k004j482M84K123K004m28k105j975K03J887K099K10j907k611Q5K130
5649b3J983J52j510k222j034J529K511J102j083k195j579P11K033J653m5j932
$$ plain form
5665 51 -2193 -2414 -99 1920 2214 696 -1604 -2806 -1159 1876 2687 1231 -1279 -2987 -1923 1232
5681 1232 3220 2165 -905 -3075 -2345 610 2744 2291 -53 -2498 -2575 -137 2631 2505 144 -2187
5697 -2187 -2588 -779 2101 3011 1325 -1627 -2883 -1759 826 2748 2261 -406 -2717 -2427 163 2715
5713 2715 2477 -136 -2379 -2719 -482 2524 3211 648 -2656 -3026 -1131 1948 3385 1624 -1925 -3380
5729 -3380 -1763 1337 3191 2002 -1026 -3211 -2393 474 2768 2475 -165 -2627 -2664 -146 2326 3071
5745 3071 802 -2358 -3415 -1142 1946 3067 1797 -1120 -2960 -2130 681 2888 2544 -372 -2831
5760 -2831 -2605 420 3048 2939 196 -2999 -3384 -259 2695 3088 906 -2053 -3064 -1307 1818 3071
5776 3071 1290 -1257 -2622 -1776 934 2557 1890 -365 -2515 -2164 43 2251 2190 262 -2058 -2688
$$ packed form
5665E1k244k21K315K019K94j518k300j202J647L035Q11j456k510j708J064L155
5681A232J988j055l070k170P30K955K134m53k344k445p7K438K768j26k361k331
5697b187m01J809K880R10j686k952j256J124K585J922m87k667k311K90K590K552
5713B715k38k613k243l40K237L006O87k563l304l70J895L079J437j761l549j455
5729c380J617L100J854j189l028k185Q18K867K294k93k640k462l7K518K472P45
5745C071k269l160j057K273L088J121j270k917j840Q30K811K207l44k916k459
5760b831K26L025K628j09k743l195l85L125K954L93k182k959j011J757L125J253
5776C071j781k547j365Q46K710J623o67k255k150L51K207K208o1j928k320o30
$$ plain form
5792 -2688 -967 1829 2763 1048 -1420 -2780 -1688 944 2818 1608 -797 -2408 -1770 575 2504
5807 2504 1805 -614 -2552 -2059 262 2560 2194 125 -2006 -2178 -661 1591 2265 846 -1169 -1819
5823 -1819 -884 796 1843 1157 -577 -1822 -1310 322 1825 1689 65 -1688 -1704 -359 1408 1901 491
5840 491 -1485 -1834 -818 848 1906 1050 -1001 -1871 -930 690 1544 917 -616 -1650 -714 585 1225
5857 1225 880 -188 -1254 -1000 -108 832 1217 407 -550 -1137 -541 431 743 567 -99 -711 -533 283 859
5876 859 627 93 -819 -1112 -117 802 999 458 -579 -976 -321 550 681 148 -337 -584 -18 298 321 -56
5896 -56 -178 -87 -200 73 289 -119 -160 84 -131 -229 -38 200 347 438 -125 -665 -453 36 408 460 227 -317
5918 -317 -420 -247 -33 139 235 -48 -389 -169 305 393 156 -153 -566 -584 93 463 618 582 -100 -743 -616
$$ packed form
5792b688J721K796R34j715k468j360J092K632J874j210k405j611O38K345J929
5807B504o99k419j938M93K321K298l66k069k131j72J517K252O74j419k015o50
5823a819R35J680J047o86j734j245N12J632J503j36j624j753j6J345J767M93j410
5840D91j976l49J016J666J058q56k051q70R41J620Q54o27j533j034R36J299O40
5857A225l45j068j066K54Q92R40L85q10r57n87N96R72L12j76o66o12J78Q16N76
5876H59k32n34r12k93R95R19J97n41j037l97O55Q71J31n33m85k47N66L16K3l77
5896e6j22R1j13K73K16m08m1K44k15r8J91K38J47R1n63n40K12M89L72N2k33n44
5918c17j03J73K14J72R6k83l41K20M74Q8k37l09m13j8O77L70J55l6o82o43J27
$$ plain form
5939 -616 -21 734 1044 242 -820 -918 -25 807 1073 295 -1014 -1330 -297 921 1071 405 -925 -1608 -719
5958 -719 958 1520 742 -536 -1546 -1294 229 1263 1143 45 -1030 -1581 -142 1026 1154 422 -890
5975 -890 -1558 -867 1167 1896 1048 -751 -1993 -1613 431 2097 1934 -17 -1723 -1847 -221 1797 1910
5992 1910 317 -1587 -2019 -585 1810 2364 565 -1681 -2290 -1088 1114 2129 1206 -827 -2013 -1439
6008 -1439 349 1852 1823 73 -1731 -2126 -367 1667 2018 530 -1498 -2035 -993 1148 2401 1232
6024 1232 -1409 -2625 -1482 1033 2639 2012 -686 -2714 -2061 476 2436 1994 -230 -2079 -1719 -13
6040 -13 1795 1995 299 -2008 -2316 -366 1631 2402 1255 -1228 -2664 -1333 1042 2272 1587 -550
6056 -550 -2181 -1738 328 2194 2042 -22 -2217 -2273 -229 1971 2452 712 -1915 -2955 -899 1964
$$ packed form
5939f16N95P55L10q02j062r8Q93Q32K66p78j309l16J033J218J50o66j330o83Q89
5958g19J677N62p78j278j010K52J523J034j20j098j075n51J439J168J28p32j312
5975h90o68O91K034P29q48j799j242L80K044J666j63j951j706j24J626K018J13
5992A910j593j904m32J434K395N54j799k246o09J202K202J015r23k033j186N74
6008a439J788J503k9j750j804l95J759K034L51j488k028n37J042K141J253j169
6024A232k641j216J143K515J606o27k698k028O53K537J960m42k224j849L60J706
6040a3J808K00j696k307l08J950J997P71j147k483j436J331K375J230o85k137
6056e50j631M43K066J866j52k064k195n6K044K200M81j740k627j040K056K863
$$ plain form
6072 1964 2860 1020 -1536 -2872 -1763 1129 2878 1755 -1034 -2547 -1923 486 2328 1733 -313 -2302
6088 -2302 -2005 44 2232 2391 540 -1735 -2693 -1442 1485 2901 1399 -1139 -2511 -1579 626 2507
6104 2507 1991 -533 -2487 -2009 341 2470 2190 19 -2178 -2413 -541 2144 2818 545 -2017 -2326
6120 -2326 -954 1249 2382 1227 -1236 -2350 -1105 839 1864 1291 -352 -1842 -1731 143 1873
6135 1873 1676 59 -1791 -1858 -367 1291 2089 1152 -1094 -2277 -1104 806 1824 1361 -614 -1957
6151 -1957 -1374 751 1955 1286 -649 -1953 -1454 303 1656 1656 -1 -1571 -1705 -219 1148 1249 571
6168 571 -599 -1412 -676 873 1203 575 -456 -1171 -841 328 1267 1045 -209 -1166 -1094 -132 1043 1195
6186 1195 304 -754 -1316 -468 857 1169 331 -548 -916 -696 425 1231 418 -759 -796 -317 551 938 499
$$ packed form
6072A964Q96j840k556j336J109K892J749j123k789j513O24K409J842n95k046j989
6088b302K97K049K188J59j851k275r58J251K927J416j502k538j372R32K205J881
6104B507n16k524j954M78K350K129k80k171k197k35J872K685O74k273k562l09
6120b326J372K203J133j155k463j114J245J944J025n73j643j490J11J874J730
6135A873j97j617j850o7J491J658P98r37k246j183J173J910J018m63j975j343
6151a957N83K125J204o69j935j304M99J757J353%j657j570j34J486J367J01o78
6168E71j170q13P36J549L30o28j031p15L30J169R39k22j254r57P2R62J175J52
6186A195q91j058n62Q48J325L12q38q79l68K20J121Q06q13j177l7M79Q68L87m39
$$ plain form
6205 499 -418 -859 -534 195 612 487 -34 -115 -235 -323 84 465 237 -207 -233 -162 -8 502 428 -161 -532 -226
6227 -226 -80 319 445 118 -195 -435 -287 283 417 14 -410 -12 115 -46 -101 160 -43 -64 209 99 -377
6248 -377 -250 158 129 -39 14 -312 -170 328 507 389 -282 -862 -379 366 716 492 -93 -521 -682 129 565
6269 565 404 -271 -248 -210 -71 417 542 162 -359 -772 -469 281 884 597 -107 -920 -1096 -176 1020 954 64
6290 64 -771 -1071 -512 905 1418 355 -859 -1190 -414 765 1422 666 -749 -1442 -835 632 1444 894
6308 894 -244 -1346 -1246 -120 1166 1525 190 -1222 -1253 -302 659 1306 508 -946 -1494 -572 865 1519
6326 1519 1205 -376 -1835 -1677 148 1869 1829 -71 -1789 -1656 -78 1386 1758 502 -1600 -1930 -282
6343 -282 1429 1769 646 -1214 -1824 -1021 1184 1823 952 -838 -1913 -1283 354 1774 1622 135 -1647
$$ packed form
6205D99r17m41L25P29M17j25n21q1j20q8M07L81k28m44k6P1J54N10p4n89l71L06
6227b26J46L99J26l27l13k40J48N70J34m03m24L98J27j61n5K61k03k1K73j10m76
6248c77J27M08k9j68N3l26J42M98J79j18o71n80M83P45L50k24n85m28j61Q11M36
6269E65j61o75K3L8J39M88J25l80n21m13L03P50O03k87p04q13j76R20J196o6q90
6290F4q35l00N59J417N13j063j214l31P76J179O57p56j415o93O07J467Q12n50
6308H94j138j102J00J126J286L59j335j412l1R51R61O47p98j454n48R22J437O54
6326A519l14j581j459J58J825J721m0j900j718J33J578J464L72j256k102l30J648
6343b82J711L40j123j860o10Q03K205O39q71j790j075O30J637J420j52j487j782
$$ plain form
6360 -1647 -1851 -170 1466 1657 449 -1166 -2000 -718 1411 2200 773 -1175 -2286 -1261 965 2362
6376 2362 1543 -629 -2231 -1885 443 2153 1782 -209 -1736 -1919 -57 2173 1903 -166 -1707 -1937
6392 -1937 -556 1485 2147 878 -1376 -2144 -1242 741 2022 1412 -566 -1973 -1547 224 1944 1861 -255
6409 -255 -1848 -1947 -247 1797 2361 425 -1924 -2351 -715 1604 2483 1090 -1457 -2501 -1164 1043
6425 1043 2277 1575 -694 -2106 -1571 566 1888 1696 -377 -1892 -1625 199 1815 1871 602 -1553
6441 -1553 -2159 -643 1260 2080 1063 -688 -1965 -1455 705 1915 1593 -331 -2106 -1703 245 1939
6457 1939 1821 -111 -1971 -2049 -89 1807 1922 220 -1385 -2064 -757 1252 1865 756 -1036 -1648 -1045
6474 -1045 552 1515 987 -330 -1474 -1128 252 1485 1278 71 -1180 -1503 -443 1415 1704 625
$$ packed form
6360a647k04J681J636J91j208j615q34J282K129P89j427j948j111J025K226J397
6376B362q19k172j602L46K328J710l71j991j527j83J862K230k70k069j541k30
6392a937J381K041O62j269k254p68R02J983J281o10j978j407M26J771J720q3k116
6409b55j593r9J700K044N64j936k349m27J636K319Q79j393k547j044J337K207
6425A043J234p02k269j412N35K137J322j92k073j515K67J824J616N6j269k155
6441a553o06J516J903Q20j017j751j277N10K160J210l22j924j775M03J948J694
6457A939j18j932j860p8J960J896J15j702j605o79J307K009O13j109j792o12O03
6474a045J597R63n28j317j144L46J380J233k07j207j251l23J060J858K89j079
$$ plain form
6490 625 -1086 -1581 -802 638 1597 845 -531 -1285 -858 528 1560 922 -517 -1382 -1105 220 1489
6507 1489 1328 -87 -1109 -887 -145 813 1046 244 -736 -868 -293 452 671 418 -368 -758 -391 176 750
6526 750 626 -236 -779 -565 182 669 759 257 -784 -878 -170 543 812 315 -389 -746 -140 500 524 37 -413
6547 -413 -556 -8 573 631 249 -157 -519 -310 221 357 243 113 -66 -222 116 211 -86 -57 175 -19 -42
6568 -42 38 -1 140 5 -24 -269 -48 44 34 140 -79 -213 -157 136 43 -40 73 -3 -71 -89 -180 -276 17 379 248
6593 248 -172 -384 -356 62 576 353 -276 -442 -264 193 740 437 -448 -801 -533 187 700 776 -4 -769 -637
6614 -637 -69 554 776 169 -616 -723 -82 688 843 343 -498 -868 -537 251 952 789 21 -1083 -1035 -74
6634 -74 978 1167 284 -1053 -1376 -353 911 1351 588 -913 -1492 -652 884 1616 780 -743 -1562 -929
$$ packed form
6490F25j711m95P79J440R59p52j376p54M27J386J032o38j439q65K77J325J269
6507A489j61j415j022K22P42R58K33q02r80j32N75P45K19k53p86l90L67N67N74
6526G50j24q62n43K14P47M87R0n02j041r4P08P13K69m97p04l57O06O40K4m87m50
6547d13j43N48N81N8l82m06l62K09N31J36j14j30j79j56L38R5k97K9K32j94k3
6568d2Q0l9J41j35k9k45K21R2j0J06k19j34N6K93r3q3J13p6o8j8r1r6K93L62j31
6593B48m20k12K8M18N14k23o29j66J78M57N47l03q85l53K68P20N13P6p80p65J32
6614f37N68O23K22o07p85j07O41P70J55n00q41l70L31P88P01j63p68j104M8R61
6634g4J052J89q83j337l23J023J264M40p63j501n79Q40J536P32q36j523q19O33
$$ plain form
6652 -929 631 1525 1204 -312 -1554 -1391 121 1252 1282 217 -988 -1436 -438 861 1278 654 -598
6669 -598 -1498 -986 787 1838 1211 -465 -1659 -1540 186 1729 1531 -73 -1440 -1650 -111 1560 1670
6686 1670 97 -1507 -1803 -519 1375 1797 585 -1167 -1765 -718 943 1788 952 -764 -1746 -1271 450
6703 450 1548 1407 -184 -1577 -1546 -217 1365 1614 260 -1329 -1720 -493 1128 2029 862 -1277 -2164
6720 -2164 -1129 997 2187 1424 -714 -2148 -1413 566 1904 1679 -286 -1850 -1664 69 1771 1808
6736 1808 253 -1770 -1978 -259 1446 1868 652 -1017 -1949 -885 866 1940 1178 -542 -1898 -1451
6752 -1451 376 1590 1547 -129 -1690 -1835 -105 1597 1937 202 -1600 -2060 -540 1687 2203 663
6768 663 -1225 -2105 -1130 927 2109 1110 -800 -1768 -1220 560 1882 1312 -417 -1760 -1385 -95 1549
$$ packed form
6652i29J560Q94l21j516j242J63J512J131L0j065j205m48R98J299M17o24j252
6669e98r00N12J773J051o27j676j194J19J726J543j98j604j367k10J539J671J10
6686A670j573j604k96J284J894M22j212j752n98J047J661Q45q36j716r82M75J721
6703D50J098j41j591j393L1J329J582K49j354j589l91J227J621R01j167k139q87
6720b164J035K126J190p63k138j434P35J979J338k25j965j564J86J733J702L7
6736A808j555k023k08J719J705M22j216j669r32J064J751J074p62j720j356M47
6752a451J827J214m3j676j561j45J730J702L40j735j802m60J520K227N16j540
6768F63j888q80R75K057J182r99j910r68N48J780J322n70j729j343L75J290J644
$$ plain form
6785 1549 1570 192 -1276 -1544 -731 941 1884 753 -840 -1702 -830 506 1706 985 -436 -1665 -1272
6802 -1272 203 1556 1465 -112 -1547 -1502 -127 1338 1473 199 -1382 -1559 -388 945 1473 568 -778
6819 -778 -1432 -654 608 1073 757 -418 -1092 -744 261 941 962 5 -1070 -938 -173 854 1093 506 -503
6838 -503 -1116 -497 638 984 578 -385 -1154 -769 557 1010 647 -449 -1073 -899 301 952 601 -212 -871
6857 -871 -776 166 720 499 -88 -474 -555 -128 401 476 108 -218 -314 -310 232 410 238 -77 -320 -348 105 455
6879 455 401 -102 -366 -453 -195 422 485 -24 -137 -209 61 126 494 -21 -378 -334 2 279 367 64 -191 -137 106
6902 106 86 -54 -109 -162 159 137 98 -217 -183 -66 -6 119 47 -356 -227 163 234 211 7 -133 -190 -6 269 301
6926 301 149 -147 -259 -52 36 222 219 231 -390 -538 -198 217 668 414 -305 -657 -375 381 685 434 -221
$$ packed form
6785A549K1j378j468k68Q13J672R43j131j593q62Q72J336J200p21j421j229L93
6802a272J475J353r1j577j435M5J375J465J35j274j581j77J171J333N28r05j346
6819g78o54P78J262M65l16j175o74L48J005O80K1r57j075J32P65J027K39n87j009
6838e03o13O19J135L46m06r63p69L85J326M53l63j096o24J74J200O51l51q13o59
6857h71R5R42N54k21n87l86q1M27N29P5l68l26r6MN42J78j72l15k43k8M53L50
6879D55n4n03k64q7K58O17O3n09j13p2K70O5L68n15l57M4L36K77Q8l03k55N4K43
6902A06k0j40n5n3L21k2l9l15L4J17O0J25p2m03J29L90P1k3k04j40n7J84K75L2
6926C01j52k96j12K07Q8J86lJ2o21j48L40M15M51k54p19l52K82P56L04k51o55
$$ plain form
6947 -221 -648 -461 281 900 664 -204 -1024 -726 338 932 760 -3 -828 -754 -108 799 874 81 -652 -899
6967 -899 -404 546 1001 537 -496 -1141 -783 163 1151 882 -30 -988 -1085 -114 1120 1398 213 -927 -1376
6986 -1376 -313 970 1665 507 -977 -1352 -625 843 1584 741 -688 -1617 -1060 613 1609 1136 -385
7003 -385 -1280 -1225 21 1179 1355 219 -1133 -1393 -180 951 1479 728 -921 -1572 -912 653 1519 1056
7021 1056 -465 -1610 -1349 53 1596 1542 -234 -1754 -1499 -9 1542 1661 326 -1443 -1741 -287
7037 -287 1360 1705 556 -1140 -1728 -710 964 1747 862 -698 -1609 -1156 355 1519 1369 -128 -1362
7054 -1362 -1396 -35 1519 1519 193 -1134 -1636 -469 1308 1902 638 -1062 -1850 -964 809 1827 1148
7071 1148 -628 -1821 -1221 583 1812 1268 -426 -1818 -1553 115 1829 1671 27 -1513 -1469 -379
$$ packed form
6947b21m27J87P42O19k36q68q20K98J064N94j72p63q25P4O46R07P5p93p33k47
6967h99M95R50M55m64j033o45L58R46R88k69r12r58r7R71J234K78j185j140m49
6986a376J063J283O95j158j484l75P27J468P41q43j429r29N57J673R96m73j521
7003c85q95N5J246J158J76j136j352k60J213J131N28p51j649o51O60J565Q66m63
7021A056j521j145K61J402J543n4j776j520K55J490J551J19j335j769k98J454
7037b87J647L45j149j696n88J018J674P83q85j560r11M53J511J164j50j497j234
7054a362l4J361J554%j326j327n02J167J777N94j264j700p88Q86J773J018o79
7071A148j776j193O00J804J229n44j694j392K65J668J714j58j644j540M4J090
$$ plain form
7087 -379 1200 1721 565 -1058 -1679 -724 892 1544 826 -690 -1724 -1195 322 1762 1515 -272 -1678
7104 -1678 -1440 -104 1426 1730 287 -1540 -1762 -408 1427 1841 768 -1145 -1867 -832 1028 1903
7120 1903 960 -830 -1683 -984 439 1541 1185 -374 -1610 -1327 26 1221 1296 297 -1118 -1437 -523
7137 -523 882 1232 558 -680 -1478 -925 504 1279 794 -297 -1458 -1149 255 1274 1067 -51 -1287
7154 -1287 -1206 127 1145 1127 157 -868 -1198 -434 975 1190 352 -562 -1064 -410 488 1050 620 -450 -826
7173 -826 -452 212 965 624 -50 -627 -649 -222 609 835 84 -508 -630 -301 370 803 416 -498 -886 -516
7193 -516 404 787 473 -246 -732 -505 181 657 399 -297 -517 -348 159 424 428 -118 -486 -373 18 269 164
7214 164 85 -93 -163 5 -39 51 165 -68 -33 1 -63 154 227 99 -217 -169 -33 104 198 45 6 -226 -35 262
$$ packed form
7087c79J579N21j156j623o21R55J616O52p18j516j034N29J517J440k47j787j406
7104a678K38J336J530L04j443j827k22J354J835M14j073j913p22J035J860Q75
7120A903r43j790q53O99J423J102l56j559j236K83J353J195P5r99j415l19R14
7137e23J405L50o74j238p98N53J429P75m85j091j161L09J404J019k07j118j236
7154a287Q1J333J018j8r70j025l30P64J409K15q38r14n02O54Q98N62m30j070l76
7173h26L74O64P53l41o74n77k2M27Q31K26p51n92j22L29O71M33l87r14l88L70
7193e16R20L83l14p19m86K27O86M76k58o96k20J69N07K65Mn46l68J13L91K51j05
7214A64p9j78p0J68m4R0J14k33L5L4o4K17P3j28l16M8J36J37R4j53l9k32J91K97
$$ plain form
7238 262 102 15 -201 -128 -39 26 -16 -71 11 196 268 21 -185 -287 33 269 165 -82 -224 -315 -61 294 335
7261 335 -158 -424 -482 -33 429 577 62 -403 -606 -295 203 482 262 -185 -367 -407 125 446 486 66 -467
7282 -467 -358 -166 430 822 422 -437 -760 -420 484 969 417 -431 -1044 -593 323 1109 858 -335 -1102 -739
7302 -739 189 943 920 -15 -1055 -849 32 888 1130 179 -963 -1202 -263 610 1142 642 -507 -1204 -675
7321 -675 399 986 826 -201 -1077 -1048 46 1105 1248 151 -1186 -1516 -216 1049 1586 475 -836
7338 -836 -1538 -756 974 1509 832 -739 -1569 -927 563 1539 1008 -192 -1370 -1232 37 1221 1248 43
7356 43 -1097 -1294 -272 1164 1521 461 -788 -1358 -812 576 1472 921 -350 -1414 -1176 273 1482
7373 1482 1118 -236 -1513 -1400 -1 1561 1572 122 -1322 -1526 -398 1112 1712 429 -1007 -1543 -591
$$ packed form
7238B62j60q7k16P3Q9O5m2n5Q2J85P2k47k06j02L20K36j04k47j42r1K54L55M1
7261C35m93k66n8M49M62J48n15m65k03L11M98K79k20m47j82m0N32L21M0m20n33
7282d67J09J92N96L92m00q59l23L40R04M85n52q48o13M51R16P86k51j193p67L63
7302g39R28P54k3r35j040K06Q81Q56K42r51j142k39R39Q73N32n00j149o97N29
7321f75J074N87j60j027q76K9J094J059J43j097j337l30J300J265N37j111j311
7338h36p02P82J730N35o77j571q30O42J490R76n31j200j178J38J269J184K7j205
7356D3j140j97J022J436L57j060j249n70N46J388Q96n51j271j064K38J449J209
7373A482l64j354j277J13J399J562J1j450j444k04J128J510O00j283j436n36R52
$$ plain form
7390 -591 963 1577 717 -743 -1497 -930 600 1456 1102 -288 -1444 -1247 61 1247 1448 207 -1393
7407 -1393 -1529 -471 1046 1637 703 -1034 -1743 -715 875 1601 984 -683 -1653 -960 621 1623 1218
7424 1218 -350 -1719 -1345 271 1599 1448 172 -1281 -1445 -123 1165 1370 443 -898 -1359 -619 869
7441 869 1410 879 -532 -1546 -1033 442 1277 1145 -168 -1336 -1366 -51 1242 1381 193 -1237 -1548
7458 -1548 -481 1145 1458 397 -855 -1476 -673 872 1423 592 -720 -1503 -778 418 1390 1020 -311
7475 -311 -994 -978 -123 967 1091 133 -815 -973 -339 605 1138 335 -630 -1109 -661 467 1161 840 -336
7494 -336 -1107 -840 10 944 1094 -35 -1015 -940 18 816 888 76 -836 -750 -67 742 979 278 -559 -887 -193
7515 -193 486 605 278 -283 -717 -293 379 449 418 -4 -406 -464 27 339 469 166 -473 -558 -158 412 531
$$ packed form
7390e91J554O14q60j460p54N67J530Q56l54j390j156J97J308J186K01j241j600
7407a393j36J058J517N91r34j737p09J028J590P26o17j667r70O93J581J002m05
7424A218j568j369L74J616J328j51j276j453j64J322J288K05r27j341m61P40J488
7441H69N41n31j411j014N13J475Q35j32j313j168l0J315J293J39j188j430l11
7458a548J067J626L13j061j252o21Q03J545N51q31j312p83P25J196R72l70j331
7475c11o83J6Q55J090J24r58r48j58O34R44N33q03r65m79M48J128O94l21j176
7494c36p71K67Q50R34J50j129r80P5R58P98P2q12r12Q6O83Q09K37p01q37l28O94
7515a93O79J19l27n61m34M24O72P0l1m22m02n8M91L12J30l03o39q5M00N70J19
$$ plain form
7536 531 254 -223 -585 -350 223 597 290 -108 -597 -328 132 301 11 -134 -360 -183 273 255 68 -221
7556 -221 -187 -70 -4 201 175 -99 58 66 -153 8 -76 22 182 326 11 -140 -165 56 13 81 60 -73 -41 -39 -122
7581 -122 42 158 109 -55 32 -158 -98 57 240 -131 -273 -297 -121 375 394 26 -445 -467 -155 303 530 88
7603 88 -434 -458 -4 473 559 95 -534 -606 -70 580 623 139 -313 -759 -237 478 628 408 -111 -719 -439 191
7625 191 628 569 15 -633 -735 -90 582 682 373 -549 -1059 -472 552 1032 499 -588 -1105 -806 314
7644 314 1177 801 -302 -1113 -836 168 1001 903 -159 -978 -938 -11 1100 1097 49 -838 -1038 -495 789
7663 789 1273 724 -441 -1202 -631 261 1131 963 -137 -1086 -958 27 1190 1211 47 -1128 -1266 -423 1024
7682 1024 1616 571 -979 -1423 -700 633 1458 880 -668 -1476 -953 444 1448 934 -273 -1327 -998
$$ packed form
7536E31k77m77l62K35N73L74l07l98m89K69M60J69k90j45k26J77M56j8j87k89
7556b21L4J17O6K05k6k74J57Qk19J61q4R8J60J44l15j51k5K21m3O8k1j33L2Kq3
7581a22J64J16m9j64Q7j90O0J55J83l71j42k4J76M96J9l68m71k2L12M58K27m42
7603H8n22k4M54M77Q6m64o29p2N36O50M3m84m52m46N22P15J50k20n19o08K80O30
7625A91M37n9n54o48j02O45O72J00l09r22n10N87J024M80n33j087n17K99J120
7644C14Q63l76j103q11K77J004Q33r8j062q19M0R27J111lj048q87k00N43J284
7663G89M84n49j165p61N71Q92Q70j68j100r49J28R85J163K1j164j175j38Q43J447
7682A024N92j045j550m44P23J333Q25n78j548q08N23J397J004n14j207j054L29
$$ plain form
7699 -998 191 1257 1081 -113 -1250 -1437 -141 1054 1382 435 -889 -1522 -735 524 1219 1000 -412
7716 -412 -1458 -974 448 1287 968 -351 -1479 -1168 294 1535 1290 51 -1358 -1582 -214 1282 1503
7733 1503 294 -1038 -1460 -536 980 1439 662 -678 -1476 -729 562 1315 953 -284 -1337 -1132 165
7750 165 1385 1144 4 -1089 -1418 -438 940 1437 515 -835 -1417 -846 671 1543 852 -634 -1500 -952
7768 -952 725 1644 1018 -480 -1483 -1211 108 1481 1294 -16 -1220 -1178 -207 868 1213 258 -919
7785 -919 -1159 -328 578 1163 615 -493 -1216 -785 405 1307 1109 -149 -1142 -1120 -139 1049 1210 305 -954
7804 -954 -1172 -349 840 1244 388 -633 -1142 -456 669 1073 538 -466 -1236 -678 464 1130 856 -203
7822 -203 -977 -845 -11 636 564 133 -507 -789 -146 534 681 196 -387 -689 -415 533 784 494 -179 -757
$$ packed form
7699i98J189J066j76j194j137j87J296J195L28r47j324o33P87J259O95k19j412
7716d12j046M84J422Q39l19j319j128L11J462J241k45j239j409k24J368J496K21
7733A503j209j332m22R24J516M59p77j340p98P47J291P53l62j237j053K05J297
7750A65J220k41j140j093l29R80J378M97r22j350n82N71J517Q72o91j486q66N48
7768i52J677R19o26j498j003K72J319J373j87j310j204M2R71J075L45r55j177
7785i19k40Q31R06N85n48j108p23M31J190R02j98j258r93K2R81J188J61r05j259
7804i54k18Q23J189M04q56j021n09O86J125M04n35j004p70N58J142O66k74j059
7822b03p74J32Q34O47p2m31o40k82O43O80J47m85n83l02K74R48K51k90o73n78
$$ plain form
7842 -757 -680 121 738 718 -123 -639 -737 -46 746 624 -6 -516 -517 -68 569 476 -188 -444 -444 -147 279 609 340
7865 340 -241 -444 -301 110 380 229 -118 -174 -194 -86 126 177 -126 -160 -213 -89 167 328 83 -279 -412 -134
7887 -134 59 365 206 -102 -190 -2 95 91 -23 -149 -192 153 370 50 -62 -173 -124 18 225 3 -195 -132
7909 -132 142 279 249 -58 -288 -127 163 298 171 -70 -436 -203 145 182 270 184 -160 -350 -124 202 153 179
7931 179 -49 -303 -117 161 342 54 -293 -463 -371 157 537 517 -24 -515 -658 -167 485 584 189 -495 -704
7952 -704 -147 590 781 -1 -569 -745 -196 613 759 271 -562 -818 -427 299 911 456 -293 -646 -590 12
7972 12 677 652 165 -551 -753 -140 583 965 372 -531 -1078 -504 550 1258 595 -507 -1202 -819 191 1031
7992 1031 1070 -89 -1128 -888 19 925 954 24 -1066 -991 60 967 1081 315 -809 -1380 -469 574 1194
$$ packed form
7842g57P7Q01O17k0q41n16r8O91P92j22o30n10jM49O37r3o64k56%K97M26L30k69
7865C40n81k03J43M11K70j51l47n6k0J08K12N1l03l4n3J24K56J61k45l62j33K78
7887a34J93L06j59l08q8J88R7mj14j26m3L45K17l20j12j11M9J42K07k22j98O3
7909a32K74J37l0l07k30J61K90J35j27k41l66K33L48L7Q8q6l44j90K26L26m9K6
7931A79k28k54J86K78J81k88l47j70R2N28L80k0n41m91j43M91O52R9l95o84k09
7952g04N57P37J91p82n68j76N49Q09J46m88q33k56L91P26O12m55p49l53N6O02
7972A2O65k5m87p16k02O13P23L82n93r03n47N74J054P08o63j102o95L83J010Q40
7992A031L9j159j039K40R07R06K9r30j090P5J051R07J14p66j124n71R11J043O20
$$ plain form
8011 1194 609 -401 -1117 -757 268 1086 869 -100 -1069 -1010 -142 977 1012 297 -1096 -1443 -319 1045
8029 1045 1376 556 -771 -1492 -690 802 1553 822 -525 -1344 -767 369 1302 786 -164 -1113 -1042 271
8047 271 1196 1051 -36 -1078 -1222 -308 1014 1397 484 -732 -1320 -708 523 1266 729 -489 -1034 -787
8065 -787 288 1298 987 -273 -1324 -1182 104 1357 1377 174 -1281 -1411 -317 1150 1408 507 -1094
8082 -1094 -1452 -519 919 1455 678 -713 -1184 -436 479 1196 873 -152 -1129 -905 186 1047 1142 295 -1036
8101 -1036 -1331 -397 783 1248 615 -744 -1228 -689 622 1260 586 -662 -1352 -771 603 1297 952 -292
8119 -292 -1344 -1078 205 1187 1121 149 -928 -1103 -248 830 1038 378 -633 -965 -310 740 1107 467
8137 467 -470 -952 -684 349 1007 724 -165 -828 -948 -136 822 943 184 -848 -983 -445 616 971 339
$$ packed form
8011A194n85j010p16L60J025Q18k17r69r69N9Q68J119L5p15j393l47J124J364
8029A045L31q20j327p21Q02J492P51p31j347q19N77J136R33n16r50r49P1J313
8047B71R25j45j087j042j44R14J322L83r13j216n88O12J231P43n37j218n45K47
8065g87J075J010l11j260j051J42J286J253K0j203j455j30J094J467K58r01j601
8082a094l58R33J438N36p77j391m71P48R15P17l23j025r77K24J091Q61R5q47j331
8101a036k95R34J180M65o33j359m84N39J311O38o74j248o90N81J374O94l45j244
8119b92j052K66J283R82o6r72j077j75Q55J078K08o60j011l32O55J050L67o40
8137D67r37m82K68J033O58k83q89o63j20Q12R58J21p59j032j35N38J061L55o32
$$ plain form
8156 339 -468 -713 -426 567 957 279 -474 -917 -512 408 912 663 -110 -594 -423 -49 569 504 164 -363
8176 -363 -274 -116 321 369 301 -255 -485 -244 269 715 272 -147 -537 -370 113
$$ packed form
8156C39q07k45K87R93L90o78p53m43M05R20N04k49p73m84J71L74O18o5l40n27
8176c63Q9J58M37M8o8n56k30K41N13M46m43m19l90J67M83
8191A13
$$ Imaginary data points
##PAGE= N=2
##DATA TABLE= (X++(I..I)), XYDATA
$$ plain form
0 0 0 0 0 0 0 0 0 0 0 0 4 -8 8 -8 8 -8 9 -12 15 -16 20 -21 23 -28 34 -37 41 -47 49 -57 64 -68 77 -89 95
35 95 -105 116 -129 144 -156 174 -194 213 -234 263 -293 327 -370 422 -481 560 -658 789 -971 1228
55 1228 -1630 2302 -3570 6474 -15861 103334 629053 304988 -285174 -194099 143814 96062
67 96062 -34021 81814 96607 -130176 -213357 -69048 5771 23259 131535 110467 -138456
78 -138456 -198409 94569 272965 114888 -38759 -74158 -179963 -189526 92351 255966 -22965
89 -22965 -273982 -92744 130679 62014 17648 157446 118591 -150075 -197916 49961 162043
100 162043 15471 -106216 -122722 -130333 -41488 146704 168956 -9302 -87541 -14091 5460
111 5460 15524 121225 106526 -116843 -206666 -34204 67099 -832 23504 87335 -64209
$$ packed form
0@%%%%%%%%%%Mj2J6j6J6j6J7k1K7l1L6m1M4n1O2p1P8q8R6j06J21j32J45j66J84
35I5k00K21k45K73l00L30l68M07m47M97n56O20o97P92r03J041j218J447j760K199
55A228k858L932n872J0044k2335J19195N25719l24065n90162R1075L37913m7752
67I6062j30083J15835J4793k26783q3181J44309P4819J7488J08276k1068k48923
78a38456n9953K92978J78396j58077j53647l5399j05805r563K81877J63615k78931
89b2965k51017J81238K23423o8665m4366J39798l8855k68666m7841K47877J12082
100A62043j46572j21687j6506p611Q8845J88192K2252j78258p8239P3450J9551
111E460J0064J05701j4699k23369q9823J72462J01303o7931K4336O3831j51544
$$ plain form
122 -64209 -194454 45765 310703 120031 -199845 -126239 84998 3784 -115275 30762
132 30762 124797 -59219 -169109 -16445 108219 91570 92613 49993 -116870 -139887 90546
143 90546 190247 -16446 -159096 -61088 -9937 -63503 35896 176724 35240 -175341 -56705
154 -56705 158873 75299 -73883 23774 87886 -102905 -191067 18068 151276 19337 -86778
165 -86778 -36952 -8471 -1769 93421 128830 -20991 -131505 -41387 41903 -4965 -5817 55395
177 55395 -18011 -137811 -50905 114180 86068 -12334 18460 31217 -64417 -44831 107150
188 107150 92767 -90904 -124152 4892 30800 -26303 26327 85226 -15052 -99622 2635
199 2635 97407 28243 -27857 14711 -13558 -98352 -42317 71666 30568 -55215 -10715 28132
$$ packed form
122f4209j30245K40219K64938j90672l19876P3606K11237q1214j19059J46037
132C0762R4035j84016j09890J52664J24664j6649J043m2620j66863k3017K30433
143I0546R9701k06693j42650R8008N1151n3566R9399J40828j41484k10581J18636
154e6705K15578q3574j49182R7657O4112j90791q8162K09135J33208j31939j06115
165h6778M9826K8481O702R5190L5409j49821j10514R0118Q3290m6868q52O1212
177E5395p3406j19800Q6906J65085k8112r8402L0794J2757r5634J9586J51981
188A07150j4383j83671l3248J29044K5908n7103N2630N8899j00278q4570J02257
199B635R4772o9164n6100M2568k8269q4794N6035J13983m1098q5783M4500L8847
$$ plain form
211 28132 -38068 -24052 99307 82119 -79229 -99800 31024 52872 -32891 -23274 28021 -36086
223 -36086 -88397 14995 95511 17416 -32401 35827 32261 -60067 -31295 74963 36560 -73597
235 -73597 -50363 22440 -3039 -21040 46024 49738 -46737 -58063 39601 59893 -6923 -5467
247 -5467 27418 -37280 -91938 -1614 81977 15192 -51050 -6677 12378 -28187 13437 91578
259 91578 33681 -77921 -53663 29859 16664 -17750 17263 14671 -66801 -68431 45010 88221
271 88221 12045 -26260 1168 -17360 -41583 25128 75745 1957 -67113 -30901 -1476 -20701
283 -20701 20118 81959 18269 -93232 -61655 58847 84861 22950 -19593 -48590 -74165 -21160
295 -21160 78260 68696 -37302 -61521 3812 13226 -11583 40131 80029 -6910 -93565 -42705
$$ packed form
211B8132o6200J4016J23359j7188j61348k0571J30824K1848q5763R617N1295o4107
223c6086n2311J03392Q0516p8095m9817O8228l566r2328K8772J06258l8403j10157
235g3597K3234P2803k5479j8001O7064L714r6475j1326R7664K0292o6816J456
247e467L2885o4698n4658R0324Q3591o6785o6242M4373J9055m0565M1624P8141
259I1578n7897j11602K4258Q3522j3195l4414L5013k592q1472j630J13441M3211
271H8221p6176l8305K7428j8528k4223O6711N0617p3788o9070L6212K9425j9225
283b0701M0819O1841o3690j11501L1577J20502K6014o1911m2543k8997k5575N3005
295b1160R9420r564j05998k4219O5333R414k4809N1714L9898q6939q6655N0860
$$ plain form
307 -42705 42478 45403 18396 -748 -50584 -79630 -5206 89053 69119 -17862 -48504 -31860
319 -31860 -21049 18371 77550 47086 -65182 -98629 -18252 43491 42435 35972 2846 -70273
331 -70273 -70279 38433 100708 32514 -46666 -50649 -35719 -24536 28698 80640 34707 -66970 -87553
344 -87553 -12270 58382 74307 42700 -32304 -88515 -38184 62940 73206 1554 -37390 -37178
356 -37178 -44473 -16794 62998 88826 8498 -72348 -63841 -4839 45253 72287 44883 -49919
368 -49919 -115142 -48563 74139 96015 14974 -53191 -64710 -36991 28393 85054 53833 -36963
380 -36963 -77149 -43804 4800 43387 61741 21517 -62296 -93540 -23985 68825 86773 29101
392 29101 -41536 -76100 -46716 35568 88910 43310 -46244 -77522 -41361 13273 62245 74049
$$ packed form
307d2705Q5183K925k7007j9144m9836k9046P4424R4259j9934q6981l0642J6644
319c1860J0811L9420N9179l0464j12268l3447Q0377O1743j056o463l3126p3119
331g0273oJ08712O2275o8194p9180l983J4930J1183N3234N1942m5933j01677k0583
344h7553P5283P0652J5925l1607p5004n6211N0331J01124J0266p1652l8944K12
356c7178p295K7679P9792K5828q0328q0846Q507N9002N0092K7034k7404r4802
368d9919o5223O6579J22702K1876q1041o8165j1519K7719O5384N6661l1221r0796
380c6963m0186L3345M8604L8587J8354m0224q3813l1244O9555R2810J7948n7672
392B9101p0637l4564K9384Q2284N3342m5600q9554l1278L6161N4634M8972J1804
$$ plain form
404 74049 12448 -74883 -86027 -5179 78671 84123 14249 -63832 -81375 -25529 50091 75414
416 75414 29487 -39585 -67861 -36395 27476 75118 57866 -20108 -77922 -54262 12503 54462
428 54462 50749 8060 -52137 -74554 -22939 55567 78058 23531 -48712 -68136 -23973 34045
440 34045 57257 32388 -21142 -60468 -47498 9123 58817 57852 749 -65425 -68032 5614 75700
453 75700 66054 -5127 -61493 -54833 -3626 39012 43299 17776 -20342 -47595 -29997 25348 59532
466 59532 35268 -17973 -51596 -40186 9321 53817 45528 -7928 -51047 -44164 -1316 35785
478 35785 42838 19789 -22393 -52371 -28687 33415 58674 18879 -31085 -45477 -27672 11489
490 11489 47776 37577 -16303 -50016 -29080 14115 38094 32433 2084 -35482 -45087 -9282
$$ packed form
404G4049o1601q7331j1144Q0848Q3850N452o9874p8081j7543N5846P5620K5323
416G5414m5927o9072k8276L1466O3871M7642j7252p7974n7814K3660O6765M1959
428E4462l713m2689o0197k2417N1615P8506K2491n4527p2243j9424M4163N8018
440C4045K3212k4869n3530l9326J2970N6621M9694r65n7103o6174k607P3646P0086
453G5700r646p1181n6366O660N1207M2638M287k5523l8118k7253J7598N5345L4184
466E9532k4264n3241l3623J1410M9507M4496q289n3456m3119O883M2848L7101
478C5785P053k3049m2182k9978K3684O2102K5259l9795m9964j4392J7805L9161
490A1489L6287j0199n3880l3713K0936M3195K3979n661l0349l7566r605L5805
$$ plain form
502 -9282 33842 34268 1825 -18848 -23384 -21766 3112 39340 31957 -16983 -38383 -14717 9729
515 9729 21223 27733 8861 -32949 -43521 -3471 33540 29891 8548 -8143 -26145 -28299 9316
528 9316 46576 23409 -27906 -33026 -4332 6639 12046 26047 9223 -32510 -32607 9144 25972
541 25972 10586 3672 -1923 -24619 -28188 8413 32630 9226 -17109 -11981 -7973 -16217 3054
554 3054 35680 19844 -26135 -28186 2312 9803 8372 18532 3408 -33978 -26842 20450 33013
567 33013 5484 -5604 -1656 -15476 -21257 12135 37461 11026 -21165 -13390 -439 -5952 6332
580 6332 28859 8165 -29637 -17805 14556 10220 3077 21293 9113 -39068 -38216 20306 43429
593 43429 7338 -17613 -12042 -15657 -15303 20281 42536 3932 -36213 -20258 4878 2452 14253
$$ packed form
502i282M3124M26l2443k0673m536J618K4878L6228p383m8940k1400K3666K4446
515I729J1494O510j8872m1810j0572M0050L7011l649k1343j6691j8002k154L7615
528I316L7260k3167n1315n120K8694J0971N407J4001j6824m1733r7M1751J6828
541B5972j5386o914n595k2696l569L6601K4217k3404k6335N128M008q244J9271
554C054L2626j5836m5979k051L0498P491j431J0160j5124l7386P136M7292J2563
567C3013k7529j1088L948j3820n781L3392K5326k6435l2191P775J2951n513J2284
580F332K2527k0694l7802J1832L2361m336p143J8216j2180m8181Q52N8522K3123
593D3429l6091k4951N571l615L54L5584K2255l8604m0145J5955K5136k426J1801
$$ plain form
606 14253 33972 -1208 -52428 -27280 34510 34082 -2189 -6418 -6484 -28220 -16726 34204 41914
619 41914 -6873 -31826 -13676 -7715 -8073 25809 44490 -6547 -54317 -21662 27628 24641 10721
632 10721 9456 -22366 -52457 -6865 58445 39527 -22824 -33937 -13865 -11038 6248 44013
644 44013 31506 -32804 -51490 -2700 28327 17289 13903 6201 -36579 -48600 14555 57584
656 57584 16065 -25740 -15518 -14439 -26043 13792 60894 21229 -54190 -52957 2391 26913
668 26913 26728 27406 -6154 -59585 -43665 35249 59446 8017 -24125 -19549 -28254 -17185 45484
681 45484 65513 -10518 -68790 -31797 18534 25587 32478 32084 -22200 -68979 -22973 51606 48583
694 48583 44 -16511 -22412 -37569 -5703 61241 53780 -27548 -58144 -17316 7882 15963 45308
$$ packed form
606A4253J9719l5180n1220K5148O1790m28l6271m229o6k1736J1494N0930P710
619D1914m8787k4953J8150N961l58L3882J8681n1037m7770L2655M9290k987j3920
632A0721j265l1822l0091M5592O5310j8918o2351j1113K0072K827J7286L7765
644D4013j2507o4310j8686M8790L1027j1038l386p702m2780j2021O3155M3029
656E7584m1519m1805J0222J079j1604L9835M7102l9665p5419J233N5348K4522
668B6913j85O78l3560n3431J5920P8914K4197n1429l2142M576q705J1069O2669
681D5484K0029p6031n8272L6993N0331P053O891l94n4284m6779M6006P4579l023
694D8583m8539j6555n901j5157L1866O6944p461q1328l0596M0828K5198Q081K9345
$$ plain form
707 45308 35621 -43520 -78470 -7824 58239 41769 3169 -16773 -43825 -46467 19785 76973
719 76973 33431 -43981 -48132 -10113 4135 23372 52554 16104 -63657 -60887 21141 55423
731 55423 24366 3562 -13487 -50337 -39207 37837 69782 10762 -40358 -29449 -13240 -5296
743 -5296 33494 57503 -840 -69416 -42918 27147 41972 24197 14370 -23497 -67469 -25800
755 -25800 61283 60546 -12791 -40186 -19821 -15821 -439 47470 46602 -28012 -65981 -16562 29892
768 29892 24940 18863 12826 -33550 -61959 -1203 64244 33850 -25861 -25957 -13140 -23271 3863
781 3863 55111 32827 -39924 -49991 -3477 15868 16439 31357 13102 -48261 -54483 21065 62828
794 62828 18023 -24389 -20234 -21343 -20479 26954 59647 7942 -50217 -30045 9604 10116 16766
$$ packed form
707D5308r687p9141l4950P0646O6063j6470l8600j9942k7052k642O6252N7188
719G6973m3542p7412m151L8019J4248J9237K9182l6450p9761K770Q2028L4282
731E5423l1057k0804j7049l6850J1130P7044L1945n9020n1120J0909J6209P944
743e296L8790K4009n8343o8576K6498P0065J4825j7775r827l7867m3972M1669
755b5800Q7083p37p3337k7395K0365M000J5382M7909q68p4614l7969M9419M6454
768B9892m952o077o037m6376k8409O0756O5447l0394n9711r6J2817j0131K7134
781C863N1248k2284p2751j0067M6514J9345N71J4918j8255o1363o222P5548M1763
794F2828m4805m2412M155j109Q64M7433L2693n1705n8159K0172L9649N12O650
$$ plain form
807 16766 33256 -2243 -54315 -28855 37016 39141 -2653 -11485 -7411 -27065 -18387 35679 46135
820 46135 -11985 -40882 -9090 5681 -3174 21509 37541 -15127 -58238 -13181 39398 22272
832 22272 -4007 2599 -10268 -36961 -6774 47256 30387 -27549 -29659 3757 3206 -1402 27267
845 27267 25570 -30338 -44472 10783 34757 1760 -5624 12502 -8802 -32808 2488 38241
857 38241 10566 -21867 -8107 2147 -12434 831 33360 16001 -30904 -26431 11825 13652
869 13652 -1483 11592 12052 -24664 -29468 16956 31289 -2999 -13585 1661 -9357 -18951 14409
882 14409 33602 -3368 -29609 -4195 12585 -5437 -4344 19563 7331 -25879 -14562 17385
894 17385 8053 -9549 10052 14557 -23884 -29017 18658 30568 -8207 -14978 9052 -2981 -23265
$$ packed form
807A6766J6490l5499n2072K5460O5871K125m1794q832M074j9654Q678N4066J0456
820D6135n8120k8897L1792J4771q855K4683J6032n2668m3111M5057N2579j7126
832B2272k6279O606j2867k6693L0187N4030j6869n7936k110L3416n51m608K8669
845B7267j697n5908j4134N5255K3974l2997p384J8126k1304k4006L5296L5753
857C8241k7675l2433J3760J0254j4581J3265L2529j7359m6905M473L8256J827
869A3652j5135J3075M60l6716m804M6424J4333l4288j0586J5246j1018r594L3360
882A4409J9193l6970k6241K5414J6780j8022J093K3907j2232l3210J1317L1947
894A7385r332j7602J9601M505l8441n133M7675J1910l8775o771K4030j2033k0284
$$ plain form
907 -23265 7210 35707 1994 -32675 -9004 16582 509 -3579 21389 10905 -31207 -23717
919 -23717 22390 21718 -9952 -2709 12943 -12631 -25042 13441 31517 -2762 -19846 -733 -1131
932 -1131 -14548 9027 34628 4244 -36596 -20438 15541 13782 2755 10804 -339 -32069 -20336
945 -20336 26808 30832 -5263 -15552 -6150 -14003 -9095 25037 30075 -10358 -29896 -7536 7751
958 7751 5942 15876 17255 -15915 -37100 -3992 31648 18321 -4472 -1802 -7902 -27008 -6639
971 -6639 36660 29003 -16676 -26499 -6953 -1300 7947 30957 17550 -32593 -41674 5494 34425
984 34425 16901 -1313 -6798 -22442 -25077 13351 42374 12465 -27646 -22919 -4145 -656 15986
997 15986 34470 4550 -42581 -31491 16568 28635 10588 2124 -8313 -28816 -18802 23908
$$ packed form
907b3265L0475K8497l3713l4669K3671K5586j6073m088K4968j0484m2112P490
919b3717M6107o72l1670P243J5652k5574j2411L8483J8076l4279j7084J9113l98
932a131j3417K3575K5601l0384m0840J6158L5979j759j1027Q049j1143l1730J1733
945b0336M7144M024l6095j0289R402p853M908L4132N038m0433j9538K2360J5287
958G751j809R934J379l3170k1185L3108L5640j3327k2793K670o100j9106K0369
971f639M3299p657m5679r823J9546N653R247K3010j3407n0143r081M7168K8931
984C4425j7524j8214n485j5644k635L8428K9023k9909m0111M727J8774L489J6642
997A5986J8484k9920m7131J1090M8059J2067j8047q464j0437k0503J0014M2710
$$ plain form
1009 23908 38216 4892 -23393 -21395 -13452 603 32070 38821 -9712 -50314 -24503 21716
1021 21716 30404 17779 2604 -25948 -39014 -975 42885 31332 -8841 -23399 -19325 -14620
1033 -14620 8951 41326 28548 -25814 -46797 -10021 25046 25593 15384 -1408 -31993 -35839
1045 -35839 8566 42421 22623 -9689 -19502 -23859 -18318 17247 46289 18491 -33587 -41705 -7075
1058 -7075 22078 30288 21843 -9574 -44628 -33246 21143 47059 17643 -16758 -25911 -23413 -5542
1071 -5542 30052 39222 252 -36980 -30069 -450 21720 30888 17462 -19528 -42196 -18146 24167
1084 24167 34821 12366 -11245 -25007 -25652 38 35731 32945 -8199 -34287 -23893 -1751
1096 -1751 20478 34486 15739 -27959 -41827 -7850 28207 30246 9393 -15155 -31295 -21695
$$ packed form
1009B3908J4308l3324k8285J998P943J4055L1467O751m8533m0602K5811M6219
1021B1716Q688j2625j5175k8552j3066L8039M3860j1553m0173j4558M074M705
1033a4620K3571L2375j2778n4362k0983L6776L5067N47j0209j6792l0585l846
1045c5839M4405L3855j9798l2312r813m357N541L5565K9042k7798n2078q118L4630
1058g075K9153Q210q445l1417l5054J1382N4389K5916k9416l4401r153K498J7871
1071e542L5594R170l8970l7232O911K9619K2170R168j3426l6990k2668K4050M2313
1084B4167J0654k2455k3611j3762o45K5690L5693k786m1144k6088J0394K2142
1096a751K2229J4008j8747m3698j3868L3977L6057K039k0853k4548j6140R600
$$ plain form
1108 -21695 14415 38871 19316 -18605 -30082 -14608 3638 20313 27262 4434 -29674 -28679
1120 -28679 4095 23738 18830 5698 -12469 -27977 -15933 18425 33004 11228 -16478 -22821
1132 -22821 -12120 4169 21584 24243 -485 -28399 -23164 6495 24199 20341 4294 -18483
1144 -18483 -29272 -6674 26391 27950 857 -19311 -18629 -5635 11500 21760 11822 -11678 -23446
1157 -23446 -10644 9746 17652 12532 561 -15863 -21371 -2505 20298 18222 -1340 -13731 -14305
1170 -14305 -5967 9916 19411 8438 -11733 -19410 -9463 6742 17395 13872 -2448 -18539 -17340
1183 -17340 2786 19983 14305 -4490 -14631 -11786 -1334 11858 15857 3326 -11862 -13479 -4348
1196 -4348 6555 12270 7666 -4794 -12233 -7927 2260 10253 8915 -530 -8739 -10110 -4816 5183
$$ packed form
1108b1695L6110K4456j9555l7921j1477J5474J8246J6675O949k2828l4108R95
1120b8679L2774J9643m908j3132j8167j5508J2044L4358J4579k1776k7706o343
1132b2821J0701J6289J7415K659k4728k7914N235K9659J7704l858j6047k2777
1144a8483j0789K2598L3065J559k7093k0168O82J2994J7135J0260r938k3500j1768
1157b3446J2802K0390P906n120j1971j6424n508J8866K2803k076j9562j2391n74
1170a4305Q338J5883R495j0973k0171p677R947J6205J0653l523j6320j6091J199
1183a7340K0126J7197n678j8795j0141K845J0452J3192L999j2531j5188j617R131
1196d348J0903N715m604j2460p439M306J0187P993j338r445q209j371N294R999
$$ plain form
1210 5183 12282 7272 -5276 -11909 -8224 1514 10178 9134 -1659 -10664 -9006 -87 9041 10388
1224 10388 927 -9189 -9526 -2889 3927 8567 6243 -2160 -7476 -5106 -724 3617 6154 3475 -3304
1239 -3304 -6838 -4203 1736 6852 6946 1630 -5546 -10543 -5788 7937 14788 4607 -8541 -10554 -4779
1254 -4779 4145 12726 9998 -4928 -13424 -6905 3898 9248 9443 3419 -6991 -12664 -4901 9106
1268 9106 13166 3510 -6709 -8759 -6290 1254 12975 13460 -2708 -15156 -11256 -1039 8637 16419
1282 16419 9628 -11880 -22202 -6608 14170 17543 4796 -9038 -15679 -10997 6021 21059 14488
1295 14488 -8659 -20491 -10959 3493 13687 17516 4284 -18420 -20864 941 17009 13909 3878
1308 3878 -7344 -17682 -13039 8604 22861 12081 -9101 -17985 -11820 540 15436 21324 2437
$$ packed form
1210E183P099n010j2548o633L685R738Q664j044j0793r005J658Q919R128J347
1224A0388r461j0116l37O637O816M640k324q403n316K370M382M341K537k679o779
1239c304l534K635N939N116R4n316p176m997M755J3725O851j0181j3148k013N775
1254d779Q924Q581k728j4926q496O519J0803N350J95o024j0410n673P763J4007
1268I106M060r656j0219k050K469P544J1721M85j6168j2448L900J0217R676P782
1282A6419o791k1508j0322J5594K0778L373j2747j3834o641M682J7018J5038o571
1295A4488k3147j1832R532J4452J0194L829j3232k2704k444K1805J6068l100j0031
1308C878j1222j0338M643K1643J4257j0780k1182q884O165J2360J4896N888j8887
$$ plain form
1321 2437 -24835 -23761 3762 21361 17311 4179 -13805 -26798 -12646 19009 27781 5784 -16214
1334 -16214 -20079 -10813 6743 23497 18251 -10693 -30279 -15165 12888 21722 13020 -29 -17305
1347 -17305 -25834 -5339 24608 24173 -549 -16189 -17685 -11573 8886 29293 18030 -16910 -31216
1360 -31216 -11427 13519 22727 17373 -1361 -25836 -27992 3985 32987 23247 -6022 -21893 -21839
1373 -21839 -8822 19948 36067 9991 -28151 -29845 -2751 16751 21384 14662 -7960 -30097
1385 -30097 -20273 14449 31323 14637 -9138 -20890 -21639 -6039 24580 34231 3075 -28867 -24762
1398 -24762 -2288 13394 23648 18776 -12911 -36934 -16459 21563 30483 11632 -9380 -24351
1410 -24351 -24874 1787 34271 29533 -9261 -31681 -18239 3303 16932 25140 12050 -22599 -34623
$$ packed form
1321B437k7272J074K7523J7599m050j3132j7984j2993J4152L1655Q772k1997k1998
1334a6214l865R266J7556J6754n246k8944j9586J5114K8053Q834q702j3049j7276
1347a7305q529K0495K9947m35k4722j5640j496O112K0459K0407j1263l4940j4306
1360c1216J9789K4946R208n354j8734k4475k156L1977K9002r740k9269j5871N4
1373b1839J3017K8770J6119k6076l8142j694K7094J9502M633o722k2622k2137
1385c0097R824L4722J6874j6686k3775j1752p49J5600L0619R651l1156l1942M105
1398b4762K2474J5682J0254m872l1687k4023K0475L8022Q920j8851k1012j4971
1410b4351n23K6661L2484m738l8794k2420J3442K1542J3629Q208j3090l4649j2024
$$ plain form
1423 -34623 -3900 25307 21202 5163 -6859 -21472 -21466 8188 32976 17033 -14830 -23030 -11607
1436 -11607 467 15313 26837 9030 -26839 -31982 549 23404 17751 5796 -7641 -25325
1448 -25325 -18928 16304 32488 6831 -19954 -19494 -8199 3788 20286 22309 -4969 -29773 -18049
1461 -18049 9967 18292 10524 3309 -9880 -23397 -9129 21745 23359 -3336 -15661 -9399 -6717
1474 -6717 1013 19889 18698 -9761 -24901 -8762 8997 13252 13260 4678 -17631 -25629 493 26622
1488 26622 16885 -6609 -11617 -9526 -9828 5178 24899 11234 -20065 -20120 3306 10521 6657 9712
1502 9712 1442 -20358 -18778 9901 21782 4763 -7066 -3909 -6986 -10844 5357 20549 5099
1515 5099 -16154 -9954 3214 1326 4228 14611 2403 -21459 -14403 12552 15482 1078 -1556
$$ packed form
1423c4623L0723K9207m105j6039j2022j4613OK9654K4788j5943l1863q200J1423
1436a1607J2074J4846J1524j7807l5869n143L2531K2855n653j1955j3437j7684
1448b5325O397L5232J6184k5657k6785M60J1295J1987J6498K023k7278k4804J1724
1461a8049K8016Q325p768p215j3189j3517J4268L0874J614k6695j2325O262K682
1474f717P730J8876j191k8459j5140J6139J7759M255Qq582k2309p998K6122K6129
1488B6622r737k3494n008K091l02J5006J9721j3665l1299n5K3426P215l864L055
1502I712q270k1800J580K8679J1881j7019j1829L157l077l858J6201J5192j5450
1515E099k1253O200J3168j888K902J0383j2208k3862P056K6955K930j4404k634
$$ plain form
1528 -1556 -1815 -12030 -9115 12963 18866 -2355 -15029 -4134 2939 -968 4993 12589 -1613 -16648
1542 -16648 -4389 11315 4076 -3334 3771 984 -11444 -4953 11722 8335 -4728 -2729 1122
1555 1122 -7794 -7958 9897 15190 -3551 -13280 -1049 4571 -2951 1144 9918 -1591 -14889 -2570
1569 -2570 12254 3936 -4152 2600 -361 -11988 -4036 13416 8276 -7064 -4044 3936 -3984 -8193
1583 -8193 6596 14068 -2448 -12936 -1730 4598 -1530 3585 11754 -2511 -17946 -4110 13589
1596 13589 6519 -2810 1948 -2071 -14516 -4605 18913 15690 -8445 -15116 -3570 1097 1860 11022
1610 11022 10287 -9535 -17190 625 11287 2291 507 4948 -7321 -18236 807 21418 10485
1623 10485 -8642 -9211 -6547 -8684 3432 21608 12626 -15485 -21311 -1684 10514 9041 8710 974
$$ packed form
1528a556k59j0215K915K2078N903k1221j2674J0895P073l907N961P596j4202j5035
1542a6648J2259J5704p239p410P105k787j2428O491J6675l387j3063J999L851
1555A122q916j64J7855N293j8741r729J2231N620p522M095Q774j1509j3298J2319
1569b570J4824q318q088O752k961j1627P952J7452n140j5340L020P980p920m209
1583h193J4789P472j6516j0488J1206O328o128N115Q169j4265j5435J3836J7699
1596A3589p070r329M758m019j2445R911K3518l223k4135o671J1546M667P63R162
1610A1022p35j9822p655J7815J0662q996j784M441j2269j0915J9043K0611j0933
1623A0485j9127n69K664k137J2116J8176q982k8111n826J9627J2198j473l31p736
$$ plain form
1637 974 -18432 -19116 9114 24198 6899 -8930 -8806 -10547 -7784 13352 24606 2068 -21803
1650 -21803 -14683 2812 8128 10708 12231 -2894 -22491 -14313 12460 19224 4324 -3921 -7009
1663 -7009 -14709 -7147 18825 23347 -4352 -22280 -11970 736 8079 18254 14026 -13679 -29175
1676 -29175 -7929 18715 18259 3122 -6879 -14488 -15384 4441 25972 14640 -15155 -20942 -5447
1689 -5447 3560 10051 19505 7897 -21873 -25780 3228 21744 13422 1109 -7182 -17007 -13614 10601
1703 10601 26394 10940 -13537 -18611 -9575 2151 18544 24202 -1187 -30992 -21535 11855 23720
1716 23720 12673 1043 -13058 -24962 -10665 21174 28102 3668 -17580 -18734 -9373 6459
1728 6459 23029 18504 -11465 -30161 -12408 14320 19716 11828 612 -17999 -26357 -3046 25671
$$ packed form
1637I74j9406o84K8230J5084j7299j5829J24j741K763K1136J1254k2538k3871
1650b1803P120J7495N316K580J523j5125j9597Q178K6773O764j4900q245l088
1663g009p700P562K5972M522k7699j7928J0310J2706P343J0175m228k7705j5496
1676b9175K1246K6644m56j5137j0001p609q96J9825K1531j1332k9795n787J5495
1689e447R007O491R454j1608k9770l907K9008J8516q322j2313q291r825L393K4215
1703A0601J5793j5454k4477n074R036J1726J6393N658k5389k9805R457L3390J1865
1716B3720j1047j1630j4101j1904J4297L1839O928k4434k1248j154R361J5832
1728F459J6570m525k9969j8696J7753K6728N396p888j1216j8611q358K3311K8717
$$ plain form
1741 25671 21857 -1754 -13695 -15451 -12348 6207 26816 17216 -15003 -27738 -9712 11432 19157
1754 19157 15798 -728 -24688 -25993 5632 29983 17314 -7981 -16960 -15213 -6518 14135 25427
1767 25427 6502 -19333 -19549 -3109 8383 14219 12967 -3689 -22130 -15226 10204 20785 7883
1780 7883 -6268 -11934 -14447 -5631 16533 23837 1319 -20134 -15853 -1452 8038 15176 11251 -9094
1794 -9094 -21536 -6911 13331 14886 4027 -5481 -13100 -13592 2341 21116 15734 -8347 -18643
1807 -18643 -8326 2671 9029 14162 6187 -14415 -18298 1889 15198 8714 319 -3414 -10010
1820 -10010 -10119 5445 17627 7989 -8941 -12210 -4870 1648 9075 14266 3717 -15610 -17028 1553
1834 1553 13831 10444 3420 -5593 -14694 -8646 10631 16175 1273 -11015 -9109 -2372 3737 9751
$$ packed form
1741B5671l814k3611j1941j756L103J8555K0609r600l2219j2735J8026K1144P725
1754A9157l359j6526k3960j305L1625K4351j2669k5295q979J747Q695K0653J1292
1767B5427j8925k5835k16J6440J1492N836j252j6656j8441O904K5430J0581j2902
1780G883j4151n666k513Q816K2164P304k2518k1453M281J4401R490P138l925k0345
1794i094j2442J4625K0242J555j0859r508p619m92J5933J8775n382k4081j0296
1807a8643J0317J0997O358N133p975k0602l883K0187J3309o484q395l733o596
1820a0010j09J5564J2182r638j6930l269P340O518P427N191j0549j9327j418J8581
1834A553J2278l387p024r013r101O048J9277N544j4902j2288J906O737O109O014
$$ plain form
1848 9751 8823 -3170 -13502 -8555 3821 8552 6048 2885 -3368 -10234 -5867 6301 8783 1767
1862 1767 -2482 -4663 -6537 -499 9811 8374 -3451 -8806 -4660 -5 4144 8300 4970 -6700
1876 -6700 -11807 -2069 8551 6392 -269 -1265 -2971 -6779 -1524 7525 4933 -3346 -2943 78 -2434
1891 -2434 -1484 5211 4487 -4831 -7253 -192 3930 1804 1771 2880 -2029 -8655 -4804 4775 6230 1982
1907 1982 475 -2718 -7808 -3034 8182 7345 -3894 -7337 -1401 2426 2478 3327 2483 -2797 -6700 -3195
1923 -3195 3804 5940 3152 164 -3546 -6476 -2959 5704 8228 2747 -3310 -6787 -5688 2396 9946
1938 9946 6539 -3666 -8684 -5174 2554 8445 7171 -1505 -9520 -8996 385 10355 10646 1043 -8660
1953 -8660 -11115 -4567 6541 11687 4912 -5610 -8920 -5195 2179 9293 7992 -2998 -11483 -7716
$$ packed form
1848I751r28j1993j0332M947J2376M731k504l163o253o866M367J2168K482p016
1862A767m249k181j874O038J0310j437j1825n355M146M655M149M156l330j1670
1876f700n107R738J0620k159o661r96j706l808N255R049k592q279M03L021k512
1891b434R50O695p24r318k422P061M122k126l3J109m909o626L851R579J455m248
1907A982j507l193n090M774J1216q37j1239l443N936L827N2Q49q44n280l903L505
1923c195O999K136k788k988l710k930L517Q663K524n481o057l477J099Q084P550
1938I946l407j0205n018L510P728N891j274q676q015N24R381R970K91r603r703
1953h660k455O548J1108N146o775j0522l310L725P374P114j301j0990q485L767
$$ plain form
1967 -7716 2205 9446 9877 2615 -8505 -13715 -6078 8696 15892 7232 -8069 -14285 -7372 5153
1981 5153 14132 10617 -4257 -15232 -10135 3842 13228 11506 -280 -12923 -13911 -1181 13472
1994 13472 15541 2628 -13361 -16090 -3469 10306 13905 6474 -6131 -13820 -9080 3110 11771
2007 11771 10435 -386 -12746 -13841 -412 14405 15596 639 -16398 -17534 -1688 14228 16344
2020 16344 5490 -9779 -18394 -9708 9594 18690 8554 -8394 -16384 -9294 5959 16424 11783
2033 11783 -4264 -17194 -14067 2940 16505 14834 745 -14285 -17857 -4082 15309 18665 3352
2046 3352 -11823 -14974 -7423 6200 16628 12261 -4913 -17642 -12966 3924 16933 14700 -1019
2059 -1019 -17432 -18574 -711 19660 20047 558 -16820 -18647 -6271 11905 21219 9130 -12613
$$ packed form
1967g716R921P241M31p262j1120n210P637J4774P196q660j5301o216O913J2525
1981E153Q979l515j4874j0975N097J3977R386j722j1786j2643r88J2730J4653
1994A3472K069j2913j5989k729J2621J3775L599p431j2605p689M740J2190Q661
2007A1771j336j0821j2360j095J3429J4817J191j4957j7037j136J5846J5916K116
2020A6344j0854j5269q615Q686J9302R096j0136j6948p990P090J5253J0465m641
2033A1783j6047j2930L127J7007J3565j671j4089j5030l572J3775J9391L356j5313
2046C352j5175l151P551J3623J0428m367j7174j2729M676J6890J3009k233j5719
2059a019j6413j142J7863K0371L87j9489j7378j827J2376J8176R314j2089k1743
$$ plain form
2072 -12613 -19861 -7184 9140 15745 9680 -5487 -17492 -12691 4611 17618 13720 -1588 -14332
2085 -14332 -16002 -4818 13085 20819 6589 -14389 -18123 -4972 8908 15499 11096 -5015 -19011
2098 -19011 -12480 7377 17690 11232 -3267 -14677 -14795 -421 17025 18025 -616 -17542 -14932
2111 -14932 -452 10975 14712 7850 -8980 -18972 -7340 10665 13653 4287 -4347 -10411 -10191 1827
2125 1827 14560 11186 -4363 -13760 -10169 -267 9515 13653 5966 -10600 -16804 -3979 10288 10867
2139 10867 4130 -3201 -11204 -10484 4890 16753 7755 -8287 -12413 -6037 2895 10947 11198 -1260
2153 -1260 -13682 -10306 3698 10401 6505 911 -4102 -9593 -6258 6997 12047 2020 -6406 -5533
2167 -5533 -3750 -560 8114 9642 -3055 -12361 -5512 4899 6900 5024 2572 -5071 -11953 -5096
$$ packed form
2072a2613p248J2677J6324O605o065j5167j2005M801J7302J3007l898j5308j2744
2085a4332j670J1184J7903P734j4230k0978l734J3151J3880O591m403j6111j3996
2098a9011O531J9857J0313o458j4499j1410j18J4374J7446J000j8641j6926K610
2111a4932J4480J1427L737o862j6830r992J1632J8005K988r366q634o064K20J2018
2125A827J2733l374j5549r397L591R902R782M138p687j6566o204J2825J4267N79
2139A0867o737p331q003P20J5374J1863q998j6042m126O376Q932Q052K51j2458
2153a260j2422L376J4004O703l896n594n013n491L335J3255N050j0027q426Q73
2167e533J783L190Q674J528j2697r306O849J0411K001j876k452p643o882O857
$$ plain form
2181 -5096 9209 11092 44 -6265 -4452 -3523 206 8045 6548 -5930 -10115 -602 5085 3841
2195 3841 3513 1475 -6761 -8883 1542 8953 3124 -2946 -886 -154 -4518 -2208 6677 5962 -3563
2210 -3563 -5623 24 566 333 5176 3886 -5975 -7151 2625 5902 633 -197 1099 -3699 -6085 1777
2226 1777 8199 2957 -3992 -2784 -780 -2777 -86 6019 2790 -5849 -2810 4357 522 -4471 1868
2241 1868 5688 -3100 -7323 400 5368 2104 859 1043 -4348 -7855 -133 8747 5084 -2709 -2923
2256 -2923 -1877 -3922 524 9074 4664 -7923 -7081 3037 3680 48 3782 4065 -6111 -9257 1762
2271 1762 8804 3516 -1119 -1231 -4675 -7053 1965 11854 6231 -6133 -7736 -2919 -932 4031 10695
2286 10695 3486 -11832 -10276 4198 8658 3227 956 -2921 -10909 -7420 8960 14954 1926 -9977
$$ packed form
2181e096J4305J883j1048o309J813R29L729P839j497j2478m185R513N687j244
2195C841l28k038q236k122J0425P411n829o070K060P32m364K310Q885p15r525
2210c563k060N647N42k33M843j290r861j176R776L277n269q30J296m798k386P862
2226A777O422n242o949J208K004j997K691O105l229q639L039P167l835m993O339
2241A868L820q788m223P723M968l264j245J84n391l507P722Q880l663p793k14
2256b923J046k045M446Q550m410j2587Q42J0118O43l632L734K83j0176l146J1019
2271A762P042n288m635j12l444k378R018R889n623j2364j603M817J987M963O664
2286A0695p209j5318J556J4474M460n431k271l877p988L489J6380N994j3028j1903
$$ plain form
2300 -9977 -8074 -2918 522 7081 10069 -1037 -12377 -6527 5230 6045 3027 3035 -3487 -12250 -5136
2315 -5136 11239 12239 -91 -6938 -7073 -6158 1252 12847 10907 -5980 -14813 -5402 5678 7659
2329 7659 7020 2766 -9540 -14954 315 15700 9587 -4699 -8479 -6840 -4054 6648 15230 4823
2343 4823 -12634 -13497 -1071 6551 8313 7863 -529 -13646 -12132 5266 14245 5170 -4261 -6228
2357 -6228 -8377 -5185 10487 17906 1120 -16770 -12781 864 7851 11626 9387 -5934 -18936
2370 -18936 -9345 11020 15785 4811 -5314 -10451 -11185 -158 17147 15943 -5839 -18215 -8514
2383 -8514 4036 8870 11796 6058 -11215 -18084 -2583 13308 12027 3469 -3482 -11400 -13122 1880
2397 1880 18181 13147 -6444 -15057 -8087 1345 9559 14091 3767 -15737 -17687 1398 14653
$$ packed form
2300i977J903N156L440O559K988j1106j1340N850J1757Q15l018Qo522q763P114
2315e136J6375J000j2330o847j35R15P410J1595j940j6887q833R411J1080J981
2329G659o39m254j2306n414J5269J5385o113j4286l780J639K786J0702Q582j0407
2343D823j7457q63J2426P622J762m50q392j3117J514J7398Q979r075r431j967
2357f228k149L192J5672P419j6786j7890L989J3645O987L775k239j5321j3002
2370a8936R591K0365M765j0974j0125n137p34J1027J7305j204k1782j2376R701
2383h514J2550M834K926n738j7273o869J5501J5891j281q558o951p918j722J5002
2397A880J6301n034j9591q613O970R432Q214M532j0324j9504j950J9085J3255
$$ plain form
2410 14653 11140 3059 -6003 -15541 -11469 8559 19177 6746 -9376 -12221 -6169 1992 11575 12830
2424 12830 -2361 -17518 -11322 6642 12426 6652 1216 -6081 -13718 -6482 11455 14839 1444
2437 1444 -7915 -8259 -6720 815 13558 12915 -5128 -16962 -8024 6552 10321 7205 786 -10177
2451 -10177 -14378 -249 15636 11217 -4034 -9457 -7557 -5043 4362 14981 7963 -10436 -13938
2464 -13938 -1672 6489 6203 4742 -421 -9771 -9492 3728 12370 5481 -3958 -5819 -6154 -5014 5426
2479 5426 14165 4886 -10324 -10063 -474 4028 6389 7206 -1414 -12106 -7374 6891 10718 2835 -3555
2494 -3555 -5302 -6007 -1551 8527 10237 -1654 -10509 -5189 2163 3711 5368 5025 -4232 -10448 -2013
2509 -2013 6970 4311 -448 -20 -1900 -5546 -1152 6911 5191 -3198 -5560 -1822 -259 1512 6452
$$ packed form
2410A4653l513q081r062r538M072K0028J0618j2431j6122k845O052Q161R583J255
2424A2830j5191j5157O196J7964N784n774n436p297p637P236J7937L384j3395
2437A444r359l44J539P535J2743o43j8043j1834Q938J4576L769l116o419j0963
2451a0177m201J4129J5885m419j5251n423J900K514R405J0619p018j8399l502
2464a3938J2266Q161k86j461n163r350K79J3220Q642o889r439j861l35J140J0440
2479E426Q739r279j5210K61R589M502K361Q17q620j0692M732J4265L827p883o390
2494c555j747p05M456J0078J710j1891q855N320P352J548J657l43r257o216Q435
2509b013Q983k659m759M28j880l646M394Q063j720q389k362L738J563J771M940
$$ plain form
2524 6452 5016 -5593 -9505 -496 6010 2460 885 1604 -3257 -6150 1690 7668 1502 -5221 -2461
2539 -2461 1244 -329 974 4551 1610 -4947 -4031 2480 2592 -940 859 2787 -2256 -4820 1299
2554 1299 4490 -396 -1588 2138 -136 -4693 -840 4862 2536 -2569 -2242 24 -379 648 3109
2569 3109 1058 -4460 -3992 2232 3043 -451 392 2280 -2179 -5371 -386 3719 1183 -252 1105 -1407
2585 -1407 -3900 -79 4406 2071 -2085 -2373 -1726 -1515 1857 6411 3262 -5732 -7624 -237 4706 3915
2601 3915 3078 191 -6379 -6498 3222 8547 2854 -3273 -3765 -3457 -1660 4475 7342 1147 -6263 -5664
2617 -5664 -141 3095 4204 4515 -641 -8732 -7564 3482 9352 4565 -1165 -5003 -7841 -3765 7188
2632 7188 10557 1090 -8144 -7426 -977 5059 7886 4197 -5210 -11131 -4947 6614 10323 4100 -3301
$$ packed form
2524F452j436j0609l912R009O506l550j575P19m861k893P840N978o166o723K760
2539b461L705j573J303L577k941o557R16O511J12l532J799J928n043k564O119
2554A299L191m886j192L726k274m557L853N702k326n105L27K266m03J027K461
2569C109k051n518M68O224Q11l494Q43J888m459l192M985M105k536j435J357k512
2585a407k493L821M485k335m156k88O47K11L372M554l149q994j892P387M943p91
2601C915q37k887o570j19R720N325n693o127m92L08J797O135K867o195p410N99
2617e664N523L236J109L11n156q091J168J1046N870m787n730l838k838M076J0953
2632G188L369r467r234P18O449O036K827l689r407n921O184J1561L709o223p401
$$ plain form
2647 -3301 -7568 -7439 158 9588 8596 -1943 -8205 -5765 -81 5447 8210 3038 -6720 -9442 -2474
2662 -2474 6106 8470 4356 -3059 -9020 -7673 2575 11737 8492 -3862 -10743 -7299 759 8827
2676 8827 10455 989 -10630 -10487 142 8785 8858 1809 -7551 -11062 -3178 8430 11580 3219 -7373
2691 -7373 -10635 -5013 3730 10016 8174 -2250 -11270 -8283 2461 8815 7478 819 -8052 -10813
2705 -10813 -2068 9808 11752 2790 -8264 -12225 -5167 7160 13382 7055 -6197 -13425 -7294 5706
2719 5706 12510 7966 -2770 -12041 -10258 2249 12663 9687 -1089 -9659 -10309 -2123 9096 12156
2733 12156 3232 -8656 -12381 -4675 7256 12179 6271 -4791 -11687 -8465 2499 11154 8861 -1146
2747 -1146 -9561 -10007 -1582 9691 11967 1600 -10149 -12193 -3224 8532 12867 5114 -7296 -12712
$$ packed form
2647c301m267J29P597R430r92j0539o262K440N684N528K763n172r758k722O968
2662b474Q580K364m114p415n961J347J0248R162l245j2354o881L444Q058Q068
2676H827J628r466j1619J43J0629Q643P3p049r360l511P884J1608L150q361j0592
2691g373l262N622Q743O286j842j0424r020K987J0744O354j337o659q871k761
2705a0813Q745J1876J944q962j1054l961P058J2327O222o327j3252p228O131J3000
2719E706O804m544j0736r271J783J2507J0414k976j0776q570o50Q186J1219L060
2733A2156q924j1888l725P706J1931M923n908j1062o896L222J0964Q655k293j0007
2747a146q415m46Q425J1273K276j0367j1749k044Q969J1756M335p753j2410n416
$$ plain form
2761 -12712 -6510 5668 12426 6956 -4933 -11118 -6544 3266 10299 8358 -1696 -10060 -8463 589
2775 589 8466 9074 1790 -7080 -9226 -3315 5575 10100 5104 -5378 -10443 -5205 3770 8968 6918
2790 6918 -1741 -9384 -7937 1055 8380 7836 -102 -8108 -8726 -842 8124 9419 1454 -8049 -9333
2805 -9333 -1589 5851 7336 3687 -3064 -8151 -4924 3675 7495 3649 -2650 -6077 -4576 1211 6056
2820 6056 5528 -21 -5393 -5674 -1223 4159 6143 3279 -3041 -7095 -3467 4171 6624 2643 -2298
2835 -2298 -5193 -4690 1173 6826 4832 -1946 -5570 -4028 530 4601 4618 91 -4935 -4958 188 4746
2851 4746 3992 -26 -2415 -3389 -2628 1378 4335 1656 -2147 -2038 -719 -755 1162 3335 824 -3205
2867 -3205 -3293 -279 2114 2702 2164 -567 -3992 -3458 1643 4497 1245 -2217 -1310 -147 -807 995 3096
$$ packed form
2761a2712O202J2178O758n470j1889o185M574R810P033j941j0054q364J597R052
2775E89P877O08p284q870k146N911Q890M525m996j0482n065N238Q975N198k050
2790F918q659p643J447Q992P325n44p938q006o18P884Q966J295p965r503j284
2805i333P744P440J485l649o751n087L227Q599L820l846o299l427J501N787M845
2820F056n28n549n372k81M451N382J984k864o320m054L628P638K453l981m941
2835b298k895N03N863N653j994o778l624J542M558M071J7m527n026k3N146M558
2851D746p54m018k389r74P61M006K957k679l803J09J319l6J917K173k511m029
2867c205q8L014K393N88n38k731l425N34N101K854l252l462R07J163o60J802K101
$$ plain form
2884 3096 275 -2905 -1266 807 281 515 1885 523 -2037 -1202 958 528 -699 842 1975 -903
2900 -903 -3487 -749 3177 2122 -426 -578 -1896 -3517 192 4945 2478 -2835 -3108 -629 341 1350
2916 1350 2468 465 -3342 -3293 360 2381 1846 1366 365 -3316 -4672 554 5512 3013 -1480 -2163
2932 -2163 -2441 -2449 2357 6497 2197 -4922 -5323 -849 2699 4868 4650 -932 -7366 -5675 3064 7795
2948 7795 3627 -2200 -4743 -4938 -1185 6434 8001 -537 -7418 -4835 156 2510 5009 4748 -2676
2963 -2676 -8533 -4084 4274 6563 3044 -1401 -5470 -6882 -1111 8186 8768 -1071 -7987 -5830 -895
2978 -895 3309 7691 5416 -5466 -10975 -3129 6984 8003 3316 -3226 -9088 -7152 3511 11135
2992 11135 6099 -4530 -8218 -4300 895 5513 7825 1912 -8235 -9120 541 7418 6089 2462
$$ packed form
2884C096k821l180J639K073n26K34J370j362k560Q35K160m30j227J541J133k878
2900i03k584K738L926j055k548j52j318j621L709M753k467n313k73K479R70J009
2916A350J118k003l807M9L653K021n35m80j001l681j356N226M958k499m493o83
2932b163k78qM806M140m300p119m01M474L548K169k18n582o434J691Q739M731
2948G795m168n827k543j95L753P619J567q538o881K583M991K354K499k61p424
2963b676n857M449Q358K289l519m445m069j412N771R297N82r839o916K157M935
2978h95M204M382k275j0882n509P846J0113J019m687o542n862J936J0663P624
2992A1135n036j0629l688L918N195M618K312n913j0147q85R661O877j329l627
$$ plain form
3006 2462 -2928 -9072 -6508 5033 10891 4286 -4822 -7684 -5730 754 8745 9172 -1296 -11250 -8546
3021 -8546 2210 8257 7164 2493 -6205 -11855 -3880 10004 11270 11 -7699 -7565 -3890 3848
3035 3848 10883 6902 -5972 -11547 -4570 4402 7388 5888 578 -7671 -10138 -271 10779 8806
3049 8806 -1550 -7069 -7269 -3865 5203 12412 5601 -8332 -11169 -2869 4939 8112 7057 -1254 -11530
3064 -11530 -9976 4002 12953 7277 -3522 -9028 -7980 -1388 8727 11957 953 -11061 -9003
3077 -9003 674 5874 7374 4751 -4344 -11604 -5517 6494 9801 4171 -2372 -7198 -8456 -899 9788
3092 9788 10173 -1254 -10107 -7116 417 5427 8605 4985 -6721 -12719 -3443 8433 9059 2882 -2919
3107 -2919 -8201 -7512 2830 11661 6645 -5117 -9201 -4543 1710 6415 7782 1257 -8597 -8988 1106
$$ packed form
3006B462n390o144K564J1541N858o605r108k862J954O484P991M27j0468r954K704
3021h546J0756O047j093m671q698n650P975J3884J266j1259p710J34L675P738
3035C848P035l981j2874n575O977Q972K986j500n310q249k467R867J1050j973
3049H806j0356n519k00L404R068P209o811j3933k837Q300P808L173j055q311j0276
3064a1530J554J3978Q951n676j0799n506J048O592J0115L230j1004j2014K058
3077i003R677N200J500k623r095p260O087J2011L307n630o543m826j258P557J0687
3092I788L85j1427q853K991P533N010L178l620j1706n998R276J1876O26o177n801
3107b919n282O89J0342Q831n016j1762m084M658O253M705J367o525r854l91J0094
$$ plain form
3122 1106 7235 4570 921 -1696 -6719 -6372 3808 10206 3363 -5603 -6548 -3147 412 5778 7234
3137 7234 184 -8331 -6896 1428 5969 4571 1122 -3693 -7878 -3509 6982 8762 -303 -5823 -3960
3152 -3960 -1887 651 6266 5659 -3235 -7949 -2083 4101 3879 1934 83 -3285 -5282 -557 5504
3167 5504 4619 -762 -2449 -2092 -2885 54 6059 4283 -4171 -5746 37 2814 1937 2635 1109 -4643
3183 -4643 -5608 1161 5608 2647 -1289 -2110 -2518 -2234 2090 5332 799 -5355 -3032 2190 1729 -66
3199 -66 1920 901 -3609 -2902 2209 2486 -502 -1 844 -1823 -2535 1482 3346 446 -1789 -558 -615
3216 -615 -2020 772 4747 1665 -4116 -2667 2019 1274 -636 1228 1127 -2730 -2285 2164 2462 -370
3232 -370 -340 153 -1750 -2421 982 3096 667 -1177 70 -504 -3022 -576 4690 2620 -3731 -3835 573
$$ packed form
3122A106O129k665l649k617n023L47J0180O398o843q966r45L401L559N366J456
3137G234p050q515J435Q324M541j398l449m815m185M369J0491J780r065n520J863
3152c960K073K538N615o07q894m714N866O184k22j945j851l368j997M725O061
3167E504q85n381j687L57p93K939O005j776q454j575N783K777q77O98j526n752
3183d643r65O769M447k961l936q21m08K84M324L242m533o154K323N222m61j795
3199f6J986j019m510P07N111K77k988N01Q45k667p12M017J864k900k235J231n7
3216f15j405K792L975l082n781J449M686p45j910J864j01l857M45M449K98k832
3232c70L0M93j903o71L403K114k429j844J247n74k518K446N266k070o351j04M408
$$ plain form
3249 573 1562 1329 2845 549 -4834 -4298 1908 4412 1682 -466 -1673 -3468 -2240 3211 5661 597
3265 597 -4849 -3278 310 972 2277 4274 258 -5781 -3914 2378 3949 2165 947 -2009 -5441
3280 -5441 -2405 5125 6610 1157 -4118 -4849 -3151 1098 6577 6428 -2115 -8829 -4599 3790 5730
3295 5730 3236 -256 -5330 -6999 -8 7663 6221 -974 -5161 -5375 -2670 3278 7486 3764 -4381
3310 -4381 -7516 -2793 2973 5153 4549 325 -6867 -8042 786 8702 6168 -1036 -5062 -6222 -2975
3325 -2975 5269 9627 2741 -6782 -8317 -2283 4535 7927 5312 -2679 -9569 -6480 3834 9388 4960
3340 4960 -2669 -6320 -5956 -186 7922 8066 -1162 -8230 -6075 -66 4510 7317 4535 -4394 -9811
3355 -9811 -4515 4950 8284 3888 -2869 -7190 -6272 885 8924 7690 -2119 -9179 -6727 385 6666
$$ packed form
3249E73R89k33J516k296n383N36O206K504k730k148j207j795J228N451K450n064
3265E97n446J571L588O62J305J997m016o039J867O292J571j784j218k956l432
3280e441L036P530J485n453n275p31J698M249N479j49q543o714M230Q389J940
3295E730k494l492n074j669O991P671j442p195m187k14K705N948M208l722q145
3310d381l135M723N766K180o04m224p192j175Q828P916k534p204m026j160L247
3325b975Q244M358o886r523j535O034O818L392k615p991o890L089J0314N554m428
3340D960p629l651L64N770Q108J44r228p068K155O009M576K807k782q929n417
3355i811N296R465L334m396o757m321R18P157Q039j234r809p060K452P112O281
$$ plain form
3370 6666 8721 2210 -8100 -10092 -1268 7648 8352 2656 -5086 -9552 -5077 5534 10650 4687 -5474
3385 -5474 -8622 -3619 2748 6609 6421 -257 -8348 -7888 1163 8099 7183 1233 -5928 -9555 -3726 6645
3401 6645 10327 3793 -5435 -9097 -4785 3736 9451 6210 -3591 -10202 -6355 3459 8753 6405 -119
3416 -119 -7441 -9707 -1850 9082 9859 729 -7593 -8436 -2574 5720 8943 3403 -5349 -8579 -3938
3431 -3938 3514 7515 5097 -1364 -6945 -6768 191 7374 7116 632 -5947 -7856 -3037 6012 10164
3446 10164 3120 -6682 -8383 -2838 4285 7426 4474 -2737 -7520 -4952 2756 7747 4891 -2310 -6897
3461 -6897 -5381 384 6442 6763 267 -6260 -5867 -850 3737 5411 2537 -3473 -6064 -2240 3234
3476 3234 4809 2780 -1476 -4879 -4324 358 5235 5390 -318 -5833 -5036 272 4406 4879 1430 -4214
$$ packed form
3370F666K055o511j0310j992Q824Q916P04n696p742m466M475J0611N116n963j0161
3385e474l148N003O367L861j88o678q091M60R051O936r16n950p161l627N829J0371
3401F645L682o534r228l662M312Q521N715l241r801o611L847R814N294k348o524
3416a19p322k266P857J0932P77r130q322q43N862Q294L223n540q752l230M641
3431c938P452M001k418o461n581J77O959P183k58o484o579j909M819R049M152
3446A0164p044r802j701N545P123L141k952p211m783K568P708M991k856p201m587
3461f897J516N765O058L21o496o527L93N017M587J674k874o010k591L824N474
3476C234J575k029m256l403N55M682M877J55n708n515P97N308M134M73l449n644
$$ plain form
3492 -4214 -5777 -1213 4171 4970 1670 -2811 -4615 -2082 2441 4230 2289 -1640 -4063 -2657 1670
3507 1670 4301 3076 -763 -3941 -3274 410 2990 2600 986 -943 -2804 -2206 901 3054 1951 -812
3523 -812 -3060 -2576 929 3445 2603 -493 -3069 -3490 -530 3174 3200 101 -2406 -2559 -670 1714 1944
3540 1944 564 -846 -1597 -1545 234 1888 1329 -280 -1044 -1274 -584 864 1352 545 -278 -808 -1510 -402
3558 -402 1690 1993 897 -1011 -2301 -1715 574 2294 1995 175 -1987 -2053 111 1937 1100 -155 -950
3575 -950 -1691 -822 1521 2417 832 -887 -1857 -1884 -375 1726 2363 1250 -894 -2890 -2234 811 3108
3592 3108 2272 -924 -3660 -2686 1351 3618 2283 -210 -2790 -3931 -910 4129 4690 89 -3825 -3935
3608 -3935 -654 2906 4121 1887 -2103 -4217 -2624 1418 4118 3165 -229 -3388 -3959 -348 4414
$$ packed form
3492d214j563M564N384P99l300m481j804K533M523J789j941l929k423J406M327
3507A670K631j225l839l178O67L684K580l90j614j929j861N98L107K153j103k763
3523h12k248M84L505K516q42l096k576m21K960L704K6l099k507j53J889K384K30
3540A944j380j410p51N2J779J654n59j609p64k30O90J448M88q07q23n30p02J108
3558d02K092L03j096j908j290N86K289J720k99j820k162o6K164J826q37j255p95
3575i50p41Q69K343Q96j585j719r70k7J509K101O37j113k144j996O56L045K297
3592C108q36l196k736R74M037K267j335k493k580j141L021N039N61m601l914j10
3608c935L281L560J215k234l990k114J593M042K700r53l394l159n71L611M762
$$ plain form
3623 4414 4306 -145 -3784 -4087 -1807 2876 6516 3241 -3509 -6632 -3291 2195 5696 4402 -979
3638 -979 -5949 -5516 801 6549 5251 -1551 -6013 -4750 -172 4953 6493 1382 -5672 -6493 -1552 3916
3654 3916 6034 3543 -2808 -6857 -4065 2655 6248 4378 -1073 -5250 -5334 -770 5594 7204 762
3669 762 -6533 -6436 -461 4833 6725 3468 -4372 -8888 -4012 5002 8484 4200 -3281 -7659 -5328 2134
3685 2134 7594 5443 -2127 -7069 -4931 1168 6021 6130 819 -6578 -8124 -827 6403 6482 1883 -3338
3701 -3338 -6749 -4915 2612 8196 4986 -3131 -7733 -5026 1933 7119 6334 -627 -7606 -7453 640
3716 640 7558 6755 570 -5644 -8010 -2935 6426 9415 2348 -5844 -7444 -3521 3209 8097 5555
3731 5555 -3091 -8624 -4750 3292 7200 4505 -1269 -6101 -6525 -579 7289 8037 565 -6370 -6951 -2744
$$ packed form
3623D414j08m451l639l03K280M683L640l275o750l123L341N486L501j294n381
3638i79m970M33O317N748j298o802m462J263M578N125J540n111p054q21M941N468
3654C916K118k491o351m049K792O720L593j870n451m177q4M564O364J610o442
3669G62p295R7N975N294J892l257p840m516M876R014L482m284p481m378K331P462
3685B134N460k151p570m942K138O099M853J09n311p397j546P297P230P9m599n221
3701c338l411J834P527N584l210q117m602K707O959N186p85o961o979J53Q093
3716F40O918q03o185o214k366N075R361K989p067q192j600L923O730M888k542
3731E555q646n533L874Q042L908k695n774m832m24N946P868P48p472o935n81M207
$$ plain form
3747 -2744 3616 8095 4866 -4173 -8511 -4013 3222 7041 5164 -1575 -7968 -7146 1602 8980 6696
3762 6696 -1637 -7265 -6347 -913 5476 8008 2434 -6346 -7897 -1380 4644 5949 3644 -2184 -7179
3777 -7179 -4980 2816 7086 4159 -1855 -5429 -4744 -114 5625 6700 695 -6125 -6256 -867 4150
3792 4150 5953 3904 -2751 -7724 -4117 4073 6319 2258 -2122 -4633 -4202 1065 6444 5019 -2149
3807 -2149 -6603 -4294 1220 4596 4565 1116 -4071 -5775 -1006 4402 3929 525 -1717 -3118 -3108 1047
3823 1047 5019 2660 -2194 -3738 -2370 67 2940 4373 999 -4370 -4951 -85 4339 3759 540
3838 540 -2027 -3712 -2752 2061 4914 1768 -2707 -2724 -771 908 2446 2326 -1200 -3699 -1532 1721
3854 1721 2506 1271 172 -1520 -2997 -1659 1941 2986 454 -1402 -808 -793 -1061 1308 2396 -508
$$ packed form
3747b744O360M479l229r039m338M498P235L819j877o739o393Q22Q748P378k284
3762F696q333n628R18N434O389K532n574q780j551O517O024J305k305n828m995
3777g179K199P796M270k927o014l574O85M630N739J075o005o820j31N389N017
3792D150J803k049o655m973L607Q190K246m061m380k511M31N267N379j425p168
3807b149m454K309N514L376l1l449n187j704M769N408m73l404k242j401J0M155
3823A047L972k359m854j544J368K437K873J433l374n369n81M866M424n80l219
3838E40k567j685R60M813K853l146m475j7J953J679J538j20l526k499K167L253
3854A721P85j235j099j692j477J338L600J045k532j856N94J5k68K369J088k904
$$ plain form
3870 -508 -2692 -842 869 862 1263 1223 -1360 -3332 -998 2270 2355 111 -1146 -1172 -1135 49 1959 1680
3888 1680 -1183 -1262 697 275 -1107 488 2077 -69 -1769 41 984 -234 133 1250 8 -2240
3904 -2240 -1410 1602 2467 1002 -468 -1529 -2379 -1218 2099 2911 -148 -1960 -758 -235 -367 1428
3920 1428 1843 -1184 -2994 -803 1638 1658 1115 170 -1875 -3198 -1093 2685 3191 480 -1514 -1985 -2117
3937 -2117 -352 3544 3820 -1041 -4221 -2283 869 2735 3412 877 -3777 -4662 250 4385 3536 227
3953 227 -2766 -3960 -2267 2365 5602 3113 -2823 -4774 -2079 978 2810 3802 871 -4270 -4560 582
3969 582 4138 3130 661 -2552 -5065 -2870 3479 6372 2778 -3301 -5680 -3463 1052 5230 4882
3984 4882 -449 -6206 -4981 1548 5236 3820 180 -4124 -5896 -1295 5635 6107 166 -4625 -4766
$$ packed form
3870e08k184J850J711pM01m0k583j972K334L268Q5k244j257k6L7J184J910k79
3888A680k863p9J959m22j382J595J589k146j700J810R43j218L67J117j242k248
3904b240Q30L012Q65j465j470j061q50J161L317Q12l059j812J202N23j32J795
3920A428M15l027j810K191K441K0n43r45k045j323K105L778N06k711j994m71j32
3937b117J765L896K76m861l180J938L152J866O77k535m654q85M912M135q49l309
3953B27k993j194J693M632L237k489n936j951K695L057J832R92k931n141k90N142
3969E82L556j008k469l213k513K195O349K893l594o079k379K217M515M178l48
3984D882n331n757J225O529L688j416l640m304j772M601O930M72n941m791j41
$$ plain form
3999 -4766 -1740 2913 5565 3350 -2605 -6204 -3371 2322 4984 3701 47 -4410 -5462 -348 5859
4014 5859 5233 -267 -4483 -4684 -1593 4165 7124 2541 -5214 -7375 -2552 3712 6569 4010 -2007
4029 -2007 -6763 -5100 2319 7169 3942 -2544 -5637 -4094 330 5444 6376 122 -6710 -6104 -331
4044 -331 4749 5949 2644 -3816 -7298 -3411 3841 6936 3322 -2685 -5903 -4630 718 6289 6413
4059 6413 -806 -7102 -5718 578 5531 6514 1809 -6043 -8236 -1476 6231 7403 2279 -4116 -6931
4074 -6931 -3920 3004 7178 4455 -2662 -6692 -3825 1984 5438 4737 -300 -6095 -6164 242 5876 5609
4090 5609 1413 -3735 -6727 -3829 3511 7385 3473 -3416 -6351 -3584 1908 5752 4769 -1143 -6576
4105 -6576 -5422 1306 6100 4947 44 -4715 -6226 -1456 5562 6590 862 -4638 -5238 -1972 2953
$$ packed form
3999d766L026M653K652k215n955l599K833N693K662j283l654m457j052N114O207
4014E859o26n500m216k01L091N758K959m583p755k161M823O264K857k559o017
4029b007m756J663P419M850l227o486l093J543M424N114R32o254o832O06N773
4044c31N080J200l305o460l482L887P252L095l614o007l218J273N348N571J24
4059F413p219o296J384O296M953R83m705p852k193O760P707J172n124o395k815
4074f931L011O924M174k723p117m030K867N809L454p01n037n795o9O406N634k67
4090E609m196n148k992K898P340L874l912o889k935K767N492L844r83n912n433
4105f576J154O728M794j153m903m759j511M770P018J028n728n500o00L266M925
$$ plain form
4120 2953 5589 3200 -2484 -5410 -3048 1902 4462 2954 -623 -3921 -4098 -71 4910 4743 -227
4135 -227 -4276 -4457 -1812 2729 5658 2814 -3071 -5180 -2337 2242 4359 2629 -1685 -4557 -3056
4150 -3056 1652 4938 3135 -1671 -4357 -3246 221 3473 4117 551 -3644 -3582 -414 2169 2916 1830
$$ packed form
4120B953K636k389n684k926K362M950K560j508l577l298j77M027M981j67m970
4135b27m049j81K645M541K929k844n885k109K843M579K117j730m314k872J501
4150c056M708L286j803m806k686J111L467L252O44l566m195O2L168K583P47j086
$$ [...]
8191E07
##END NTUPLES=NMR FID
##END=
