##TITLE=1H_CA-8618-1
 CDCl3, 8 sc, 
 1.7.2019
##JCAMPDX= 6.0         $$ Bruker NMR JCAMP-DX V2.0
##DATA TYPE= NMR FID
##DATA CLASS= NTUPLES
##ORIGIN= UXNMR, Bruker Analytische Messtechnik GmbH
##OWNER= root
$$ XWIN-NMR		Version 3.5
$$ Mon Jul  1 13:50:22 2019 Russian Standard Time (UT+4h)  she@DPX200
##.OBSERVE FREQUENCY= 200.13155
##.OBSERVE NUCLEUS= ^1H
##.DELAY= (6, 6)
##.ACQUISITION MODE= SIMULTANEOUS
##.ACQUISITION SCHEME= undefined
##.AVERAGES= 8
##.DIGITISER RES= 18
##SPECTROMETER/DATA SYSTEM= spect
##.PULSE SEQUENCE= zg30
##.SOLVENT NAME= CDCl3
##.SHIFT REFERENCE= (INTERNAL, CDCl3, 0, 15.7039)
##AUDIT TRAIL= $$ (NUMBER, WHEN, WHO, WHERE, WHAT)
$$ ##TITLE= Audit trail, XWIN-NMR		Version 3.5
$$ ##JCAMPDX= 5.01
$$ ##ORIGIN= Bruker BioSpin GmbH
$$ ##OWNER= she
$$ F:/spectra/data/she/nmr/H-F/1/audita.txt
$$ ##AUDIT TRAIL=  $$ (NUMBER, WHEN, WHO, WHERE, WHAT)
(   1,<2019-07-01 13:48:47.31 +0400>,<she>,<DPX200>,
      <created by zg, POWCHK disabled, PULCHK disabled
       configuration hash MD5:
       00 E9 B6 7A A2 85 ED C7 34 08 36 98 17 FE 4E 26
       data hash MD5: 16K
       1E 88 2C 93 30 3C 1E 40 45 0C 2B 3D E5 38 C2 6B>)
$$ ##END=
$$ 
$$ hash MD5
$$ 46 86 4E 21 41 B8 0B CE 3A 7E 05 FD 4C 4F AF FF
##$RELAX= 
##$RELAX= 
##$RELAX= 
##$RELAX= 
##$RELAX= 
##$RELAX= 
$$ Bruker specific parameters
$$ --------------------------
##$DU= <F:/spectra>
##$EXPNO= 1
##$NAME= <H-F>
##$PROCNO= 1
##$TYPE= <nmr>
##$USER= <she>
##$AMP= (0..31)
100 100 100 100 100 100 100 100 100 100 100 100 100 100 100 100 100 100 
100 100 100 100 100 100 100 100 100 100 100 100 100 100 
##$AQSEQ= 0
##$AQ_mod= 1
##$AUNM= <au_zg>
##$AUTOPOS= <>
##$BF1= 200.13
##$BF2= 200.13
##$BF3= 200.13
##$BF4= 200.13
##$BF5= 200.13
##$BF6= 200.13
##$BF7= 200.13
##$BF8= 200.13
##$BYTORDA= 1
##$CFDGTYP= 0
##$CFRGTYP= 5
##$CHEMSTR= <none>
##$CNST= (0..31)
1 1 145 1 1 1 1 1 1 1 1 1 1 1 1 1 1 1 1 1 1 1 1 1 1 1 1 1 1 1 1 1 
##$CPDPRG= <>
##$CPDPRG1= <>
##$CPDPRG2= <>
##$CPDPRG3= <>
##$CPDPRG4= <mlev>
##$CPDPRG5= <mlev>
##$CPDPRG6= <mlev>
##$CPDPRG7= <mlev>
##$CPDPRG8= <mlev>
##$CPDPRGB= <>
##$CPDPRGT= <>
##$D= (0..31)
0 1.2 0 0 0 0 0 0 0 0 0 0.03 0 0 0 0 0 0 0 0 0 0 0 0 0 0 0 0 0 0 0 0 
##$DATE= 1561974526
##$DBL= (0..7)
120 120 120 120 120 120 120 120 
##$DBP= (0..7)
150 150 150 150 150 150 150 150 
##$DBP07= 0
##$DBPNAM0= <>
##$DBPNAM1= <>
##$DBPNAM2= <>
##$DBPNAM3= <>
##$DBPNAM4= <>
##$DBPNAM5= <>
##$DBPNAM6= <>
##$DBPNAM7= <>
##$DBPOAL= (0..7)
0.5 0.5 0.5 0.5 0.5 0.5 0.5 0.5 
##$DBPOFFS= (0..7)
0 0 0 0 0 0 0 0 
##$DE= 6
##$DECBNUC= <off>
##$DECIM= 24
##$DECNUC= <off>
##$DECSTAT= 4
##$DIGMOD= 1
##$DIGTYP= 9
##$DL= (0..7)
0 120 120 120 120 120 120 120 
##$DP= (0..7)
150 150 150 150 150 150 150 150 
##$DP07= 0
##$DPNAME0= <>
##$DPNAME1= <>
##$DPNAME2= <>
##$DPNAME3= <>
##$DPNAME4= <>
##$DPNAME5= <>
##$DPNAME6= <>
##$DPNAME7= <>
##$DPOAL= (0..7)
0.5 0.5 0.5 0.5 0.5 0.5 0.5 0.5 
##$DPOFFS= (0..7)
0 0 0 0 0 0 0 0 
##$DQDMODE= 0
##$DR= 18
##$DS= 0
##$DSLIST= <SSSSSSSSSSSSSSS>
##$DSPFIRM= 0
$$ [...]
##$SUBNAM2= <"">
##$SUBNAM3= <"">
##$SUBNAM4= <"">
##$SUBNAM5= <"">
##$SUBNAM6= <"">
##$SUBNAM7= <"">
##$SUBNAM8= <"">
##$SUBNAM9= <"">
##$SW= 24.9336996594482
##$SWIBOX= (0..15)
0 0 2 0 0 0 0 0 0 0 0 0 0 0 0 0 
##$SW_h= 4990.01996007984
##$TD= 16384
##$TD0= 1
##$TE= 0
##$TE2= 300
##$TE3= 300
##$TEG= 300
##$TL= (0..7)
0 120 120 120 120 120 120 120 
##$TP= (0..7)
150 150 150 150 150 150 150 150 
##$TP07= 0
##$TPNAME0= <>
##$TPNAME1= <>
##$TPNAME2= <>
##$TPNAME3= <>
##$TPNAME4= <>
##$TPNAME5= <>
##$TPNAME6= <>
##$TPNAME7= <>
##$TPOAL= (0..7)
0.5 0.5 0.5 0.5 0.5 0.5 0.5 0.5 
##$TPOFFS= (0..7)
0 0 0 0 0 0 0 0 
##$TUNHIN= 0
##$TUNHOUT= 0
##$TUNXOUT= 0
##$USERA1= <user>
##$USERA2= <user>
##$USERA3= <user>
##$USERA4= <user>
##$USERA5= <user>
##$V9= 5
##$VALIST= <valist>
##$VCLIST= <CCCCCCCCCCCCCCC>
##$VD= 0
##$VDLIST= <DDDDDDDDDDDDDDD>
##$VPLIST= <PPPPPPPPPPPPPPP>
##$VTLIST= <TTTTTTTTTTTTTTT>
##$WBST= 1024
##$WBSW= 4
##$XGAIN= (0..3)
0 0 0 0 
##$XL= 0
##$YL= 0
##$YMAX_a= 62993
##$YMIN_a= -137913
##$ZGOPTNS= <>
##$ZL1= 120
##$ZL2= 120
##$ZL3= 120
##$ZL4= 120
##$ABSF1= 10
##$ABSF2= 0
##$ABSG= 5
##$ABSL= 3
##$ALPHA= 0
##$AQORDER= 0
##$ASSFAC= 0
##$ASSFACI= 0
##$ASSFACX= 0
##$ASSWID= 0
##$AUNMP= <proc_1d>
##$AZFE= 0.1
##$AZFW= 0.1
##$BCFW= 1
##$BC_mod= 2
##$BYTORDP= 1
##$COROFFS= 0
##$CY= 11.3945322036743
##$DATMOD= 1
##$DC= 2
##$DFILT= <>
##$DTYPP= 0
##$F1P= 18.9103706918063
##$F2P= -1.10871071338519
##$FCOR= 0.5
##$FTSIZE= 0
##$FT_mod= 4
##$GAMMA= 1
##$GB= 0.15
##$INTBC= 1
##$INTSCL= 1
##$ISEN= 128
##$LB= 0.24
##$LEV0= 0
##$LPBIN= 0
##$MAXI= 10000
##$MC2= 0
##$MEAN= 0
##$ME_mod= 0
##$MI= 1.114404
##$NCOEF= 0
##$NC_proc= 0
##$NLEV= 6
##$NOISF1= 3.799351
##$NOISF2= 2.8
##$NSP= 1
##$NTH_PI= 0
##$NZP= 0
##$OFFSET= 15.70392
##$PC= 1
##$PHC0= -8501.612
##$PHC1= 18.80097
##$PH_mod= 1
##$PKNL= yes
##$PPARMOD= 0
##$PSCAL= 0
##$PSIGN= 0
##$REVERSE= no
##$SF= 200.130013532006
##$SI= 16384
##$SIGF1= 3
##$SIGF2= 2
##$SINO= 400
##$SIOLD= 16384
##$SREGLST= <1H.CDCl3>
##$SSB= 0
##$STSI= 0
##$STSR= 0
##$SW_p= 3612.71676300578
##$SYMM= 0
##$S_DEV= 0
##$TDeff= 0
##$TDoff= 0
##$TI= <>
##$TILT= no
##$TM1= 0
##$TM2= 0
##$TOPLEV= 0
##$USERP1= <user>
##$USERP2= <user>
##$USERP3= <user>
##$USERP4= <user>
##$USERP5= <user>
##$WDW= 1
##$XDIM= 8192
##$YMAX_p= 0
##$YMIN_p= 0
$$ End of Bruker specific parameters
$$ ---------------------------------
##NTUPLES= NMR FID
##VAR_NAME=  TIME,          FID/REAL,        FID/IMAG
##SYMBOL=    X,             R,               I
##VAR_TYPE=  INDEPENDENT,   DEPENDENT,       DEPENDENT
##VAR_FORM=  AFFN,          ASDF,            ASDF
##VAR_DIM=   8192,          8192,            8192
##UNITS=     SECONDS,       ARBITRARY UNITS, ARBITRARY UNITS
##FACTOR=    0.0002004,     1,               1
##FIRST=     0,             0,               0
##LAST=      1.6414764,     0,               0
##MIN=       0,             -137913,         0
##MAX=       1.6414764,     62993,           0
$$ Real data points
##PAGE= N=1
##DATA TABLE= (X++(R..R)), XYDATA
$$ [...]
$$ plain form
2848 -2278 -1830 -1836 224 3305 1210 -2366 -2189 -1286 208 3483 2916 -1914 -3250 -1250 176 2316 4007
2865 4007 -204 -3108 -1941 218 1811 3970 1804 -2762 -2737 331 973 2634 3000 -815 -3677 -662
2881 -662 1788 2006 2178 -3 -3603 -1766 1288 1492 1734 449 -3343 -3618 1276 2902 971 209 -2169
2898 -2169 -4219 -1137 3423 2484 321 -1958 -3880 -1984 2374 2548 589 -249 -2567 -3486 585 4055
2914 4055 956 -440 -1195 -2523 -958 2401 2690 244 -969 -2217 -1331 2831 3409 116 -1116 -742
2930 -742 -1621 1545 4737 1721 -2654 -2433 -682 757 3757 2308 -1924 -3050 -1577 -212 2623 3402
2946 3402 -1285 -3407 -1676 -123 421 2972 1371 -2929 -2812 -497 55 1882 1690 -1535 -3551 -906
2962 -906 560 1372 2616 -487 -4361 -1861 1811 2113 1727 160 -3286 -2829 1474 2718 1819 1002 -1907
$$ packed form
2848b278M48oK060L081k095l576J77R03J494L275n67m830j336K000J426K140J691
2865D007m211k904J167K159J593K159k166m566K5L068O42J661L66l815k862L015
2881f62K450K18J72k181l600J837L054K04K42j285l792k75M894J626j931p62k378
2898b169k050L082M560r39k163k279j922J896M358J74j959q38k318r19M071L470
2914D055l099j396p55j328J565L359K89k446j213j248Q86M162N78l293j232L74
2930g42q79L166L192l016m375K21J751J439L000j449m232j126J473J365K835P79
2946C402m687k122J731J553N44K551j601m300J17K315N52J827j92l225k016K645
2962i06J466Q12J244l103l874K500L672L02l86j567l446M57M303J244q99q17k909
$$ plain form
2979 -1907 -3369 419 3359 2097 724 61 -2370 -1556 2159 2670 1348 455 -1842 -2941 864 3135
2995 3135 1641 164 -1296 -3295 -656 3696 2419 -1086 -1885 -3071 -1442 2773 2810 -768 -2434 -2358
3011 -2358 -1968 1447 3481 100 -2845 -1736 -1632 -211 2865 2312 -2113 -2835 -1601 -724 2066 2951
3027 2951 -589 -2526 -1410 -923 1222 3656 1343 -2600 -1918 196 898 2685 2860 -1500 -3130 -243
3043 -243 1362 2621 3073 -313 -3317 -1393 1389 1776 2536 825 -3248 -2594 1296 2118 1195 951 -2194
3060 -2194 -3419 -262 1722 1095 894 -990 -3556 -1823 1594 1618 587 -9 -3020 -3540 628 2668
3076 2668 870 -358 -1998 -3148 -5 3478 1602 -575 -1258 -2307 -896 2876 2646 -293 -1241 -1296
3092 -1296 -1189 1917 3682 795 -1079 -1106 -1441 83 3376 2298 -993 -1641 -1444 -746 2613 3463 -656
$$ packed form
2979a907j462L788K940j262j373o63k431Q14L715N11j322q93k297j099L805K271
2995C135j494j477j460j999K639M352j277l505p99j186J629M215L7l578j666P6
3011b358L90L415K034l381k945J109J04J421L076n53m425p22J234Q77K790Q85
3027B951l540j937J116M87K145K434k313l943O82K114P02J787J75m360j630K887
3043b43J605J259M52l386l004J924K782L87P60j711m073O54L890Q22r23k44l145
3060b194j225L157J984o27k01j884k566J733L417K4j031n96l011n20M168K040
3076B668j798j228j640j150L143L483j876k177o83j049J411L772k30k939r48n5
3092a296J07L106J765k887j874k7l35J524L293j078l291o48J97O98L359Q50m119
$$ plain form
3109 -656 -3060 -1512 -476 1638 3293 -13 -3237 -1985 -271 987 2345 1279 -3022 -3027 -104 526
3125 526 1264 1878 -1408 -3596 -1399 320 993 2285 172 -3008 -2724 287 1412 2037 1561 -2113 -3625
3142 -3625 -22 2198 1745 1692 -779 -3398 -789 2790 2515 1118 134 -2394 -1913 1918 3005 941
3158 941 110 -1413 -2479 426 3370 1585 -7 -856 -2668 -1267 2765 2440 -32 -994 -2320 -2467
3174 -2467 869 3107 472 -1487 -2222 -2533 -198 2788 1626 -1830 -2042 -2079 -945 2378 2407 -1452 -2780
3191 -2780 -1466 -407 1440 3230 -254 -2843 -1608 -256 726 2941 1629 -2145 -2070 88 598 2223
3207 2223 2966 -383 -2539 -857 551 1637 3093 1076 -2940 -1772 645 1398 2343 1784 -2149 -3173
3223 -3173 353 1944 1650 1201 -1332 -3395 -526 2033 1354 624 -544 -3116 -1988 1419 1788 494
$$ packed form
3109f56k404J548J036K114J655l306l224J252J714J258J358j066m301nK923O30
3125E26P38O14l286k188K197J719O73J292k113l180K84L011J125O25m76l674j512
3142c625L603K220m53n3k471k619K609L579k75j397r84k528M81L831J087k064
3158I41q31j523j066K905K944j785j592q49j812J401M032l25k472r62j326j47
3174b467L336K238k635j959p35l11K335K986j162l456k12l7J134L323K9l859j328
3191b780J314J059J847J790l484k589J235J352R82K215j312l774P5K158N10J625
3207B223P43l349k156J682J408J086J456k017m016J168K417P53R45n59l933j024
3223c173L526J591k94m49k533k063K869K559o79p30j168k572J128L407L69j294
$$ plain form
3239 494 -320 -2078 -3214 -3 2358 923 181 -1365 -3199 -1415 2360 2217 -30 -1127 -2841 -2061
3255 -2061 2039 3344 547 -1084 -1994 -1712 812 3707 1462 -1555 -1101 -997 240 2878 2264 -806
3271 -806 -1410 -589 -485 1613 3593 144 -2023 -1510 -815 866 3396 1586 -2142 -2578 -829 478 2060
3288 2060 2308 -1856 -3411 -1333 -69 1352 2119 -312 -3419 -2158 197 1134 1816 551 -2721 -2999
3304 -2999 15 1294 1373 1393 -1404 -3068 -780 1723 1852 1661 -53 -2950 -2207 1500 2527 1556 934
3321 934 -1590 -2724 807 3052 1925 678 -1044 -3091 -358 2745 2011 317 -515 -2111 -1422 2110
3337 2110 2709 -125 -1043 -1806 -1950 767 2842 738 -1545 -1581 -1847 -701 2142 1862 -910 -1735 -2115
3354 -2115 -1854 1053 2973 202 -2167 -2268 -1922 97 3206 1357 -2200 -2040 -842 250 2197 2266
$$ packed form
3239D94q14j758j136L211K361j435p42j546j834J784L775j43k247j097j714P80
3255b061M100J305k797j631r10K82K524K895k245l017M54J04J237K638o14l070
3271h06o04Q21J04K098J980l449k167N13O95J681K530j810l728m36J749J307J582
3288B060K48m164j555K078J264J421P67k431l107J261K355R37O82j265l272k78
3304b999L014J279P9K0k797j664K288K503J29j91j714k897P43L707J027r71o22
3321I34k524j134L531K245j127j247j722k047K733L103p34j694q32j596O89L532
3337B110N99k834r18p63j44K717K075k104k283l6k66J146K843k80k772q25l80
3354b115K61K907J920k771k369j01L46K019L109j849l557J60J198J092J947O9
$$ plain form
3370 2266 -1235 -2111 -486 686 2030 2307 -485 -2529 -643 1032 1260 2656 1236 -2118 -1989 801
3386 801 1394 1794 2087 -678 -2927 -933 1325 1909 2049 -253 -3467 -2040 1205 1451 1595 278 -2799
3403 -2799 -2955 992 2182 222 -876 -2076 -2784 1 2190 900 -13 -1209 -2553 -1644 1732 2064
3419 2064 -193 -451 -1697 -2655 778 3379 1264 -820 -1417 -2300 71 3328 2306 -251 -886 -1474
3435 -1474 -1048 2040 3107 59 -1583 -948 -623 981 3327 1037 -2248 -1740 -435 452 2559 1729
3451 1729 -1741 -2555 -1046 64 1769 2358 -797 -2957 -1781 -95 776 2028 431 -2297 -2520 -295
3467 -295 600 1778 1678 -1816 -3274 -969 981 1023 1764 -125 -2785 -1349 992 1682 1754 284 -2442
3484 -2442 -1623 1456 2080 1038 703 -899 -2338 247 2761 1851 682 -420 -2366 -1189 2067 2660
$$ packed form
3370B266l501q76J625J172J344K77k792k044J886J675K28J396j420l354J29K790
3386H01N93M00K93k765k249J994K258N84J40k302l214J427L245K46J44j317l077
3403b799j56L947J190j960j098j200p08K785K189j290r13j196j344R09L376L32
3419B064k257k58j246r58L433K601k115k084n97q83K371L257j022k557o35n88
3435a474M26L088J067l048j642O35L25J604K346k290l285N08J305Q87K107q30
3451A729l470q14J509J110J705N89l155k160J176J686Q71J252j597k728k23K225
3467b95Q95J178j00l494j458K305J950M2P41j889k660J436K341O90P2j470k726
3484b442Q19L079O24j042l35j602j439K585K514r10j169j102j946J177L256N93
$$ plain form
3500 2660 1423 -135 -2493 -2748 1505 3203 1025 -760 -1603 -2372 -551 2553 1799 -1022 -1771 -1794 -740
3517 -740 1631 1397 -808 -1440 -1451 -1614 737 2432 -60 -2049 -1251 -898 -373 2187 1903 -985 -2615
3534 -2615 -1319 130 2429 2888 -526 -2750 -1139 -25 1520 3280 973 -2294 -1886 574 1538 2190
3550 2190 1419 -1043 -2234 197 809 1739 1750 -576 -2596 -627 1158 1189 1244 351 -2488 -2329 856 1697
3568 1697 1160 272 -1921 -2980 -34 2196 969 317 -1469 -3528 -1311 1814 1877 251 -1081 -2492
3584 -2492 -1850 1093 2360 297 -499 -1609 -2220 151 2750 1179 -483 -708 -1377 -834 1936 2459 381
3601 381 -824 -1338 -1201 1436 3169 878 -554 -899 -1335 453 3014 1872 -1490 -1833 -753 68 2003
3618 2003 2385 -440 -2492 -1905 -279 1800 2534 -24 -2737 -1641 -206 395 1701 1121 -2267 -2590
$$ packed form
3500B660j237j558k358k55M253J698k178j785q43p69J821L104p54k821p49k3J054
3517g40K371k34k205o32j1j63K351J695k492j989P98L53N25K560k84k888j630
3534b615J296J449K299M59l414k224J611J114J545J760k307l267M08K460R64O52
3550B190p71k462j191K431O12R30J1k326k020J969J785L1N5q93k839J59L185Q41
3568A697n37q88k193j059K946K230j227o52j786k059K217L125O3j626j332j411
3584b492O42K943J267k063p96j110o11K371K599j571j662k25o69N43K770N23k078
3601C81j205n14J37K637J733k291j432l45m36J788K561j142l362l43J080Q21J935
3618B003L82k825k052N87J626K079P34k558k713J096J435O01J306n80l388l23
$$ plain form
3634 -2590 -725 690 1117 1239 -1054 -2344 -1107 619 1059 1923 -103 -2694 -1866 805 1325 1583 1114
3651 1114 -1495 -2447 218 2357 2135 981 -756 -2409 -290 2213 1754 884 -20 -1840 -1555 1660
3667 1660 2281 914 -163 -1429 -2192 -15 2340 1307 -108 -1095 -2374 -1080 2081 2319 -168 -1643
3683 -1643 -2031 -1584 801 2767 205 -1996 -1841 -1719 495 2405 1008 -1895 -1775 -1084 -411 1703 1935
3700 1935 -1066 -1692 -748 -148 1213 2573 282 -1886 -1118 -141 843 2915 1710 -1742 -2150 -113 844
3717 844 2388 1954 -447 -2576 -558 1368 1426 2255 125 -2415 -1516 1183 1316 1628 1183 -1704 -2525
3734 -2525 115 1550 478 907 -738 -2592 -962 1284 1068 293 -572 -2608 -1516 945 1844 342
3750 342 -53 -1889 -2764 16 2390 1237 -238 -1293 -2229 -740 2324 2338 57 -980 -1828 -1042 2205
$$ packed form
3634b590J865J415M27J22k293j290J237J726M40Q64k026k591Q28K671N20K58m69
3651A114k609r52K665K139k22j154j737j653K119K503m59q70r04j820K85L215
3667A660O21j367j077j266p63K177K355j033j415r87j279J294L161K38k487j475
3683a643l88M47K385J966k562k201J55J22K214J910j397k903J20O91O73K114K32
3700A935l001o26R44O00J361J360k291k168P68R77R84K072j205l452m08K037R57
3717H44J544m34k401k129K018J926N8Q29k130k540Q99K699J33L12m45k887q21
3734b525K640J435j072M29j645j854J630K246k16p75q65k036J092K461Q99j502
3750C42l95j836q75K780K374j153j475j055r36J489L064J4k281j037q48P86L247
$$ plain form
3767 2205 2881 -77 -789 -956 -989 819 2520 1192 -1039 -1066 -492 -109 2067 1925 -513 -1157 -852 -765
3785 -765 1602 2792 -28 -1862 -1445 -739 748 2248 1468 -2229 -2574 -633 480 1922 1584 -1384
3801 -1384 -2687 -895 549 775 1204 -484 -2944 -1536 866 550 1249 898 -1996 -2020 284 1175 1100
3818 1100 1016 -708 -2383 -619 1760 1626 1458 75 -2357 -1385 2078 2115 1170 236 -1519 -1462 1049 2456
3836 2456 1060 43 -935 -2047 -513 2191 1440 83 -711 -1608 -1119 1286 1931 3 -1027 -1507 -1656
3853 -1656 281 2341 623 -1395 -1590 -1819 -241 1988 1621 -1102 -2151 -1432 -503 1212 2350 -275
3869 -275 -1841 -1281 -661 936 2591 926 -1594 -1626 -29 144 2097 2043 -1003 -1900 -316 647 1386 2175
3887 2175 97 -1709 -710 378 1200 1916 1268 -1786 -1892 308 1362 1545 1284 -1115 -2690 -483 1252
$$ packed form
3767B205O76k958p12j67l3J808J701j328k231k7N74L83K176j42k438o44L05Q7
3785g65K367J190k820j834M17P06J487J500p80l697l45J941J113J442l38k968
3801a384j303J792J444K26M29j688k460J408K402l16O99l51k894k4K304Q91p5
3818A100q4j724j675J764K379j34j68j383k432R72L463L7r45r34j755N7K511J407
3836B456j396j017r78j112J534K704p51j357p94q97M89K405O45j928j030m80j49
3853a656J937K060j718k018j95k29J578K229l67k723j049P19R29J715J138k625
3869b75j566N60O20J597J655j665k520l2J597J73J953n4l046q97J584R63P39P89
3887B175k078j806R99J088Q22P16o48l054j06K200J054J83k61k399j575K207J735
$$ plain form
3904 1252 1255 1009 -601 -3096 -1734 1291 1212 210 -276 -2076 -2170 674 1237 280 -219 -1253 -2144 -660
3922 -660 1378 988 402 -765 -1612 -1595 1399 2205 222 -730 -1402 -1727 1027 2801 1054 -491 -1265 -969
3940 -969 372 2585 1893 -706 -1292 -744 154 2132 2439 -121 -1540 -797 -493 563 2073 517 -1273
3957 -1273 -1037 -725 27 1979 1468 -1459 -2017 -1022 -84 1083 2167 -645 -2424 -1577 44 886 1458
3974 1458 492 -2282 -2238 389 1077 1259 845 -1819 -2578 -389 1343 1263 1102 -511 -1817 -663 1273
3991 1273 1334 1027 473 -1154 -1487 844 1587 865 686 -563 -2163 359 2216 1313 453 -606 -1896
4008 -1896 -651 1849 2069 205 -792 -1710 -1694 921 2155 554 -1090 -1088 -1889 -259 2642 1073 -1283
4025 -1283 -1297 -1657 -797 1284 1399 -673 -1543 -1112 -1026 359 2476 472 -1815 -1236 -954 8 1811 1520
$$ packed form
3904A252Lk46j610k495J362L025p9j002m86j800r4K844N63r57m99j034q91J484
3922f60K038l90n86j167q47J7K994Q06j983r52o72l25K754J774j747j545p74K96
3940i69J341K213o92k599n86N48Q98J978L07k560j419P43L04J056J510j556j790
3957a273K36L12P52J952n11k927n58R95R38J167J084k812j779Q47J621Q42N72
3974A458r66k774M4K627O88J82m14k664p59K189J732q0j61j613j306J154J936
3991A273O1l07n54j627l33K331P43p22j79j249j600K522J857r03q60j059j290
4008a896J245K500K20j864r97r18J6K615J234j601j644Kq01J630K901j569k356
4025a283j4l60Q60K081J15k072q70M31Q6J385K117k004k287N79K82R62J803k91
$$ plain form
4043 1520 -1387 -1976 -596 -19 1977 2254 -639 -2380 -736 586 1441 2575 543 -1821 -1355 496
4059 496 1054 1938 1569 -1131 -1739 308 1163 1003 1273 -193 -2187 -592 763 1011 1077 168 -2006 -2007 243
4078 243 1398 714 341 -1947 -2733 -55 2120 872 -403 -1203 -2341 -858 1509 1493 -388 -513 -1829
4095 -1829 -1209 722 1699 533 -109 -886 -1278 -115 2234 1252 -342 -1162 -1230 -609 1633 2360 -117 -1080
4113 -1080 -1195 -623 1361 2653 195 -1131 -539 -237 442 2240 1114 -1423 -1527 -289 487 1627 1459
4130 1459 -813 -1934 -935 -256 512 2045 19 -2197 -1681 106 218 1146 1060 -1574 -2374 -879 679
4147 679 1347 1312 -523 -2126 -762 801 1259 909 186 -2217 -1615 945 1659 1320 342 -1535 -1835 700
4165 700 1975 1206 601 -636 -1940 -559 1823 1435 410 -163 -1045 -985 828 2213 966 -94 -1125
$$ packed form
4043A520k907n89J380N77J996K77k893j741J644J322Q55J134k032k364M66J851
4059D96N58Q84l69k700o08K047Q55j60K70j466j994J595J355K48O6r09k174jK250
4078B43J155o84l73k288p86K678K175j248j275q00j138J483K367j6j881j25j316
4095a829O20J931R77j166o42p77l92J163K349r82j594q20o8O21K242P27k477r63
4113a080j15N72J984J292k458j326N92L02O79J798j126k537j04J238P76J140j68
4130A459k272j121R99O79P68J533k026k216N16J787J12R28q6k634q00J495J558
4147F79O68l5j835j603J364J563M58l50p23k403O02K560P14l39r78j877l00K535
4165G00J275p69o05j237j304J381K382l88j025n73q82O0J813J385j247j060j031
$$ plain form
4182 -1125 -1858 -92 2202 1026 -543 -1005 -1846 -911 1713 2141 -596 -1457 -1813 -962 1425 2001 -74
4199 -74 -1741 -1424 -1488 405 2165 573 -1414 -1116 -322 -398 1199 1596 -674 -1533 -641 -240 968 1703
4217 1703 184 -1102 -1066 -177 799 1989 1375 -1488 -2226 367 1342 1531 1603 -613 -1844 -612 919
4234 919 1326 1257 40 -2137 -896 908 599 852 587 -1256 -1652 225 1271 318 246 -664 -1963 -1027
4252 -1027 979 862 -40 -483 -1945 -1185 1018 1308 38 -407 -1832 -1528 310 2053 1052 -411 -977
4269 -977 -1489 -301 1942 1536 118 -269 -1267 -858 994 2354 415 -726 -490 -882 567 2263 1026
4286 1026 -1194 -770 -328 -99 1907 1570 -861 -1779 -375 -152 1225 2286 -52 -1942 -1505 -269 936
4303 936 1672 348 -1825 -1848 37 286 1018 1085 -1461 -2301 -475 342 488 733 -118 -1692 -1175 -41
$$ packed form
4182a125p33J766K294j176j569m62q41R35K624M28k737q61l56Q51K387N76k075
4199g4j667L17o4J893J760j592j987K98P94p6J597L97k270q59Q92M01J208P35
4217A703j519j286L6Q89R76J190o14k863p38K593R75J89P2k216j231J232J531
4234I19M07o9j217k177J241J804l09K53k65j843l96J877J046r53p2r10j299R36
4252a027K006j17r02m43j462P60K203K90j270m45j425L04J838J743j001j463n66
4269i77n12J188K243m06j418l87r98M09J852J360j939j141K36l92J449J696j237
4286A026k220M24M42K29K006l37k431r18J404K23J377J061k338j890M37J236J205
4303I36P36j324k173k3J885K49P32O7k546q40J826Q17J46K45q51j574N17J134
$$ plain form
4321 -41 328 1204 1057 -1724 -1440 276 1273 1017 913 -242 -2078 -388 1872 1404 655 -348 -1802 -917
4339 -917 1463 2069 974 -86 -1548 -1372 915 2223 519 22 -331 -1480 -197 1677 1463 111
4355 111 -512 -1461 -1334 727 1575 303 -649 -1240 -1456 50 2125 560 -987 -1128 -1153 -631 1652 1177
4373 1177 -914 -1624 -1111 -359 1139 1546 -330 -1445 -625 -114 271 2048 937 -1304 -951 -225 474
4390 474 1434 1361 -365 -1407 -413 445 979 2009 292 -1727 -601 845 1016 1123 815 -1639 -1854 197
4408 197 1075 664 589 -1052 -2269 112 1172 504 575 -747 -1912 -1343 1073 1053 457 -619 -1520 -1974
4426 -1974 347 1574 283 139 -997 -1752 -534 1577 1053 156 -451 -1298 -1190 1285 1549 289 -369
4443 -369 -845 -837 723 2189 478 -959 -754 -723 58 1977 1604 -998 -900 -622 -389 1501 2019 -150 -1261
$$ packed form
4321d1L69Q76j47k781K84J716R97k56j04j155j836J690K260m68p49j003j454Q85
4339i17K380O06j095j060j462J76K287J308j704m97l53j149J283J874k14j352
4355A11o23r49J27K061Q48j272r52n91k16J506K075j565j547j41k5N22K283m75
4373A177k091p10N13P52J498M07j876j115Q20N11L85J777j111k241L53P26O99
4390D74R60p3j726j042R94Q58N34J030j717k019J126J446J71J07l08k454k15K051
4408A97Q78m11p5j641j217K381J060o68P1j322j165N69K416k0n96j076r01m54
4426a974K321J227j291j44j136p55J218K111n24q97o07q47J08K475K64j260o58
4443c69m76QJ560J466j711j437K05L1P81J919l73k602R8K78K33J890N18k169j111
$$ plain form
4462 -1261 -615 -644 742 1763 501 -1462 -1304 -169 -327 1473 1356 -1251 -1986 -803 191 658 1328
4479 1328 -818 -2385 -1252 566 842 1286 160 -1917 -1502 534 625 843 549 -807 -1918 -120 980
4496 980 502 1021 -66 -1369 -1039 744 1245 1091 542 -1394 -1573 765 1601 981 483 -781 -1633 425
4514 425 1997 1208 198 -729 -1166 -427 1327 1494 -415 -540 -971 -841 648 1561 -15 -771 -619 -1304
4532 -1304 -294 1523 993 -921 -1365 -1067 -906 893 1275 -494 -1384 -1020 -764 769 1978 481 -1563
4549 -1563 -947 -336 75 1771 1128 -1054 -1217 -51 427 1291 1545 -441 -1400 -448 516 1069 1472 391
4567 391 -1853 -1019 443 771 1406 821 -911 -1606 23 702 1084 1047 -325 -2163 -1002 866 709 874
4585 874 60 -1924 -1620 367 1173 472 -20 -1290 -1885 143 1708 1053 -273 -632 -1454 -653 1272 1004
$$ packed form
4462a261O46k9J386J021j262j963J58J135j58J800j17k607p35J183R94M67O70
4479A328k146j567J133J818K76M44j126k077M15K036R1K18k94j356j111J798J100
4496I80m78N19j087j303L30J783N01j54n49j936j79K338Q36o20m98j264q52K058
4514D25J572p89j010r27m37P39J754J67j909j25m31J30J489R13j576p56J52o85
4532a304J010J817n30j914m44K98J61J799L82j769q90L64K56J533J209j497k044
4549a563O16O11M11J696o43k182j63J166M78Q64K54j986r59R52R64N53M03j081
4567C91k244Q34J462L28O35n85j732o95J629O79L82l7j372j838J161J868j57J65
4585H74q14j984L04J987Q06p01m92j270n95K028J565o55j326l59q22Q01J925k68
$$ plain form
4603 1004 -339 -255 -1023 -1090 782 1750 513 -254 -789 -1584 199 2310 1217 -452 -860 -897 -201 1531
4621 1531 1656 -70 -918 -759 -720 910 1936 221 -1250 -573 -398 253 1708 792 -1196 -1101 -563 -395
4639 -395 1055 1688 -321 -1906 -938 -272 419 1339 29 -1619 -1338 -84 330 1045 836 -1384 -1888 30
4657 30 682 637 484 -1015 -1720 -555 771 854 662 363 -1473 -963 1077 987 811 626 -869 -1592 354
4676 354 1360 779 313 -399 -1521 -631 1683 1313 364 -182 -1195 -1196 679 1514 214 -393 -988 -1157 -35
4695 -35 1722 530 -588 -801 -1359 -319 1216 978 -891 -1043 -887 -959 633 1320 -258 -1294 -709 -738
4713 -738 -25 1384 785 -1088 -957 -482 -325 1141 1398 -356 -1176 -310 -28 965 1954 346 -1809 -496
4731 -496 251 743 1498 839 -1430 -1244 408 951 1096 1223 -716 -1410 104 784 674 632 31 -1325 -1151
$$ packed form
4603A004j343Q4p68o7J872R68j237p67n35p95J783K111j093j669m08l7O96J732
4621A531J25j726q48J59L9J630J026j715j471O77J75O51J455r16j988R5N38J68
4639c95J450O33k009j585R68O66O91R20j310j648K81J254M14P15k09k220n04J918
4657C0O52m5j53j499p05J165J326Q3j92k99j836N10K040r0j76j85j495p23J946
4676C54J006n81m66p12j122Q90K314l70r49n46j013jJ875Q35j300o07n95j69J122
4695c5J757j192j118k13n58J040J535k38j869j52J56p2J592O87j578j036N85k9
4713g38P13J409n99j873J31M75J57J466K57j754q20Q66K82R93R89j608k155J313
4731d96P47M92P55o59k269J86J652N43J45J27j939o94J514O80j10m2o01j356J74
$$ plain form
4750 -1151 334 549 810 484 -1047 -1564 -208 753 729 565 -852 -2171 -817 936 683 -37 -428 -1702
4768 -1702 -1181 950 1540 289 -560 -929 -1386 492 1542 504 -441 -593 -877 -42 1585 1340 -255
4785 -255 -273 -470 -662 1021 1713 111 -958 -877 -500 415 1814 819 -829 -771 -530 24 1553 1093 -881
4804 -881 -1663 -334 135 422 1369 -440 -1435 -829 -141 457 1087 326 -1555 -1149 128 295 713 807 -763
4823 -763 -1732 -686 729 843 1021 -258 -1646 -729 620 464 878 789 -1304 -1479 263 1282 846 506
4841 506 -259 -1367 -267 1534 1105 560 41 -1279 -300 1250 1145 121 128 -1108 -1410 683 1625 672
4859 672 -344 -767 -1339 -352 1406 926 -153 -801 -1492 -800 984 1351 -163 -867 -1211 -1253 261 1492
4877 1492 575 -926 -847 -888 -297 1325 723 -991 -950 -366 -27 962 1192 -324 -1124 -577 168 569 1481
$$ packed form
4750a151J485K15K61l26j531n17J356R61k4j64j417j319J354J753k53p20l91j274
4768a702N21K131N90j251q49l69m57J878J050j038r45j52k84Q35J627k45j595
4785b55j8j97j92J683O92j602j069Q1L77R15J399r95j648N8K41N54J529m60j974
4804h81p82J329M69K87R47j809r95O06O88N98O30p61j881M06J277J67M18R4j570
4823g63r69J046J415J14J78j279j388R17J349j56M14q9k093j75J742J019m36l40
4841E06p65j108J100J801m29n45n19j320R79J550j05j024Pj236l02K093R42r53
4859F72j016m23n72R87J758m80j079o48o91O92J784L67j514p04l44m2J514J231
4877A492r17j501P9m1N91J622o02j714M1N84L39R89K30j516q00N47P45M01R12
$$ plain form
4896 1481 659 -1210 -1044 -270 451 1553 1213 -752 -1453 -54 555 949 1215 -101 -1664 -832 786
4913 786 908 638 10 -984 -828 606 364 498 369 -788 -1550 -171 1043 557 -55 -222 -1272 -896
4931 -896 514 829 130 -84 -1414 -1342 649 1303 534 436 -880 -1539 -198 1779 1163 -451 -641 -718 -232
4950 -232 1108 1488 395 -566 -690 -492 589 1705 366 -507 -298 -399 -40 1382 1173 -786 -956 -485
4968 -485 -163 1041 1265 -636 -841 -777 -311 699 1117 -55 -1534 -946 -433 61 1086 834 -1072 -1542
4986 -1542 -634 498 651 876 -261 -1577 -639 602 332 951 277 -1197 -1064 306 762 451 357 -781
5004 -781 -990 194 874 633 714 -200 -1532 -501 1223 1285 846 -214 -1102 -951 840 1360 487 -183 -984
5023 -984 -1527 239 1389 869 -193 -537 -1233 -358 868 1052 -221 -402 -796 -698 745 915 57 -492
$$ packed form
4896A481q22j869J66P74P21J102l40j965p01J399O09L94K66j316j563Q32J618
4913G86J22k70o28r94J56J434k42J34j29j157p62J379J214m86o12j67j050L76
4931h96J410L15o99k14j330P2J991O54p69r8j316o59J341J977o16j614j90p7M86
4950b32J340L80j093r61j24J98J081J116j339q73K09j01L59J422k09j959j70M71
4968d85L22J204K24j901k05O4M66J010M18j172j479N88N13M94J025k52j906m70
4986a542R08J132J53K25j137j316R38J241k70O19o74j474J33J370M56l11r4j138
5004g81k09J184O80k41Q1r14j332J031J724O2m39j060q88J51J791N20q73o70q01
5023i84n43J766J150n20j062l44o96Q75J226J84j273j81l94R8J443J70q58n49
$$ plain form
5041 -492 -732 -992 -103 1026 561 -765 -1099 -704 -317 822 1048 -598 -1141 -690 -344 882 1320 123
5059 123 -824 -677 -238 435 1084 671 -763 -898 69 65 1066 1272 207 -995 -405 619 753 1292 172
5078 172 -1155 -866 649 715 1033 695 -863 -1535 208 1068 438 209 -620 -1453 -569 747 782 98 -566
5097 -566 -1248 -708 682 493 52 1 -848 -1273 -370 1218 715 -331 -479 -1153 -282 1219 1087 -141 -4
5116 -4 -935 -932 583 1533 303 -461 -506 -988 313 1528 744 -190 -644 -359 -57 1295 1155 -290 -770 -426
5136 -426 -153 382 1423 243 -847 -670 -292 210 1249 627 -805 -948 -428 -174 727 569 -585 -1249
5154 -1249 -706 -20 536 729 139 -1365 -867 345 638 537 403 -1166 -1473 476 914 649 503 -407
5172 -407 -1077 51 1000 440 443 -59 -881 -583 700 1132 690 311 -973 -1123 620 1078 650 1 -608
$$ packed form
5041d92k40k60Q89J129m65j326l34L95L87J139K26j646n43M51L46J226M38j197
5059A23r47J47M39O73O49m13j434j35R67mJ001K06j065j202N90J024J34N39j120
5078A72j327K89J515O6L18l38j558o72J743Q60o30k29q29q33Q84J316L5o84o64
5097e66o82N40J390j89m41n1q49m25R03J588n03j046j48o74Q71J501j32j228J37
5116dr31LJ515R50j230p64m5m82J301J215p84r34m54K85L02J352j40j445m80L44
5136d26K73N35J041j180j090J77L78N02J039o22j432j43N20K54R01j58j154o64
5154a249N43O86N56J93n90j504M98J212K93j01j34j569l07J949M38k65j46r10
5172d07o70J128R49n60Ln02q22K98J283M32m42l79j284j50J743M58m28o49o09
$$ plain form
5191 -608 -1103 -210 1274 1233 363 -837 -1213 -559 799 1061 260 -755 -859 -417 184 1277 330 -953
5209 -953 -731 -765 -363 1044 924 -333 -570 -645 -687 409 1259 -26 -879 -541 -188 678 1431 587 -783
5228 -783 -834 -7 332 873 689 -770 -1132 -70 297 790 1327 193 -1096 -621 168 760 1189 641 -714
5247 -714 -695 -186 462 842 670 -295 -1453 -450 873 558 444 -464 -1680 -759 567 394 587 -90 -1087
5266 -1087 -1044 297 977 286 54 -638 -1417 -253 1184 716 -83 -577 -1051 -329 912 946 180 -396 -555
5285 -555 -615 322 1278 366 -238 -247 -820 -122 1447 869 -137 -196 -736 -305 986 1381 76 -980 -640 -155
5305 -155 634 1342 233 -920 -633 -95 255 872 541 -565 -1237 -358 68 426 853 -209 -921 -733 290
5324 290 167 1039 482 -1009 -1081 -64 466 833 987 -813 -1266 -202 755 788 598 -401 -1374 -462 781
$$ packed form
5191f08m95Q93J484m1q70j200l76O54J358K62q01j015j04M42O01J093r47j283
5209i53K22l4M02J407j20j257k37p5m2J096Q50j285q53L38L53Q66P53q44j370
5228g83n1Q27L39N41j84j459l62J062L67M93N37j134j289M75P89N92M29n48j355
5247g14J9N09O48L80j72r65j158J003J323l15j14r08j216R21J326j73J93o77r97
5266a087M3J341O80o91k32o92p79J164J437m68p99m94m74P22J241L4p66n76j59
5285e55o0R37R56r12o04rn73O98J569n78j006n9n40M31J291L95j305j056L40M85
5305a55P89P08j109j153K87N38L50O17l31j106o72Q79M26L58M27j062p12J88J023
5324B90j23Q72n57j491p2J017N30L67J54j800m53J064R57L3j90r99r73R12J243
$$ plain form
5343 781 1127 527 147 -780 -882 298 913 550 154 -324 -1162 -71 1211 710 447 122 -951 -531 1047
5362 1047 1037 219 -229 -683 -843 737 1204 112 -358 -561 -940 168 1039 463 -302 -840 -1165 -517 928
5381 928 1028 -133 -963 -682 -264 229 910 294 -849 -613 -550 155 1202 741 -513 -545 -482 -42 841 1296
5401 1296 -9 -823 -233 114 374 1033 201 -744 -916 179 423 990 859 -758 -1051 -57 405 855 572
5420 572 -243 -1292 -703 594 473 543 -61 -1168 -953 255 411 516 -149 -764 -1130 -513 890 351 10
5439 10 -147 -1266 -747 724 651 -202 -481 -1167 -787 598 1215 164 -548 -568 -786 365 1378 508 133
5458 133 -343 -518 -72 741 1155 173 -82 -256 -132 632 1153 311 -487 -534 -412 305 1232 694 -692 -452
5478 -452 -363 -424 811 613 -827 -1277 -721 86 619 1031 -52 -1424 -771 26 105 609 327 -1026 -1104 -138
$$ packed form
5343G81L46o00l80r27j02J180O15l63l96m78q38J091J282n01k63l25j073M20J578
5362A047j0q18m48m54j60J580M67j092m70k03l79J108Q71n76p65n38l25O48J445
5381I28J00j161q30K81M18M93O81o16j143K36O3P05J047m61j254l2O3M40Q83M55
5401A296j305q14N90L47K60O59q32r45j72J095K44N67j31j617k93R94M62M50k83
5420E72q15j049N89J297j21P0o04j107K15J208J56J05o65o15l66O17J403n39l41
5439A0j57j119N19J471p3q53k79o86L80J385O17j051p12k0k18J151J013q70l75
5458A33m76j75M46Q13M14r82k55j74J24P64N21q42p98m7J22P17R27n38j386K40
5478d52Q9o1J235j98j440m50N56Q07N33M12j083j372O53P97P9N04k82j353p8R66
$$ plain form
5498 -138 111 683 942 -491 -1100 -465 224 588 887 471 -847 -893 448 675 572 507 -652 -1231 236
5517 236 1203 383 369 -179 -721 -43 965 903 118 -378 -722 -583 741 1088 416 -398 -747 -670 163 1037
5537 1037 398 -109 -567 -746 -393 791 546 -58 -401 -746 -941 250 564 -69 -700 -484 -465 -159 840
5556 840 506 -964 -680 -370 -49 732 712 -419 -976 -392 42 639 830 74 -778 -279 162 490 803 562
5576 562 -417 -462 129 594 747 913 -120 -995 -440 484 738 942 352 -1000 -777 406 405 579 -30 -920
5596 -920 -1164 212 733 218 389 -415 -1117 -536 792 323 -133 -295 -1049 -549 696 775 -24 -46 -656 -776
5616 -776 44 974 443 -49 -732 -994 -239 948 965 -91 -640 -507 -198 807 1187 208 -512 -556 -554 470
5636 470 1350 457 -430 -453 -395 -182 821 986 -201 -859 -370 -218 533 595 257 -680 -676 -322 128 949 214
$$ packed form
5498a38K49N72K59j433o09O35O89L64K99m16j318m6J341K27j03o5j159n79J467
5517B36R67q20j4n48n42O78J008o2p85m96l44J39J324L47o72q14l49P7Q33Q74
5537A037o39n07m58j79L53J184k45o04l43l45j95J191L14o33o31K16J9L06R99
5556H40l34j470K84L10L21P81k0j131n57N84M34N97J91p56q52M99M41L28L13k41
5576E62r79m5N91M65J53J66j033q75N55R24K54K04n90j352K23J183jJ74o09q90
5596i20k44J376N21n15J71q04p02N81J328m69m56j62p54N00J245P9p99k2o10j20
5616g76Q20R30n31m92o83k62P55J187J7j056n49J33L09J005L80r79p20m4KJ024
5636D70Q80q93q87k3N8K13J003J65j187o58M89J52P51O2l38r37ML54M50Q21p35
$$ plain form
5657 214 -858 -854 -234 89 489 685 -616 -1237 -611 377 374 671 -136 -1083 -480 128 488 464 68 -823 -391
5678 -391 370 592 637 399 -272 -517 -319 607 529 516 -82 -755 -268 688 805 293 36 -832 -603 279 1082
5699 1082 388 55 -361 -972 279 1368 775 81 -422 -721 -387 669 931 -323 -753 -290 -551 310
5717 310 879 223 -533 -458 -660 -196 655 482 -719 -472 -525 -723 337 803 368 -979 -570 -184 568 925
5737 925 401 -616 -830 5 299 842 677 -599 -909 302 377 753 641 -166 -640 -372 -13 564 887
5756 887 458 -877 -913 109 187 693 267 -252 -1188 -115 811 344 300 -134 -981 -451 717 585 93 -104
5776 -104 -826 -611 357 654 261 42 -401 -1139 -321 871 618 192 -312 -707 -451 911 897 110 -316 -642
5796 -642 -720 629 1014 230 -380 -156 -410 -15 1103 519 -434 -580 -179 170 771 717 -331 -1299 -555 -273
$$ packed form
5657B14j072MO20L23M00J96j301o21O26R88lK97q07r47O03O08L60k4l96q91M32
5678c91P61K22M5k38o71k45J98R26p8j3n98o73M87R56J17n12k57q68K29Q82Q03
5699A082o94l33m16o11J251J089n93o94n03k99L34J056K62j254m30M63k61Q61
5717C10N69o56p56P5k02M64Q51j73j201K47n3j98J060M66m35j347M09L86P52L57
5737I25n24j017k14Q35K94N43j65j276l10J211P5L76j12q07m74K68L59N77L23
5756H87m29j335l6J022P8N06m26n19r36J073R26m67m4m34q47N30J168j32m92j97
5776a04p22K15R68K97l93k19m43p38Q18J192k53m26n04l95K56J362j4p87m26l26
5796f42p8J349L85p84o10K24k54L95J118n84r53j46M01L49O01n4j048r68P44K82
$$ plain form
5816 -273 364 829 165 -770 -667 83 163 506 662 -625 -1001 -571 30 165 741 -399 -1508 -538 355
5835 355 482 569 -7 -887 -777 444 413 251 233 -648 -921 44 786 136 596 -316 -719 -56 803 570 484
5856 484 47 -450 -411 368 589 194 329 -197 -1059 -178 705 303 -17 -141 -589 -565 852 1031 -106 -190
5876 -190 -832 -302 204 1146 61 -563 -613 -705 39 688 111 -437 -618 -356 -366 526 851 -353 -578 -645 -353
5897 -353 166 1039 521 -594 -208 -155 65 670 667 -661 -786 -431 -82 609 710 -204 -1082 -103 361 637
5917 637 881 30 -987 -565 137 510 562 423 -603 -698 22 625 424 551 -295 -841 -9 467 472 108 100
5938 100 -949 -799 334 585 212 -199 -579 -1257 -33 814 323 -53 -525 -874 -193 646 634 21 -269
5957 -269 -518 -671 463 977 174 -376 -131 -309 218 1084 628 -315 -275 -225 -5 875 848 -128 -453 -323 -472
$$ packed form
5816b73O37M65o64r35J03P50Q0L43J56j287l76M30O01J35N76j140j109R70Q93
5835C55J27Q7n76q80J10J221l1j62j8q81k73R65P42o50M60r12m03O63Q59k33q6
5856D84m37m97L9P79K21l95J35n26q62Q81Q83m02l20j24m48K4J417J79j137q4
5876a90o42N30N06R42j085o24n0r2P44O49n77n48j81K62j0Q92L25j204k25o7K92
5897c53N19Q73n18j115L86N3K20O05lj328j25L55L49O91J01r14q78R79M64K76
5917F37K44q51j017M22P02L73N2j39j026r5P20O03k01J27q46n46Q32M76Nl64q
5938A00j049J50J133K51l73m11l80o78J224Q47m91l76m72l49O81Q39j2o13k90
5957b69k49j53J134N14q03n50K45j78N27Q66m56r43M0N0K20Q80k7r76l25J30j49
$$ plain form
5978 -472 576 1056 8 -680 -567 -211 372 931 701 -726 -805 -498 112 603 608 -368 -858 -199 118 428
5998 428 667 -477 -974 -631 130 285 690 240 -480 -945 -2 519 305 721 -237 -894 -422 692 667 655
6018 655 -326 -829 -407 656 524 286 74 -445 -532 579 704 760 366 -362 -807 -25 946 523 -182 -155
6038 -155 -726 -573 512 1130 209 -91 -612 -985 123 716 371 -427 -334 -758 -125 642 750 -301 -508
6057 -508 -305 -116 215 601 61 -491 -357 -251 444 742 414 -508 -247 -194 123 601 684 -470 -749 227
6077 227 103 491 892 -83 -1019 -276 -28 345 855 365 -742 -781 5 450 668 711 -144 -708 -76 620
6097 620 345 460 225 -932 -600 720 584 4 -202 -877 -952 350 311 263 -9 -296 -1152 -130 578 438
6117 438 142 -33 -795 -917 718 849 351 35 -624 -722 -2 798 599 -337 -512 -442 -175 1013 744 -233
$$ packed form
5978d72J048M80j048o88J13L56N83N59k30j427p9L07O10M91Nr76m90O59L17L10
5998D28K39j144m97L43P61J55M05m50p20m65R43N21k14M16r58o57M72J114k5j2
6018F55r81n03M22J063j32k38k12n19q7J111J25N6l94p28m45P82R71m23p05K7
6038a55n71J53J085O18r21l00n21l73J108N93l45p98R3m24O33P67J08j051k07
6057e08K03J89L31L86n40n52J34J06O95K98l28r22K61N3L17M78Q3j154k79R76
6077B27j24L88M01r75r36P43K48L73N10m90j107l9P86M45K18M3q55n64O32O96
6097F20k75J15k35j157L32J320j36n80k06o75p5J302l9m8k72k87q56J022P08j40
6117D38k96j75p62j22J635J31m98l16o59r8P20Q00j99r36j75P0K67J188k69r77
$$ plain form
6137 -233 -247 -132 -19 452 814 79 -129 -337 -398 364 1075 -25 -197 -216 -279 23 774 688 -266 -733 -351
6158 -351 -145 368 761 -106 -905 -465 21 179 772 291 -842 -628 27 218 277 377 -515 -981 180 216
6178 216 229 233 -47 -547 -461 334 328 230 364 -621 -794 89 888 389 392 -201 -453 -200 826 372 135 -56 -542
6201 -542 -333 691 630 -36 30 -455 -313 -172 536 55 -101 -605 -669 57 712 318 -244 -419 -501 -247 460
6222 460 581 -354 -589 -293 -527 5 638 144 -491 -499 -450 -152 750 294 -305 -509 -319 322 556 941 -257
6243 -257 -870 -320 -464 477 600 539 -481 106 328 388 711 412 -252 -506 604 340 273 571 -32 -511
6263 -511 -305 279 646 388 201 -598 -542 47 550 355 439 -794 -837 166 531 319 92 -375 -620 -135
6283 -135 392 148 -185 -377 -502 -175 416 660 258 -160 -236 -351 -308 926 525 -73 -62 -600 -149 762 755
$$ packed form
6137b33j4J15J13M71L62p35k08k08o1P62P11j100j72j9o3L02P51q6r54m67L82
6158c51K06N13L93q67p99M40M86J58N93m81j133K14O55J91N9J00q92m66J161L6
6178B16J3Mk80n00Q6P95or8J34r85j73Q83P99m99Ln93k52K53J026m54k37j91m86
6201e42K09J024o1o66O6m85J42J41P08m81j56n04o4P26O55l94n62j75q2K54P07
6222D60J21r35k35K96k34N32O33m94o35qM9K98R02m56n99k04J90O41K34L85j198
6243b57o13N50j44R41J23o1j020N87K22O0L23k99o64k54J110k64o7K98o03m79
6263e11K06N84L67k58j87p99N6N89N03j95Q4j233m3J003L65k12k27m67k45M85
6283a35N27k44l33j92j25L27N91K44m02m18p6j15M3J234m01n98J1n38M51R11p
$$ plain form
6304 755 213 -318 -469 -220 454 834 262 -310 -316 -50 399 906 129 -273 -271 -252 -92 549 795 -227 -790
6325 -790 -231 -28 129 236 183 -513 -371 -58 152 290 196 -505 -697 -5 71 519 350 -369 -935 -211 -66
6346 -66 358 289 7 -922 -606 205 233 381 235 -400 -811 141 602 280 276 -106 -468 -124 384 559 169 91
6368 91 -524 -510 358 417 131 170 -312 -862 -1 883 349 -309 -242 -1013 -91 543 292 119 -480 -552 -220 317
6390 317 650 -138 -608 -290 -432 198 720 386 -340 -520 -298 -362 261 221 -106 -690 -416 15 90 544 74
6411 74 -470 -387 124 362 681 511 -439 -533 172 465 684 583 -175 -342 -92 357 332 592 -4 -525 -379
6432 -379 21 390 553 183 -12 -791 41 87 578 359 -309 -1058 -170 539 222 -129 -218 -714 -584 269 466
6453 466 201 -247 -655 -510 308 514 344 57 -289 -586 44 378 461 -363 -509 -266 -361 283 809 376 62
$$ packed form
6304G55n42n31j51K49O74L80n72n72oK66M49N07p77m02KJ9J60O41K46j022n63
6325g90N59K03J57J07n3o96J42L13K10J38r4p01j92O92P6M48j69p19n66P24J45
6346f6M24o9k82r29L16Q11K8J48j46o35m11R52M61l22ml82l62L44N08J75l90p8
6368I1o15J4Q68N9k86L9m82n50Q61Q84n34o58O7p71R22O34k51j73n99p2L32N37
6390C17L33p88m70L18j42O30N22l34p26j80K22o4O23m0l27n84K74M31P5M54m70
6411G4n44Q3N11K38L19j70r50r4P05K93K19j01p58j67K50M49k5K60n96n21J46
6432c79M00L69J63l70j95p79Q32M6M91k19o68p49Q88P09l17l51q9m96J30Q53J97
6453D66k65m48m08J45Q18K06j70k87l46k97O30L34Q3q24j46K43r5O44N26m33l14
$$ plain form
6474 62 -14 -75 355 726 613 -572 -275 -212 -233 797 629 -108 -410 -353 -63 597 667 -158 -496 -186 13 381
6496 381 703 169 -884 -401 -103 -246 439 588 -655 -851 -409 95 85 464 98 -709 -494 88 272 589
6516 589 300 -557 -570 29 638 506 485 -26 -1034 -184 661 442 351 -11 -705 -111 319 659 41 133 -312
6537 -312 -510 109 714 461 -55 -87 -669 -134 449 306 74 208 -480 -612 423 422 219 -308 -347 -714 -10
6558 -10 586 -264 -419 -548 -548 3 668 154 -546 -473 -166 -426 440 349 -454 -299 -155 -53 133 548 105 -387
6580 -387 -246 94 62 576 565 -402 -514 -151 -43 331 378 -439 -502 -190 520 296 736 117 -626 -617 211 127
6602 127 181 102 -560 -544 -317 534 294 -155 -131 -438 -457 190 388 413 -144 -755 -603 284 460 53 -192 -382
6624 -382 -694 -211 541 342 -27 -115 -260 -185 869 559 -116 -378 -220 -270 224 716 280 -324 -269 -163 -68
$$ packed form
6474F2p6o1M30L71j13j185K97O3k1J030j68p37l02N7K90O60P0q25l38L10J99L68
6496C81L22n34j053M83K98j43O85J49j243j96M42N04j0L79l66q07K15N82J84L17
6516E89k89q57j3N99O09j32k1n11j008Q50Q45k19r1l62o94N94M30L40o18R2m45
6537c12j98O19O05k53n16l2n82N35N83j43k32J34o88j32J035jk03n27l9l67P04
6558a0N96q50j55j29%N51O65n14p00P3L07k60Q66r1q03J55J44J02J86M15m43m92
6580c87J41L40l2N14j1r67j12L63J08L74M7q17o3L12P10k24M40o19p43RQ28q4
6602A27N4p9o62J6K27Q51k40m49K4l07j9O47J98K5n57o11J52Q87J76m07k45j90
6624c82l12M83P52j99l69q8j45P5J054l10o75k62J58n0M94M92m36o04N5J06R5
$$ plain form
6645 -68 639 416 36 -425 -238 -473 478 397 -39 -339 4 -74 378 1057 245 -396 -466 -296 206 402 262
6666 262 -489 -390 -522 -73 626 442 -367 -718 -318 124 167 389 40 -536 -455 307 261 58 311 -259 -533
6687 -533 -164 336 256 268 124 -505 -105 346 256 233 54 -511 -578 553 584 243 181 -211 -256 111 708 238
6709 238 -202 -332 -354 9 522 224 -85 158 -505 -559 369 625 233 4 -356 -541 169 372 332 -268 -355
6730 -355 -529 -281 541 374 239 -570 -349 -37 357 627 164 -552 -270 45 124 330 242 -495 -402 -196 318
6751 318 405 293 -194 -442 -401 246 284 501 389 -240 -316 15 248 510 599 -578 -530 133 337 176 515 -193
6773 -193 -646 31 297 298 122 -107 -302 -428 355 92 136 -82 -261 -311 126 647 255 -141 -339 -320 -277 291
6795 291 394 222 -39 -270 -336 345 613 40 -158 -143 -527 -31 538 114 -297 -127 -408 162 830 609 -270
$$ packed form
6645f8P07k23l80m61J87k35R51q1m36l00L43p8M52O79q12o41p0J70N02J96j40
6666B62p51R9j32M49O99j84q09l51M00M42M3K22l49n76Q1P62m6k03K53n70k74
6687e33L69N00q0J2j44o29M00M51r0k3j79n65o7J131L1l41o2l92m5L67N97m70
6709B38m40j30k2L63N13k98l09K43o63n4R28K56l92k29l60j85P10K03m0o00q7
6730c55j74K48Q22j67j35q09K21L12L94K70m63p16K82L15P9K06q8p37R3K06N14
6751C18Q7j12m87k48M1O47L8K17j12o29p6L31K33K62Q9j177M8O63K04j61L39p08
6773a93m53O77K66Jj76k29j95j26P83k63M4k18j79n0M37N21l92l96j98J9M3N68
6795B91J03j72k61k31o6O81K68n73j98J5l84M96N69m24m11J70k81N70O68k21q79
$$ plain form
6816 -270 -114 -100 -276 516 845 -243 -556 -211 -321 29 800 454 -470 -271 240 -78 82 286 10 -660
6836 -660 -280 44 -124 223 -227 -667 -435 124 114 156 24 -752 -720 -85 530 340 54 -213 -702 -35 370
6857 370 216 239 2 -605 -50 137 432 139 379 -160 -640 324 487 309 197 -324 -473 -99 207 559
6877 559 271 -129 -607 -420 235 347 30 -245 -87 89 133 422 -26 49 -251 -207 25 266 414 -11 -258
6898 -258 -477 -436 537 556 -139 -354 -290 -474 -88 724 364 -241 -89 -207 -175 379 687 -276 -336 -332 -4 -20 746
6921 746 38 -450 -639 54 335 296 182 -373 -171 -49 409 213 179 -184 -502 186 466 354 270 46 -357
6942 -357 -444 148 363 441 434 -266 -498 65 239 90 231 -85 -653 -143 227 331 -219 -282 -514 -211 293 407
6964 407 -261 -206 -698 -339 203 454 111 -180 118 -420 34 573 326 -136 -45 -394 -176 498 600 186 -208
$$ packed form
6816b70J56J4j76P92L29j088l13L45j10L50P71l46r24J99N11l18J60K04k76o70
6836f60L80L24j68L47m50m40K32N59j0M2j32p76L2O35O15j90k86k67m89O67M05
6857C70j54K3k37o07N55J87K95k93K40n39m80R64J63j78j12n21j49L74L06L52
6877E59k88m00m78J87O55J12l17k75J58J76M4K89m48P5l00M4K32K41J48m25k47
6898b58k19M1R73J9o95k15O4j84L86Q12l60o05J52j18L2N54L08r63o0ML28j6P66
6921G46p08m88j89O93K81l9j14n55K02J22M58j96l4l63l18O88K80j12q4k24m03
6942c57q7N92K15P8pp00k32N63J74j49J41l16n68N10L70J04n50o3k32L03N04J14
6964D07o68N5m92L59N42K51l43k91K98n38M54N39k47m62R1l49K18O74J02m14l94
$$ plain form
6985 -208 -497 -321 103 561 80 -536 -119 290 55 400 475 -610 -452 -443 -109 519 524 -244 -578 91 19 252
7007 252 393 -16 -475 -171 -141 74 235 307 -343 -809 242 52 369 386 -111 -516 -595 268 487 220 88
7028 88 -278 -233 -1 175 397 114 -294 -132 70 547 426 20 -87 -320 238 547 366 66 147 -68 -501
7049 -501 39 523 51 -14 -105 -285 39 232 240 28 -196 -186 11 570 494 -188 -488 -464 -355 296 606 123
7071 123 -417 -498 -324 -11 473 434 -391 -20 -27 -239 76 274 -204 -518 1 169 364 364 316 -206 -354 -125
7093 -125 -87 560 654 -368 -488 379 458 402 558 -67 -632 -378 363 576 270 77 -724 -74 154 338 -150
7114 -150 297 -311 -417 217 562 121 -295 -36 -650 104 242 327 111 74 -483 12 5 626 -73 -181 -398
7135 -398 -161 140 546 31 -100 -102 -314 -210 315 406 -217 -130 -111 -52 67 571 314 -471 -93 -80 -16 549 354
$$ packed form
6985b08k89J76M24M58m81o16M17M09k35L45P5j085J58RL34O28Np68l34O69p2K33
7007B52J41m09m59L04L0K15J61P2o50m66J051j90L17J7m97m05p9Q63K19k67j32
7028H8l66M5K32J76K22k83m08J62K02M77j21m06j07k33N58L09j81l00Q1k15m33
7049e01N40M84m72o5r1j80L24J93Qk12k24J0J97N59p6o82l00K4J09O51L10m83
7071A23n40q1J74L13M84l9q25L71pk12L15J98m78l14N19J68J95%m8n22j48K29
7093a25L8O47R4j022j20Q67P9n6J56o25n65K54P41K13l06j93q01O50K28J84m88
7114a50M47o08j06O34L45m41m16K59o14P54J38Q5k16l7n57M95pO21o99j08k17
7135c98K37L01M06n15j31kk12J04N25R1o23Q7J9N9J19N04k57p85L78J3O4N65j95
$$ plain form
7158 354 -127 -304 -93 -43 416 535 -84 -317 -116 74 17 426 85 -572 -378 -183 299 422 278 -531 -441
7179 -441 -41 263 299 386 -261 -483 -197 332 -5 154 291 -296 -196 200 269 322 47 -349 -360 -15 55 455
7201 455 292 -209 -531 -119 282 468 166 -57 -208 -128 488 458 -80 293 -133 -327 122 402 -134 37 -248
7222 -248 -408 -114 536 414 -312 -403 -442 -122 399 270 73 -147 -488 -287 3 377 -2 -125 -266 -383 23
7243 23 177 435 -185 -399 -176 -269 252 395 78 -357 -363 402 78 238 83 -475 -153 96 355 263 151 -159
7265 -159 -401 35 127 500 207 66 -548 -178 210 410 447 86 -220 -419 -43 187 167 135 -55 -530 89
7286 89 159 217 53 -58 -644 -224 288 281 25 313 -349 -512 -52 84 165 -69 -5 -201 -49 205 182 -144 -95
7309 -95 -392 -220 277 532 5 -89 -182 -39 96 288 364 -135 -446 -188 -169 270 345 -127 -218 -60 25 371 450
$$ packed form
7158C54m81j77K11N0M59J19o19k33K01J90n7M09l41o57J94J95M82J23j44q09R0
7179d41M00L04L6Q7o47k22K86N29l37J59J37n87J00L96O9N3k75l96j1L45P0M00
7201D55j63n01l22M12M01J86l02k23j51Q0O16l0n38L73m26j94M49K80n36J71k85
7222b48j60K94O50j22p26r1l9L20N21j29j97k20l41K01K90L74l79j23j41j17M06
7243B3J54K58o20k14K23r3N21J43l17m35oP65l24J60j55n58L22K49K59r2j12l10
7265a59k42M36R2L73k93j41o14L70L88K00L7l61l06j99L76K30k0l2j90m75O19
7286H9P0N8j64j11n86M20N12pk56K88o62j63M60J36Q1k34O4j96J52K54k3l26M9
7309i5k97J72M97K55n27r4r3J43J35J92P6m99l11K58J9M39P5m72r1J58Q5L46P9
$$ plain form
7332 450 34 -322 -274 140 319 296 185 -603 -353 -169 -126 250 88 -362 -632 -128 184 222 326 -234 -784
7353 -784 -301 93 246 202 72 -547 -419 124 335 155 252 -293 -344 88 48 195 -34 97 -348 -223 355
7374 355 395 67 57 -45 -165 282 707 43 117 37 -381 -51 259 90 187 -237 -320 -329 210 198 -336 -479 -291
7397 -291 -437 123 276 -61 -172 -125 18 -131 167 202 -246 -13 -266 -135 348 396 -245 -548 45 -93 211
7418 211 363 310 -454 -344 -255 115 402 226 -239 -242 -216 258 458 239 -168 86 -20 -78 319 304 156 -346
7440 -346 -242 394 102 251 266 -298 -462 165 9 352 -31 304 -456 -110 15 110 67 -93 -585 -447 217
7461 217 293 448 156 -46 -677 -183 402 56 -182 91 -472 34 521 304 37 -126 -568 -446 -12 190
7481 190 21 -238 -314 127 76 397 193 -7 -427 -354 -160 441 675 14 -142 -174 -183 142 309 -71 -417 -442
$$ packed form
7332D50m16l56M8M14J79k3j11p88K50J84M3L76j62m50k70N04L12L8J04n60n50
7353g84M83L94J53m4j30o19J28N43K11j80R7n45n1M32m0J47k29J31m45J25N78
7374C55M0l28j0j02j20M47M25o64P4q0m18L30L10j69R7m24q3rN39j2n34j43J88
7397b91j46N60J53l37j11M7J43j49K98L5m48K33k53J31M83M8o41l03N93j38L04
7418B11J52n3p64J10Q9L70K87j76m65lK6M74K00k19m07K54j06n8L97j5j48n02
7440c46J04O36k92J49J5n64j64O27j56L43l83L35p60L46J25R5m3j60m92J38O64
7461B17P6J55k92k02o31M94N85l46k38K73n63N06M87k17k67j63m42J22M34K02
7481A90j69k59p6M41n1L21k04k00m20P3J94O01K34o61j56l2rL25J67l80l46k5
$$ plain form
7503 -442 -13 -4 238 140 -375 -394 -304 106 42 385 -129 -197 127 133 109 328 70 -212 -301 56 -60 92 279 -573
7527 -573 -292 -174 424 116 305 -195 -237 -258 507 161 199 131 -473 -397 184 142 325 118 -103 -355 -28 436
7549 436 253 214 -44 -339 -62 416 244 471 -113 -493 -429 5 406 -58 -310 -196 -319 80 686 121 -27
7570 -27 -188 -79 -257 461 -53 -43 -160 -322 -71 359 227 -440 -107 -101 -17 140 375 358 -149 -83 -120 -58 -38
7593 -38 249 82 -375 44 36 216 467 -168 -469 -277 -154 139 238 452 -261 54 233 -50 64 343 23
7614 23 -500 -3 300 320 83 12 -309 -334 171 631 289 272 -18 -494 203 104 -31 -62 -212 -324 -607 441
7636 441 209 84 -246 -515 -272 315 396 -12 -400 -430 -259 132 308 169 -89 -265 -358 51 235 323 -262
7657 -262 -174 350 -27 372 324 72 -274 -250 -198 135 635 136 -456 77 -291 -72 348 114 -82 -461 -292
$$ packed form
7503d42M29RK42r8n15j9R0M10o4L43n14o8L24Ok4K19k58k82q9L57j16J52J87q52
7527e73K81J18N98l08J89n00m2k1P65l46L8o8o04P6N81m2J83k07k21k52L27M64
7549D36j83l9k58k95K77M78j72K27n84l80O4M34M01m64k52J14j23L99O06n65j48
7570b7j61J09j78P18n14J0j17j62K51M30j32o67L33OQ4J57K35j7n07O6l7O2K0
7593c8K87j67m57M19qJ80K51o35l01J92J23K93R9K14p13L15J79k83J14K79l20
7614B3n23M97L03K0k37p1l21k5N05M60l42j7k90m76O97r9j35l1j50j12k83J048
7636D41k32j25l30k69K43N87Q1m08l88l0J71L91J76j39k58j76r3M09J84Q8n85
7657b62Q8N24l77L99m8k52l46K4N2L33N00m99n92N33l68K19M20k34j96l79J69
$$ plain form
7678 -292 -187 366 344 -306 -507 -226 80 242 345 49 -473 -420 -215 249 95 146 -4 -402 -233 52 238
7699 238 329 121 -495 -151 206 134 470 190 -446 -550 215 475 273 288 -345 -291 -152 446 399 -45 -25 -68
7721 -68 -87 372 208 -200 288 -186 -223 155 104 45 0 -81 -129 2 291 203 -481 -500 55 -193 94 351 107
7744 107 -248 -34 15 243 431 16 -20 -313 -77 95 409 218 -219 -487 145 205 257 98 -65 -167 -46
7765 -46 41 394 453 -25 -274 -239 275 154 458 272 -247 -174 42 187 85 -121 -146 -335 -210 133 194 325
7787 325 -327 -494 -481 64 348 -56 -4 -238 -426 -17 403 158 108 -271 -166 -211 53 387 126 -176 -269 -463
7809 -463 110 402 -113 47 132 -333 -76 266 38 -167 -236 -147 -40 552 182 -32 -24 -254 114 26 321 159
7831 159 -350 -194 -186 10 164 137 -365 -137 33 -182 383 590 -23 -524 -432 107 -293 631 -63 -409 -299
$$ packed form
7678b92J05N53k2o50k01K81L06J62J03k96n22N3K05M64j54N1j50l98J69K85J86
7699B38R1k08o16L44L57p2L36k80o36j04P65K60k02J5o33N4J39N98m7m44K0m3
7721f8j9M59j64m08M88m74l7L78n1n9m5q1m8J31K89q8o84j9N55k48K87K57k44
7744A07l55K14M9K28J88m15l6k93K36J72L14j91m37k68O32O0N2j59j63j02J21
7765d6Q7L53N9m78k49L5N14j21L04j86n19P3K16J45j02k06k5j89J25L43O1J31
7787C25o52j67J3N45K84m04N2k34j88M09M20k45n0l79J05m5K64L34k61l02r3j94
7809d63N73K92n15J60Q5m65K57L42k28k05o9Q9J07N92l70k14Qk30L68q8K95j62
7831A59n09J56QJ96J54k7n02K28J70k15N65K07o13n01R2N39m00R24o94l46J10
$$ plain form
7852 -299 -125 102 -167 235 -319 -538 30 276 39 463 69 -437 -153 122 178 352 10 -236 -122 278
7872 278 8 133 364 -192 -507 -16 207 83 130 110 -305 -71 313 -133 51 85 -158 -136 -76 288 150 -184
7894 -184 -450 -396 -75 428 221 -79 191 -203 -77 48 129 17 -185 3 -51 89 229 85 -179 -229 105
7915 105 -298 297 198 -300 -2 -291 150 111 363 42 -267 -53 -257 57 159 107 -532 -282 5 24 25 371
7937 371 -119 -360 67 24 426 427 -143 -240 -192 36 401 394 5 -298 -193 138 211 -113 46 -41 -319 -75 150
7960 150 252 0 -530 -238 -164 192 276 208 -30 -77 10 329 36 120 -97 -470 -233 -205 76 66 -144 -287 -217
7983 -217 -112 276 131 35 173 -260 -119 316 589 -109 -25 -169 -161 197 309 119 -409 -213 -129 102 199 280
8005 280 -5 -415 -282 104 15 430 207 -314 -241 -230 -116 4 -151 -298 -170 -80 103 -51 -3 -306 -106 -355
$$ packed form
7852b99J74K27k69M02n54k19N68K46k37M24l94n06K84K75N6J74l42k46J14M00
7872B78k70J25K31n56l15M91K23j24M7k0m15K34L84m46J84L4k43K2O0L64j38l34
7894a84k66N4L21N03k07l00K70l94J26J25Q1j12k02J88n4J40J40j44k64n0L34
7915A05m03N95r9m98K98k89M41l9K52l21l09K14k04L14J02n2o39K50K87J9JL46
7937C71m90k41M27m3M02Jn70r7M8K28L65pl89l03J05L31P3l24J59q7k78K44K25
7960A50J02k52n30K92P4L56Q4o8k38m7Q7L19k93Q4k17l73K37K8K81j0k10j43P0
7983b17J05L88j45r6J38m33J41M35K73o98Q4j44QL58J12j90n28J96Q4K31R7Q1
8005B80k85m10J33L86q9M15k23n21P3J1J14J20j55j47J28R0J83j54M8l03K00k49
$$ plain form
8027 -355 -40 87 391 -396 -342 -289 338 88 353 104 -413 -379 -143 48 88 169 -400 -140 -148 356 152 198 -159
8050 -159 -387 -294 380 205 -339 122 204 -82 -80 152 145 -27 -3 -297 -33 322 38 -114 -200 -256 -198 194 79
8073 79 -35 -149 30 -278 77 470 -21 -330 -34 92 -178 281 274 324 -114 -164 -355 107 -32 174 -126 -129
8095 -129 254 359 519 314 -329 -244 -117 204 91 540 -372 -251 -90 328 503 621 -169 -220 -96 175 153
8116 153 262 -75 -151 -378 14 258 220 133 -238 -265 -4 431 154 146 -160 -499 -162 -103 354 95 -88 -294
8138 -294 -215 144 131 -195 -46 -206 -276 45 246 143 344 -128 -448 -49 126 268 404 -143 -37 -18 72 630
8160 630 62 213 -102 -14 139 235 178 -118 -370 -264 -54 320 293 -108 -170 -282 -129 159 449 311 -81 -259
8182 -259 -142 125 293 71 -159 -110 -35 375 113
$$ packed form
8027c55L15J27L04p87N4N3O27k50K65k49n17L4K36J91M0Q1n69K60qN04k04M6l57
8050a59k28R3O74j75n44M61Q2k86KK32pj72K4k94K64L55k84j52q6n6N8L92j15
8073G9j14j14J79l08L55L93m91l09K96J26k70M59pN0m38n0j91M62j39K06l00l
8095a29L83J05J60k05o43Q5J27L21j13M49r12J21J61M18J75J18p90n1J24K71k2
8116A53J09l37p6k27L92K44l8q7l71k7K61M35k77ql06l39L37N9M57k59j83k06
8138b94P9L59j3l26J49j60p0L21K01j03K01m72l20L99J75J42J36n47J06J9R0N58
8160F30n68J51l15Q8J53R6n7k96k52J06K10L74k7m01o2j12J53K88K90j38l92j78
8182b59J17K67J68k22k30M9P5M10k62
8191A13
$$ Imaginary data points
##PAGE= N=2
##DATA TABLE= (X++(I..I)), XYDATA
$$ plain form
0 0 0 0 0 0 0 0 0 0 0 0 -1 8 -8 8 -8 8 -12 16 -16 19 -24 26 -32 35 -41 46 -53 61 -69 78 -88 97 -110 122 -137
35 -137 152 -168 189 -208 231 -256 281 -312 345 -383 426 -474 528 -592 664 -753 861 -991 1160
54 1160 -1383 1695 -2167 2947 -4492 8699 -43120 -137913 -36493 51662 41425 -11544 -35832
67 -35832 -39482 -22118 -12142 -5465 7287 3148 -28179 -27552 -3208 102 -1906 12539 436 -20750
81 -20750 -7847 12756 14536 19168 5601 -28352 -19948 28335 38818 11437 -8300 -16766 -8962
94 -8962 14908 21372 13273 13773 -4355 -33448 -10515 36803 29618 -3281 -10042 -10598 -10418 7894
108 7894 20360 14181 3034 -20434 -32347 7918 42911 12642 -27015 -22885 -7097 7053 20516
121 20516 5346 -19246 -14218 -6360 -12274 4814 23672 2324 -24627 -21658 -8503 10567 24351
$$ packed form
0@%%%%%%%%%%jRj6J6j6J6k0K8l2L5m3N0n8O7p6Q7r9J14j30J47j66J85k07K32k59
35a37K89l20L57l97M39m87N37n93O57p28Q09r00J002j120J256j417J614j852K151
54A160k543L078l862N114p439J3191n1819r4793J01420Q8155j0237n2969k4288
67c5832l650J7364R976O677J2752m139l1327O27K4344L310k008J4445j2103k1186
81b0750J2903K0603J780M632j3567l3953Q404M8283J0483k7381j9737q466P804
94h962K3870O464q099N00j8128k9093K2933M7318p185l2899o761n56J80J8312
108G894J2466o179j1147k3468j1913M0265L4993l0269l9657M130J5788J4150J3463
121B0516j5170k4592N028P858n914J7088J8858k1348k6951K969J3155J9070J3784
$$ plain form
134 24351 5640 -21164 -19265 -9128 3564 29015 23114 -21638 -30900 2639 15722 11837 14430
147 14430 1187 -16812 -7818 5332 9097 19523 13821 -13760 -17354 3329 13003 16859 14879
160 14879 -10041 -20715 2973 14678 8759 14193 4300 -26376 -20437 17772 26917 7361 -11202
173 -11202 -25023 -14857 13394 17765 2867 -3669 -16711 -27251 -2015 23853 8272 -9647
185 -9647 -10376 -17976 -15838 9393 18809 4240 -8023 -19849 -20116 7924 26988 8271 -9526 -12563
199 -12563 -15352 2090 29932 18053 -12150 -13673 -4614 230 18836 25126 -677 -16553 -9129
212 -9129 859 14730 23301 4136 -13576 -7258 -4213 -1700 19351 21080 -9766 -21237 -7263
225 -7263 1190 11353 18499 -1792 -22396 -13811 -809 7290 16770 4741 -22283 -20401 -155
$$ packed form
134B4351j8711k6804J899J0137J2692K5451n901m4752r262L3539J3083l885K593
147A4430j3243j7999Q994J3150L765J0426n702k7581l594K0683R674L856j980
160A4879k4920j0674K3688J1705n919N434r893l0676N939L8209R145j9556j8563
173a1202j3821J0166K8251M371j4898o536j3042j0540K5236K5868j5581j7919
185i647p29p600K138K5231R416j4569j2263j1826k67K8040J9064j8717j7797l037
199a2563k789J7442K7842j1879l0203j523R059M844J8606O290k5803j5876P424
212i129R988J3871Q571j9165j7712O318L045K513K1051J729l0846j1471J3974
225g263Q453J0163P146k0291k0604Q585J3002Q099R480j2029k7024J882K0246
$$ plain form
238 -155 7689 13255 10130 -16735 -27562 -3564 13430 11635 8617 -7692 -25741 -9892 14561
251 14561 12554 4340 -1062 -13473 -11885 7685 11390 4869 5768 -3768 -16229 -1049 16244 10675
265 10675 4077 -1736 -15584 -8289 17933 19948 3174 -5228 -13076 -12501 11888 24642 7356 -7692
279 -7692 -12260 -14069 2250 22708 11573 -8935 -10981 -10957 -7225 11920 16254 -4529 -14338 -10714
293 -10714 -8793 4987 16640 870 -15710 -11283 -6294 444 14794 8281 -14892 -15243 -2467
306 -2467 1406 9652 14832 -3580 -17339 -7874 1876 10112 19848 6475 -18300 -14331 3589 11737
320 11737 18091 11245 -13662 -18357 4122 13734 10673 9157 -3190 -15790 -3073 10808 8646
333 8646 7468 2440 -13857 -12128 6475 10260 5878 3983 -10450 -20279 -1952 14767 9165 1251
$$ packed form
238a55P844N566l125k6865j0827K3998J6994j795l018j6309j8049J5849K4453
251A4561k007q214n402j2411J588J9570L705o521Q99r536j2461J5180J7293n569
265A0675o598n813j3848P295K6222K015j6774q402p848N75K4389J2754j7286j5048
279g692m568j809J6319K0458j1135k0508k046K4L732J9145M334k0783r809L624
293a0714J921J3780J1653j5770j6580M427M989O738J4350o513k3173l51J2776
306b467L873Q246N180j8412j3759R465R750Q236R736j3373k4775L969J7920Q148
320A1737O354o846k4907m695K2479R612l061j516j2347j2600J2717J3881k162
333H646j178n028j6297J729J8603L785m382j895j4433r829J8327J6719n602p914
$$ plain form
347 1251 -9552 -21422 -9243 15300 14282 -1349 -9718 -18136 -12274 11429 17408 -409 -8855
360 -8855 -8998 -11249 706 15470 7592 -4067 -5225 -10680 -7841 12253 17383 1796 -7069 -10446
374 -10446 -8813 10505 22942 4547 -12711 -9211 -2473 7235 19731 9050 -12243 -10836 37
387 37 4022 12463 12640 -5270 -13005 -3685 487 5859 14935 3534 -15407 -12285 -1745 3335 12607
402 12607 9325 -12961 -19512 -4042 5803 9237 8768 -8313 -20830 -6497 7255 6158 6039 -1626
416 -1626 -16305 -11154 6308 8293 5229 3864 -9735 -16353 909 14544 10333 4336 -6678 -16533
430 -16533 -3026 17235 14175 2229 -3766 -10852 -5829 13133 14909 1813 -1872 -3692 -8401 1620
444 1620 13645 7594 -494 -3691 -11625 -7884 11974 14685 64 -8936 -13418 -10542 9421 19162
$$ packed form
347A251j0803j1870J2179K4543j018j5631q369q418N862K3703N979j7817q446
360h855j43k251J1955J4764p878j1659j158n455K839K0094N130j5587q865l377
374a0446J633J9318J2437j8395j7258L500O738R708J2496j0681k1293J407J0873
387C7L985Q441J77j7910p735R320M172N372R076j1401j8941L122J0540N080R272
402A2607l282k2286o551J5470R845L434m69j7081j2517J4333J3752j097j19p665
416a626j4679N151J7462J985l064j365j3599o618J7262J3635m211n997j1014r855
430a6533J3507K0261l060j1946n995p086N023J8962J776j3096l685j820m709J0021
444A620J2025o051q088l197p934L741J9858K711j4621r000m482K876J9963R741
$$ plain form
458 19162 -49 -15574 -12959 -6463 5780 16125 3494 -15401 -12315 -2575 1726 10052 8538
471 8538 -6807 -10621 -3307 -2915 3745 13888 4407 -11056 -8928 -2452 3561 14949 10521 -10653
485 -10653 -14964 -844 7749 12802 10803 -7459 -16643 -1390 9620 9108 9268 175 -13895 -7419
499 -7419 7962 9358 6796 4293 -9492 -13280 1759 10482 7992 4883 -6583 -17149 -4525 11698
513 11698 8802 2129 -3455 -14962 -11503 7872 11795 854 -4994 -9746 -11245 2228 11217 3344
527 3344 -3310 -6599 -12335 -4424 12503 10475 -2725 -6883 -10513 -7967 10069 17743 1921 -9909
541 -9909 -9042 -4891 6907 16701 6466 -7289 -5452 -3405 595 13490 12780 -2825 -7624 -2768
555 -2768 -1897 7279 15761 3721 -11113 -8752 -1115 5989 13635 4456 -13667 -12687 -609 4541 9190
$$ packed form
458A9162j9211j5525K615O496J2243J0345j2631j8895L086R740M301Q326j514
471H538j5345l814P314L92O660J0143r481j5463K128O476O013J1388m428k1174
485a0653m311J4120Q593N053j999j8262r184J5253J1010n12J60r093j4070O476
499g419J5381J396k562k503j3785l788J5039Q723k490l109j1466j0566J2624J6223
513A1698k896o673n584j1507L459J9375L923j0941n848m752j499J3473Q989p873
527C344o654l289n736P911J6927k028j3200m158l630K546J8036P674j5822j1830
541i909Q67M151J1798R794j0235j3755J837K047M000J2895p10j5605m799M856
555b768Q71R176Q482j2040j4834K361P637P104P646r179j8123R80J2078N150M649
$$ plain form
570 9190 6089 -11599 -18134 -3337 5656 5578 5761 -3725 -16123 -9645 2959 5185 6643 3707 -10302
585 -10302 -13375 -499 6780 7949 7673 -4700 -15313 -3012 11089 9293 5221 -1800 -12336 -6562
599 -6562 10871 12695 3275 -1311 -7236 -8064 5505 13966 6348 -671 -6216 -10396 372 14864
613 14864 9509 -1189 -4254 -9506 -7118 9838 15024 1232 -7112 -7616 -8195 808 12170 6010
627 6010 -5464 -9715 -10587 -2387 11872 7612 -8118 -10422 -5897 -3725 6647 11946 -3668 -15157
641 -15157 -7156 1713 6038 9116 1291 -10473 -7761 -212 4514 10859 7726 -7830 -10017 933
655 933 3477 4784 11543 3802 -11764 -8905 3166 8958 11580 5726 -9157 -10763 617 8062
669 8062 11311 8406 -7766 -14516 1431 11519 5787 2380 -1681 -11474 -7088 8529 10151 1989
$$ packed form
570I190l101j7688o535J4797Q993p8J83r486j2398O478J2604K226J458k936j4009
585a0302l073J2876P279J169k76j2373j0613J2301J4101j796m072p021j0536N774
599f562J7433J824r420m586n925q28J3569Q461p618p019n545m180J0768J4492
613A4864n355j0698l065n252K388J6956N186j3792q344n04n79R003J1362o160
627F010j1474m251q72Q200J4259m260j5730k304M525K172J0372N299j5614j1489
641a5157Q001Q869M325L078p825j1764K712P549M726O345l133j5556k187J0950
655I33K544J307O759p741j5566K859J2071N792K622n854j4883j606J1380P445
669H062L249k905j6172o750J5947J0088n732l407m061r793M386J5617J622q162
$$ plain form
683 1989 -4716 -11467 -9566 4361 9745 2915 -2448 -9617 -14164 -1504 11810 5217 -4424 -5793
697 -5793 -9821 -7402 7056 10940 136 -5378 -6924 -6912 3667 12052 4540 -3497 -4415 -6030 552
712 552 12477 9666 -3172 -5428 -3830 -1542 10103 14646 -1108 -10019 -4283 569 6607 12977
726 12977 3314 -9667 -8122 -454 4794 9967 6725 -6684 -9960 -3708 -839 6814 12092 -1601
740 -1601 -16090 -8802 3006 6102 7657 863 -12970 -12221 1073 7478 6926 535 -10648 -10873 2110
755 2110 6068 2018 3513 -1096 -11564 -5421 7871 6484 1893 921 -5200 -8050 1715 9033 8441
770 8441 3617 -7169 -11658 2241 13555 7316 1305 -2622 -9911 -4900 12424 13296 -1371 -6924
784 -6924 -5352 -2812 4869 9335 2775 -2760 -6219 -8976 -323 11929 6137 -4843 -6861 -8243 -5899
$$ packed form
683A989o705o751J901J3927N384o830n363p169m547J2660J3314o593r641j369
697e793m028K419J4458L884j0804n514j546J2J0579Q385p512q037r18j615O582
712E52J1925k811j2838k256J598K288J1645M543j5754q911N736M852O038O370
726A2977r663j2981J545P668N248N173l242j3409l276O252K869P653N278j3693
740a601j4489P288J1808L096J555o794j3833P49J3294O405n52o391j1183k25J2983
755B110L958m050J495m609j0468O143J3292j387m591r72o121k850R765P318n92
770H441m824j0786m489J3899J1314o239o011l927p289N011J7324Q72j4667n553
784f924J572K540P681M466o560n535l459k757Q653J2252n792j0980k018j382K344
$$ plain form
799 -5899 8020 12333 -2523 -12495 -8231 -2689 5061 9463 318 -10121 -7769 -3145 2267 10266
813 10266 4951 -9127 -8846 -398 1937 6604 8910 -2502 -10788 -3650 3715 6149 9137 2446 -8994
828 -8994 -6596 3141 6514 8212 6323 -5655 -9685 1150 6602 6210 6647 -1395 -10350 -4523 5276
843 5276 5265 5507 2811 -8902 -10886 1824 8913 5444 667 -9094 -12615 151 10551 5731 -1746
858 -1746 -7891 -12386 -2671 11117 6913 -4687 -6002 -6010 -5687 4368 9313 1186 -4233 -5482 -6267 597
874 597 9013 5494 -561 -2854 -7200 -5089 9533 12655 -546 -6259 -4052 -2417 5432 12231 3336
889 3336 -7526 -5504 -192 5582 10079 2981 -7358 -5197 -1 1110 6799 8721 -3622 -10791
903 -10791 -3994 1317 4076 8591 1759 -10985 -10294 -1485 4554 8870 3711 -10218 -12006 -971
$$ packed form
799e899J3919M313j4856r972M264N542P750M402r145j0439K352M624N412P999
813A0266n315j4078K81Q448K335M667K306j1412q286P138P365K434K988o691j1440
828h994K398R737L373J698j889j1978m030J0835N452l92M37q042q955N827R799
843E276j1K42k696j1713j984J2710P089l469m777r761l521J2766J0400m820p477
858a746o145m495R715J3788m204j1600j315qL23J0055M945q127n419j249p85O864
874E97Q416l519o055k293m346K111J4622L122j3201n713K207J635P849O799q895
889C336j0862K022N312N774M497p098j0339K161N196J111N689J922j2343p169
903a0791O797N311K759M515o832j2744O91Q809O039M316n159j3929j788J1035
$$ plain form
917 -971 3959 4695 4985 -4386 -12708 -3769 6082 4843 2732 -1485 -8680 -6038 5006 7008 4003 1308
933 1308 -6417 -8584 3381 9991 5301 1836 -3058 -8980 -1820 10790 9533 1340 -2159 -6731 -5232
948 -5232 6604 10388 3159 -1407 -4942 -7682 599 10455 5815 -2463 -5298 -7544 -2829 9069 8251
963 8251 -3495 -7859 -6779 -3772 5281 9519 -1435 -9303 -5844 -3059 1073 7693 3178 -6471 -7043
978 -7043 -4379 -1131 6722 8375 -3265 -8838 -4128 -958 4688 10393 1869 -9354 -6545 1293 5350
993 5350 9378 4987 -6695 -7788 2118 5976 6887 5848 -3489 -8673 404 6388 4753 4712 645 -7487
1009 -7487 -5102 4342 5517 3856 1634 -6514 -9085 782 6290 4349 1965 -4807 -11802 -3823 7206
1024 7206 6200 62 -3368 -10088 -7734 4787 8397 1135 -3022 -7440 -8822 1930 9979 3522
$$ packed form
917i71M930P36K90r371q322Q939R851j239k111m217p195K642J1044K002l005k695
933A308p725k167J1965O610m690l465m894n922P160J2610j257q193l499m572J499
948e232J1836L784p229m566l535k740Q281R856m640q278k835k246M715J1898q18
963H251j1746m364J080L007R053M238j0954p868L459K785M132O620m515r649n72
978g043K664L248P853J653j1640n573M710L170N646N705q524j1223K809P838M057
993E350M028m391j1682j093R906L858R11j039r337n184R077N984j635m1m067q132
1009g487K385R444J175j661k222q148k571R867N508j941k384o772o995P979J1029
1024G206j006o138l430o720K354J2521L610p262m157m418j382J0752Q049o457
$$ plain form
1038 3522 -4100 -5149 -6071 -193 8922 6069 -3220 -3904 -2890 -1979 5815 9112 225 -4235 -2570 -2771
1054 -2771 2731 11019 5787 -4649 -5269 -3263 467 9987 9573 -3377 -9083 -4231 161 6923 9377
1069 9377 -931 -10328 -5037 972 3474 6228 1721 -8655 -7234 518 1946 3544 3760 -4891 -9676
1084 -9676 -2534 2820 3908 5192 -1461 -11576 -6969 3735 6223 5485 1064 -8993 -10053 2302
1098 2302 7703 5411 2686 -3697 -9450 -1598 7732 6363 3533 -762 -7244 -4519 6382 8216 2933
1113 2933 163 -4664 -6561 3395 9979 3845 -2018 -4021 -6249 -482 9319 6106 -2192 -4229 -5405
1128 -5405 -3900 5873 8633 -167 -4813 -5740 -6189 1062 9250 4012 -5440 -6419 -5893 -1046 8253 6545
1144 6545 -5157 -8671 -3690 -583 5603 7092 -2539 -8483 -2936 905 2497 6433 2474 -6217 -5509
$$ packed form
1038C522p622j049r22N878R115k853r289o84J014R11P794L297q887m460J665k01
1054b771N502Q288n232j0436o20K006L730R520m14j2950n706M852M392O762K454
1069I377j0308r397N291O009K502K754m507j0376J421P752J428J598K16q651m785
1084i676P142N354J088J284o653j0115M607J0704K488p38m421j0057j060J2355
1098B302N401k292k725o383n753P852R330j369k830m295o482K725J0901J834n283
1113B933k770m827j897R956O584o134n863k003k228N767R801l213q298k037j176
1128e405J505R773K760q800m646r27m49P251Q188n238r452r79N26M847R299j708
1144F545j1702l514M981L107O186J489r631n944N547L841J592L936l959q691P08
$$ plain form
1159 -5509 31 1948 6080 7034 -3358 -8041 -1908 3435 6377 8369 260 -9748 -4591 4950 6824
1174 6824 6505 1265 -7966 -6867 4505 7442 3832 1253 -4683 -7526 938 6297 2747 718 -1679
1189 -1679 -7598 -4923 4144 4477 1454 -209 -6961 -9435 1064 7918 3003 -2328 -6439 -9118 -829
1204 -829 8739 5065 -3011 -5229 -7205 -2734 7525 8110 -1776 -4636 -3744 -3522 3816 9620 2769 -3981
1220 -3981 -3681 -3026 1077 8877 6972 -2486 -4128 -2188 -269 7036 9155 -803 -6951 -2494 654
1235 654 3548 8515 2853 -7188 -6296 -824 2489 6603 4406 -6301 -9239 -2519 1236 4715 6557
1250 6557 -2716 -12214 -5768 2839 4543 4173 -669 -9355 -7549 1826 4400 2843 1091 -5259 -7254
1265 -7254 476 4260 2451 2966 -41 -7519 -3890 5289 6107 3633 1114 -5570 -7004 3439 9472
$$ packed form
1159e509N540J917M132R54j0392m683O133N343K942J992q109j0008N157R541J874
1174F824l19n240r231J099J1372K937l610k579n936k843Q464N359l550k029k397
1189a679n919K675R067L33l023j663o752k474J0499O854m915n331m111k679Q289
1204h29R568l674q076k218j976M471J0259N85r886k860Q92K22P338N804o851o750
1220c981L00O55M103P800j905r458j642J940J919P305K119r958o148M457L148
1235F54K894M967n662j0041Q92N472L313M114k197j0707k938O720L755L479J842
1250F557r273r498O446Q607J704l70m842q686J806R375K574j557j752o350j995
1265g254P730L784j809N15l007p478L629R179Q18k474k519o684j434J0443O033
$$ plain form
1280 9472 5610 762 -4934 -7892 1565 10797 6145 -637 -2770 -5517 -2070 7479 7093 -869 -3306
1295 -3306 -3455 -3487 2806 6624 337 -3929 -3819 -4948 -971 6761 4029 -4988 -6251 -5074 -2340 5745
1311 5745 6926 -3863 -8953 -4777 -1537 3641 7778 352 -8365 -5459 -482 2091 6162 4431 -4449
1326 -4449 -6024 -623 1638 5124 6900 -1449 -6599 -719 2863 3483 6752 3184 -6124 -5481 2813
1341 2813 5685 5636 3683 -4582 -7325 292 5409 5462 4525 -3374 -10371 -2962 6686 4814 1333 -901
1357 -901 -7374 -7125 3249 6767 1921 -2251 -6040 -6713 925 5757 1697 -1284 -3331 -7505 -2861
1372 -2861 6665 4756 -2556 -2844 -3654 -4408 2720 8168 2430 -3630 -5034 -4557 2476 9356 4630 -2917
1388 -2917 -3468 -4388 -1006 8505 9015 -1960 -5499 -2042 -277 4098 8282 2393 -5034 -3638 -581
$$ packed form
1280I472l862m848n696k958R457R232m652o782k133k747L447R549l86p962k437
1295c306j49l2O293L818o287m266J10j129L977P732k732r017j263J177K734Q085
1311E745J181j0789n090M176L240N178M137p426q717K906M977K573M071j731q880
1326d449j575N401K261L486J776q349n150N880L582O20L269l568r308O43Q294
1341B813K872m9j953q265k743P617N117N3r37p899o997P409R648j872l481k234
1357i01o473K49J0374L518m846m172l789o73P638M832m060k981k047m174M644
1372b861R526j909p312k88q10p54P128N448n738o060j404M77P033O880m726p547
1388b917n51r20L382R511N10j0975l539L457J765M375M184n889p427J396L057
$$ plain form
1403 -581 2539 7535 3370 -4809 -4835 -556 366 4260 5700 -2671 -8145 -2811 1464 2425 5167 -416
1419 -416 -9043 -6758 884 3887 5268 1486 -7799 -8924 78 4885 4182 2589 -4428 -8877 -1540
1434 -1540 5052 3510 2254 202 -6141 -3937 4907 5025 1269 947 -2048 -4284 1440 5832 3197
1449 3197 1444 -1472 -5896 -1259 6769 5926 1546 -1109 -6189 -5678 6081 10698 2173 -4310 -5392
1464 -5392 -4611 2115 8481 3679 -3642 -4891 -5472 -740 7030 4269 -3856 -3894 -2739 -3793 1765 6706
1480 6706 88 -6601 -4642 -1798 1173 4763 1896 -5180 -5077 -2060 922 6436 5334 -5246 -7784
1495 -7784 -708 2573 4062 6523 933 -7399 -3941 2550 4555 5709 3060 -4617 -4854 614 2975
1510 2975 5027 5907 -2064 -7666 -852 4802 3586 3117 540 -6283 -4392 3457 4684 2191 -110
$$ packed form
1403e81L120M996m165q179k6M279R22L894J440q371n474N334M275R61K742n583
1419d16q627K285P642L003J381l782r285j125R002M807p03j593p017m449P337
1434a540O592j542j256k052o343K204Q844J18l756l22k995k236N724M392k635
1449C197j753k916m424M637Q028q43m380k655n080N11J1759M617q525o483j082
1464e392P81O726O366m802p321j249n81M732P770k761q125l8J155j054N558M941
1480F706o618o689J959K844K971L590k867p076J03L017K982N514j102j0580k538
1495g784P076L281J489K461n590q332L458O491K005J154k649p677k37N468K361
1510B975K052Q80p971n602O814N654j216m69k577o823J891P849J227k493k301
$$ plain form
1525 -110 -5263 -5646 1494 5086 1770 -24 -3956 -8207 -2142 6556 4279 -1146 -3645 -7204 -4529
1540 -4529 4941 6716 -404 -3242 -5010 -5161 1859 7170 1707 -2895 -2873 -3413 -536 5627 4356 -1268
1556 -1268 -1910 -1993 -2564 4026 7662 1193 -3297 -2094 -2030 2094 8585 4064 -4922 -5397 -1024 2988 7156
1573 7156 4787 -5078 -6574 -1327 2029 4152 5408 -1674 -7805 -3312 903 1049 3551 2462 -4895
1588 -4895 -6398 -1486 1193 4080 3574 -3752 -7760 -1670 2314 2886 4131 -1139 -8830 -4429 5026
1603 5026 5288 1758 -1081 -5599 -5088 3081 6183 2818 514 -3569 -5361 1163 6499 3694 1266
1618 1266 -74 -4782 -3925 5219 6792 1680 -751 -3789 -4558 2088 7016 2926 -1284 -3030 -5063
1633 -5063 -739 6350 3653 -2571 -3381 -4132 -3178 4225 6290 -1388 -5707 -4651 -3091 2462 7312 1456
$$ packed form
1525a10n153l83P140L592l316j794l932m251O065Q698k277n425k499l559K675
1540d529R470J775p120k838j768j51P020N311n463m602K2n40K877O163j271n624
1556a268o42q3n71O590L636o469m490J203O4M124O491m521q986m75M373M012M168
1573G156k369r865j496N247L356K123J256p082o131M493M215J46K502j089p357
1588d895j503M912K679K887n06p326m008O090L984N72J245n270p691M401R455
1603E026K62l530k839m518N11Q169L102l365k304m083j792O524N336k805k428
1618A266j340m708Q57R144J573n112k431l038p69O646M928m090m210j746k033
1633e063M324P089k697o224q10p51R54P403K065p678m319J056J560N553M850n856
$$ plain form
1649 1456 -6021 -5245 -2746 126 6153 3958 -4749 -5703 -1762 34 3037 5036 -1182 -5387 -1813
1664 -1813 554 1877 5181 2646 -4756 -4003 751 2446 4899 4834 -2806 -6293 -281 3866 4552 5082
1680 5082 -1036 -7006 -2310 4923 4837 3054 267 -5415 -4953 2972 4477 1749 272 -3475 -6194 -676
1696 -676 4189 2265 581 -1835 -6763 -4238 3894 3955 157 -1726 -5434 -5905 2041 6816 1772 -2461
1712 -2461 -3944 -5366 373 6797 3354 -2297 -3110 -3766 -1148 5316 5947 -848 -2997 -2133 -1786 3021
1728 3021 7202 2094 -2947 -2427 -1727 748 6951 5205 -2400 -3670 -1405 82 4935 6330 -1017
1743 -1017 -5610 -2436 336 2650 5567 640 -6417 -4797 114 2250 3984 2229 -5544 -6705 -618
1758 -618 2275 2380 2743 -2453 -7314 -2772 1976 2037 2874 538 -5784 -5592 1628 3359 3167 2205 -3860
$$ packed form
1649A456p477P76K499K872O027k195q707r54L941J796L003J999o218m205L574
1664a813K367J323L304k535p402P53M754J695K453o5p640l487O012M147O86N30
1680E082o118n970M696P233q6j783k787n682M62P925J505k728j477l747k719N518
1696f76M865j924j684k416m928K525Q132O1l798j883l708m71P946M775n044m233
1712b461j483j422N739O424l443n651q13o56K618O464O31o795k149Q64L47M807
1728C021M181n108n041N20P00K475O203j746p605j270K265J487M853J395p347
1743a017m593L174K772K314K917m927p057J620M911K136J734j755p773j161O087
1758f18K893J05L63n196m861M542M748O1Q37k336o322J92P220J731j92r62o065
$$ plain form
1775 -3860 -6699 -16 5116 4018 2297 -1643 -5944 -1839 6091 5474 1353 -900 -4205 -3303 4260
1790 4260 6824 1752 -993 -2683 -4145 1415 6892 3112 -968 -2211 -3728 -1907 4941 5094 -600
1805 -600 -2944 -3462 -3745 1862 5446 241 -4106 -3849 -3381 -436 5223 2355 -3779 -4603 -3349 -1026
1821 -1026 4300 4840 -2504 -6130 -2945 -272 3308 5728 230 -6400 -3356 1239 2698 4873 2745
1836 2745 -4117 -4546 933 2213 3344 4705 -835 -5032 -1118 2343 2739 5002 1843 -4788 -4203 2047
1852 2047 3944 3914 2374 -4189 -6029 766 5281 3337 1344 -3314 -6792 -1331 5219 3359 -549
1867 -549 -2434 -5563 -3924 2946 4034 341 -1159 -3634 -5556 -553 4484 2598 -669 -2521 -5390
1882 -5390 -2729 4895 4947 -220 -2656 -4171 -3016 3756 6425 804 -3115 -2319 -1821 2018 6371 2655
$$ packed form
1775c860k839O683N132j098j721l940m301M105P930o17m121k253l305R02P563
1790D260K564n072k745j690j462N560N477l780m080j243j517J821O848J53n694
1805f00k344n18k83N607L584n205m347K57M68K945N659k868o134q24J254K323
1821a026N326N40p344l626L185K673L580K420n498o630L044M595J459K175k128
1836B745o862m29N479J280J131J361n540m197L914L461L96K263l159o631N85O250
1852B047J897l0j540o563j840O795M515j944j993m658l478N461O550j860l908
1867e49j885l129J639O870J088l693j500k475j922N003N037j886l267j852k869
1882e390K661P624N2n167k436j515J155O772K669n621l919P96M98L839M353l716
$$ plain form
1898 2655 -3211 -2529 -948 675 5192 5321 -1716 -3849 -1754 -277 3439 6332 1055 -4909 -3110
1913 -3110 -502 1737 5195 2844 -4416 -5060 -847 1430 3194 3218 -3307 -6131 -2015 1156 1577 3239
1929 3239 -800 -6607 -4076 1403 2252 2556 799 -4618 -6064 355 3933 3030 1281 -3513 -5960 -788
1945 -788 4576 3358 1654 -327 -4760 -3632 3357 4881 2337 925 -1969 -4122 788 5199 3456
1960 3456 1305 -1698 -5100 -697 6201 4690 -658 -2378 -3840 -2319 4067 6230 -496 -4216 -3436
1975 -3436 -2296 1626 4882 1281 -3183 -3282 -2781 -1341 4131 3680 -2751 -3801 -2904 -2343 2058 5467
1991 5467 481 -4860 -4112 -1667 1789 5580 2233 -4604 -4650 -664 1542 4283 3656 -3017 -5558 83
2007 83 2690 3012 3856 -105 -4800 -1898 2381 2883 3806 2541 -3235 -4581 707 3061 3486 3416 -1487
$$ packed form
1898B655n866O82J581J623M517J29p037k133K095J477L716K893n277n964J799
1913c110K608K239L458k351p260o44M213K277J764K4o525k824M116L171M21J662
1929C239m039n807K531N479Q49L04j757n417j446O419L578r03j749m794k447N172
1945g88N364j218j704j981m433J128O989J524k544j412k894k153M910M411j743
1960C456k151l003l402M403O898j511n348j720j462J521O386K163o726l720P80
1975c436J140L922L256l601m464r9N01J440N472m51o431j050Q97N61M401L409
1991E467m986n341P48K445L456L791l347o837m6L986K206K741o27o673k541N641
2007H3K607L22Q44l961m695K902M279N02R23j265n776j346N288K354M25p0m903
$$ plain form
2024 -1487 -5759 -1651 3395 3432 2542 -623 -5773 -3199 2736 3461 1286 -405 -4110 -5152 798 4231
2040 4231 1142 -1413 -3386 -4768 -850 4258 2189 -1606 -2337 -4303 -2403 4099 4570 -913 -2454
2055 -2454 -2441 -3130 1471 5354 2590 -1720 -2553 -2693 150 5456 4342 -656 -1663 -2343 -1580 3858 6652
2072 6652 504 -3769 -1528 -267 1744 5326 2802 -3310 -4149 -926 2056 4701 2411 -4171 -4479
2087 -4479 -313 707 2324 3720 -1465 -6315 -3101 1309 2037 3001 578 -4573 -5568 -724 2221 3668
2103 3668 2337 -3744 -6262 -1026 2984 2320 2356 -225 -4993 -2822 3171 3832 1453 -130 -3221 -2728
2119 -2728 2259 4080 1929 867 -2034 -4070 404 5339 3434 630 -565 -3826 -2459 3706 5556
2134 5556 1450 -1203 -3845 -4068 2178 6182 2352 -2121 -3401 -4025 -364 5172 3358 -2337 -3736
$$ packed form
2024a487m272M108N046L7q90l165n150K574N935P25k175j691l705j042N950L433
2040D231l089k555j973j382L918N108k069l795p31j966J900O502M71n483j541
2055b454J3o89M601L883k764m310q33j40K843N306j114m998j007o80P63N438K794
2072F652o148m273K241J261K011L582k524o112q39L223K982K645k290o582l08
2087d479M166J020J617J396n185m850L214M410P28R64k423n151r95M844K945J447
2103C668j331o081k518N236M010o64L6k581m768K171N993O61k379j583l091M93
2119b728M987J821k151j062k901k036M474M935j905k804j195l261J367O165J850
2134E556m106k653k642k23O246M004l830m473j280o24L661N536j814n695j399
$$ plain form
2149 -3736 -2769 -1201 2966 3493 -1948 -3794 -2213 -1629 1163 4484 727 -4295 -3235 -915 498 3667
2165 3667 2992 -2487 -4466 -2125 -63 3519 4908 -681 -5097 -1573 900 2027 4538 1938 -4064
2180 -4064 -4208 1666 3686 3198 1943 -2166 -3045 640 2616 2933 3765 -280 -4757 -1507 3259 2302
2196 2302 1646 1500 -3275 -4607 602 3492 2138 -402 -3763 -4983 -602 3228 1664 -140 -2166
2211 -2166 -5556 -3071 4104 3558 -805 -2570 -3549 -3574 1978 4882 1152 -2094 -3587 -3185 1460 5638
2227 5638 2340 -1975 -2359 -2473 -755 4049 4925 -335 -2452 -1341 -1027 2079 5061 2066 -2002 -2159
2243 -2159 -1504 683 5054 3564 -1891 -3448 -1490 -190 3667 4915 -1126 -5395 -2751 409 2916
2258 2916 4207 -327 -5580 -3785 613 1818 2176 839 -4142 -4903 -277 1611 1789 2160 -1460 -5089
$$ packed form
2149c736R67J568M167N27n441j846J581N84K792L321l757n022J060K320J413L169
2165C667o75n479j979K341K062L582J389n589m416L524K473J127K511k600o002
2180d064j44N874K020m88j255m109q79L685J976L17Q32m045m477L250M766r57
2196B302o56j46m775j332N209K890j354k540l361j220M381L830j564j804k026
2211b166l390K485P175n46m363j765r79k5N552K904l730l246j493M02M645M178
2227E638l298m315l84j14J718M804Q76n260k117J111L14L106K982k995m068j57
2243b159O55K187M371j490n455j557J958J300L857J248o041m269K644L160K507
2258B916J291m534n253J795M398J205L58j337m981p61M626J888J78L71l620l629
$$ plain form
2274 -5089 -2322 1790 2317 2897 890 -4915 -4241 1826 4025 2641 524 -2796 -4751 614 4797 2982
2290 2982 786 -1590 -3849 -670 4101 2997 453 -65 -2745 -2699 1989 4570 1165 -833 -1518 -3190
2306 -3190 -38 4416 3023 -817 -2956 -4090 -1321 4458 4626 -1239 -3174 -2980 -2808 1605 5050 926
2322 926 -4169 -3298 -1883 213 3288 1862 -3074 -3041 -1922 -422 2774 3722 -2059 -4396 -1298 193
2338 193 2122 4037 703 -4604 -3161 647 2660 3771 2514 -2749 -3406 282 1918 3231 3738 -1137
2354 -1137 -5075 -1710 2526 3223 3464 826 -4428 -3312 2010 3177 2259 960 -3255 -4113 856 3444
2370 3444 1270 222 -1883 -4212 -1037 2905 2001 -139 -910 -3899 -3556 1723 3477 834 -667 -3248
2386 -3248 -4532 -132 4489 2661 -935 -2869 -4139 -1358 4593 4572 -807 -2548 -3095 -1324 3553 4848
$$ packed form
2274e089K767M112N27N80k007n805O74O067K199j384k117l320j955N365M183j815
2290B982k196k376k259L179M771j104k544n18k680M6M688K581l405j998o85j672
2306c190L152M454j393l840k139j134K769N779J68n865j935J94J72M413L445m124
2322I26n095Q71J415K096L075j426m936L3J119J500L196R48n781k337L098J491
2338A93J929J915l334n307J443L808K013J111j257n263o57L688J636J313N07m875
2354a137l938L365M236O97K41k638n254J116N322J167r18j299m215q58M969K588
2370C444k174j048k105k329L175L942r04k140p71k989L43N279J754k643j501k581
2386c248j284M400M621j828l596j934j270K781N951k1n379j741n47J771M877J295
$$ plain form
2402 4848 -13 -3007 -1201 -704 1356 4563 2077 -1900 -1751 -610 236 3714 3552 -1154 -2608 -1394
2418 -1394 -379 2344 4726 803 -4123 -3264 -196 1780 4155 2218 -4010 -4728 -674 1291 2663
2433 2663 2461 -2494 -5126 -1720 1569 1550 1847 -555 -4926 -2962 1322 1856 1592 769 -3249 -3983 287
2450 287 2887 1853 1995 -1590 -4353 -1242 3576 3246 1196 -73 -3452 -2392 3217 4801 2032 19
2466 19 -2601 -3753 1891 4971 2436 -188 -1484 -3115 -715 4137 3286 -285 -1844 -2540 -2144 2391
2482 2391 4038 -309 -2537 -2489 -2483 511 3881 938 -2825 -3591 -2603 -899 3187 3103 -1918 -3727 -2520
2499 -2520 -1132 2292 4272 -309 -4291 -2461 -762 1641 4193 1807 -3226 -3178 67 1573 3015
2514 3015 2909 -1580 -3648 -309 1845 2272 3344 383 -3729 -1968 2002 2324 2963 1953 -2606 -3952
$$ packed form
2402D848m861k994J806M97K060L207k486l977J49J141Q46L478j62m706j454J214
2418a394J015K723K382l923m926Q59L068J976K375j937o228p18M054J965J372
2433B663k02m955k632L406L289j9K97k402m371J964M284N34k64q23m018p34M270
2450B87K600j034J42l585k763L111M818l30k050j269l379J060N609J584k769k013
2466A9k620j152N644L080k535k624j296j631K400M852q51l571j559o96L96M535
2482B391J647m347k228M8OK994L370k943l763p66R88J704M086q4n021j809J207
2499b520J388L424J980m581l982J830J699K403K552k386n033M8L245J506J442
2514C015j06m489k068L339K154M27J072k961m112J761L970L22O39j010m559j346
$$ plain form
2530 -3952 690 3296 2815 1881 -2013 -4883 -1301 3357 2756 1108 -1167 -4876 -2913 2659 2855 111
2546 111 -1111 -3584 -3658 1005 3166 490 -938 -2012 -3606 -1053 2948 2123 -714 -1371 -2913 -2394
2562 -2394 2394 3880 325 -1599 -2086 -2433 1719 5430 2444 -2530 -2527 -2212 1248 4892 3649 -1748
2578 -1748 -2605 -1134 42 3257 4219 -343 -3209 -1275 -133 1404 3593 1215 -2836 -2279 -431 493
2594 493 2636 2471 -1958 -4186 -1540 359 1916 2991 -951 -5041 -2472 1172 1640 2462 106 -4469
2610 -4469 -4040 796 2363 1931 570 -2745 -4824 -420 2887 2220 1617 -426 -3935 -2010 2502 3088
2626 3088 1474 232 -2375 -2671 1887 3982 1594 218 -1333 -2829 230 4094 2630 316 -1183
2641 -1183 -3086 -1655 3550 3972 214 -1539 -3125 -2881 1561 5007 1485 -2660 -3369 -2876 42 3714
$$ packed form
2530c952M642K606m81r34l894k870L582M658o01j648k275l709J963N572J96k744
2546A11j222k473p4M663K161k676j428j074j594K553M001q25k837o57j542N19
2562b394M788J486l555j924m87l47M152L711k986m974LL15L460L644j243n397
2578a748q57J471J176L215R62m562k866J934J142J537K189k378m051N57J848R24
2594D93K143j65m429k228K646J899J557J075l942m090K569L644M68Q22k356m575
2610d469M29M836J567m32j361l315k079M404L307o67o03k043l509J925M512N86
2626C088j614j242k607k96M558K095k388j376j551j496L059L864j464k314j499
2641a183j903J431N205M22l758j753j586K44M442L446l522m145p09M93K918L672
$$ plain form
2657 3714 1871 -2045 -3318 -2094 -1211 2061 2751 -1065 -2900 -1477 -1217 267 3031 1003 -2923 -2622
2673 -2622 -653 280 3143 2531 -2133 -3682 -1005 898 3547 3898 -738 -4530 -1670 1890 2243 3615
2689 3615 919 -3265 -2256 1275 2754 2495 1395 -1551 -2838 167 2044 1888 1937 -28 -3875 -2163
2705 -2163 1901 2543 1505 -93 -3417 -3762 1202 3277 1232 -574 -3289 -4057 196 3885 1280 -922
2721 -922 -2143 -4040 -1671 2896 2650 -684 -1876 -2264 -2174 1589 3714 767 -1357 -1740 -2211 5 4093
2738 4093 2688 -1118 -1756 -1804 -549 3293 4382 -262 -2103 -1686 -878 2471 4980 1302 -3146 -2021
2754 -2021 -718 1157 3786 2517 -2637 -3682 -1058 862 2723 2552 -1781 -4218 -1608 389 1126
2769 1126 2570 83 -4245 -3039 565 1309 1625 1173 -2731 -3970 -749 1779 2060 1892 -1476 -4662
$$ packed form
2657C714j843l916j273J224Q83L272O90l816j835J423K60J484K764k028l926L01
2673b622J969R33K863o12m664j549K677J903K649L51m636l792K860L560L53J372
2689C615k696m184J009L531J479k59j100k946j287L005J877j56M9j965l847J712
2705b163M064O42j038j598l324l45M964K075k045j806k715p68M253L689k605k202
2721i22j221j897K369M567k46l334j192l88R0L763K125k947k124l83m71K216M088
2738D093j405l806o38m8J255L842J089m644j841M17Q08L349K509l678m448J125
2754b021J303J875K629j269n154j045K624J920J861j71m333k437K610J997P37
2769A126J444k487m328J206L604P44L16m52l904j239L221K528K81j68l368l186
$$ plain form
2785 -4662 -1396 2156 2053 1963 519 -3711 -3517 2018 3876 1819 19 -2096 -2932 677 3395 2322
2801 2322 827 -916 -2839 -289 3547 2576 -213 -254 -1417 -2308 1478 3551 1188 -858 -1995 -2888
2817 -2888 194 3876 2280 -1048 -2313 -3363 -1359 3991 3602 -1969 -3796 -2397 -1486 1785 3968
2832 3968 -167 -3655 -2550 -955 639 3108 937 -2605 -2283 -778 -356 2101 2762 -1044 -3097 -602
2848 -602 508 1410 2682 549 -2742 -1849 724 1992 3059 2066 -2594 -3253 1132 2723 2869 2476 -1085
2865 -1085 -3933 -903 2582 2537 2262 115 -4014 -2565 1451 2023 1140 697 -2057 -4007 -306 2770
2881 2770 1373 -187 -1269 -3377 -1102 2088 1498 -386 -1194 -3287 -2728 2660 3455 -349 -2020 -2337
2897 -2337 -2457 1011 4001 1785 -1634 -2737 -2307 -114 3962 3002 -687 -1284 -1757 -1489 2512 4477
$$ packed form
2785d662L266L552j03r0j444m230J94N535J858k057j800k115q36L609K718j073
2801B322j495j743j923K550L836r71k789m1j163q91L786K073k363k046j137q93
2817b888L082L682j596l328j265j050K004N350l89n571j827J399R11L271K183
2832C968m135l488J105J595J594K469k171l542L22J505M22K457O61l806k053K495
2848f02J110R02J272k133l291Q93K573J268J067r93m660o59M385J591J46l93l561
2865a085k848L030L485m5k75k147m129J449M016N72q83m43k754j950L701L076
2881B770j397j560j082k108K275L190n90j884q08k093N59N388P95l804j671l17
2897b337j20L468K990k216l419j103M30K193M076r60l689n97m73K68M001J965
$$ plain form
2913 4477 748 -2075 -1160 -1051 76 3417 2260 -960 -1730 -1223 -72 3002 2751 -1300 -2408 -865
2929 -865 -133 1606 3349 171 -4183 -2358 381 2061 2680 850 -3594 -3717 190 1209 2188 1418
2945 1418 -2698 -4317 -688 1406 738 1307 -132 -3249 -2515 997 1598 1212 783 -2114 -2908 184 2661
2962 2661 1726 1262 -839 -3558 -429 3643 2835 445 -862 -3029 -1729 3123 3561 265 -837 -1873
2978 -1873 -2210 1258 3978 1018 -956 -1306 -2114 -698 2801 2385 -752 -1668 -2390 -2074 1508 3059 79
2995 79 -2054 -2161 -2588 -189 3497 1393 -2979 -2792 -1452 123 2529 2221 -2095 -3367 -1450 84
3011 84 2167 3096 -702 -3639 -1285 552 1248 2762 1422 -2625 -2400 632 1569 2301 2300 -1070 -2618
3028 -2618 -460 1343 2058 2939 -7 -3457 -1544 1997 2049 1845 1009 -2292 -3296 566 2368 1921 989
$$ packed form
2913D477l729k823R15J09J127L341j157l220p70N07J151L074k51m051j108J543
2929h65P32J739J743l178m354J825K739J680O19j830m444j23L907J019R79p70
2945A418m116j619L629K094o68N69j439l117P34L512O01l86m29k897p94L092K477
2962B661r35m64k101k719L129M072q08k390j307k167J300M852M38l296j102j036
2978a873l37L468K720k960j974l50q08J416L499m16l137r16p22L16L582J551k980
2995G9k133j07m27K399L686k104m372J87J340J575K406l08m316j272J917J534
3011H4K083R29l798k937K354J837O96J514j340m047K25L032R37P32jl370j548
3028b618K158J803P15Q81k946l450J913L541N2k04q36l301j004L862J802m47r32
$$ plain form
3045 989 -1915 -3904 -241 2484 1530 595 -1225 -3784 -2543 2348 2603 -127 -1278 -2492 -3009 967
3061 967 2912 738 -916 -1732 -2554 -544 2892 1898 -507 -983 -1970 -1593 2351 3589 76 -1289 -1672
3078 -1672 -1572 1683 4176 1669 -1805 -1916 -1100 701 3712 2437 -1690 -2016 -251 204 2198 2911
3094 2911 -290 -2596 -1266 -103 729 3048 1175 -2598 -2426 -672 332 2129 2350 -2166 -3796 -721
3110 -721 751 1560 1720 -1431 -4218 -1570 1617 1571 1162 213 -3595 -2533 1268 1734 1006 509 -1332
3127 -1332 -3059 -267 2400 1751 936 -766 -2939 -1871 2427 2786 1311 445 -2101 -2452 1516 3570
3143 3570 1766 58 -1413 -2669 196 3744 2034 -653 -1300 -2135 -816 2644 2940 -655 -1719 -1593
3159 -1593 -1443 1109 3279 400 -2458 -2219 -1974 -379 2701 1864 -1739 -2204 -2181 -1224 1828 2897 -645
$$ packed form
3045I89k904j989L663K725r54r35j820k559J241M891K55k730j151j214n17L976
3061I67J945k174j654q16q22K010L436r94k405m76r87L77L944J238l513j365l83
3078a672J00L255K493k507l474j11Q16J801L011j275m127l26J765M55J994P13
3094B911l201k306J330J163Q32K319j873l773J72J754J004J797K21m516j630L075
3110g21J472Q09J60l151k787K648L187m6m09r49l808J062L801M66p28m97j841
3127a332j727K792K667o49q15j702k173J068M298L59j475q66k546l51L968K054
3143C570j804j708j471j256K865L548j710k687o47q35J319L460K96l595j064J26
3159a593J50K552K170k879k858K39K45J595L080q37l603m65K3R57L052J069l542
$$ plain form
3176 -645 -2737 -1702 -964 685 3010 921 -3122 -2184 -118 600 2568 1945 -2105 -2872 -48 1379
3192 1379 2329 2491 -743 -2849 -751 1642 1869 1986 601 -2710 -1779 1060 1951 1413 1276 -1516 -3278
3209 -3278 -466 1825 1647 1186 -441 -3451 -1669 1799 1885 709 10 -2890 -2842 1259 2595 572 -822
3226 -822 -2097 -2896 315 2748 1046 -1131 -1660 -2829 -1161 2383 2223 -813 -918 -1786 -1668 1173 3066
3243 3066 888 -1366 -1332 -1452 417 3590 2531 -1342 -1419 -1063 -68 2937 3242 -596 -2033 -1060 -275
3260 -275 1929 3533 351 -2509 -1435 49 862 2434 1336 -2083 -2346 -513 496 1470 1672 -1010
3276 -1010 -3352 -1463 192 1129 2219 87 -3400 -2751 375 1350 1762 861 -2489 -3272 100 2214
3292 2214 1517 1063 -1378 -3472 -987 1886 1643 960 302 -1842 -1873 1915 2894 1320 309 -1029 -2120
$$ packed form
3176f45k092J035P38J649K325k089m043R38K066P18J968o23m050p67K824J427
3192A379R50J62l234k106K098K393K27J17j385l311R31K839Q91n38j37k792j762
3209c278K812K291j78m61j627l010J782L468Q6j176o99k900M8M101J336k023j394
3226h22j275p99L211K433j702k177n29j169J668L544j60l036j05q68J18K841J893
3243C066k178k254L4j20J869L173j059l873p7L56R95L005L05l838j437R73P85
3260b75K204J604l182k860J074J484Q13J572j098l419k63J833J009R74K02k682
3276a010k342J889J655R37J090k132l487O49L126R75M12r01l350p83L372K114
3292B214o97m54k441k094K485K873k43o83o58k144l1L788R79j574j011j338j091
$$ plain form
3309 -2120 651 3033 1666 251 -875 -2608 -873 2875 2850 -14 -1187 -2189 -1971 1814 3218 644
3325 644 -1159 -1931 -2089 422 3081 1413 -1758 -2110 -1819 -1127 2095 2098 -1241 -2376 -1627 -768 1297 2643
3343 2643 -339 -2406 -1484 -710 262 2550 1133 -1965 -2366 -678 308 1874 2864 -655 -2733 -1178
3359 -1178 570 1830 2750 639 -2833 -1865 936 1678 2507 1409 -1859 -2610 966 2393 1783 1112 -1339
3376 -1339 -2862 -105 2140 1145 1365 -87 -2466 -2106 1370 1778 847 168 -2011 -3419 -511 2055
3392 2055 1478 232 -1601 -3094 -1162 2356 1624 -435 -979 -2349 -1769 1795 2842 -511 -1517 -1283
3408 -1283 -1068 710 3075 1018 -1154 -1383 -1583 1 2857 2133 -771 -1242 -1040 -1007 1961 3676 574
3425 574 -1870 -1559 -893 846 3079 1656 -1916 -1983 -660 377 2466 2285 -1311 -2621 -904 507
$$ packed form
3309b120K771K382j367j415j126j733J735L748k5k864j173j002K18L785J404k574
3325F44j803p72j58K511K659j668l171l52K91O92L222Ll339j135P49Q59K065J346
3343B643k982k067R22P74R72K288j417l098m01J688R86J566R90l519k078J555
3359a178J748J260R20k111l472R68K801P42Q29j098l268p51L576J427o10o71k451
3376a339j523K757K245r95K20j452k379L60L476M08r31o79k179j408K908K566
3392B055n77j246j833j493J932L518p32k059n44j370N80L564J047l353j006K34
3408a283K15J778K365k057k172k29k00J584K856p24k904m71K02L3K968J715l102
3425E74k444L11O66J739K233j423l572o7J323J037K089j81l596j310J717J411
$$ plain form
3441 507 1101 1952 -196 -3332 -1695 228 1122 1610 372 -2783 -3068 -10 1237 1323 995 -1605 -3472
3458 -3472 -644 1560 1522 1048 -95 -2778 -1743 1581 1659 1493 609 -2018 -2541 627 2599 1618 952
3475 952 -734 -2145 -99 2833 2060 645 -597 -1969 -950 2426 2399 -182 -591 -1077 -1771 762 3032
3492 3032 1154 -1398 -1478 -1833 -600 2245 2121 -477 -1689 -2704 -1948 2017 3397 -440 -2700 -1602
3508 -1602 -1198 588 2855 1146 -2510 -2397 -729 638 1660 1025 -1799 -1812 -436 -157 1389 2199 -286
3525 -286 -2486 -1003 1152 855 2316 1344 -1727 -2225 82 1421 2344 2133 -1427 -3020 -566 1304
3541 1304 1600 2118 141 -2933 -1246 1751 1933 908 42 -2187 -2202 545 1614 971 12 -1685 -2434
3558 -2434 -413 1840 1010 120 -940 -2676 -1806 1296 2165 18 -1216 -2266 -2124 896 2745 750
$$ packed form
3441E07N94Q51k148l136J637J923Q94M88j238l155k85L058J247Q6l28k600j867
3458c472K828K204l8m74j143k683J035L324P8j66q84k627n23L168J972r81o66
3475I52j686j411K046K932p73j415j242j372J019L376k7k581m09m86o94K533K270
3492C032j878k552q0l55J233K845j24k598j212j015P56L965J380l837k260J098
3508a602M04J786K267j709l656J13J668J367J022o35k824j3J376K79J546Q10k485
3525b86k200J483K155k97J461r72l071m98K307J339R23k11l560j593K454J870
3541A304K96N18j977l074J687K997J82j025q66k229j5K747J069o43r59j697p49
3558b434K021K253q30q90j060j736Q70L102Q69k147j234j050J42L020J849j995
$$ plain form
3574 750 -1113 -1540 -1906 105 2785 1903 -834 -1614 -1266 -412 2564 2731 -36 -1459 -1012 -849 1056
3591 1056 2919 712 -1612 -921 -616 131 2159 2323 -1025 -1886 -499 -198 1973 2477 -147 -2062 -1257
3608 -1257 -473 494 2353 756 -3008 -2437 65 909 1344 1141 -2080 -2971 -951 1156 1447 1496 -1336
3625 -1336 -3459 -1057 1386 964 845 128 -2386 -2420 866 2000 1284 440 -1188 -2215 -65 1795 1690
3642 1690 1048 -365 -2185 -986 2174 2341 726 -136 -1561 -2062 763 3056 1147 -759 -1544 -1615 463
3659 463 2689 1276 -711 -759 -1876 -1123 2044 2318 -516 -1288 -1060 -1151 737 2290 848 -1521 -1906
3676 -1906 -1573 -124 2455 1462 -1422 -2405 -1298 -322 1753 2262 -1073 -2618 -1297 364 970 2382
3692 2382 263 -2201 -1296 408 891 2010 1440 -1074 -1859 88 1245 1734 1904 -169 -2357 -858
$$ packed form
3574G50j863m27l66K011K680q82k737p80L48Q54K976J67k767j423M47J63J905
3591A056J863k207k324O91L05P47K028J64l348q61J387L01K171N04k624j915Q05
3608a257P84R67J859j597l764N71K502Q44M35k03l221q91K020K107K91M9k832
3625a336k123K402K443m22j19p17k514l4L286J134p16q44j628j027K150J860j05
3642A690o42j413j820J199L160J67j615q62j425n01K825K293j909j906p85p1K078
3659D63K226j413j987m8j117P53L167K74k834p72K28r1J888J553j442k369l85
3676a906L33J449K579r93k884r83J107R76K075N09l335j545J321J661O06J412
3692B382k119k464R05J704M83J119n70k514p85J947J157M89J70k073k188J499
$$ plain form
3708 -858 958 1547 2121 1082 -2285 -2050 911 1727 1407 616 -1680 -2989 32 1871 1365 141 -1270
3725 -1270 -2558 -1290 1487 1189 114 -448 -2326 -2114 889 2105 -29 -662 -1361 -1975 -276 1925
3741 1925 784 -805 -1267 -1678 -811 2242 2114 -329 -788 -1507 -1379 1135 3423 787 -1043 -1219 -1322
3758 -1322 395 2999 1842 -964 -1673 -978 314 2645 2489 -1087 -1926 -547 -180 1155 2377 225
3774 225 -2086 -1268 123 449 1540 976 -1583 -1954 -162 428 1219 1655 -1171 -3177 -1303 481 1066
3791 1066 1783 52 -2859 -2376 666 1496 1197 381 -2274 -2488 196 1874 958 533 -985 -2415 -477
3808 -477 1793 1390 739 91 -1237 -1206 1201 2075 860 253 -1070 -2085 551 2353 1477 -6 -893
3825 -893 -1832 -744 2169 2095 -161 -1346 -1698 -1209 1420 2547 -15 -1509 -1518 -1652 335 2240 822
$$ packed form
3708h58J816N89N74j039l367K35K961Q16l20p91k296j309L021J839n06j224j411
3725a270j288J268K777k98j075n62j878K12L003J216k134o33o99o14J699K201
3741A925j141j589m62m11Q67L053j28k443m59p19J28K514K288k636j830j76j03
3758a322J717K604j157k806p09O95J292K331j56l576q39J379L67J335J222k152
3774B25k311Q18J391L26J091n64k559l71J792N90P91M36k826k006J874J784N85
3791A066P17j731k911M83L042Q30k99q16k655k14K684J678r16m25j518j430J938
3808d77K270m03o51o48j328L1K407Q74j215o07j323j015K636J802q76j483q87
3825h93r39J088K913p4k256j185l52M89K629J127k562j494rj34J987J905j418
$$ plain form
3842 822 -1257 -1506 -1498 -539 1407 1652 -976 -1759 -1263 -639 890 2189 -115 -2195 -1427 -197 934 2111
3860 2111 1123 -1471 -1766 -154 1035 1651 1679 -637 -2310 -852 988 1317 1870 301 -2142 -1463 1137
3877 1137 1407 1347 671 -1454 -1605 480 1552 1144 1145 -612 -2440 -554 1296 1106 727 -37 -2286 -1885
3895 -1885 1039 1899 410 -352 -1767 -2385 387 1914 761 -350 -1634 -2263 -546 2137 1417 -493
3911 -493 -1356 -1545 -1186 1499 1939 68 -1087 -736 -848 376 2648 870 -670 -804 -1072 -127 2206
3928 2206 2476 -401 -1174 -1090 -689 1839 2647 -76 -1990 -1057 -277 912 2436 804 -2169 -1838 -208
3945 -208 697 1816 1499 -1183 -2317 -492 630 587 1327 170 -2233 -1205 109 827 1119 268 -1933
3962 -1933 -2540 -203 1016 1125 1184 -1088 -2748 -634 1548 1609 990 -330 -2294 -1264 1422 2122 894
$$ packed form
3842H22k079k49QR59J946K45k628p83M96O24J529J299k304k080P68J230J131J177
3860B111r88k594k95J612J189O16K8k316j673J458J840L29N53j569k443O79K600
3877A137K70o0o76k125j51K085J072m08Jj757j828J886J850j90l79p64k249M01
3895a885K924Q60j489p62j415o18K772J527j153j111j284o29J717K683p20j910
3911d93q63j89L59K685M40j871j155L51j12J224K272j778j540j34k68R45K333
3928B206K70k877p73Q4M01K528Q08k723j914R33P80J189J524j632k973L31J630
3945b08R05J119l17k682j134J825J122m3P40j157k403J028J314P18K92q51k201
3962a933o07K337J219J09N9k272j660K114K182O1o19j320j964J030K686P00j228
$$ plain form
3979 894 270 -1536 -1585 957 2211 1094 291 -951 -1513 -223 2112 1189 106 -397 -1320 -862 1350
3996 1350 1940 109 -559 -1043 -1460 406 2113 664 -861 -1470 -1356 -385 1944 1611 -1378 -1759 -1265
4013 -1265 -758 1398 2266 -476 -1998 -1591 -920 704 1857 810 -1774 -1457 -223 226 1720 1581 -1071
4030 -1071 -1870 -381 437 1178 1643 124 -1810 -857 644 783 1596 801 -1556 -1548 302 1616 1744 1316
4048 1316 -1251 -2524 -104 1392 1521 1150 -661 -2686 -1104 1418 1166 717 64 -2016 -1925 483 1400
4065 1400 441 -141 -929 -2395 -523 1388 1057 54 -487 -2204 -1347 1397 1737 512 -468 -1712 -1626
4082 -1626 926 2518 387 -1113 -1038 -1048 647 2212 1330 -436 -920 -690 103 1691 2030 -22 -1002
4099 -1002 -566 -969 517 2645 1306 -1236 -1058 -613 186 1806 1671 -1117 -1833 -542 413 1624 1840
$$ packed form
3979H94o24j806m9K542J254j117q03j242n62J290K335r23j083n03r23M58K212
3996A350N90j831o68m84m17J866J707j449j525o09J14R71K329l33k989l81M94
4013a265N07K156Q68k742j522M07O71J624J153j047k584L17J234M49J494j39k652
4030a071p99J489Q18P41M65j519j934R53J501J39Q13p95k357QJ850J314J28m28
4048A316k567j273K420J496J29l71j811k025J582K522k52m49o53k080R1K408R17
4065A400r59n82p88j466J872J911l31j003n41j717Q57K744L40j225r80j244Q6
4082a626K552J592k131j500P5j0J695J565q82j766m84K30P93J588L39k052r80
4099a002M36m03J486K128j339k542J78M45P99J620j35k788p16J291R55J211K16
$$ plain form
4116 1840 -591 -2090 -715 406 506 1445 28 -2619 -1921 402 1033 1051 611 -1579 -2233 -54 958
4133 958 743 1222 -785 -2398 -869 1142 1176 628 95 -1565 -1783 489 1830 1058 526 -988 -1532 -368
4151 -368 1841 1025 366 -219 -1928 -592 1938 2073 223 -584 -1327 -1311 1362 2578 630 -452 -1037
4168 -1037 -1423 290 2002 990 -785 -797 -1136 -801 1544 1631 -275 -1607 -1406 -1274 424 2154 144
4185 144 -1521 -1161 -1225 -84 1612 1294 -1427 -2109 -490 294 1717 1844 -654 -1963 -695 550 1218
4202 1218 1923 571 -2066 -1163 719 481 1413 1256 -589 -1955 -545 684 1366 1712 -184 -1673 -568
4219 -568 1021 1007 1565 187 -2129 -1978 1264 1708 763 273 -1173 -1881 -16 1708 1043 -66 -992 -1884
4237 -1884 -587 1304 790 -29 -464 -1331 -1368 280 1772 286 -680 -645 -1398 140 1801 924 -595 -514
$$ packed form
4116A840k431j499J375J121J00R39j417k647O98K323O31J8m40k190o54K179J012
4133I58k15M79k007j613J529K011L4n48n33j660k18K272J341p72n32j514n44J164
4151c68K209q16o59n85j709J336K530J35j850q07p43J6K673J216j948j082n85
4168a037l86J713J712j012j775j2l39L35K345Q7j906j332K01J32J698J730k010
4185A44j665L60o4J141J696l18k721o82J619P84J423J27k498j309J268J245O68
4202A218P05j352k637R03J882k38R32j57j845j366J410J229O82L46j896j489J105
4219e68J589j4N58j378k316J51L242M44r45m90j446p08J865J724o65j109r26q92
4237a884J297J891n14q19m35q67l7J648J492j486r66L5p53J538J661q77j519Q1
$$ plain form
4255 -514 -1627 -409 2015 1660 -495 -955 -592 -370 1468 2425 501 -1033 -1011 -337 896 1986 1136
4272 1136 -1006 -1033 -475 -348 1573 1975 -256 -1730 -749 -156 295 1947 287 -1753 -1014 30 766
4289 766 1496 970 -1767 -1986 -13 735 973 827 -987 -2634 -972 1008 1294 705 -331 -2352 -1289
4306 -1289 871 1113 656 309 -1454 -2093 165 1281 902 756 -291 -1403 -811 1441 1425 687 367 -1314
4324 -1314 -1366 1222 1919 654 -31 -815 -1645 242 2539 1188 -455 -882 -1585 160 2095 1234 -715
4341 -715 -755 -1121 -1041 1502 1711 -478 -1695 -724 -1097 107 1620 785 -993 -1255 -833 -671 1381 1547
4359 1547 -557 -1466 -1093 -698 693 2169 234 -1844 -1184 312 662 1496 717 -1239 -1565 256 1244
4376 1244 1037 1333 -1081 -1887 165 1181 1007 1239 295 -1767 -817 647 954 1221 791 -1268 -1939 132
$$ packed form
4255e14j113J218K424l55k155m60L63K22J838R57j924j534K2O74J233J090q50
4272A136k142k7N58J27J921M02k231j474R81N93M51J652j660k040P39J044P36
4289G66P30n26k737k19J973P48K38j46j814j647J662J980K86n89j036k021J063
4306a289K160K42m57l47j763o39K258J116l79j46j047j112N92K252j6p38l20j681
4324a314n2K588O97j265o85p84q30J887K297j351j643m27p03J745J935q61j949
4341g15m0l66Q0K543K09k189j217R71l73J204J513q35j778k62M22J62K052J66
4359A547k104r09L73L95J391J476j935k078O60J496L50Q34p79j956l26J821R88
4376A244k07K96k414q06K052J016j74K32r44k062R50J464L07K67m30k059o71K071
$$ plain form
4394 132 1155 876 835 -466 -2305 -957 1174 671 177 -47 -1909 -1555 850 1243 -32 -367 -1198 -1404
4412 -1404 595 1742 660 -998 -810 -1505 -377 1807 1400 -313 -795 -1413 -859 1165 1596 348 -980
4429 -980 -897 -1063 492 2250 1042 -746 -864 -735 -65 1504 1559 -152 -1076 -930 -19 1451 1873 -111
4447 -111 -1784 -586 -16 703 1565 510 -1688 -1806 -266 531 1213 1018 -1172 -2023 -906 285 702
4464 702 1259 -152 -1983 -1036 189 708 1092 341 -1828 -2069 -50 1389 950 519 -996 -1916 -91
4481 -91 1523 1244 656 -236 -1802 -861 1569 1341 326 -103 -834 -850 728 1297 693 331 -522 -1103 -129
4500 -129 1646 1338 53 -274 -1443 -1041 1475 2007 297 -830 -1173 -837 614 2015 263 -1173 -1255
4517 -1255 -1040 -79 1388 498 -1109 -1028 -868 -356 839 1356 -383 -1454 -985 -510 150 1455 705 -1096
$$ packed form
4394A32J023k79m1j301j839J348K131n03m94k24j862L54K405L93j275l35q31k06
4412a404J999J147j082j658J88o95J128K184m07j713m82o18N54K024M31j248j328
4429i80Q3j66J555J758j208j788j18J29O70J569N5j711r24J46R11J470M22j984
4447a11j673J198N70P19Q62j055k198j18J540P97O82j95k190q51J117J191M17
4464G02N57j411j831R47J225N19L84p51k169k41K019J439m39m31j515r20J825
4481i1J614k79n88q92j566R41K430k28j015m29p31j6J578N69o04l62q53n81R74
4500a29J775l08j285l27j169M02K516N32j710j127l43L36J451J401j752j436q2
4517a255K15R61J467q90j607Q1J60N12J195N17j739j071M69M75O60J305p50j801
$$ plain form
4535 -1096 -1200 -134 427 1240 1093 -882 -1611 -514 368 1060 1552 89 -1762 -710 915 736 1092
4552 1092 706 -1578 -1267 626 1111 950 643 -423 -1747 237 1108 976 482 -369 -1955 -864 1245
4569 1245 1108 382 259 -1516 -1744 501 1346 487 -324 -892 -1855 -201 1182 1105 -170 -456 -1747 -1228
4587 -1228 1294 1557 -495 -521 -1148 -1098 757 1838 452 -1014 -1104 -880 546 1845 1089 -738 -633 -282
$$ packed form
4535a096j04J066N61Q13j47j975p29J097Q82O92M92j463j851J052J625j79L56
4552A092l86k284L11J893M85j61l07j066j324J984Q71j32m94q51j586J091K109
4569A245j37p26j23j775k28K245Q45q59q11n68r63J654J383p7j275k86j291N19
4587a228K522K63k052k6o27N0J855J081j386j466r0K24J426J299p56j827J05L51
$$ [...]
8191a98
##END NTUPLES=NMR FID
##END=
