##TITLE=1H_CA-8617
 DMSO, 8 sc, 
 28.6.2019
##JCAMPDX= 6.0         $$ Bruker NMR JCAMP-DX V2.0
##DATA TYPE= NMR FID
##DATA CLASS= NTUPLES
##ORIGIN= UXNMR, Bruker Analytische Messtechnik GmbH
##OWNER= root
$$ XWIN-NMR		Version 3.5
$$ Fri Jun 28 15:30:40 2019 Russian Standard Time (UT+4h)  she@DPX200
##.OBSERVE FREQUENCY= 200.13155
##.OBSERVE NUCLEUS= ^1H
##.DELAY= (6, 6)
##.ACQUISITION MODE= SIMULTANEOUS
##.ACQUISITION SCHEME= undefined
##.AVERAGES= 8
##.DIGITISER RES= 18
##SPECTROMETER/DATA SYSTEM= spect
##.PULSE SEQUENCE= zg30
##.SOLVENT NAME= DMSO
##.SHIFT REFERENCE= (INTERNAL, DMSO, 0, 15.7039)
##AUDIT TRAIL= $$ (NUMBER, WHEN, WHO, WHERE, WHAT)
$$ ##TITLE= Audit trail, XWIN-NMR		Version 3.5
$$ ##JCAMPDX= 5.01
$$ ##ORIGIN= Bruker BioSpin GmbH
$$ ##OWNER= she
$$ F:/spectra/data/she/nmr/H-F/1/audita.txt
$$ ##AUDIT TRAIL=  $$ (NUMBER, WHEN, WHO, WHERE, WHAT)
(   1,<2019-06-28 15:29:36.56 +0400>,<she>,<DPX200>,
      <created by zg, POWCHK disabled, PULCHK disabled
       configuration hash MD5:
       00 E9 B6 7A A2 85 ED C7 34 08 36 98 17 FE 4E 26
       data hash MD5: 16K
       7A A1 36 78 2E 11 63 A8 16 B5 37 9D 51 1F 61 12>)
$$ ##END=
$$ 
$$ hash MD5
$$ 73 11 A5 CA 09 F5 B8 75 27 D1 45 0D FD 13 14 9A
##$RELAX= 
##$RELAX= 
##$RELAX= 
##$RELAX= 
##$RELAX= 
##$RELAX= 
$$ Bruker specific parameters
$$ --------------------------
##$DU= <F:/spectra>
##$EXPNO= 1
##$NAME= <H-F>
##$PROCNO= 1
##$TYPE= <nmr>
##$USER= <she>
##$AMP= (0..31)
100 100 100 100 100 100 100 100 100 100 100 100 100 100 100 100 100 100 
100 100 100 100 100 100 100 100 100 100 100 100 100 100 
##$AQSEQ= 0
##$AQ_mod= 1
##$AUNM= <au_zg>
##$AUTOPOS= <>
##$BF1= 200.13
##$BF2= 200.13
##$BF3= 200.13
##$BF4= 200.13
##$BF5= 200.13
##$BF6= 200.13
##$BF7= 200.13
##$BF8= 200.13
##$BYTORDA= 1
##$CFDGTYP= 0
##$CFRGTYP= 5
##$CHEMSTR= <none>
##$CNST= (0..31)
1 1 145 1 1 1 1 1 1 1 1 1 1 1 1 1 1 1 1 1 1 1 1 1 1 1 1 1 1 1 1 1 
##$CPDPRG= <>
##$CPDPRG1= <>
##$CPDPRG2= <>
##$CPDPRG3= <>
##$CPDPRG4= <mlev>
##$CPDPRG5= <mlev>
##$CPDPRG6= <mlev>
##$CPDPRG7= <mlev>
##$CPDPRG8= <mlev>
##$CPDPRGB= <>
##$CPDPRGT= <>
##$D= (0..31)
0 1.2 0 0 0 0 0 0 0 0 0 0.03 0 0 0 0 0 0 0 0 0 0 0 0 0 0 0 0 0 0 0 0 
##$DATE= 1561721376
##$DBL= (0..7)
120 120 120 120 120 120 120 120 
##$DBP= (0..7)
150 150 150 150 150 150 150 150 
##$DBP07= 0
##$DBPNAM0= <>
##$DBPNAM1= <>
##$DBPNAM2= <>
##$DBPNAM3= <>
##$DBPNAM4= <>
##$DBPNAM5= <>
##$DBPNAM6= <>
##$DBPNAM7= <>
##$DBPOAL= (0..7)
0.5 0.5 0.5 0.5 0.5 0.5 0.5 0.5 
##$DBPOFFS= (0..7)
0 0 0 0 0 0 0 0 
##$DE= 6
##$DECBNUC= <off>
##$DECIM= 24
##$DECNUC= <off>
##$DECSTAT= 4
##$DIGMOD= 1
##$DIGTYP= 9
##$DL= (0..7)
0 120 120 120 120 120 120 120 
##$DP= (0..7)
150 150 150 150 150 150 150 150 
##$DP07= 0
##$DPNAME0= <>
##$DPNAME1= <>
##$DPNAME2= <>
##$DPNAME3= <>
##$DPNAME4= <>
##$DPNAME5= <>
##$DPNAME6= <>
##$DPNAME7= <>
##$DPOAL= (0..7)
0.5 0.5 0.5 0.5 0.5 0.5 0.5 0.5 
##$DPOFFS= (0..7)
0 0 0 0 0 0 0 0 
##$DQDMODE= 0
##$DR= 18
##$DS= 0
##$DSLIST= <SSSSSSSSSSSSSSS>
##$DSPFIRM= 0
$$ [...]
##$SUBNAM2= <"">
##$SUBNAM3= <"">
##$SUBNAM4= <"">
##$SUBNAM5= <"">
##$SUBNAM6= <"">
##$SUBNAM7= <"">
##$SUBNAM8= <"">
##$SUBNAM9= <"">
##$SW= 24.9336996594482
##$SWIBOX= (0..15)
0 0 2 0 0 0 0 0 0 0 0 0 0 0 0 0 
##$SW_h= 4990.01996007984
##$TD= 16384
##$TD0= 1
##$TE= 0
##$TE2= 300
##$TE3= 300
##$TEG= 300
##$TL= (0..7)
0 120 120 120 120 120 120 120 
##$TP= (0..7)
150 150 150 150 150 150 150 150 
##$TP07= 0
##$TPNAME0= <>
##$TPNAME1= <>
##$TPNAME2= <>
##$TPNAME3= <>
##$TPNAME4= <>
##$TPNAME5= <>
##$TPNAME6= <>
##$TPNAME7= <>
##$TPOAL= (0..7)
0.5 0.5 0.5 0.5 0.5 0.5 0.5 0.5 
##$TPOFFS= (0..7)
0 0 0 0 0 0 0 0 
##$TUNHIN= 0
##$TUNHOUT= 0
##$TUNXOUT= 0
##$USERA1= <user>
##$USERA2= <user>
##$USERA3= <user>
##$USERA4= <user>
##$USERA5= <user>
##$V9= 5
##$VALIST= <valist>
##$VCLIST= <CCCCCCCCCCCCCCC>
##$VD= 0
##$VDLIST= <DDDDDDDDDDDDDDD>
##$VPLIST= <PPPPPPPPPPPPPPP>
##$VTLIST= <TTTTTTTTTTTTTTT>
##$WBST= 1024
##$WBSW= 4
##$XGAIN= (0..3)
0 0 0 0 
##$XL= 0
##$YL= 0
##$YMAX_a= 121222
##$YMIN_a= -191496
##$ZGOPTNS= <>
##$ZL1= 120
##$ZL2= 120
##$ZL3= 120
##$ZL4= 120
##$ABSF1= 10
##$ABSF2= 0
##$ABSG= 5
##$ABSL= 3
##$ALPHA= 0
##$AQORDER= 0
##$ASSFAC= 0
##$ASSFACI= 0
##$ASSFACX= 0
##$ASSWID= 0
##$AUNMP= <proc_1d>
##$AZFE= 0.1
##$AZFW= 0.1
##$BCFW= 1
##$BC_mod= 2
##$BYTORDP= 1
##$COROFFS= 0
##$CY= 11.3945322036743
##$DATMOD= 1
##$DC= 2
##$DFILT= <>
##$DTYPP= 0
##$F1P= 18.9103706918063
##$F2P= -1.10871071338519
##$FCOR= 0.5
##$FTSIZE= 0
##$FT_mod= 4
##$GAMMA= 1
##$GB= 0.15
##$INTBC= 1
##$INTSCL= 1
##$ISEN= 128
##$LB= 0.24
##$LEV0= 0
##$LPBIN= 0
##$MAXI= 10000
##$MC2= 0
##$MEAN= 0
##$ME_mod= 0
##$MI= 1.114404
##$NCOEF= 0
##$NC_proc= 0
##$NLEV= 6
##$NOISF1= 3.799351
##$NOISF2= 2.8
##$NSP= 1
##$NTH_PI= 0
##$NZP= 0
##$OFFSET= 15.70392
##$PC= 1
##$PHC0= -8505.94
##$PHC1= 17.60097
##$PH_mod= 1
##$PKNL= yes
##$PPARMOD= 0
##$PSCAL= 0
##$PSIGN= 0
##$REVERSE= no
##$SF= 200.130013532006
##$SI= 16384
##$SIGF1= 3
##$SIGF2= 2
##$SINO= 400
##$SIOLD= 16384
##$SREGLST= <1H.CDCl3>
##$SSB= 0
##$STSI= 0
##$STSR= 0
##$SW_p= 3612.71676300578
##$SYMM= 0
##$S_DEV= 0
##$TDeff= 0
##$TDoff= 0
##$TI= <>
##$TILT= no
##$TM1= 0
##$TM2= 0
##$TOPLEV= 0
##$USERP1= <user>
##$USERP2= <user>
##$USERP3= <user>
##$USERP4= <user>
##$USERP5= <user>
##$WDW= 1
##$XDIM= 8192
##$YMAX_p= 0
##$YMIN_p= 0
$$ End of Bruker specific parameters
$$ ---------------------------------
##NTUPLES= NMR FID
##VAR_NAME=  TIME,          FID/REAL,        FID/IMAG
##SYMBOL=    X,             R,               I
##VAR_TYPE=  INDEPENDENT,   DEPENDENT,       DEPENDENT
##VAR_FORM=  AFFN,          ASDF,            ASDF
##VAR_DIM=   8192,          8192,            8192
##UNITS=     SECONDS,       ARBITRARY UNITS, ARBITRARY UNITS
##FACTOR=    0.0002004,     1,               1
##FIRST=     0,             0,               0
##LAST=      1.6414764,     0,               0
##MIN=       0,             -191496,         0
##MAX=       1.6414764,     121222,          0
$$ Real data points
##PAGE= N=1
##DATA TABLE= (X++(R..R)), XYDATA
0 0 0 0 0 0 0 0 0 -8 8 -8 8 -9 16 -16 24 -24 32 -40 47 -55 64 -72 84 -97 112 -129 145 -166 188 -213 238
31 238 -270 302 -337 376 -421 468 -518 576 -640 707 -782 868 -961 1064 -1179 1310 -1459
48 -1459 1631 -1829 2062 -2342 2683 -3115 3676 -4441 5550 -7315 10577 -18683 84357 77771
62 77771 -66552 -14335 56884 121222 82742 -17640 -76761 -13750 31362 25926 10313 -8456
74 -8456 -44191 -30055 -4621 -5514 -3858 -5756 -55753 -68859 -11363 21255 -5565 -27085 -39231
87 -39231 -24104 29922 38800 -28703 -54684 -12196 16320 12790 -9226 -54216 -53976 10942 37095
100 37095 -1127 -25835 -35242 -38545 810 37016 5654 -38783 -48693 -40947 6627 67729 42322
113 42322 -40744 -55946 -977 61229 90531 36600 -61531 -62854 29023 77784 54993 6153
125 6153 -43670 -39335 28246 57842 23753 -5030 -28678 -54587 -28995 19246 12712 -24248 -51579
138 -51579 -69602 -37718 28367 22606 -45528 -66509 -36609 -7356 11034 -11628 -60083 -45557
150 -45557 12386 15460 -18723 -25900 -19216 423 30481 14728 -31671 -31181 -7107 -4042 9314
163 9314 19423 -16489 -47387 -29218 1441 31986 42203 -16926 -84343 -51033 32002 57481
175 57481 18137 -50042 -86979 -23989 69621 64515 -8306 -44726 -34783 5035 50127 39531
187 39531 -12528 -25010 -10401 -7694 13479 40099 18739 -16657 -21083 -11393 14001 43557 12508
200 12508 -46973 -40398 9118 26681 14162 -14319 -39236 -9314 41852 28012 -18194 -22246
212 -22246 -2568 16281 33210 12262 -29021 -17901 22501 31640 28537 16607 -18208 -23494 22039
225 22039 46871 27391 -2332 -35604 -38293 20981 61610 21497 -31924 -41393 -17985 29861
237 29861 54169 6477 -47292 -35768 -2672 14749 27376 11794 -27003 -30339 -3539 13397
249 13397 31214 32522 -14778 -47341 -12936 30662 37750 14936 -29202 -46436 6766 54561
261 54561 26059 -19269 -25412 -6751 23823 33803 -6984 -36312 -4748 25036 14705 945
273 945 -9119 -13711 10388 31087 11698 -4808 -2147 -9177 -5094 26034 30454 -570 -19222
286 -19222 -19831 -305 42688 49168 -9781 -48431 -21354 20904 42715 27923 -27411 -54705 -10936
299 -10936 32904 28156 8561 -15764 -35710 -14811 21118 21365 4943 -9259 -32863 -30068 16097
312 16097 36198 8099 -19552 -29099 -15656 25791 38258 -7892 -37793 -15141 10281 18131
324 18131 10887 -19194 -28961 6821 27066 4777 -11319 -12713 -10625 8136 21933 -2060 -23149
337 -23149 -13348 -3291 7722 24829 8240 -27686 -23915 5438 21616 24847 1565 -38471 -33145
350 -33145 15534 34453 14008 -10222 -30010 -22639 17557 34806 9024 -12141 -19863 -23140 1582
363 1582 32141 19584 -13065 -25947 -22157 5092 41972 27343 -25733 -39369 -7238 22831
375 22831 31751 5958 -36514 -30044 18674 31502 4656 -13627 -16187 -2391 22504 16231 -15932
388 -15932 -16410 5747 8404 5597 6031 -6740 -9371 7024 9663 4850 11967 1711 -20533 -9963
402 -9963 17385 20420 8385 -12010 -31087 -9591 35568 34029 -6923 -29329 -24538 932 34270
415 34270 27096 -18422 -35613 -14321 7750 24226 23229 -11011 -33810 -12807 12482 20810 17423
428 17423 -9119 -35467 -15529 21264 23304 4786 -12975 -24112 -5378 25274 17084 -12348
440 -12348 -15891 -6735 -414 10877 5485 -15891 -13801 3936 3494 826 2520 -10564 -17046 1905
454 1905 10846 1102 -5446 -15795 -20981 4713 25808 5656 -20203 -21792 -9109 14369 28417
467 28417 204 -34699 -24513 4069 17404 17861 -2017 -30976 -23067 8404 18808 12539 -107
480 -107 -25123 -29287 4386 26363 13898 -6734 -24910 -24458 11115 37002 12194 -19938 -20111
493 -20111 -4043 17632 26642 1310 -22974 -6885 14908 12896 7113 350 -8682 1020 14454
506 14454 4802 -3610 2840 -1504 -6063 6451 10521 -1834 -4802 -5596 -5750 11894 20786 -4362
520 -4362 -23926 -10631 9185 20356 15789 -15052 -33424 -4450 28285 23732 1533 -19627 -26145
533 -26145 1779 32164 20469 -10079 -20173 -16159 2477 27651 20758 -10671 -19786 -6963 6250
546 6250 20617 18992 -8869 -20875 -1998 12303 14181 12859 -2952 -14201 2112 16640 10874
559 10874 6096 1679 -8610 -1734 15713 11172 -1338 -2602 -4591 86 16871 13053 -11505 -15069
573 -15069 934 10853 13466 1392 -23563 -20943 11368 22199 3937 -14212 -23086 -12235 17779
586 17779 23910 -4564 -23053 -15449 -2761 13332 20187 -1951 -20783 -12330 2229 11806 19461
599 19461 5725 -20424 -17735 5046 16404 16583 3416 -20256 -18444 11653 23201 8773 -4988
612 -4988 -13913 -10589 11780 20046 164 -11150 -5900 -1900 6245 13202 66 -11740 -3135 3674
626 3674 3022 7117 -481 -15390 -8068 9138 7919 -1179 -8970 -17513 -6997 16453 12336 -13032
640 -13032 -21083 -13536 1359 17107 9171 -21239 -27557 -4449 11416 13637 4530 -18609 -24795
653 -24795 -42 17229 10844 -495 -13535 -19919 -860 19804 12085 -3366 -9499 -12488 -1995
666 -1995 18029 14037 -6106 -11751 -7761 -1812 12535 14235 -5914 -15273 -4863 3163 9024 9881
680 9881 -7362 -18952 -3278 11269 6639 -1659 -11110 -15065 2997 18561 2750 -15653 -13398
693 -13398 -2524 10253 14827 -4993 -24357 -11037 10624 12592 4586 -8859 -19697 -6823 14834
706 14834 12589 -2089 -7343 -11908 -7759 10332 15695 1410 -6703 -9262 -8085 9017 23443 8128
720 8128 -11665 -11647 -2258 13180 24375 7534 -17579 -12218 8704 17745 15932 2086 -15453 -8419
734 -8419 14720 16836 3818 -3806 -8954 -4004 12671 13254 -3811 -8473 -2216 1585 8333 9052 -6529
749 -6529 -12504 902 7937 5295 2874 -7175 -13006 2078 14842 6369 -3484 -8663 -10741 1798
763 1798 17712 8370 -9703 -11719 -6411 4082 17372 10841 -12267 -16222 -2307 8220 15061
776 15061 9415 -11717 -18801 -217 13505 12072 5472 -9423 -17021 -226 16714 10577 -745
789 -745 -8287 -12357 -999 16070 10154 -6587 -9322 -5844 1699 12788 7397 -11701 -11989 2069
803 2069 6898 5840 -145 -12692 -10191 8491 11396 -1914 -8312 -8589 -3777 10036 11290 -6627
817 -6627 -13728 -4127 1922 7248 9344 -4232 -14088 -4338 4998 6517 8509 -223 -14680 -10171 6758
832 6758 11831 7678 -1527 -16592 -13358 10469 19360 4985 -9305 -15773 -9305 12791 20353 -947
846 -947 -16620 -10477 1267 12001 13715 -4258 -16937 -4247 9088 7028 2682 -4177 -11021 -1271
860 -1271 10212 3697 -4368 -2676 -3512 -1321 7675 4088 -6326 -4490 -495 -734 5478 6430 -6249
875 -6249 -10150 -190 4992 6503 5659 -7791 -15651 -139 13389 9187 -961 -11126 -15258 1710
889 1710 19769 9642 -9107 -13558 -8666 4693 18205 7847 -14035 -14638 -1669 7005 12208
902 12208 5493 -12078 -13495 2325 8556 6051 2390 -7774 -11752 1832 10267 3446 -1422 -4822
916 -4822 -7984 578 11335 3433 -6496 -4533 -2083 2351 9087 2340 -10485 -5579 5014 5748 4221
931 4221 -240 -10134 -5323 9261 9317 -635 -4758 -7736 -4366 9989 12411 -2215 -9662 -6380 -1483
946 -1483 9751 14086 -1982 -14824 -7518 3597 10417 11852 -2234 -17566 -8264 9798 12637
959 12637 5816 -4886 -15132 -6847 12069 12522 -1159 -7514 -8287 -3205 9511 10088 -4319 -8274
973 -8274 -1757 559 4186 6540 -2821 -8184 -53 3166 1103 3503 -418 -7798 -1681 6478 3250
988 3250 134 -2086 -7987 -2997 10163 7502 -5534 -8286 -4744 2135 12831 7813 -11500 -14413
1002 -14413 711 9747 10923 2540 -14094 -14603 5543 15349 6067 -4553 -11403 -9660 6245 15019
1016 15019 2546 -8467 -7423 -4647 2803 10736 3530 -7625 -6041 -1388 438 7005 6342 -6345
1030 -6345 -8932 -679 2969 5523 5487 -5528 -10586 1498 8831 4048 -783 -5849 -7658 4480 12060
1045 12060 1020 -8502 -4764 646 6852 10037 -2261 -12643 -2900 8567 7932 3682 -4059 -11242
1059 -11242 -1853 12075 8848 -879 -5168 -7580 -1878 11464 10505 -2787 -8144 -5141 -994 9225
1073 9225 11680 -2961 -11525 -4838 2203 7630 9809 -2209 -12995 -4909 6077 6697 4193 -2402
1087 -2402 -11280 -4927 8417 6989 -757 -3368 -6527 -3432 7390 7144 -3967 -5457 -1963 -464
1101 -464 5525 6408 -4349 -8297 783 5057 4142 2860 -5573 -9606 2107 10644 3790 -3923 -6658
1116 -6658 -6813 4055 13201 2938 -10118 -8291 -1737 5639 10962 1147 -12934 -8873 2979 6331
1130 6331 5506 395 -10383 -8866 3936 6902 2030 -163 -6399 -9422 857 8295 2960 -2069
1144 -2069 -5094 -8799 -551 10441 5046 -6139 -7187 -4391 1490 10102 4362 -9973 -8570 3001
1158 3001 6002 5145 -446 -9968 -5550 8951 9077 -1968 -5845 -4829 -581 9462 7798 -6029
1172 -6029 -8599 210 3893 5724 5055 -5226 -8831 801 5664 3414 2663 -2342 -9233 -2834 6942
1187 6942 5273 1381 -2368 -9408 -5757 8135 9103 -1165 -6689 -8123 -4076 8778 11067 -3680
1201 -3680 -11172 -5262 1395 7934 8388 -5077 -12103 -1641 7037 5382 2340 -4258 -8420 391 9257
1216 9257 3522 -3125 -2623 -3040 1143 7935 3225 -5456 -2506 1664 2352 5254 3313 -5991 -5147 3699
1232 3699 5016 3320 1618 -5868 -7198 4253 9124 2028 -2569 -5940 -6663 3929 11310 1839 -7396
1247 -7396 -5945 -2981 4032 10404 2105 -9467 -7217 796 3970 7222 2579 -8893 -8652 2622
1261 2622 6410 4537 1456 -7114 -8510 3885 9501 2307 -3102 -4956 -4810 4625 10379 63 -7289
1276 -7289 -2950 1840 4683 6664 -1470 -8099 -493 6560 3606 698 -1716 -5206 -107 8094 3419
1291 3419 -2806 -2143 -2402 -885 6123 5309 -3466 -4807 -1752 -663 4902 7343 -3164 -9340 -3564
1306 -3564 2482 5827 6313 -3695 -12873 -4026 7687 7123 1695 -5935 -11288 -2188 11101 7264 -4251
1321 -4251 -7103 -5531 368 9344 5544 -6817 -6963 290 2516 4174 2810 -5366 -5844 2663 3729
1336 3729 90 900 -1611 -4876 1293 4923 -252 -1278 -514 -3699 -528 6291 2501 -4558 -3407
1351 -3407 -2348 972 7541 3521 -8485 -7712 2032 5525 5695 574 -9670 -8423 5673 9896 1816
1366 1816 -4516 -7864 -5347 6343 9954 -932 -7186 -4731 -1680 4016 8369 -33 -8428 -3519
1380 -3519 1058 2858 5491 1264 -7396 -4616 3229 3741 2644 949 -5685 -5472 4726 6083 -199
1395 -199 -1981 -3083 -2907 4496 6539 -1987 -5176 -943 522 3390 5300 -2223 -7274 -132 4659
1410 4659 3063 2377 -1949 -7406 -1093 7608 4076 -1261 -3430 -5739 -1267 8851 6371 -4491 -6492
1425 -6492 -3360 820 8038 6314 -5893 -9212 -956 4131 5783 4023 -5766 -9708 597 7240
1439 7240 3264 -196 -3735 -6510 617 7590 2245 -3050 -2135 -2528 -893 5585 2879 -3659 -2363
1454 -2363 97 -1177 3370 4140 -3211 -5155 785 2147 2492 2714 -3575 -7228 1533 7040 1918 -2150
1470 -2150 -4751 -5189 3743 10086 525 -8332 -5520 166 5061 7827 -1306 -10153 -4045 5546 5556 2604
1486 2604 -2043 -7839 -3424 6780 5152 -827 -1568 -3815 -3755 3742 5680 -589 -2321 -2131 -3799 1783
1502 1783 7485 1238 -4887 -3121 -1494 2358 6816 1780 -7678 -4106 3295 3763 3491 -409 -7013
1517 -7013 -3458 6469 5212 -1561 -3273 -3794 -695 6860 5291 -4989 -5807 -121 2580 4460 3504
1532 3504 -5228 -6958 1890 5221 2409 959 -3384 -5971 1182 6783 2331 -1698 -2507 -5044 -404
1547 -404 7371 4401 -3534 -4089 -2926 -232 6468 5379 -4794 -6273 -530 1954 4799 4056 -4266
1562 -4266 -7044 914 4651 2235 1451 -2812 -5967 667 6401 2087 -1667 -2001 -3437 244 6397
1577 6397 2265 -5066 -3242 -114 1400 4889 1697 -6392 -4599 3238 4055 2116 -649 -6171 -4025
1592 -4025 5459 6259 -1294 -4177 -3661 -1915 5270 6791 -2302 -5907 -1154 983 3074 5070 -656
1607 -656 -6063 -1746 2346 1863 3975 1297 -5934 -4255 3082 4076 2727 895 -5161 -5354 4307 6801
1623 6801 699 -3035 -4489 -3464 4623 7767 -1430 -6564 -2547 1274 3894 4131 -3481 -7462 -108
1638 -108 5528 2250 -596 -3121 -4843 794 6321 938 -4102 -2314 -1843 600 4769 1709 -4652
1653 -4652 -2611 620 113 2528 3116 -3342 -4755 378 1837 2876 3236 -2724 -7314 -357 5895 3812
1669 3812 607 -3605 -6902 -7 8548 4021 -3635 -4613 -3133 1491 7451 2674 -6277 -4873 979
1684 979 2535 3630 1562 -5516 -4488 2523 3176 176 -184 -2826 -3974 2283 4159 -994 -2194 -1343
1700 -1343 -2171 1167 4956 -394 -4506 -1310 220 1392 3705 205 -6177 -2333 3525 2952 1783
1715 1783 -134 -5728 -2893 5153 4955 -181 -2034 -3953 -2328 4953 6266 -1263 -4341 -1998 -489
1730 -489 3847 6700 -549 -6341 -1900 1734 3167 4542 -258 -7165 -2449 5005 3600 1029 -1460
1745 -1460 -5396 -2250 5577 3692 -2286 -3112 -2096 -662 4276 3088 -4138 -4035 970 1255 1611 1899
1761 1899 -2731 -4170 1592 3130 165 230 -668 -3926 661 4698 1574 -896 -1111 -3189 -456 6119
1777 6119 3759 -2950 -3481 -1410 1270 6330 4347 -5251 -6501 1045 4247 4737 1754 -5522 -6503 2645
1793 2645 6656 1894 -1793 -3913 -3774 2719 5936 -200 -4208 -1683 -956 1002 3965 -219 -4307
1808 -4307 -1269 770 -386 1549 1323 -3458 -2491 1338 1093 533 1267 -2524 -3746 1843 4061 386
1824 386 -1585 -2813 -3225 2658 6242 -1019 -5151 -2116 182 3678 4928 -1531 -7005 -1641 4468
1839 4468 3624 2082 -2122 -6101 -1077 5823 3477 -1151 -2361 -3508 -1160 4930 3899 -2592 -2787
1854 -2787 -1399 -880 2797 4316 -1794 -4627 -920 584 1499 3424 -1229 -5457 -1518 3111 1434
1869 1434 855 -988 -4345 -1239 4417 1779 -2413 -1795 -1775 -454 4099 2702 -3696 -2878 336 1250
1885 1250 2738 2278 -3611 -4344 1709 3248 1596 785 -2855 -4864 1754 5723 1487 -1856 -2810 -3137
1901 -3137 1634 6427 1247 -4339 -3178 -272 2163 4762 1018 -5239 -3305 2116 2580 2140 746
1916 746 -4200 -3073 2776 2699 -278 204 -1792 -3228 1410 3722 31 -1255 -969 -2321 323 4489
1932 4489 1183 -3334 -1994 -634 745 4013 1010 -5129 -2929 2414 3144 1391 -749 -4681 -2194
1947 -2194 5197 4642 -1408 -3349 -2326 -118 4918 3988 -3806 -4731 186 1662 2783 2313 -2557 -4790
1963 -4790 840 2846 1032 1338 -691 -3921 -758 3085 1321 186 -269 -3265 -2264 3256 3417 -796
1979 -796 -1862 -2538 -1754 3565 4703 -2025 -4153 -1019 936 3088 2958 -2532 -5361 423 3979 1308
1995 1308 -67 -2485 -3903 1373 4910 406 -3000 -1851 -962 1315 3727 389 -4195 -1581 1322
2010 1322 1070 2271 704 -3760 -2614 1974 2494 1228 905 -2693 -3857 2068 4188 646 -883 -2577
2026 -2577 -3065 1781 5522 833 -3182 -2233 -1083 1397 4494 1016 -4361 -2126 1152 1619 2355 1079
2042 1079 -3647 -3028 2364 2680 806 -43 -2875 -2938 2500 3770 -275 -1887 -1484 -1341 2408 3953 -1236
2059 -1236 -4085 -620 1486 1924 2072 -1802 -4737 129 3654 1515 -257 -1275 -2851 -53 4157
2074 4157 1802 -1796 -1258 -1493 -590 3302 2589 -2026 -2300 -765 -282 2127 3458 -1490 -4127 -684
2090 -684 1248 1726 2838 -957 -4974 -1156 3722 2325 497 -1893 -4182 -573 4791 2619 -2433
2105 -2433 -2767 -1393 597 4039 1604 -3981 -2695 1584 2137 1718 423 -3194 -2321 2492 2395 -700
2121 -700 -445 -989 -1817 1830 2659 -551 -1199 -211 -1587 -381 3376 1063 -2552 -1784 -948 606 3702
2138 3702 1843 -4124 -3491 935 2649 2547 377 -4307 -3859 2801 4203 537 -1612 -3314 -2238 2902
2154 2902 4395 -704 -3217 -1165 -504 1577 3840 -462 -3449 -730 1198 797 1632 -156 -3384 -949
2170 -949 2323 1251 -558 -30 -2154 -1217 2581 2254 -1338 -1403 -829 -795 1970 2831 -1531 -2781 -423
2187 -423 705 1582 2359 -1178 -3962 -386 2579 1407 983 -977 -4355 -765 4001 2252 -1225 -1762
2203 -1762 -2608 -299 4195 2651 -2543 -2352 -508 83 3038 2609 -2620 -3615 -23 1531 1847 1878 -2122
2220 -2122 -3935 1039 3193 1351 -277 -1172 -2243 824 3725 171 -2556 -586 -174 577 2009 51
2236 51 -2540 -554 1379 -167 982 1168 -1923 -2136 729 1229 846 1053 -2049 -3556 1095 3567 605
2253 605 -1241 -2537 -2523 1994 4950 -83 -4271 -2251 563 2338 3215 -797 -4613 -1395 2854 2005
2269 2005 981 -695 -2917 -1221 2976 2074 -640 -494 -1307 -1585 1904 2618 -869 -1028 -219 -1155 1046
2286 1046 2554 -224 -2269 -218 328 514 2130 10 -3154 -1170 2134 1126 727 -50 -3230 -1241
2302 -1241 3167 2385 -961 -2065 -2026 -711 3545 3023 -2770 -3419 -346 1506 2604 1241 -3190 -3771
2318 -3771 1040 2856 655 -194 -1541 -2866 857 2814 360 -1009 -305 -1563 -589 2994 1504 -1375
2334 -1375 -1306 -1196 -708 2673 2616 -2356 -2583 70 935 1898 1401 -2339 -2856 1267 2290 -38 -573 -1395
2352 -1395 -2099 942 2836 -204 -1504 -309 -799 106 2755 684 -2812 -1633 86 930 2551 559
2368 559 -3871 -2363 2040 2355 593 -820 -3215 -1560 3181 3197 -1370 -2287 -1067 -119 2500 2508 -1340
2385 -1340 -2350 -255 203 617 1964 136 -2506 -914 1029 750 1803 812 -2622 -1881 1865 1863 290
2402 290 -154 -2318 -1578 2182 2271 -1019 -1236 -989 -741 1737 2467 -1376 -2715 -126 947 1181 1917 -1341
2420 -1341 -3544 -51 2734 1148 -13 -1231 -2725 754 3772 837 -2479 -1895 -676 1119 2707
2435 2707 451 -3100 -1182 1204 181 889 1103 -1479 -1737 140 171 665 1831 -329 -3179 -638
2451 -638 2504 1678 221 -1504 -3028 152 4312 1696 -2279 -2165 -851 888 3272 453 -3245 -1785
2467 -1785 1863 1048 838 299 -2210 -1649 1710 1201 -696 -122 -814 -1584 1311 2184 -837 -1733 -755 -1006
2485 -1006 1050 2870 -522 -2994 -652 805 1120 1496 -562 -3143 -855 1881 1026 574 -41 -2009
2501 -2009 -1202 1901 1544 -153 -98 -1343 -2020 1722 3208 -304 -2125 -1320 -489 2055 2956 -748 -3153
2518 -3153 -469 1791 1143 1101 -652 -2687 206 2465 581 -772 -402 -1514 -366 2097 1375 -1180
2534 -1180 -697 -545 -741 1891 2037 -1924 -1981 533 949 1259 820 -1637 -2686 1497 2243 -25 -798 -801
2552 -801 -1539 761 2368 21 -1094 20 -1111 -536 2166 1477 -708 -1065 -1259 -330 2664 2594 -2149
2569 -2149 -3157 379 1879 2157 884 -2573 -3171 2086 3318 -131 -1426 -1494 -1047 1840 2609 -1101
2585 -1101 -2347 213 185 2 1234 -219 -1909 59 809 -610 686 1063 -1882 -1599 1250 1111 216
2602 216 188 -1990 -1702 2254 2449 -658 -1219 -931 -964 1557 2599 -902 -2071 -613 10 907 2143 -320
2620 -320 -3098 -929 1738 1296 1183 -572 -3202 -1217 2865 1923 -517 -1422 -1889 -439 3205 1624
2636 1624 -2175 -1955 477 150 1166 751 -1218 -1178 871 291 -266 1203 51 -1781 -235 1103 543
2653 543 790 -8 -2221 -573 3043 1137 -1294 -1586 -1065 271 2655 1195 -2654 -1874 1165 932 1107
2670 1107 829 -1986 -1511 1199 1356 312 341 -941 -2236 503 2298 751 -536 -1122 -1935 531 3540
2687 3540 523 -2701 -1466 -14 1058 2209 -26 -3285 -1187 1957 980 -148 50 -1492 -709 1528
2703 1528 985 -860 226 -7 -1192 283 1573 -426 -655 -132 -1305 173 2790 30 -2382 -992
2719 -992 736 1102 1841 -239 -2935 -735 2442 1465 -312 -369 -1954 -568 2640 1161 -956 -750 -852
2736 -852 -831 1984 2416 -1481 -2300 -223 457 1247 1644 -1541 -3032 338 1730 722 127 -419 -1875
2753 -1875 608 2175 -156 -937 491 -629 -965 1205 595 -604 -224 -571 -1306 1272 2331 -829
2769 -829 -2011 -179 527 1683 1364 -1558 -3073 738 2809 722 -811 -1538 -1848 1617 2903 -582
2785 -582 -2090 -287 383 497 1511 -86 -1853 -557 996 -191 1062 1208 -1559 -1904 891 837 463
2802 463 516 -1383 -1997 1487 2205 -252 -759 -961 -1065 768 2207 -411 -1747 57 29 181 1575 611
2820 611 -1775 -435 540 133 943 824 -1915 -1570 1193 1304 232 -242 -1562 -1080 2094 2317 -1051
2837 -1051 -1763 -494 -111 1461 1739 -1433 -2081 739 817 334 963 -510 -1926 -39 1673 345 78
2854 78 -68 -2002 -663 1990 1341 -813 -606 -946 -374 1923 1599 -1896 -1533 274 81 1042 1290 -1155
2872 -1155 -1713 449 839 28 1232 -218 -1997 -484 1314 605 431 -233 -2266 -798 2917 1470
2888 1470 -1379 -1358 -719 254 2486 438 -2806 -1352 1739 1243 473 -210 -1623 -825 2153 1111 -1153
2905 -1153 -452 -140 -1222 335 1673 -299 -403 54 -1095 -323 2195 567 -1902 -980 -32 349 1764
2922 1764 631 -2619 -1542 1288 1123 469 -90 -1882 -1479 1477 1390 -667 -450 -923 -1399 1156 2163
2939 2163 -412 -1483 -245 -452 993 2083 -293 -2488 -132 1219 357 499 -529 -1912 -143 2153
2955 2153 -104 -663 -220 -562 -427 1553 646 -1039 -482 8 -714 685 1593 -710 -1436 -142 -54 608
2973 608 2088 -532 -2549 -325 1517 1051 368 -876 -1843 -11 2462 722 -1074 -581 -780 -93 1621
2990 1621 790 -1310 -717 -279 -538 1167 1779 -1248 -1714 578 430 484 683 -1192 -1839 1000 1928 147
3008 147 -506 -1024 -1153 588 2038 -576 -1722 -50 285 -176 1057 63 -1471 -88 990 -425 244
3025 244 809 -1268 -1467 690 931 355 470 -1344 -1968 853 2143 130 -1109 -829 -1121 614 2350
3042 2350 -589 -2123 -201 377 642 1125 -130 -2210 -682 1294 624 333 432 -1520 -901 1496 774
3059 774 -680 -185 -595 -601 1313 1380 -1321 -1106 313 -77 530 1426 -965 -1472 452 676 -26 915 116
3078 116 -1629 -264 1412 239 208 75 -1726 -959 1644 1059 -892 -578 -960 -389 1953 1433 -2032
3095 -2032 -1490 392 731 1124 469 -2016 -1714 961 1565 -100 -21 -427 -1548 460 1301 -149 -577 181
3113 181 -824 -392 1808 243 -968 -238 -226 -491 1414 1013 -1482 -1111 794 708 353 330 -1245 -1322 1078
3132 1078 991 -489 -233 -126 -1039 149 1790 -142 -1108 -303 -386 327 1677 329 -1669 -522 866
3149 866 333 1062 -38 -2242 -1134 1833 1173 -352 -164 -1404 -752 1667 1083 -513 -631 -58 -472
3166 -472 764 1531 -906 -1036 319 -450 372 1107 -86 -2176 -309 1085 65 460 145 -1417 -666
3183 -666 1466 625 -431 18 -640 -670 1370 1004 -1055 -471 9 -888 1054 1087 -905 -1773 470 700
3201 700 360 1344 -828 -1687 428 1529 470 -281 -900 -1388 361 2049 98 -1698 -456 -23 7
3218 7 1438 420 -1694 -292 589 -226 185 926 -925 -1181 683 213 -55 1131 -196 -1755 280
3235 280 1401 383 -109 -337 -1213 428 1980 256 -1294 -620 -58 35 1470 377 -1712 -837 1110
3252 1110 538 289 506 -1577 -672 1289 1112 -636 -370 -694 -957 1256 1532 -923 -1055 -263 -450 485
3270 485 1502 -641 -1613 225 260 -95 851 135 -1655 -213 1298 181 144 243 -1044 -1255 1213 1055
3288 1055 -519 -205 -748 -967 1218 1516 -845 -1052 -232 -75 771 1404 -696 -1653 105 868 411 492
3306 492 -420 -1487 115 1580 53 -380 -380 -750 -231 1379 397 -1141 -448 171 -109 1201 813 -1317
3324 -1317 -782 715 574 360 561 -950 -992 890 961 -95 132 -415 -1228 292 1367 -34 -381 -168
3342 -168 -928 -562 1371 837 -868 -579 -244 -78 1034 834 -1457 -1473 469 654 486 113 -1113 -1065 1120
3361 1120 1320 -148 -586 -349 -713 871 1561 -589 -1176 15 137 509 1094 -171 -1159 -213 828 -392
3379 -392 78 189 -1022 -510 1070 141 -129 228 -507 -936 893 1252 -551 -466 -270 -855 188 1432
3397 1432 -420 -1415 -321 268 240 1124 -259 -1631 -313 1211 337 274 -304 -1562 -536 1771 738
3414 738 -864 -633 -644 -146 1299 685 -1246 -430 501 141 595 828 -815 -738 665 803 42 536 -499
3433 -499 -1420 387 1406 -268 -6 127 -997 -220 1681 219 -1034 -365 -168 48 972 547 -1182
3450 -1182 -831 609 597 435 542 -983 -1014 823 779 127 291 -420 -1454 530 1620 -337 -653 -351
3468 -351 -444 459 1564 -33 -1465 -114 457 18 926 172 -1093 -332 1261 231 -148 171 -911 -416
3486 -416 788 816 -521 -61 -373 -933 497 1105 -327 -645 78 128 42 1197 -68 -1502 -90 480
3504 480 122 765 169 -1567 -469 1175 436 73 68 -991 -814 1535 1180 -814 -624 -254 -252 888 906
3523 906 -1038 -1198 329 409 162 622 -678 -1259 491 823 -166 -12 45 -1035 108 1164 110 -262
3541 -262 405 -427 -563 986 455 -835 -400 347 -485 507 1089 -1005 -920 434 265 239 456 -675 -1211
3560 -1211 444 1077 137 -63 -261 -1067 318 1426 -180 -1030 -321 -192 -39 1173 309 -1349 -291
3577 -291 525 471 639 391 -1151 -703 1020 346 -82 100 -392 -712 725 880 -321 -276 -242 -682 443
3596 443 1403 58 -592 -68 -23 -220 1026 108 -1685 -235 337 144 317 368 -1112 -957 1126 696 -428
3615 -428 -261 -641 -763 962 968 -479 -621 206 -432 715 1024 -544 -1130 282 734 260 258 -286 -842 188
3635 188 953 310 45 118 -809 -176 763 586 -957 -12 -384 -290 676 692 -849 -498 336 4 223 852
3655 852 -739 -805 480 398 124 398 -359 -1406 178 1301 48 -288 5 -983 181 1632 302 -937
3673 -937 -249 72 343 912 317 -1140 -700 546 360 108 493 -1130 -972 950 726 -386 39 -305
3691 -305 -625 369 730 -363 -726 180 -609 -107 1034 -178 -944 172 311 -54 643 450 -911 -725
3709 -725 806 337 315 526 -768 -942 679 749 -540 11 -265 -295 497 1394 -252 -739 231 -171 217
3728 217 844 -451 -1501 301 1038 101 158 -194 -899 -37 1011 4 -476 -141 -618 -170 730 629 -651
3747 -651 -475 96 -275 18 958 -560 -848 449 239 97 517 -790 -1048 193 703 325 119 -41 -898
3766 -898 -131 778 229 -656 -5 -274 -189 953 677 -944 -568 450 9 471 286 -956 -686 499 200
3785 200 46 166 -511 -1062 613 1177 -352 -570 -1 -751 176 966 -49 -901 -6 482 -32 720 378
3804 378 -828 -286 360 141 348 272 -952 -903 979 479 -109 498 -399 -681 843 1058 -403 -239 -197
3823 -197 -480 381 973 -240 -1030 11 420 39 626 -323 -1179 152 637 292 -60 271 -922 -500 673
3842 673 425 -726 -100 -13 -414 787 612 -657 -727 -24 -208 123 587 -289 -1097 201 451 -36 654
3861 654 -170 -785 -162 993 114 -354 -192 -787 -610 816 722 -500 -551 -123 -101 993 650 -897 -775
3880 -775 290 233 339 812 -747 -734 449 400 2 334 -435 -695 307 431 -175 -391 80 30 -367 683
3900 683 173 -1104 -177 323 91 321 285 -676 -479 715 38 157 122 -563 -440 752 936 -206 -42
3919 -42 -309 -563 439 983 -141 -584 104 -495 240 876 43 -1085 -319 418 66 338 273 -697 -316 991
3939 991 192 -174 -197 -347 -416 886 870 -704 -150 -34 -344 486 613 -418 -934 525 58 -223 534 -83
3959 -83 -818 162 717 -185 544 461 -847 -206 678 69 -386 -184 -363 -297 827 655 -584 -459 62 -56
3979 -56 495 1202 -869 -894 429 384 338 547 -167 -1045 267 755 -8 -171 -90 -882 7 1153 -20 -616
3999 -616 -66 -120 -198 672 331 -827 -89 182 -236 233 392 -645 -458 641 330 -125 169 -106 -523 66
4019 66 690 -169 -429 -115 -307 151 1023 -48 -585 -136 208 60 794 275 -975 -293 639 136 290 328
4039 328 -619 -618 834 298 -488 -145 -186 -520 667 728 -477 -537 262 -234 -20 840 -594 -694 217 241 -172
4060 -172 462 -49 -755 -227 589 215 -170 214 -439 -548 860 451 -276 -185 -285 -516 543 806 -334
4079 -334 -484 340 -83 182 671 -331 -667 -56 401 -214 197 -189 -876 5 883 -219 -470 -186 -601
4098 -601 -115 893 212 -961 -23 218 -191 634 204 -510 -347 432 144 154 330 -325 -666 452 386 -7
4118 -7 70 93 -293 50 823 -180 -325 13 -412 -294 796 233 -634 -232 433 307 575 311 -763 -314
4138 -314 478 335 11 478 -546 -626 517 811 -359 -129 118 -171 388 690 -61 -745 447 78 -12
4157 -12 329 -19 -787 18 165 34 367 170 -925 -90 907 682 -486 -104 -303 -587 454 463 -671 -282
4177 -282 217 -354 227 867 -459 -948 37 286 44 284 108 -1063 35 428 252 77 120 -855 -143
4196 -143 1230 296 -455 -3 113 -314 790 703 -968 -598 162 -160 186 375 -459 -577 356 456 -393
4215 -393 -244 -235 -874 200 1013 -195 -477 147 -95 206 929 177 -289 91 133 -31 646 485 -431 -196
4235 -196 201 -137 267 404 -149 -878 449 544 -199 263 -179 -669 22 743 -151 -419 47 -306 -25 716
4255 716 154 -858 -258 161 24 519 113 -840 -268 569 -91 -188 557 -75 -194 537 623 -727 142 -399
4275 -399 -520 144 457 -307 -689 265 -468 -161 401 -155 -538 -2 242 26 215 155 -1105 -209 725 145
4295 145 -3 -77 -444 -436 688 445 -792 -303 -257 -315 511 622 -484 -772 218 -3 87 658 -73 -461 197
4316 197 330 -175 -216 276 -845 -156 525 193 -275 38 -101 -255 692 278 -649 -264 -37 -66 360 312 -595
4337 -595 -445 575 173 -240 229 -5 -767 311 744 64 149 -85 -602 344 842 66 -531 -24 46 22
4357 22 732 24 -917 9 304 -17 386 84 -726 -365 886 377 -177 379 -347 -323 194 685 4 -167
4377 -167 111 -5 -47 646 -152 -415 110 25 -208 504 26 -812 -91 694 116 143 281 -408 -331 344 349 -525
4399 -525 218 -295 -590 486 517 -578 -465 -7 -190 181 402 -298 -715 349 655 -6 268 21 -714
4418 -714 295 853 -14 -11 -26 -529 -234 740 53 -391 300 -202 -47 435 535 -466 -432 127 -250 94 697
4439 697 -168 -971 268 416 11 -86 -46 -881 43 730 -131 -46 -128 -373 -40 721 118 -700 144 4 -303
4460 -303 311 326 -629 -259 185 55 -291 33 -398 -431 795 369 -258 3 151 -557 180 621 -324 -262 49
4481 49 -172 438 681 266 -435 16 322 -527 311 323 -756 -88 720 41 -99 351 -583 -216 389 487 -390
4502 -390 -21 234 -48 221 514 -282 -545 293 40 171 424 -54 -749 402 599 -165 18 109 -521 -118
4522 -118 790 62 -365 -203 -126 -289 442 191 -555 16 304 -77 133 359 -554 -346 650 243 -15 458
4542 458 -156 -439 235 446 6 112 -53 -531 -262 636 201 -121 63 125 -500 491 396 -602 -348 233 58
4563 58 278 432 -587 -507 435 274 -204 198 175 -438 402 800 -203 -128 -105 -54 -25 604 44 -56 -140 -35
4585 -35 -308 346 -378 -400 -95 474 117 330 207 -651 -371 558 212 -289 -105 -148 -491 154 673 -309 -315 -154
4607 -154 -393 57 635 -488 -659 82 167 -165 411 -39 -649 -72 294 -24 -118 224 -137 -112 235 218 -324
4628 -324 -113 68 -334 243 591 -272 -114 88 -144 112 608 -98 -551 323 -55 50 -27 -81 -508 -142 610
4649 610 175 -222 -11 -501 -15 440 306 -414 144 150 -67 179 69 -324 -295 297 25 -126 414 -403 -760
4670 -760 258 348 -284 15 136 -540 -169 706 -303 -566 -191 -198 17 421 339 -530 -69 104 69 259 337
4691 337 -250 -284 517 -104 129 57 -216 -432 -81 648 -436 -12 419 -421 115 641 -317 -255 69 -90 22
4712 22 555 231 -805 -212 316 -173 269 259 -618 -9 406 145 -225 96 -351 -222 587 561 -389 -195 273
4733 273 -333 -46 255 -56 -481 102 21 30 238 -162 -624 -34 239 -172 51 10 -382 11 566 130 -268
4754 -268 -51 -251 -339 523 169 -654 -300 -28 -99 329 351 -434 -508 283 204 -21 100 -377 -335 -29 459 -131
4776 -131 -480 292 -215 -172 392 62 -307 66 -41 -216 590 161 -620 -21 97 -371 97 497 -403 -435 336
4797 336 520 61 122 -32 -541 364 575 -379 -102 -95 -329 74 657 -63 -190 -19 -39 45 412 308 -489 60
4819 60 318 192 429 318 -455 -449 481 339 -193 121 -129 -228 65 616 -137 -452 277 -260 -23 522 -113
4840 -113 -457 319 562 -154 171 192 -403 -134 316 -157 81 162 -739 -142 494 359 -347 -63 306 -42 377
4861 377 329 -184 -68 145 -168 379 272 -250 -397 75 270 56 -179 42 -674 1 468 -98 -292 98
4881 98 -184 -220 257 258 -485 97 139 277 194 105 -502 -141 465 34 -321 226 -238 -277 429 219 -361 -33 -28
4904 -28 -361 -342 420 -95 -278 234 71 144 608 20 -248 58 474 260 -50 4 -348 -313 255 135 -169 -35
4926 -35 -176 -238 357 432 -146 17 110 -386 242 444 94 -118 139 68 -15 190 332 -566 -159 359 -45 5
4948 5 52 -88 -340 832 227 -339 13 -404 -310 274 140 -190 -219 -60 -76 -14 511 -275 -746 175 330 -155
4970 -155 230 -9 -359 -28 248 -21 -278 586 -41 -85 325 -178 -395 -160 -95 -57 578 410 -388 -185 197
4991 197 152 148 247 -41 -383 -10 677 -320 270 -95 -314 187 472 -150 -257 -189 -113 83 315 112 -629 40
5013 40 312 -76 302 456 -323 35 520 -138 76 267 -92 -269 116 -45 -412 -107 -252 80 68 674 -640
5034 -640 -232 280 129 -79 415 -65 -383 74 140 48 -87 127 -436 -43 300 10 9 144 37 -285 644
5055 644 254 -448 25 46 -150 227 440 -211 -292 227 67 -146 546 -133 -541 -248 201 -55 112 2 -471
5076 -471 -333 409 -105 -134 124 -221 -411 477 172 -452 -99 -13 122 130 88 -530 -369 383 46 -195 170 -38
5098 -38 -479 135 159 74 -21 114 -439 -190 420 50 -327 188 -265 -103 491 227 -269 -311 168 20 -32 558
5120 558 -390 -508 458 171 -73 161 172 -141 131 173 -310 98 66 -289 -98 416 -98 -451 -27 -259 -21
5141 -21 493 417 -332 -5 280 -155 372 43 -277 -370 232 361 -353 232 -106 -235 265 274 -388 -251 68 -258
5163 -258 -157 386 -193 -275 334 -53 -106 -99 20 -509 -221 258 -110 -29 133 -249 -179 144 255 -215 204 -98
5185 -98 -11 132 434 -143 -131 -228 -15 58 227 -463 -259 115 260 -29 278 -203 -460 255 441 -205 -459 88
5207 88 -30 -240 175 47 -373 -4 63 -71 257 267 -301 -284 218 -153 -225 275 58 -422 129 397 -116 67
5229 67 -399 -392 160 398 399 -399 -6 129 -82 656 -6 -232 28 233 -165 300 87 -257 -14 230 -130 222
5251 222 385 -405 -177 289 247 -139 24 -262 -224 219 552 -239 -309 201 -81 -55 430 92 -344 -182 315
5272 315 -150 41 12 -338 -67 -13 319 -169 50 -164 -474 530 303 -279 73 132 -152 98 335 -94 -93
5293 -93 288 101 -241 438 205 -478 -98 468 -49 -83 55 -370 -206 265 22 107 -144 -281 -77 360 184
5314 184 -35 -253 -49 -254 -100 86 -509 -147 129 152 -96 37 100 -133 239 27 -246 202 176 -252 -198
5335 -198 453 103 -203 117 -199 57 379 169 -192 -88 108 -64 -3 146 -319 -583 498 197 19 66
5355 66 131 -442 228 116 -361 127 49 -158 -284 61 -52 -67 -4 -171 13 360 221 -217 -240 188 -45 -20
5377 -20 222 -381 -68 555 247 -35 0 -9 -107 73 262 13 -97 -111 -183 -64 659 -218 -495 185 -118 -112 -65
5400 -65 62 -303 -33 317 -51 83 190 29 -132 611 241 -172 6 98 -124 148 222 -147 36 213 252
5421 252 22 364 61 -456 57 298 229 256 354 -389 -81 536 158 40 -133 -396 -54 457 -64 -448 307
5442 307 356 -5 -20 248 -394 -542 69 -36 0 78 -97 -173 -81 609 130 381 194 -419 -48 295 -210 -364
5464 -364 90 248 100 257 218 -432 157 -60 -114 108 -113 -398 -212 357 -120 -88 -10 -72 -9 261 120 -327
5486 -327 51 11 -364 -190 154 14 -164 74 -66 -132 280 -221 -612 93 96 108 -104 -129 65 -281 241 46
5508 46 77 195 -65 -306 183 -20 -106 -333 -108 -129 -126 97 -360 -198 222 -193 81 261 33 -538 19 147
5530 147 -97 111 96 -280 -187 402 -78 -36 -8 -9 -219 418 434 -187 -242 123 -60 332 506 -312 -382 402 271
5553 271 -50 55 -317 -98 218 301 -205 -93 286 -52 8 123 278 -259 59 -29 -314 -18 379 -263 -135
5574 -135 451 25 -194 28 -173 -733 247 49 -332 151 -330 -183 38 347 -176 -278 53 49 -62 386 -55
5595 -55 -417 -46 23 -503 -16 180 -159 -371 319 -332 -26 82 -326 -340 441 182 34 12 199 -437 350
5616 350 337 -224 -107 -249 105 -409 534 107 -270 4 145 -87 51 -240 -334 82 340 204 -83 375 4
5637 4 -241 417 114 -141 61 172 -127 188 -38 -172 -425 261 -166 -157 192 -166 -319 160 348 -374 176
5658 176 117 -271 -154 464 -3 -260 214 31 -280 534 118 -423 -129 164 -434 244 -59 -582 -326 409
5678 409 57 -194 154 -178 -204 -174 16 -184 293 -20 -250 77 176 220 31 111 75 -172 283 207 -618 -228
5700 -228 46 211 -171 161 -367 -248 198 68 -52 23 -272 -384 404 226 99 161 126 -291 207 364 -386
5721 -386 -195 -85 -154 -190 202 113 -106 -97 -157 -108 230 50 -340 -57 348 216 -79 183 159 -122 161 85 -277
5744 -277 -185 83 74 44 115 -30 -505 263 105 123 -18 24 -267 108 17 -367 -176 77 -363 -232 62 24 -444
5767 -444 339 -367 -101 211 5 -262 167 150 -118 361 414 -200 -346 115 -65 336 58 98 -253 226 388
5788 388 -339 -444 -78 103 -84 129 -27 -220 151 -78 -252 -125 63 -142 -72 169 -208 123 315 -182
5808 -182 -180 52 163 -113 115 53 -100 47 424 102 -122 -22 -156 -233 220 -46 -150 -236 522 119 155 283
5830 283 -246 -103 266 -251 65 135 -237 -73 365 -92 -37 53 42 -273 39 319 -155 -32 322 -114 57
5851 57 72 130 147 -108 201 70 111 94 -102 31 463 418 108 -149 -172 -153 338 -54 -289 -78 37 74 135 125
5875 125 -190 -186 30 -34 -33 221 75 -239 115 120 -514 -46 110 -266 247 -19 119 -191 -154 -96 119 425 -8
5898 -8 -438 -119 318 -204 48 293 232 -40 304 -70 -433 35 238 33 133 201 164 -34 334 -515 -76 36
5920 36 54 -20 -8 -25 74 -51 176 -3 11 154 -200 170 262 -111 -262 39 253 -437 3 52 -327 -194 205
5943 205 -159 -151 -46 -235 118 14 -118 -503 170 174 -197 63 -4 -235 64 249 -2 -224 226 107 -164 515
5965 515 61 -223 182 232 -78 68 248 -95 -435 -117 -61 15 147 -135 -280 90 33 -129 -84 88 -178 -77
5987 -77 171 -541 -43 195 196 -28 291 -31 -503 58 92 -221 85 -32 -9 32 29 -130 72 229 -132 -173 87
6010 87 119 229 85 -135 -256 41 245 -434 -97 -175 -13 -209 23 75 -532 219 252 -153 130 -24 -181 -139
6032 -139 298 -23 -226 143 95 -54 89 -1 -85 147 202 -257 -57 400 -259 -95 48 240 26 25 128 -396
6054 -396 -325 314 129 405 203 -5 -51 303 -7 -230 -53 -42 -318 307 -48 -364 127 93 -155 -7 216
6075 216 -118 -136 374 -286 -122 -118 27 -196 16 -74 21 -108 186 -162 -266 103 -28 17 191 -238 -312 600
6097 600 -25 -202 -79 1 14 -62 342 -181 102 345 195 320 81 35 -407 198 160 -25 187 147 -7 -197
6119 -197 93 -21 -196 51 81 -299 243 -99 -89 -342 27 257 -271 282 -532 -318 179 180 -220 -47 -266
6140 -266 -190 89 118 85 50 169 -71 -66 21 -165 -319 118 199 -369 11 -83 323 -41 349 -262 -346 302 -252
6163 -252 -49 29 153 -90 118 -146 -285 352 372 -165 -126 230 -287 -107 153 246 -158 231 90 -443 172
6184 172 -53 -312 -1 423 -443 -101 32 -156 -180 361 167 -349 108 93 -355 -31 197 -328 173 271 175
6205 175 -159 230 -143 -366 -65 86 -81 274 171 88 -25 186 192 -133 63 16 -188 294 350 -470 -122 278
6227 278 35 -230 34 -32 78 201 -170 -115 25 35 -314 24 245 -37 -226 125 -231 202 419 148 -173
6248 -173 206 -235 -155 130 70 -413 -2 396 -238 168 -48 -117 -327 639 155 -68 22 135 -161 279 269 -48
6270 -48 -170 201 31 45 189 -20 -219 -71 227 -186 317 243 -214 -8 -102 -404 131 294 -200 -465 260
6291 260 -30 -187 -77 75 -224 584 104 -137 87 -25 335 76 427 -98 -247 350 232 -169 126 -116
6311 -116 -54 -26 371 97 63 -85 160 -192 53 56 -206 172 39 -587 7 447 -104 -260 169 190 196 56 -99
6334 -99 -239 280 28 -377 160 -29 -195 -122 339 159 -195 122 -96 -55 356 -304 -170 -50 132 -81 287
6355 287 -68 -254 -42 330 -82 262 180 -182 -296 65 49 -128 -190 31 -304 -376 119 189 -144 91 -101 -256
6377 -256 6 66 -200 67 215 -298 137 -36 -365 -195 -56 -298 -467 35 229 -76 219 202 -44 341 228
6398 228 -265 119 329 -227 114 -181 -205 -37 136 131 -291 -230 -49 -251 92 283 -261 -208 168 212 -27 3
6420 3 32 -211 -124 88 2 154 246 -188 -25 145 95 69 131 174 -122 24 127 -410 -282 394 -77 -196 303
6443 303 -270 -32 86 -122 -31 273 -39 -171 248 140 -102 -108 98 -78 -34 45 -247 -145 338 161 -289 136
6465 136 -127 -146 -107 258 -2 -496 180 16 -338 136 -166 -51 226 253 67 219 120 -29 94 -74 -52 96
6487 96 434 -161 -132 -52 50 -101 -32 -18 -170 97 168 -324 -79 85 276 -62 166 -46 166 281 -53 -1
6509 -1 231 70 -139 -180 -67 -29 122 -149 -42 -291 -33 -24 -238 292 -248 252 308 420 -221 -17 191 -140
6531 -140 -14 -105 -213 -65 390 211 4 118 -63 -5 -74 14 -360 -262 114 -218 -1 212 -133 -348 178 -24
6553 -24 -133 191 217 195 79 -76 -203 201 262 -44 -224 -61 83 88 -94 87 -273 94 36 -111 150 176 -121
6576 -121 -78 61 -21 -204 370 202 -263 77 227 -219 114 284 -259 -483 -188 140 -338 -166 50 -168 -102
6597 -102 24 -93 27 29 90 -141 -124 -140 4 110 -32 -251 270 -87 123 76 30 -47 -201 449 239 -336 -14
6620 -14 204 -219 289 238 -118 145 241 -11 -159 245 2 -159 247 13 -105 -119 90 -201 -78 -90 240 172
6642 172 134 -204 17 12 188 5 25 -83 24 319 72 -166 -197 49 -30 -69 160 309 -39 98 -98 -130 226
6665 226 -110 -245 -174 -80 -49 68 242 -496 -108 333 -105 -285 319 172 -112 59 -210 -482 -101 103 -155
6686 -155 70 139 -223 70 210 -74 -125 142 -46 108 -41 54 -1 -129 31 -62 -53 296 -7 -28 33 110 -127
6709 -127 -13 126 -348 274 -120 89 105 275 -446 -33 -304 186 156 -7 155 87 147 97 -426 -128 -115 77
6731 77 14 305 -80 -228 77 57 155 27 187 -170 -210 146 -148 -75 42 -62 167 124 -181 94 -40 267
6753 267 -111 -24 -62 83 -425 -31 -155 -261 380 -72 -280 -184 -55 -303 -223 110 -108 87 232 -64 -187
6774 -187 142 179 -117 271 -29 -12 399 136 258 418 155 160 12 142 -97 61 61 130 -237 79 -46 -29 171
6797 171 -185 64 170 218 15 118 32 58 -94 -86 127 117 37 126 -301 41 -230 -145 -54 155 -10 -306 -272 56
6821 56 195 -150 177 -187 78 65 -92 67 253 38 -97 -126 277 -106 417 -33 -207 290 372 -4 -232
6842 -232 127 -82 -236 352 81 -48 137 -48 -212 150 415 -190 109 206 -63 -11 23 -198 19 177 -86
6863 -86 -285 402 208 -111 -214 160 -253 61 20 -227 -165 392 -50 -280 86 -57 292 53 31 -216 -38
6884 -38 130 175 176 51 74 -292 323 260 -38 239 -4 -104 107 53 -516 -165 -62 155 -359 7 39 -267 14
6907 14 -350 -214 103 360 -85 -54 181 -155 -191 146 -258 -313 313 117 -202 116 2 -230 6 564 110
6928 110 -313 15 34 -112 -181 -186 -240 -121 68 -189 -18 -89 153 -364 77 -173 -11 119 130 -330 -18 -239
6950 -239 -196 188 -85 -160 185 78 -234 -162 -69 -192 100 215 -45 -332 28 -39 -36 -39 41 -265 34 142 -315
6973 -315 -72 25 218 -239 164 -84 -30 244 5 -50 -27 94 -105 -117 0 -152 196 -39 -96 -307 -235 -19
6995 -19 219 -107 134 -249 -95 186 -130 110 8 -185 139 295 -334 -277 -141 289 -160 75 -43 -45 -199
7016 -199 57 138 -260 -92 320 89 -63 213 26 -35 258 -11 222 53 -350 128 226 -331 -58 -41 39 -342
7038 -342 -46 209 181 162 -81 -287 26 231 -118 -155 231 126 -62 113 113 -422 -54 119 226 244 194 113 -148
7061 -148 -67 -166 -5 14 63 73 39 388 58 141 34 -319 121 11 -200 142 401 -98 -31 225 -3 -141 137
7084 137 204 144 131 115 -406 -108 269 31 -25 -52 370 34 71 47 132 215 79 132 -133 28 179 82 -126 243
7108 243 -76 -54 -95 -280 -10 -73 35 291 -32 101 -174 -197 248 28 258 -106 156 137 8 -296 -40 163
7130 163 -240 142 61 152 -323 164 279 -186 144 -127 -44 -219 -45 2 218 264 -63 -6 -25 270 1 156
7152 156 -248 -227 254 -57 45 -83 -51 -154 216 313 -343 4 1 140 49 -171 54 -279 -150 -91 -325 -78
7174 -78 151 -36 -14 142 106 -149 27 -1 -97 -54 15 -263 -11 375 -201 433 9 -95 -52 -270 -222 -109 -9
7197 -9 162 -303 -57 273 -222 111 -94 -57 -139 158 70 -248 -184 -110 -30 169 352 157 133 59 -150 108 -225
7220 -225 -172 -309 -41 65 -288 -33 224 -101 58 279 -130 -179 195 51 22 13 -62 -122 120 270 -234 -192 165
7243 165 -168 -38 245 91 261 -232 -214 -81 -74 -204 34 -51 188 51 275 38 211 -189 98 293 -334
7264 -334 30 114 -292 14 -45 16 -28 -318 104 -37 48 -375 -71 144 -170 -42 -66 12 -102 3 69 -40 59
7287 59 63 -74 4 42 -46 -294 -31 103 107 -117 275 -44 -122 -245 121 -326 92 4 3 178 136 -241 1 367
7311 367 -108 -153 25 -55 241 -72 -339 43 -1 1 -243 -4 -216 3 97 44 -84 -30 -60 -204 -113 -153 63 229
7335 229 -84 -34 80 -26 214 -164 -201 74 -62 54 310 -94 55 50 82 -79 80 130 -243 167 28 -321
7357 -321 112 -78 -213 58 69 -196 85 55 196 -90 118 9 -59 -198 117 8 -29 12 153 63 74 97 36
7380 36 -158 156 25 9 -55 -207 -25 139 -172 -102 382 -218 -188 -250 -61 42 77 -36 38 -87 98 46 -284
7403 -284 -191 263 67 -66 102 -168 9 55 -173 -67 -65 166 -224 271 -169 128 255 -95 -25 17 301 133
7425 133 170 -170 -171 218 61 121 -197 179 -26 -21 -13 99 -242 -83 32 -115 -166 -144 -227 83 -31 14 -244 35
7449 35 -79 -85 95 -125 -28 66 7 -225 -18 435 -80 -188 -46 196 109 261 117 -137 -108 -13 300 -55 -108
7472 -108 102 -120 358 -99 91 360 186 -5 172 -113 -158 10 188 -231 -201 49 -131 -169 170 -65 -445
7493 -445 50 58 -191 183 117 -60 157 -119 -93 5 109 -94 -274 113 315 -282 -159 13 73 -3 245 -177
7515 -177 16 355 -156 187 -83 210 -174 -144 261 -321 74 81 62 -144 -18 103 -96 -107 -314 -93 26 219
7537 219 -25 193 -176 -58 -31 -80 208 149 -123 -151 -159 -259 324 -220 -154 -276 -293 -83 87 -219 317 -78 82
7560 82 -49 -142 -13 -400 103 149 189 40 121 86 27 -188 -139 162 217 -250 -146 396 165 -69 -214 -202 56
7583 56 72 -71 -9 11 151 40 -131 -37 -105 -295 -86 -182 -57 -123 2 -47 -30 189 -322 -194 157 -113 -255
7606 -255 -17 159 -331 194 69 4 -39 265 64 65 124 -316 -436 24 185 -199 -190 145 -25 103 -210 -282 -186
7629 -186 118 190 -188 179 21 -182 -34 233 -44 -61 146 201 -187 105 -66 -335 62 368 -143 -76 -186
7650 -186 156 14 104 112 -88 -182 -91 -24 207 -110 -193 -222 12 -242 186 109 -421 -318 156 17 -93 56 -1
7673 -1 -10 211 73 -253 -8 -16 -246 -47 0 20 -58 58 187 144 -104 -135 -212 127 121 -232 -22 -157 69 -281 2
7698 2 -7 231 -153 272 48 204 54 -201 9 255 -218 5 -22 26 107 -33 -148 4 150 -92 -409 190
7720 190 148 -241 234 132 135 -149 184 -42 -25 218 -129 106 139 -85 -43 22 -216 -256 -171 -384 88 -83 192
7743 192 357 64 55 139 -204 -275 74 -99 304 -457 -28 -245 0 -6 108 165 -60 -58 191 268 -53 76 166 -38
7767 -38 -367 128 -135 -69 -20 26 16 -48 188 -83 0 157 10 216 -25 -121 -74 -5 -98 185 20 -149 183 -206
7791 -206 -224 -17 -296 -5 -174 186 -23 69 -57 98 -117 214 95 -97 66 -117 47 55 -18 35 10 221
7813 221 -26 -73 -13 -55 -133 -38 45 -305 -317 -113 69 205 -69 67 -209 22 0 -122 20 -6 -51 -147 130 315
7837 315 -85 -90 191 -21 100 -178 -14 -67 354 307 -183 146 -220 85 -251 -177 1 136 -23 50 15 328
7859 328 280 99 45 -389 -11 15 157 -7 68 107 118 -142 34 -259 -100 -190 103 -17 1 47 -189 30 99
7882 99 -6 -64 18 324 -223 242 199 -110 -77 -25 -178 374 85 -164 96 435 -130 -173 274 53 138 205 -92
7905 -92 -126 -164 135 -236 -179 92 -231 61 105 -114 -190 97 -41 -219 1 41 -111 -79 424 157 -22 208 178
7928 178 -224 104 -17 -391 169 434 57 -22 140 -316 6 196 -90 -113 -151 -132 33 133 221 274 209 117 127
7951 127 69 37 -115 50 -28 -5 -118 14 -16 51 -253 415 -214 185 292 -211 -10 -30 77 -162 178 -53
7973 -53 -145 37 -102 -5 -81 33 20 143 76 -1 68 120 136 -229 113 -133 -87 -96 198 -215 -107 270 -33 -64 132
7998 132 -94 -398 -88 134 230 -143 14 -126 309 -104 -162 27 -40 -205 -109 90 -124 -251 287 -65 -65 57
8020 57 200 51 150 201 130 46 -56 72 -267 -199 -27 139 132 -32 75 -42 -209 -74 17 -73 255 102 22 -19
8044 -19 185 -9 192 -206 -67 -84 215 -43 51 -63 36 95 333 27 130 98 -54 -185 115 75 -43 255
8066 255 -45 75 -156 24 188 109 7 -359 142 -51 24 -91 247 -83 90 377 46 181 144 -214 8
8087 8 -182 -26 -256 -363 -77 -134 -41 -141 -67 67 296 1 334 -159 135 -178 -117 -477 -266 10 -2 -128
8109 -128 56 216 -266 31 168 -148 421 -145 -50 -209 165 -70 120 -130 98 -242 -210 15 -34 -469 -132
8130 -132 126 74 356 -47 -186 -118 -8 -210 -93 159 -7 9 99 -425 -31 127 -186 -144 325 355 231 255
8152 255 -46 -113 -71 253 39 121 -34 78 -360 -278 137 -61 11 -152 361 -8 -18 204 -52 -2 -92 -269 -32
8175 -32 -19 -260 199 -122 106 264 -37 -17 -16 102 277 -225 40 156 -92 -92
8191i2
$$ Imaginary data points
##PAGE= N=2
##DATA TABLE= (X++(I..I)), XYDATA
0 0 0 0 0 0 0 0 0 0 0 8 -8 8 -8 11 -16 16 -23 24 -31 34 -40 47 -54 62 -72 83 -95 106 -120 136 -154 172
32 172 -193 216 -242 268 -298 332 -367 406 -451 500 -552 612 -678 753 -838 935 -1044 1173
50 1173 -1326 1512 -1740 2029 -2412 2944 -3734 5032 -7554 14282 -70879 -191496 -66793 31953
64 31953 44272 -36573 -128790 -146666 -47845 11032 -25101 -71147 -84033 -92010 -52847 -284
76 -284 3882 -13688 -21768 -53810 -52485 14281 44044 -5303 -43049 -43066 -21280 24097 35457 -21870
90 -21870 -40909 9954 31995 5825 -16657 -35164 -24407 27736 34047 -24235 -45607 -17533
102 -17533 6438 38083 55691 8950 -37369 -21700 14076 47454 68849 17495 -66189 -56051
114 -56051 29087 80097 67026 -3159 -81519 -58865 44487 73695 9204 -53243 -80279 -58770
126 -58770 6744 29288 -19041 -49949 -48021 -49198 -22555 18905 2857 -42346 -55410 -47195 -16660
139 -16660 30220 16016 -47175 -47229 9026 35732 28428 692 -33252 -11748 45279 36041 -18168
152 -18168 -25861 -1981 17855 36206 19636 -24431 -20233 16495 19706 14607 16305 -15871 -41913
165 -41913 -13106 23171 33933 25748 -19483 -58207 -6505 73939 69116 2697 -48153 -47245 22285
178 22285 91459 53629 -35764 -50053 -1423 43827 64240 34403 -23208 -28122 7948 18123
190 18123 20628 28657 -79 -34396 -20049 10895 30625 40106 6985 -42700 -21680 38772 45249
203 45249 10568 -16545 -25857 5267 50058 31955 -16297 -10750 22791 33177 30975 9096 -22732
216 -22732 -7531 33583 29696 3227 -9362 -24108 -16569 29311 43652 4245 -28769 -36191 -19636
229 -19636 30386 50564 -7560 -61566 -43321 3056 38888 41930 -10745 -55836 -24511 24819
241 24819 31346 20323 -1361 -34398 -28804 9244 24381 22317 13209 -23418 -41473 3871 44837
254 44837 29156 -8478 -37828 -36943 13994 48202 5519 -42399 -28914 6437 26524 22200 -16387
267 -16387 -38134 -144 31462 8064 -17028 -18432 -13413 7911 24709 2088 -19443 -7988
279 -7988 -2776 -548 20095 17404 -19504 -33693 -17133 4723 29129 21988 -33124 -56161 -8416
292 -8416 35962 32943 533 -42927 -50585 2970 41787 16250 -18567 -29583 -27789 363 33630
305 33630 22283 -8336 -17565 -20968 -9945 27796 35376 -6517 -32861 -21112 3913 33585 33229
318 33229 -14513 -37857 -1669 28595 21354 2364 -20128 -22879 12115 29697 204 -18525
330 -18525 -6426 3300 14736 20780 -3139 -22721 -5106 10882 11232 13591 -2616 -30167 -16409
343 -16409 21130 28129 11985 -10975 -33730 -17650 30609 36587 -2402 -27909 -28712 -9765 25970
356 25970 33130 -3742 -26304 -17273 -5974 13527 31283 8711 -28617 -29796 -8595 15367 33904
369 33904 11365 -37748 -37097 10030 34466 22091 -8957 -38319 -22308 26380 30087 -9626 -26241
382 -26241 -12384 5110 20999 11220 -19587 -17282 11381 13225 -731 -3002 -9679 -11871 5653
395 5653 10039 -854 637 -2502 -17431 -4972 21764 16112 -7126 -20846 -24368 -1146 34389
408 34389 22152 -24433 -35690 -9711 17841 33886 15029 -29052 -35748 728 23367 21006
420 21006 7678 -20714 -31956 -73 28047 21861 4632 -15252 -28555 -2545 31932 20997
432 20997 -10305 -21516 -17001 3477 27351 13673 -19316 -17681 2943 8923 10017 3000 -15808
445 -15808 -12540 8667 8019 -2059 -983 -6152 -9566 8411 16564 300 -8529 -8888 -7596 11024
459 11024 24211 -1257 -26362 -14891 7097 21209 21752 -7342 -34475 -13185 21643 23413 7579
472 7579 -12049 -28698 -12472 22340 24953 4064 -9579 -19986 -13931 19581 34086 7880 -16920
485 -16920 -20553 -8357 21883 36208 3192 -28304 -15004 11510 24137 20181 -5995 -24992
497 -24992 -3975 20571 11020 -3301 -6733 -8945 151 12726 2788 -9024 -1174 1072 -4698 4167
511 4167 7849 -6384 -9766 -2354 403 9674 14554 -8325 -22910 -800 20542 18745 4653 -18422
525 -18422 -25581 6882 35449 17403 -12793 -22169 -12725 15513 36332 14052 -20543 -20742 -2077
538 -2077 15213 26927 12231 -19263 -21309 3885 17690 19577 10639 -13533 -19283 6117 20611
551 20611 10825 1587 -8865 -14820 2791 17744 6128 -5217 -5053 -8464 -2638 12215 5871 -11852
565 -11852 -10688 -5249 -2213 7717 2739 -19444 -18332 3934 10845 2877 -8842 -23786 -15552 15776
579 15776 19942 -7747 -23775 -17970 -657 20890 18857 -13503 -26762 -7261 10138 15911 12027
592 12027 -9952 -24818 -7623 12277 13629 9497 -4810 -23290 -13547 14045 18776 5528 -9352
605 -9352 -22794 -14411 15440 21260 -2963 -16754 -14541 -4809 12880 15561 -7519 -18660 -5645
618 -5645 2282 3863 5383 -5838 -16241 -4858 6048 1734 -148 -4369 -14326 -6306 11030 5695
632 5695 -8844 -12187 -10932 -122 17015 8589 -17442 -18780 134 13125 17613 5117 -20675
645 -20675 -19321 10455 23152 12435 -1775 -15591 -13032 13574 26951 10245 -6533 -10608 -7833
658 -7833 9487 24995 9766 -10721 -10749 -3677 6714 19574 11077 -11693 -13370 -650 5846 11708
672 11708 8806 -10615 -17329 -41 10060 7467 3690 -9282 -15750 2212 16603 5273 -7353
685 -7353 -10320 -8227 7137 17800 -422 -18878 -8458 8101 13364 10096 -7671 -20895 -2485
698 -2485 19982 13873 -2933 -11224 -12527 2305 20868 12961 -6925 -9068 -3663 2519 14963 15543
712 15543 -2607 -11042 -4738 1794 12963 19544 1184 -17754 -9049 7416 16214 15969 -2641 -22589
726 -22589 -10651 14434 16502 4163 -8595 -17785 -6671 16044 13600 -6035 -11993 -7886 -1487
739 -1487 10853 8509 -9975 -12954 27 5015 5206 3976 -8442 -11983 4423 11123 2108 -3390
753 -3390 -7421 -8962 5352 15671 2079 -10045 -7809 -3156 7073 16515 3813 -15026 -11377
766 -11377 2145 9616 13456 3974 -16233 -14856 5804 14477 10699 1162 -14828 -15412 6646 18250
780 18250 7174 -4584 -12581 -12924 5042 18511 5988 -9750 -11274 -7319 2894 15069 5073
793 5073 -14074 -12369 -1348 4597 8489 1706 -14488 -12157 6057 8817 884 -5046 -11246 -7245
807 -7245 9862 10350 -7053 -12365 -4715 1724 9604 7621 -9542 -14419 450 8177 5792 3060
821 3060 -7422 -13888 -601 10673 6544 1407 -4834 -13564 -5717 12526 12275 -33 -8456 -14399
835 -14399 -6540 14841 18052 -3229 -16259 -11863 278 16346 16337 -7377 -21001 -5989 9470
848 9470 12602 7148 -8895 -16686 -256 14176 7022 -2435 -5709 -7207 1742 11553 3115 -7216
862 -7216 -3550 400 1256 6591 3363 -6697 -4276 3965 3102 3766 4169 -6109 -8296 3960 9050
877 9050 4316 514 -7769 -10645 5225 17077 5496 -7321 -10828 -7308 7638 19466 4426
890 4426 -15508 -12991 29 11116 15540 1868 -17571 -12472 6539 12340 8017 -677 -13863
903 -13863 -10739 7827 12740 2913 -2880 -7811 -8136 4818 12672 1413 -6338 -4915 -3884 2840
917 2840 10564 1123 -9925 -4763 2488 3840 5988 -289 -11005 -4351 7912 5787 -1224 -4220
931 -4220 -8181 -3146 10500 8213 -5927 -8347 -4380 318 9623 8919 -7221 -13100 -2856 4546
945 4546 8973 8303 -6812 -16234 -3343 10714 10186 4017 -7446 -16893 -3232 14759 11680 -2011
959 -2011 -9911 -11549 -1119 15411 11034 -7086 -10860 -4482 2375 10625 7967 -7391 -10004 1401
973 1401 5244 4205 3973 -3763 -7972 1689 6748 1274 648 -481 -5884 -520 8147 3425 -2917 -2080
989 -2080 -3266 559 10380 5443 -8380 -8153 1208 6521 10128 3110 -12963 -11631 6941 13779 6213
1004 6213 -4007 -13900 -9622 10776 16457 204 -11404 -9896 -3437 9763 13673 -1938 -13262
1017 -13262 -6324 1902 5702 8723 151 -10723 -6033 3145 4142 5420 3181 -7692 -8117 3173
1031 3173 6649 3732 1293 -6416 -8877 3826 10829 1677 -4969 -5338 -3425 5758 10683 -1953 -11359
1046 -11359 -3217 5070 6540 5045 -5413 -12440 -436 11922 6271 -2965 -6889 -8555 1045 12951
1060 12951 5788 -7612 -8517 -4261 1885 10373 6781 -8213 -10479 -1906 3618 7632 6636 -7037
1074 -7037 -13217 -1338 7275 6927 3692 -5894 -12599 -1670 10805 6394 -938 -5300 -9411 -1702
1088 -1702 10855 6628 -4910 -5806 -3252 318 8288 6288 -6018 -7135 1498 3320 4405 3619 -5533
1103 -5533 -7706 2853 7388 1808 -1458 -5454 -6730 4213 10767 513 -8131 -6431 -2351 5556
1117 5556 10634 -1036 -13567 -6844 4210 7400 6486 -3244 -13533 -6440 8086 7997 958 -4013
1131 -4013 -9932 -5911 7414 8674 -1079 -4744 -5701 -5588 3902 9976 946 -6119 -5046 -3661 2680
1146 2680 10814 3092 -9286 -6738 1276 5195 8302 1641 -10855 -6664 7035 8507 1889 -3208
1160 -3208 -7838 -2378 10380 8322 -5340 -7972 -1700 2780 7765 4400 -8607 -9037 2913 6737
1174 6737 3153 235 -6594 -8054 2526 8284 1360 -2030 -3874 -6974 -97 9182 4530 -3144 -4533
1189 -4533 -5828 -1238 10228 8507 -5110 -8651 -3723 1929 10107 8733 -6092 -11692 -416 7994
1203 7994 8316 4691 -6172 -10096 2511 11740 4717 -1346 -4080 -4984 3581 10879 2582 -5740 -2588
1218 -2588 786 2794 6687 1940 -6772 -2925 4413 2925 2488 750 -6045 -4809 5131 5507 -405
1233 -405 -2211 -5642 -5362 5229 8463 -1705 -7155 -5385 -2293 5451 9583 -1830 -11055 -4700 1830
1248 1830 5519 6867 -877 -11572 -5524 5404 5958 3660 -1049 -9002 -6457 6634 8429 1169
1262 1169 -2598 -6388 -5473 6264 10356 -897 -6520 -4256 -952 5460 8544 -2246 -9485 -1593
1276 -1593 4993 4441 2728 -3393 -8391 626 7906 2078 -3468 -3118 -3693 569 6997 1648 -6363 -3507
1292 -3507 -233 307 4712 3161 -6457 -6358 231 2071 3558 3686 -5199 -9819 -308 6693 4950 1685
1308 1685 -5773 -11044 55 11419 6482 -3452 -7484 -7440 1911 12423 5744 -8275 -8106 -548 4359
1323 4359 8847 3331 -8680 -6802 4081 5569 2701 253 -4777 -4529 4344 5424 -1292 -1302 -894
1338 -894 -2709 1668 5349 -670 -3290 -362 -1511 -175 5593 1594 -6446 -3511 1421 2616 4628
1353 4628 905 -9023 -6130 5550 7173 1714 -3482 -8790 -4800 8784 9844 -2568 -7907 -5525
1367 -5525 -663 7854 8477 -3990 -9706 -2618 2872 5121 5659 -2246 -9143 -2061 5183 3817 2757
1382 2757 -857 -7159 -2990 5929 4880 -274 -1507 -4660 -2951 6063 6028 -2753 -4171 -1677 -404
1397 -404 4324 5367 -3701 -6501 909 3387 2618 2735 -3113 -6769 882 6555 1859 -1273 -3092 -5227
1413 -5227 933 8427 3409 -5071 -4493 -2315 1796 8138 4077 -7532 -7261 464 4249 6558 3221
1428 3221 -7793 -8332 3030 7752 3901 70 -6501 -7156 3234 9190 1898 -4156 -4111 -3516 2258
1443 2258 7565 805 -5950 -2801 155 922 4616 2069 -5015 -3061 2424 1100 1904 2595 -3758 -5340
1459 -5340 2562 3949 917 121 -3525 -5182 2873 7662 68 -5183 -4141 -1618 4629 8462 -1793
1474 -1793 -10104 -3156 4486 5728 4045 -4059 -10394 -1602 8679 5503 -1846 -4499 -6154 -825 8053
1489 8053 4482 -3714 -3930 -2165 -1337 4690 5352 -2410 -4966 -1597 -563 2526 6399 -183 -6894 -2500
1505 -2500 2235 2869 4386 -209 -7867 -3561 5710 4586 301 -2152 -5727 -1278 7523 4660 -4361
1520 -4361 -4791 -1028 1292 6045 3382 -6138 -6159 2669 4895 2481 855 -5104 -5541 4098 6881 657
1536 657 -2062 -3313 -3789 2708 7438 958 -4460 -2862 -1916 1508 7303 2672 -6377 -4814 275 2425
1552 2425 5345 2994 -6253 -6361 2115 4517 3064 1002 -5232 -6513 2926 6866 1085 -1869 -3295
1567 -3295 -4090 1758 6849 372 -4770 -2205 -1145 1159 5132 881 -6166 -2995 2695 2533 2520 -93
1583 -93 -6734 -3343 5613 4493 -943 -2699 -4573 -1712 6559 5768 -3675 -5699 -1691 1209 4878 4480
1599 4480 -4354 -6916 224 3473 2714 2351 -2435 -6484 -613 4358 2027 746 -800 -5578 -3079
1614 -3079 4989 4272 -345 -2045 -4629 -3369 5276 6621 -2136 -5619 -3017 -644 4691 5627 -3574
1629 -3574 -7877 -504 4296 2852 1266 -4035 -6591 1691 7227 1196 -3291 -3019 -2614 2162 6198
1644 6198 331 -5865 -2115 1991 2118 3457 982 -4890 -2155 3244 2236 1487 2057 -3105 -4350 2388
1660 2388 4338 1504 722 -2842 -5570 1736 7417 2166 -2942 -4065 -4405 1952 8436 2573 -6711
1675 -6711 -5116 -70 3199 5786 701 -7816 -4926 3239 4001 1459 -949 -5532 -3707 4137 4199 -1500
1691 -1500 -1960 -2072 -1998 2832 4410 -1550 -3522 -411 -5 1450 3943 -595 -5126 -327 3225 2007
1707 2007 2107 8 -5214 -1346 5744 3487 -772 -1875 -3617 -1393 6017 4430 -2532 -3563 -1829
1722 -1829 -220 4866 4749 -3149 -5954 -803 1883 3564 3954 -2559 -7162 -1076 4499 3016 1352
1737 1352 -2335 -6607 -1038 6428 3316 -1615 -2903 -3910 -586 5939 3581 -4380 -3722 32 1125
1752 1125 3350 2294 -4245 -3696 2625 2916 528 319 -2150 -3004 2661 3926 -722 -1322 -207 -2088
1768 -2088 1090 4727 528 -2732 -1273 -1193 791 4963 2346 -4836 -4080 819 2498 4471 1457 -6620
1784 -6620 -5728 3215 5701 2053 -1978 -5864 -5034 4572 7335 -723 -5041 -3695 -1649 3603 5349
1799 5349 -2027 -6212 -1103 1608 1495 2202 -757 -4811 -1000 2901 437 419 481 -2884 -2263 2441 2040
1816 2040 -408 126 -1981 -2817 2880 4521 -675 -3076 -1611 -780 2989 5143 -1865 -5966 -675 3273
1832 3273 3531 2615 -2737 -6753 71 6469 3293 -1755 -3483 -4462 374 6399 2315 -4308 -3467 -1708
1848 -1708 259 4545 2950 -4518 -4184 338 1195 2687 2837 -2728 -5024 503 2972 1488 1138 -1600
1864 -1600 -4590 -163 4576 1575 -928 -1674 -3007 223 4901 1991 -3389 -1789 426 740 3469
1879 3469 2014 -4071 -2886 2223 2486 1419 863 -2867 -3678 3024 4266 231 -1300 -2463 -2871 2852
1895 2852 5813 -613 -4182 -2533 -508 2755 5236 -327 -5909 -2664 2159 2792 2747 -947 -5807 -2510
1911 -2510 3899 3047 -105 -1339 -3531 -2334 3713 2969 -986 -1772 -1254 -1846 1643 3966 -577 -2898
1927 -2898 -725 -815 797 3796 79 -4022 -1715 1591 1859 2239 -253 -4689 -2213 4307 3347 -588
1943 -588 -2341 -3371 -605 5292 3709 -3636 -4079 -77 1740 4143 2433 -4631 -4582 2156 3641 1681
1959 1681 201 -3087 -3909 1933 4252 471 -1165 -1209 -2913 -161 3734 968 -1907 -1129 -2158 -1142
1975 -1142 3496 3234 -2196 -3253 -1004 -187 3429 3429 -2999 -5081 441 2855 1833 1204 -2606 -4648
1991 -4648 1684 5126 1069 -2083 -2019 -1835 2049 4827 -410 -4534 -1144 1397 1739 2443 -116 -4749
2007 -4749 -1150 3214 1563 759 23 -3427 -2007 2968 2999 -253 -1219 -2437 -2445 2886 4147 -588 -3065
2024 -3065 -1713 -1198 2423 4567 -539 -4645 -1899 947 1801 3191 -42 -4755 -2035 2986 2287 820
2040 820 -284 -3837 -2098 3545 3067 -856 -1006 -1920 -1551 3015 3984 -1777 -3274 -842 602 2259
2056 2259 3025 -2367 -4665 578 3120 1601 362 -1994 -3719 1290 4433 1073 -2147 -1599 -1545 703
2072 703 4185 1346 -3334 -1677 -29 510 2566 1858 -3038 -2914 748 1007 1558 2077 -2370 -4417 247
2089 247 2844 1588 526 -1907 -4614 -126 4876 1893 -1406 -2584 -2863 490 4958 2034 -4220
2104 -4220 -3060 379 1789 3190 488 -4718 -2568 2795 2652 -6 -850 -2369 -1375 3406 2414 -1901
2120 -1901 -1835 -233 -755 1491 2625 -1289 -2260 313 -189 281 2538 391 -3435 -1628 962 1308 2382
2137 2382 673 -4154 -2851 3244 3427 797 -1265 -4042 -1985 3983 4485 -1645 -3522 -2032 -414
2152 -414 3175 3987 -1876 -4081 -316 1580 1624 2299 -1267 -3669 -26 2990 1022 267 -411 -2712 -712
2169 -712 3081 1530 -1728 -805 -1084 -567 2681 1730 -2423 -1889 156 -3 1349 2176 -2188 -2944 667
2186 667 1987 1068 767 -1505 -3565 105 3729 1537 -1105 -1841 -2496 935 4593 1410 -2996 -2304
2202 -2304 -713 903 3597 1819 -3425 -2477 901 1609 2240 1732 -3045 -3571 1549 3128 732 147
2218 147 -1890 -2974 1368 4076 18 -1780 -1315 -1288 1298 3341 -469 -3344 -847 1110 570 1193
2234 1193 -48 -3043 -667 2113 545 -71 537 -1648 -1928 1453 1950 -105 -230 -1468 -2618 1723
2250 1723 3871 -273 -2984 -1758 -317 2440 3999 -1158 -5002 -1446 2678 2723 1640 -1679 -4473
2265 -4473 -604 3837 1844 -693 -1739 -2254 -328 3196 1755 -1522 -1327 -368 -139 1739 2305 -1347
2281 -1347 -1931 -163 -49 489 1909 -674 -2976 -308 1385 555 838 -691 -2679 -792 2765 1234
2297 1234 -1130 -777 -2201 -615 3237 1921 -2716 -2708 -635 978 2958 1885 -3603 -3270 1627 2880
2313 2880 1325 -61 -3348 -2728 2581 3716 -251 -1726 -1615 -1308 1641 3109 -258 -2015 -309 -691
2329 -691 203 2384 1194 -2466 -1445 62 160 2257 1644 -2949 -3049 1341 1919 700 -241 -2492 -2113
2346 -2113 2160 2749 -693 -1581 -583 -1264 971 2329 -960 -2429 -518 363 613 1989 127 -3112
2362 -3112 -1173 1613 1058 1172 -48 -2896 -1595 3025 2589 -422 -1532 -2040 -367 3560 2937 -2492
2378 -2492 -3061 -181 852 2133 1702 -1975 -2858 583 1237 565 1537 -260 -2552 -432 1936 664
2394 664 502 54 -2946 -1266 2722 2123 -1003 -1117 -1491 -829 2371 2208 -2097 -2321 25 298 1512
2411 1512 1812 -1648 -3002 853 1928 1017 713 -1677 -3037 692 3801 783 -1702 -1551 -1716 1427
2427 1427 3827 -144 -3363 -1638 1027 1494 1965 -195 -3188 -1184 2471 899 280 62 -990 -1653
2443 -1653 933 1276 136 934 -755 -2995 -42 3173 1176 -1092 -1892 -2115 845 3880 892 -3754
2459 -3754 -2044 721 1841 2050 -134 -3748 -1167 2746 1662 -398 -640 -1775 -863 2409 1303 -1593
2475 -1593 -866 -60 -704 1229 2103 -882 -2344 -39 326 1107 2019 -924 -3374 314 2199 885 535
2492 535 -963 -2618 -64 3017 807 -1038 -297 -1056 -921 2397 1398 -1056 -996 -845 -906 1963 2742 -997
2510 -997 -2971 -525 825 1627 1909 -1735 -3753 217 2836 1014 -603 -1190 -2158 419 2999 417
2526 417 -1589 -591 -523 -400 2366 703 -1805 -947 344 30 1300 1546 -2317 -2489 1302 1924 280
2543 280 -98 -1719 -1831 2086 3007 -551 -1381 -490 -530 1074 2133 -348 -1714 -290 -275 20 1767 953
2561 953 -1890 -1462 225 628 2007 1516 -2652 -3240 1270 2850 874 -367 -2829 -2170 2506 3321 -1214
2578 -1214 -2515 -391 272 1602 1732 -1637 -2642 752 1549 -345 560 -3 -1559 116 1262 92
2594 92 318 465 -1499 -1303 1930 1297 -456 -485 -1081 -1034 1931 2397 -1747 -2126 -207 229 1459 1592 -1345
2613 -1345 -2537 204 1386 797 840 -686 -2979 -332 2616 1290 -266 -634 -2504 -394 3458 1767
2629 1767 -1978 -1655 -261 806 2443 999 -2846 -1894 1607 1260 123 594 -1472 -1267 1295 1002
2645 1002 -519 288 28 -1650 112 1477 278 -587 -619 -1681 139 2799 1191 -2215 -1244 314
2661 314 975 1940 555 -3144 -1417 2107 1349 217 -348 -1726 -1760 1949 1908 -639 -505 -355 -1485 964
2679 964 2617 57 -1585 -1102 -739 1132 2637 143 -3446 -1172 1459 1709 1445 -480 -3190 -865
2695 -865 2896 1059 -837 -375 -883 -480 1569 801 -1230 -248 402 -826 374 1895 -38 -1345 -118
2712 -118 -282 483 2292 -124 -2956 -670 1854 921 623 -748 -2566 -476 2951 1010 -1362 -963
2728 -963 -1168 -20 2639 1208 -1892 -1437 22 16 1517 1592 -1829 -2626 583 1208 1079 740 -1319 -2578
2746 -2578 847 2402 -24 -953 -957 -1240 720 2436 -309 -1661 116 280 -633 1081 985 -1195 -461
2763 -461 240 -416 1033 2120 -1384 -2434 233 1340 1133 438 -1889 -2570 1218 3150 148 -2070
2779 -2070 -1288 -762 1701 2373 -1151 -2761 -67 1403 539 854 -237 -2131 -53 1375 535 209 345
2796 345 -1603 -1702 1328 1458 -135 -352 -1284 -1379 2004 2376 -877 -1715 -179 93 1300 2046 -686 -2244
2814 -2244 121 907 39 748 324 -2064 -498 1172 504 262 565 -1709 -1557 2221 1851 -537 -1100
2831 -1100 -1128 -688 2055 1858 -1926 -2156 480 846 1040 711 -1552 -2115 1066 1710 -271 -208 -951 -1774
2849 -1774 611 1606 -235 -839 -208 -1441 -573 2265 1299 -1802 -1222 -493 19 1394 977 -1944 -1756
2866 -1756 892 971 384 630 -946 -1532 832 1264 -303 160 23 -1884 -267 2321 365 -691 -525
2883 -525 -1396 -59 2374 906 -2184 -1493 648 1208 1760 48 -2670 -1062 2417 1672 -731 -1166 -1432
2900 -1432 -362 2107 1186 -1445 -789 457 -227 361 1392 -317 -1081 263 -245 -271 1841 88 -2197
2917 -2197 -842 734 915 1383 62 -2398 -1128 2091 1416 -436 -237 -1212 -1051 1880 2050 -1110 -1154
2934 -1154 -330 -566 1088 1626 -1028 -1858 141 888 493 1299 -671 -2145 115 1757 740 -486 -575
2951 -575 -1675 456 2339 269 -1585 -249 295 -166 1227 820 -1439 -793 291 -279 383 1330 -929
2968 -929 -1518 234 1030 608 762 -649 -2421 210 2248 664 -880 -944 -1732 187 2437 377 -1822
2985 -1822 -585 253 107 1501 713 -1620 -766 650 227 211 962 -1119 -1752 906 1346 -62 180 -886
3003 -886 -1688 848 2546 -391 -1377 -242 -6 861 1589 -286 -2243 -64 1340 76 347 -127 -1412
3020 -1412 -44 1208 -212 -135 480 -761 -1243 976 1360 -346 -186 -878 -1313 1182 2376 -874 -1638
3037 -1638 -616 38 1078 1843 -962 -2173 -283 1399 587 633 6 -1916 -276 1817 590 -472
3053 -472 31 -1299 -358 1482 860 -974 -631 246 -186 1262 1288 -1292 -1420 464 387 281 632 -792
3071 -792 -1447 551 1049 -205 -21 146 -1216 -239 1497 235 -306 -88 -1000 -478 1827 1157 -1489 -1362
3089 -1362 -174 301 1690 946 -2128 -1564 1131 1344 282 -196 -1697 -1155 1510 1577 -693 -660 -264 -956
3107 -956 310 1634 -426 -938 159 -363 -538 1472 776 -1405 -805 548 281 826 670 -1683 -1101
3124 -1101 1292 912 -484 175 -944 -827 1139 1525 -618 -930 74 -625 339 1411 -299 -1555 79
3141 79 275 428 1085 -76 -1868 -518 1379 976 473 -449 -1441 -667 2108 905 -1068 -534 -801 -334
3159 -334 1482 1347 -1667 -1158 254 99 477 1068 -953 -1320 761 775 88 805 -146 -1528 153 1192
3177 1192 32 -253 347 -1204 -242 1397 761 -1014 -187 -35 -330 1329 948 -1204 -1083 540 -10
3194 -10 480 845 -1103 -2040 763 1191 319 295 -703 -1417 630 2187 -63 -1458 -709 -758 643 1913
3212 1913 -207 -1734 -202 733 253 878 270 -1353 -578 1245 271 -36 181 -812 -719 718 881 -337
3230 -337 -179 -283 -1204 226 1851 209 -830 -589 -715 496 1809 -1 -2086 -316 887 262 1234
3247 1234 105 -1689 -360 1683 446 -446 -179 -808 -743 1392 1190 -877 -788 189 -213 1151 1197 -1249
3265 -1249 -1394 89 -42 648 915 -464 -1644 258 939 -358 257 -79 -1223 -95 1409 155 -387
3282 -387 5 -725 -714 1555 1005 -886 -644 -55 -223 1151 1260 -1120 -1819 479 853 329 737 -672
3300 -672 -1523 349 1215 -62 -192 -308 -1058 402 1869 -40 -874 -171 -328 -131 1219 541 -1415 -421
3318 -421 636 -7 503 602 -1202 -812 1068 641 -387 231 -410 -790 869 1279 -714 -417 287 -554
3336 -554 81 1260 104 -1163 169 182 -377 1412 821 -1374 -562 544 308 797 746 -1378 -1229 1277
3354 1277 1074 -162 -192 -761 -873 1129 1519 -878 -923 131 -34 897 1224 -708 -1268 344 648 -14
3372 -14 249 -273 -1513 49 1223 58 -231 339 -880 -278 1630 533 -898 -267 -232 -422 763 899
3390 899 -608 -827 216 -310 438 1109 -354 -1315 20 592 637 708 -665 -1563 -91 1580 440 -504
3408 -504 -517 -1183 218 1638 279 -1349 -511 76 -224 783 937 -1464 -1054 804 336 57 350 -811
3426 -811 -804 837 902 -664 -47 -88 -743 100 1236 95 -627 58 -385 -21 1523 195 -1357 -226 489
3445 489 -42 765 265 -1704 -770 1205 400 171 -79 -1219 -968 824 1208 -351 -381 -570 -689 753
3463 753 1696 -304 -1097 46 92 276 982 -295 -1528 -294 1093 151 382 120 -1166 -385 1441 474
3481 474 -607 76 -598 -453 1166 777 -1050 -129 33 -576 442 1032 -878 -1152 375 280 -80 675
3499 675 -323 -1458 196 1007 218 283 123 -1501 -150 1311 423 -656 -228 -705 -99 1507 731 -1368
3517 -1368 -823 -21 241 825 866 -1242 -1341 896 807 185 466 -480 -907 434 1327 -450 -491 -19 -602 103
3537 103 746 -129 -820 -35 -224 -347 792 434 -943 -413 410 148 466 601 -743 -1170 669 576 -53
3556 -53 261 -377 -1317 749 1572 -199 -747 35 -422 345 1222 -81 -1560 102 652 191 753 84 -1290
3575 -1290 -108 1137 188 8 46 -860 -453 1040 554 -573 -336 -224 -316 905 931 -481 -515 172 -213
3594 -213 457 1004 -506 -1043 346 427 -8 358 221 -1261 -140 1120 57 -173 -141 -419 -575 843
3612 843 743 -759 -649 -209 -349 924 1019 -1014 -1036 420 590 415 885 -1060 -1401 415 810 -84 47
3631 47 -317 -1102 252 1088 -253 -706 171 -388 -96 928 197 -1086 -61 84 -317 485 1139 -951
3649 -951 -635 528 378 66 687 -477 -1124 234 885 -376 176 -410 -1155 384 1233 22 -665 44
3667 44 -156 236 1229 127 -1263 -349 708 -198 816 244 -1023 -618 862 341 -371 -156 -611 -457
3685 -457 915 927 -831 -549 -290 -475 273 804 -322 -908 207 149 -70 678 143 -1054 -197 513 -124
3704 -124 480 99 -1119 -332 1023 567 -281 16 -894 -518 762 685 -679 -807 -281 -246 555 806 -975
3723 -975 -991 179 462 263 322 -530 -1129 369 817 -132 -398 -83 -797 -83 915 -210 -1033 -243 92 -26
3743 -26 735 155 -1003 -379 696 103 172 542 -504 -937 306 577 38 360 -360 -1040 187 1050 -271
3762 -271 -324 -13 -738 -154 1262 87 -966 -121 80 -110 991 200 -1198 -353 728 195 60 -36 -842
3781 -842 -580 965 572 -313 52 -303 -223 588 1053 -797 -665 316 14 32 747 -385 -1008 377 295 -94
3801 -94 242 212 -711 -508 774 119 1 359 -757 -425 981 573 -665 -323 -302 -396 325 787 -782 -953
3821 -953 211 -270 377 894 -252 -1065 -130 673 -110 122 -88 -1011 -348 1085 244 -337 -54 -399 -148
3840 -148 644 244 -936 -359 102 -9 710 452 -549 -622 714 96 -53 394 -527 -927 214 668 -110
3859 -110 -185 232 -536 159 1112 -150 -799 -167 -193 -128 1032 542 -1088 -201 340 -65 448 672 -763 -1007
3879 -1007 470 496 -233 -17 -698 -737 868 891 -398 -522 -24 -418 177 1002 -76 -999 208 350 -103
3898 -103 294 166 -789 229 660 -29 -33 351 -843 -442 514 343 -192 -190 -426 -651 351 841 -492 -255
3918 -255 29 -398 318 798 -504 -618 255 227 344 842 10 -1458 101 1101 204 175 195 -661 -159 1185
3938 1185 393 -482 -164 64 -381 406 570 -756 -708 427 91 121 281 -549 -777 333 549 -74 239
3957 239 -133 -507 -174 848 204 -224 -59 -753 64 799 313 -652 -90 11 -324 388 426 -1067 -715 766
3977 766 189 280 338 -844 -810 439 477 13 51 -293 -421 234 1147 -195 -594 -20 -277 39 1342 -90
3997 -90 -952 -308 290 111 675 279 -913 -22 685 -138 -18 402 -588 -496 216 260 -413 13 -35 -284 466
4018 466 854 -457 -623 51 5 37 850 -26 -789 -58 408 14 201 168 -642 -205 950 350 39 1 -440
4039 -440 -332 961 584 -606 -158 167 1 381 537 -583 -550 297 404 100 567 -479 -880 97 881
4058 881 -142 -89 -13 -369 -162 1069 241 -229 122 -236 -197 700 540 -596 -125 -47 -332 445 852 -697
4078 -697 -567 161 114 509 223 -302 -946 396 640 66 -18 -107 -836 264 589 -130 -475 -268 -111 25
4098 25 849 135 -862 -48 363 -30 197 167 -708 -758 854 384 -172 -70 -206 -547 440 464 -412 -255 -152
4119 -152 -441 -56 900 -213 -675 -20 -134 -204 639 119 -749 -337 361 253 305 363 -716 -587 899 497
4139 497 -270 95 -147 -588 658 586 -455 -544 3 -173 -59 850 -401 -908 36 290 -230 225 -17 -1137
4159 -1137 -36 704 -285 -381 -120 -251 -104 705 47 -429 -256 -32 -333 622 478 -672 -254 100 -42
4178 -42 255 673 -266 -1030 298 626 -231 285 -138 -656 -24 780 -18 -290 -2 -438 -107 962 241 -687
4198 -687 -185 194 -5 716 218 -710 -143 697 320 7 176 -198 -630 587 410 -292 -175 -68 -385 321
4218 321 408 -127 -461 180 -133 179 762 131 -752 -102 527 55 183 77 -789 -112 364 227 -88 424
4238 424 -303 -434 313 415 -259 -358 131 -328 118 795 -227 -707 309 -262 46 544 -188 -722 -120 612
4258 612 -186 -171 -47 -697 -293 606 -121 -598 -214 -339 -252 598 286 -536 67 347 -103 -59 431 -422 -708
4279 -708 116 -41 -52 548 -29 -676 76 862 58 214 -9 -641 -93 651 331 -644 -217 -38 -180 677
4299 677 571 -459 -319 238 -174 189 185 -396 -556 638 426 -75 40 19 -323 332 897 -126 -399 19
4319 19 -354 -185 771 -26 -925 58 103 -285 602 312 -514 -347 634 115 75 217 -456 -789 349 534 -164
4340 -164 -190 -208 -699 471 552 -227 -574 388 -108 37 925 -101 -588 17 43 -162 322 246 -500 -500 577
4361 577 35 -66 -54 -382 -99 914 419 -598 70 257 -270 158 547 -385 -644 -32 162 71 551 -154
4381 -154 -533 215 360 -162 114 107 -624 -306 490 -10 19 252 -450 -211 632 164 -325 -102 -8 -310 82
4402 82 565 -845 -324 115 139 218 298 -465 -754 28 515 -3 -172 -84 -372 472 573 152 -456 321 -191
4423 -191 54 496 246 -691 -104 105 -124 453 299 -638 -122 462 240 -78 471 -245 -696 166 674 -86
4443 -86 42 -99 -381 104 669 -59 -431 144 -310 69 782 321 -710 -287 412 148 -46 110 -608 -624
4463 -624 669 24 -181 36 -54 -478 489 611 -502 31 293 -212 31 647 -168 -711 408 252 -118
4482 -118 427 54 -780 120 789 -260 -2 380 -355 -310 748 304 -391 -35 30 -487 653 454 -610
4501 -610 -196 294 -207 247 490 -439 -691 415 379 -155 170 -127 -622 218 711 -135 -395 271 -165 -176
4521 -176 748 -242 -631 20 214 -144 433 191 -791 -569 427 -100 98 375 -340 -342 5 618 -423 100
4541 100 2 -504 260 466 38 -267 370 -259 -270 504 -36 -634 102 11 174 658 151 -557 -348 412 -108
4562 -108 -128 -16 -551 -367 339 533 -279 -195 188 -439 433 584 -720 -657 41 59 -172 405 -108 -807 381
4583 381 293 -246 338 105 -390 -227 733 -114 -150 208 -301 -72 479 279 -467 -128 251 -196 376 871 -681
4604 -681 -541 518 190 -187 556 -182 -652 412 387 -233 138 -109 -594 23 703 161 -293 -6 -202 -216
4624 -216 261 139 -428 10 297 -180 370 479 -531 -618 191 -77 -182 218 -198 -432 99 587 -154 16
4644 16 250 -453 348 650 12 -420 153 120 -152 355 274 -391 -6 105 -162 -78 464 -559 -510 657 93
4665 93 -339 286 -171 -601 604 667 -307 -38 292 -178 -128 363 -192 -695 -28 149 -49 763 175 -453 -12
4686 -12 556 231 114 132 -633 -18 561 134 -96 210 8 -412 478 464 -745 -47 123 -206 231 531 -80
4707 -80 -342 197 143 -74 312 31 -823 -258 683 94 -139 -72 -161 -135 745 60 -408 52 97 -343 611 267
4729 267 -500 -286 376 113 -283 460 -117 -439 146 79 -286 302 142 -556 -53 389 321 247 509 -40 -39 595
4751 595 122 -490 -388 -103 -128 215 206 -679 -484 543 -56 40 135 -349 -805 132 449 -72 -61 -45 -416 467
4773 467 488 -209 -586 29 -267 74 87 -65 -249 192 128 -107 275 36 -184 -351 510 134 -217 346 -40
4794 -40 -445 172 199 -254 35 -59 -363 195 517 -140 -248 102 -89 117 502 -219 -572 193 466 -119 139
4815 139 146 -333 -174 409 92 -287 -95 -522 -329 356 55 -289 -229 -87 0 298 561 -136 -215 5 168 -168
4837 -168 129 -291 -615 152 770 32 15 109 -354 -57 502 -83 -341 175 -113 -371 348 435 -404 9 187
4858 187 -190 -93 317 -228 -496 459 189 109 -115 234 -531 -115 585 -306 -109 83 -354 -5 645 -135 -327
4879 -327 -176 284 -154 587 -7 -301 -203 514 -14 -19 -14 -497 -152 230 206 -436 29 -3 -404 350 247 -395
4901 -395 -63 6 -211 -179 547 -152 -383 -59 -213 -402 100 198 -719 -204 566 28 -98 106 -160 49 486
4922 486 260 -490 -103 61 -309 41 398 -303 -186 249 -151 -157 278 82 -490 -117 17 -148 195 5 -373
4943 -373 -285 476 -71 -34 26 -480 81 490 112 -502 -89 -75 -421 410 611 -206 -292 109 130 322 532 145
4965 145 -749 -14 177 -68 289 15 -322 81 484 -90 -358 -120 -193 -101 280 118 -383 10 -64 -252 154
4986 154 320 -393 -604 369 43 -175 325 -465 -797 251 136 -478 -215 169 -489 152 615 -69 -391 70
5006 70 121 -6 271 313 -728 -46 335 -145 165 229 -282 -6 334 24 158 392 -159 -231 414 290 -266
5027 -266 -134 0 -453 175 465 -247 -619 144 123 -217 456 -92 -741 28 338 -206 -171 -75 -292 -36 442
5048 442 62 -115 370 -331 -580 426 481 -506 -114 171 -154 -76 376 -178 -487 288 78 -333 216 -231
5068 -231 -646 35 350 -104 118 60 -394 -14 423 140 -248 -72 -149 -399 155 184 -410 -184 58 155 200 195
5090 195 -535 -182 341 -37 97 21 -1 -436 234 320 -216 -3 32 134 -356 505 124 -367 -80 14 243 302
5112 302 153 -399 -195 619 307 25 -113 -463 -206 407 338 -562 183 -124 -113 176 219 -197 -393 260 -370
5133 -370 -420 296 7 -228 -23 195 -236 98 -18 -347 23 396 546 -153 -116 -326 -386 357 384 -86 -102 -166
5155 -166 -282 290 441 -323 -169 92 -33 -69 62 76 -503 321 -248 -179 11 -152 -692 -176 327 -394 -26
5176 -26 127 -177 -194 495 -113 -374 -59 87 -58 154 402 -489 -464 227 292 -34 200 8 -461 34 263
5197 263 -23 -285 121 -571 -11 420 -161 -466 397 127 -154 392 288 -451 -163 -41 -92 -114 291 -428 -396
5218 -396 320 75 248 124 23 -277 282 328 -91 92 -32 -455 -74 377 -108 -493 -155 261 240 136 -61
5239 -61 -384 -48 564 -78 9 -15 -238 -46 362 -240 -195 253 -144 -846 34 200 -229 47 -79 -307 -238 270
5261 270 -464 -539 55 90 -82 197 93 -347 44 567 -175 -194 -31 -25 -140 274 -114 -372 112 55 -400 -109
5283 -109 471 -254 -106 -34 -187 8 170 -112 -299 168 211 -150 12 127 -331 -121 394 -107 226 66 -242
5304 -242 9 640 115 -518 192 -118 218 359 172 -575 -205 166 -6 -80 404 -545 -330 385 280 -156
5324 -156 -151 136 -125 16 159 -420 29 583 -92 -291 419 197 -9 352 318 20 371 305 -354 -101 183
5345 183 70 185 83 -438 -367 242 150 -396 47 -56 -480 147 373 -309 -244 158 -163 -138 139 22 -129
5366 -129 72 490 -255 198 -4 -250 -44 293 -19 -342 277 -197 -490 383 218 -356 -155 -103 -326 -5
5386 -5 62 -368 -36 289 -114 -314 372 62 -434 134 131 -239 218 -283 -407 132 155 -211 -213 118 160 101 339
5409 339 360 -149 -171 109 -60 -46 306 -28 -390 348 48 -12 -69 -207 -269 121 717 -53 -120 -291 -763 -177
5431 -177 398 129 -394 6 138 -78 258 -120 -560 90 402 -48 -33 6 -211 -203 263 76 -80 286 71
5452 71 -446 -15 470 -198 315 -3 -341 -128 338 266 -259 37 -132 -175 238 -56 -356 -35 164 76 -16 163
5474 163 -103 -308 375 58 -233 137 183 -165 -13 127 -241 -10 117 -295 -77 496 40 -137 217 128 -148
5495 -148 -70 156 -337 111 402 -4 -117 295 -135 -375 522 41 -286 4 132 -113 217 294 -420 -217 85
5516 85 -12 -172 161 -88 -201 246 -6 -198 25 -87 -208 78 508 -3 -2 94 -158 -83 457 -192 -399 -67
5538 -67 -190 -437 512 113 -70 -507 -139 -111 153 140 -199 -351 379 291 -393 21 -216 -238 374 410 -297 -289 89
5561 89 204 -75 -64 285 -50 204 158 -190 303 294 -193 -401 101 32 -382 193 -234 -420 263 403 -83 -335
5583 -335 244 -326 182 325 -264 -49 54 60 225 119 -448 -313 312 56 -26 113 163 -31 -141 527 -108
5604 -108 -163 -1 -67 -368 27 326 -260 -121 208 -384 280 24 123 -367 -97 -20 -10 112 0 -406 120 306
5626 306 -139 -67 16 -405 -165 476 233 -524 -22 5 -313 388 155 -543 -374 -29 186 -310 330 -157 -292
5647 -292 218 152 -196 35 -120 -241 -79 288 -52 -33 43 -268 59 141 -407 -178 51 42 121 296 331 -483 -311
5670 -311 96 237 54 -41 -276 -142 385 15 -374 201 352 -310 -234 394 -137 314 225 -254 107 270 129
5691 129 -288 -65 43 70 61 78 -336 -136 360 -105 79 188 -410 -243 -88 197 -98 308 166 -266 224
5712 224 143 -274 -81 144 67 33 299 173 -131 16 -325 -240 111 270 -224 -214 457 -76 -333 431 -75 -24
5734 -24 241 269 -336 -62 -13 -43 293 208 -430 -576 191 -98 -203 95 -245 -514 108 230 -51 -44 -54 -402 139
5757 139 308 -208 -192 217 86 -277 164 62 -385 -11 379 -148 -168 646 -76 -137 -191 98 42 224 -203 -411
5779 -411 54 440 -96 1 212 -239 329 147 -275 -474 226 60 86 92 -54 -325 39 443 -34 64 256 -133
5801 -133 -143 349 -294 -47 230 -9 0 98 335 -412 -59 -18 -79 31 178 -360 -318 149 226 -226 96 -59 -296
5824 -296 303 309 -219 125 213 -57 -102 103 86 -321 98 29 -224 25 118 -358 -15 298 -275 -150 400 -12
5846 -12 -188 9 -224 216 183 106 -136 189 179 35 -91 -114 -219 -375 262 112 -137 -197 22 -144 495 38
5868 38 -154 103 303 -205 -55 125 77 -341 76 217 -239 -27 173 -51 127 90 -393 -112 -92 -260 19
5889 19 480 13 -237 -195 87 -297 164 183 -385 54 616 -338 65 196 -388 -110 461 272 -359 -18 -269
5910 -269 -212 15 29 -52 -254 138 184 -199 61 -7 86 101 178 27 -29 33 -298 -156 84 -324 -116 36 -267
5933 -267 -328 127 199 -362 -51 26 -224 196 404 -298 -194 147 143 155 148 -37 -173 107 -170 -211 -23 95 56
5956 56 45 92 269 -398 76 -106 -264 143 -15 -308 264 53 -158 103 -187 99 -150 67 113 53 4 -398
5978 -398 -416 -115 85 -47 54 -118 77 330 452 -122 14 -149 -66 57 25 268 -185 -139 72 -54 70
5999 70 -54 -279 -163 252 31 -184 300 174 -174 343 -135 -248 8 91 -288 -93 147 -226 49 -57 140
6020 140 21 -37 257 -422 59 217 -360 -223 229 -157 -182 145 -197 -208 -181 -182 -35 264 127 -183 102 197
6042 197 173 -52 165 169 -209 35 4 -105 167 4 -243 51 261 -142 214 -21 -330 123 28 112 -315 152
6064 152 94 63 229 44 -432 -145 317 -310 107 137 101 -149 14 64 -462 383 -177 -284 68 56 -31 -264
6086 -264 178 210 -208 720 380 52 -57 -172 45 29 42 -80 -46 -35 -135 -143 -205 -217 -293 138 -98 -178 -210 -62
6110 -62 -79 -66 167 -344 61 160 -132 51 234 150 -75 -171 119 -80 12 -111 -345 -209 26 -141 -171 118 -138
6133 -138 -281 157 198 -574 -133 -58 -158 27 50 -114 -54 89 -387 -23 77 10 -157 -131 -105 84 296 22
6155 22 -16 -61 183 84 -326 249 -108 -183 207 -116 90 -102 -66 -110 205 344 -68 -42 225 -56 223 278 -349
6178 -349 -568 213 235 -134 -75 90 323 -37 218 -31 -1 144 236 -152 421 278 -252 34 -273 -153 264
6199 264 69 -63 -585 211 -66 17 35 -184 -548 149 74 -73 199 -241 -348 -305 0 -346 -244 379 240
6220 240 -217 132 -303 -421 -291 124 -576 -85 165 -79 31 170 -389 -200 168 60 -410 215 92 -57
6240 -57 -52 257 -402 -191 386 13 -303 -195 161 -208 212 48 -345 33 313 -14 -177 17 -173 -179 -99 5
6262 5 -243 -218 223 -307 368 16 -327 -189 149 -513 34 418 -103 -30 -123 120 -65 203 -10 83 25 114 -43
6285 -43 45 306 -345 -153 182 50 0 32 -95 -290 -80 21 -431 -392 -107 -149 -208 149 -197 -373 171 88 -367
6308 -367 -470 -55 -45 -52 -153 -67 238 134 -91 -230 432 130 -57 -16 340 -331 92 139 -367 -94 39 -168
6330 -168 -134 84 -91 -189 26 415 -88 138 161 -1 112 5 -117 -413 229 159 42 164 494 -180 87
6351 87 -60 -170 23 200 -256 -140 -62 -85 162 -269 264 -174 285 218 -229 -147 -30 -328 149 214 229 -219
6373 -219 192 129 -17 -272 187 -355 231 299 -149 83 21 -275 -127 302 -10 -104 -54 -132 -216 258 147 107 176
6396 176 -114 49 64 85 -9 -290 78 -86 -79 238 -255 -2 -276 237 160 104 62 -32 -80 617 -108 -46 151 -101
6420 -101 -218 -37 61 -386 55 160 86 71 251 -73 23 -47 -162 9 60 -24 -434 -272 286 -212 -143 106 130
6443 130 -285 312 328 -347 -97 -206 -160 0 111 -177 -132 201 228 243 -77 -168 -59 199 75 -101 295 -240
6465 -240 -232 -47 212 -207 -343 -158 237 12 117 104 -252 55 20 -285 76 66 -406 19 234 104 -192 84
6487 84 8 -112 307 26 -297 -71 89 -11 330 -114 -181 -174 -155 275 -122 148 -54 -573 238 -127 -222 -72
6509 -72 351 292 -288 359 78 163 -199 26 -220 134 -47 -464 72 207 -215 31 353 -414 -115 206 -287
6530 -287 35 -115 113 -62 462 18 -161 -265 275 -211 -33 233 -41 -25 190 183 199 53 204 -64 87
6551 87 -264 22 108 -175 -230 37 166 131 -69 52 33 -259 96 97 30 -247 79 -112 148 493 141 -161 123
6574 123 128 -147 -193 -78 -159 78 407 -144 -111 41 -343 -51 49 46 252 105 19 -161 58 242 -20 -36 111
6597 111 -233 90 150 -230 -179 112 23 -216 152 193 -409 290 183 -4 185 -209 -306 -95 66 185 -384 -124
6619 -124 -60 -151 132 73 21 -129 -194 154 53 -35 -316 -230 79 126 19 203 134 -197 132 220 -227 -282 85 99
6643 99 57 75 6 -69 66 298 -246 -139 63 -376 -215 244 -169 68 83 23 -220 66 217 78 -212 13
6665 13 49 -98 92 59 33 81 -106 -169 242 -159 -408 -28 36 -154 513 227 -9 81 89 266 -405 -77 -390
6688 -390 -148 71 259 -134 -108 -229 -161 49 -362 -153 18 83 277 -212 2 -144 -135 -38 111 -99 67 326
6710 326 -28 -217 91 55 10 97 -70 3 -135 45 -258 423 154 -134 226 195 333 -268 79 -5 -1 422 -100
6733 -100 -165 130 -145 -15 87 209 45 -221 228 -40 -100 207 361 -11 42 126 -78 -151 -25 75 -115 16
6755 16 -153 -23 194 -42 -218 -105 34 -115 360 32 -108 -138 123 177 178 322 -103 -37 125 -80 -474 130
6777 130 138 -3 110 309 -157 -1 172 119 66 68 -19 -81 214 -323 -129 344 78 -201 107 -123 -439 -281 193
6800 193 -51 -252 79 -49 -296 79 32 -152 45 131 103 53 191 103 -77 267 458 79 2 -42 131 -85
6822 -85 53 -134 -123 172 12 -285 0 -275 -336 221 -247 -105 -2 205 -1 -77 187 -330 -57 -101 -153 -149 68
6845 68 -20 -340 -236 253 -20 -273 42 207 -179 533 138 -226 132 91 -22 -130 179 -58 -286 114 -101
6866 -101 94 125 -323 -122 304 82 -352 170 154 38 -32 -76 117 79 89 -134 -291 140 -47 202 -144 -20
6888 -20 -453 -89 -88 -196 69 134 34 116 167 -240 79 116 -131 91 170 166 47 186 -38 95 17 -120 148 -124
6912 -124 232 -104 41 165 -279 76 111 -91 193 -83 -22 -70 154 53 -197 -114 15 152 -74 55 133 -49
6934 -49 188 164 -6 -155 -103 82 97 140 39 31 29 -51 -66 -84 -20 -41 94 -110 -47 -164 135 -333 -123 -7 -268
6959 -268 -15 -114 -35 37 286 91 -149 -255 143 -36 -50 508 37 -199 80 251 -312 280 -11 -206 229
6980 229 58 67 237 -95 -217 -85 136 274 -38 20 32 115 -376 -90 234 189 152 -95 105 392 62 121 -54
7003 -54 149 52 69 -62 -200 50 -3 -140 -121 -180 -137 25 -6 183 12 -218 61 -14 -84 90 -175 -309 194
7026 194 50 -237 -67 204 21 -83 10 -97 -81 23 193 -51 83 -204 153 156 -77 -438 198 -183 -38
7047 -38 7 -127 -146 66 157 -125 -24 2 -246 -150 -28 -215 96 445 15 -353 -53 -259 -91 26 19 241 246
7070 246 254 -164 -173 172 164 -390 61 -103 -161 100 74 -12 -106 -100 -78 96 171 -126 -222 42 156 -156 59 237 -88
7095 -88 -71 126 -170 -94 176 154 -198 -149 257 -302 -60 -228 8 30 6 -394 -392 95 85 -29 -266 -204 -161 57
7119 57 189 -66 -165 135 109 72 316 -61 -323 17 -97 -181 302 -161 -469 281 147 -236 184 199 -146 41
7141 41 -118 -181 -79 170 -199 -337 12 161 -99 -208 -30 -190 9 236 183 -40 48 88 -38 346 146 -138
7163 -138 11 135 -40 -66 104 23 68 345 -10 -94 225 211 -209 1 -53 1 -149 97 -117 52 351 -17
7185 -17 -274 -59 173 -226 -42 -71 150 -163 315 405 -88 -19 82 -200 380 77 -304 -240 -144 -15 387 42
7207 42 -168 259 -17 -11 -36 365 -35 -51 248 -97 -141 100 -21 -197 -33 292 188 -76 -194 -33 95 141
7229 141 -87 72 -143 -286 -340 208 -32 13 -99 116 -7 69 22 -94 -152 63 225 -71 97 -97 -121 -172
7251 -172 11 99 -136 37 33 3 -385 184 -46 46 143 -67 75 159 70 202 -45 146 -320 -82 -46 -159 192
7274 192 51 -127 -366 104 -31 244 196 -310 242 43 -30 -103 181 75 28 -217 193 -218 -70 159 -555
7295 -555 119 1 3 -32 380 10 -381 212 228 -31 132 28 -48 165 -45 -168 -27 -66 -32 24 -24 -446 -36
7318 -36 -10 -55 90 -179 105 -44 -85 467 -206 -400 111 212 -185 82 100 119 0 -207 -8 -138 -36 165
7340 165 30 20 -30 16 95 -12 -157 103 79 -191 18 -89 98 -168 101 -322 27 326 64 -24 391 203
7362 203 -160 -43 195 140 -110 103 -167 16 394 24 -96 209 -40 -313 -20 -33 -215 48 99 124 27 169
7384 169 99 -134 317 160 -51 111 -143 -93 202 -94 203 221 260 -57 -234 -101 37 6 165 160 60 118 57
7407 57 -8 -4 7 -104 -5 88 -103 -221 304 180 -182 -312 -474 -198 8 61 -153 106 111 -16 171 -32 179
7430 179 20 -31 -123 445 -30 374 -467 -118 -33 -36 -209 41 -21 2 240 196 -179 6 -159 -97 -87 -170 50 158
7454 158 90 103 -240 30 130 -115 135 -27 -28 -246 144 -2 -147 89 125 -82 -40 -100 -277 -84 -35 58 -65
7477 -65 8 8 -55 207 79 96 132 -201 -127 131 -94 9 -142 164 -17 100 24 62 125 32 -421 58 -12 -345
7501 -345 -111 135 308 57 -57 110 -368 15 75 -195 88 263 367 -289 108 -67 -61 138 -46 294 -28
7522 -28 151 57 178 60 -11 210 -234 209 -147 83 71 -109 289 153 234 -2 -29 -20 -12 239 -17 -37 83 -167
7546 -167 -152 -48 464 -135 3 259 207 -128 -115 -182 -157 246 -39 17 114 -25 288 129 170 -148 15 182 -14
7569 -14 99 -19 64 105 -148 -291 -269 -15 31 98 107 31 -207 -17 -45 -6 -104 -107 44 -316 -44 -177 240 -167 179
7594 179 68 -127 -282 -27 -218 278 -94 -347 -18 167 -7 -116 194 -383 150 -304 25 -19 -95 -10 -261
7615 -261 -48 166 -10 193 36 -58 -24 56 172 -269 4 191 -214 84 62 -83 17 -7 137 -46 -42 110
7637 110 131 389 -75 51 136 51 -304 120 -215 -71 289 -35 -128 109 -56 7 -20 205 85 -88 -68 -46 105
7660 105 -31 187 -190 30 32 -322 -21 -74 54 21 208 136 -138 -226 16 -70 -93 32 281 -7 449 -145 -64
7683 -64 74 89 -18 -57 3 -250 124 -25 -78 21 -209 -121 -109 -7 -158 25 -148 -231 97 -22 168 51 55 73
7707 73 -93 81 155 -333 -186 92 65 196 45 94 -167 67 82 -444 -57 -24 -138 22 -159 105 -406 0
7729 0 -143 59 53 -12 -344 6 -141 -111 8 368 89 -273 282 320 10 96 174 14 97 6 -393 -46 -80 -184
7753 -184 -103 -91 187 209 -98 -27 171 110 28 174 225 -17 219 -40 20 -86 -5 47 -50 -176 110 84 104 -150
7777 -150 -173 136 -227 37 303 -211 96 48 -25 -187 237 -38 -26 140 328 -287 -7 -233 172 366 -50
7798 -50 -307 -116 201 -67 284 87 -251 -98 -40 -246 54 -97 -149 86 129 100 108 56 141 101 -156 127 -171
7821 -171 28 -54 79 201 126 -191 -371 216 -10 -125 108 135 -137 -27 149 -225 51 147 330 5 212
7842 212 57 -85 222 -9 -188 243 -178 89 -187 250 -199 9 -321 146 197 -420 -129 55 207 -83
7862 -83 -153 15 135 -169 310 105 296 100 94 -145 -328 153 -5 34 379 -193 101 68 378 -21 119 -52
7884 -52 83 -107 -135 259 -14 96 -8 39 -77 -61 157 -6 -157 -93 37 -64 222 -275 -8 26 -101 -14
7906 -14 148 -56 -256 -263 -38 -177 191 34 -186 -177 62 -108 144 191 -216 -82 209 -72 31 148 194 -75
7928 -75 94 14 87 92 191 94 99 -94 14 -7 2 62 143 55 -46 -19 -221 -43 67 -16 -77 -6 -109 153 61 224 268
7955 268 -173 -112 -7 -18 172 -56 -65 -198 -303 287 -99 126 313 -177 289 -156 -141 -75 -92 140 117 -274 223
7978 223 20 -120 -103 -258 -228 -95 28 -66 3 -274 71 73 396 -93 -57 -318 183 -26 -78 -231 -448 194 -51
8001 -51 -21 178 74 -133 21 -206 81 -117 -213 60 82 -142 52 -71 157 226 -33 -18 210 303 -196 40
8023 40 -149 -58 -70 -164 -4 3 254 -139 110 66 -221 -112 -229 74 107 101 -4 -122 72 -215 -91 4 48 -33
8047 -33 -193 -188 -388 176 304 33 -392 -19 136 181 47 47 -192 115 204 -182 175 126 -384 41 -47 106 -113
8070 -113 -7 -30 -10 18 -126 -82 -68 260 -83 -59 -207 -53 174 153 -233 -195 53 43 -58 -11 -215 -74 388
8093 388 123 -100 -58 -568 164 57 31 36 -211 267 -86 -29 -387 29 -74 -155 -77 84 -85 -106 -129 -21 254
8116 254 -103 -110 280 -101 -51 -41 152 -172 -85 -74 132 -17 -25 -231 53 -85 188 44 112 435 -27 47 -42 32
8140 32 98 3 136 -39 4 140 6 -261 64 151 59 209 -173 49 81 -57 -80 148 -72 -127 -35 229 -150
8163 -150 193 -130 130 -42 69 -29 13 -50 -53 -241 299 -28 -178 186 279 76 -40 109 -213 -254 -146 240
8185 240 47 -87 -117 -107 -217 -140
8191a40
##END NTUPLES=NMR FID
##END=
