##TITLE=1H_CA-8616-1
 DMSO, 8 sc, 
 28.6.2019
##JCAMPDX= 6.0         $$ Bruker NMR JCAMP-DX V2.0
##DATA TYPE= NMR FID
##DATA CLASS= NTUPLES
##ORIGIN= UXNMR, Bruker Analytische Messtechnik GmbH
##OWNER= root
$$ XWIN-NMR		Version 3.5
$$ Fri Jun 28 15:25:02 2019 Russian Standard Time (UT+4h)  she@DPX200
##.OBSERVE FREQUENCY= 200.13155
##.OBSERVE NUCLEUS= ^1H
##.DELAY= (6, 6)
##.ACQUISITION MODE= SIMULTANEOUS
##.ACQUISITION SCHEME= undefined
##.AVERAGES= 8
##.DIGITISER RES= 18
##SPECTROMETER/DATA SYSTEM= spect
##.PULSE SEQUENCE= zg30
##.SOLVENT NAME= DMSO
##.SHIFT REFERENCE= (INTERNAL, DMSO, 0, 15.7039)
##AUDIT TRAIL= $$ (NUMBER, WHEN, WHO, WHERE, WHAT)
$$ ##TITLE= Audit trail, XWIN-NMR		Version 3.5
$$ ##JCAMPDX= 5.01
$$ ##ORIGIN= Bruker BioSpin GmbH
$$ ##OWNER= she
$$ F:/spectra/data/she/nmr/H-F/1/audita.txt
$$ ##AUDIT TRAIL=  $$ (NUMBER, WHEN, WHO, WHERE, WHAT)
(   1,<2019-06-28 15:24:00.85 +0400>,<she>,<DPX200>,
      <created by zg, POWCHK disabled, PULCHK disabled
       configuration hash MD5:
       00 E9 B6 7A A2 85 ED C7 34 08 36 98 17 FE 4E 26
       data hash MD5: 16K
       24 DA 11 0D AE C2 C6 E7 80 14 E5 B0 93 4C 1D CA>)
$$ ##END=
$$ 
$$ hash MD5
$$ DD D0 D4 87 62 8B AD EF 05 2D 3D BF 61 BE 84 ED
##$RELAX= 
##$RELAX= 
##$RELAX= 
##$RELAX= 
##$RELAX= 
##$RELAX= 
$$ Bruker specific parameters
$$ --------------------------
##$DU= <F:/spectra>
##$EXPNO= 1
##$NAME= <H-F>
##$PROCNO= 1
##$TYPE= <nmr>
##$USER= <she>
##$AMP= (0..31)
100 100 100 100 100 100 100 100 100 100 100 100 100 100 100 100 100 100 
100 100 100 100 100 100 100 100 100 100 100 100 100 100 
##$AQSEQ= 0
##$AQ_mod= 1
##$AUNM= <au_zg>
##$AUTOPOS= <>
##$BF1= 200.13
##$BF2= 200.13
##$BF3= 200.13
##$BF4= 200.13
##$BF5= 200.13
##$BF6= 200.13
##$BF7= 200.13
##$BF8= 200.13
##$BYTORDA= 1
##$CFDGTYP= 0
##$CFRGTYP= 5
##$CHEMSTR= <none>
##$CNST= (0..31)
1 1 145 1 1 1 1 1 1 1 1 1 1 1 1 1 1 1 1 1 1 1 1 1 1 1 1 1 1 1 1 1 
##$CPDPRG= <>
##$CPDPRG1= <>
##$CPDPRG2= <>
##$CPDPRG3= <>
##$CPDPRG4= <mlev>
##$CPDPRG5= <mlev>
##$CPDPRG6= <mlev>
##$CPDPRG7= <mlev>
##$CPDPRG8= <mlev>
##$CPDPRGB= <>
##$CPDPRGT= <>
##$D= (0..31)
0 1.2 0 0 0 0 0 0 0 0 0 0.03 0 0 0 0 0 0 0 0 0 0 0 0 0 0 0 0 0 0 0 0 
##$DATE= 1561721040
##$DBL= (0..7)
120 120 120 120 120 120 120 120 
##$DBP= (0..7)
150 150 150 150 150 150 150 150 
##$DBP07= 0
##$DBPNAM0= <>
##$DBPNAM1= <>
##$DBPNAM2= <>
##$DBPNAM3= <>
##$DBPNAM4= <>
##$DBPNAM5= <>
##$DBPNAM6= <>
##$DBPNAM7= <>
##$DBPOAL= (0..7)
0.5 0.5 0.5 0.5 0.5 0.5 0.5 0.5 
##$DBPOFFS= (0..7)
0 0 0 0 0 0 0 0 
##$DE= 6
##$DECBNUC= <off>
##$DECIM= 24
##$DECNUC= <off>
##$DECSTAT= 4
##$DIGMOD= 1
##$DIGTYP= 9
##$DL= (0..7)
0 120 120 120 120 120 120 120 
##$DP= (0..7)
150 150 150 150 150 150 150 150 
##$DP07= 0
##$DPNAME0= <>
##$DPNAME1= <>
##$DPNAME2= <>
##$DPNAME3= <>
##$DPNAME4= <>
##$DPNAME5= <>
##$DPNAME6= <>
##$DPNAME7= <>
##$DPOAL= (0..7)
0.5 0.5 0.5 0.5 0.5 0.5 0.5 0.5 
##$DPOFFS= (0..7)
0 0 0 0 0 0 0 0 
##$DQDMODE= 0
##$DR= 18
##$DS= 0
##$DSLIST= <SSSSSSSSSSSSSSS>
##$DSPFIRM= 0
$$ [...]
##$SUBNAM2= <"">
##$SUBNAM3= <"">
##$SUBNAM4= <"">
##$SUBNAM5= <"">
##$SUBNAM6= <"">
##$SUBNAM7= <"">
##$SUBNAM8= <"">
##$SUBNAM9= <"">
##$SW= 24.9336996594482
##$SWIBOX= (0..15)
0 0 2 0 0 0 0 0 0 0 0 0 0 0 0 0 
##$SW_h= 4990.01996007984
##$TD= 16384
##$TD0= 1
##$TE= 0
##$TE2= 300
##$TE3= 300
##$TEG= 300
##$TL= (0..7)
0 120 120 120 120 120 120 120 
##$TP= (0..7)
150 150 150 150 150 150 150 150 
##$TP07= 0
##$TPNAME0= <>
##$TPNAME1= <>
##$TPNAME2= <>
##$TPNAME3= <>
##$TPNAME4= <>
##$TPNAME5= <>
##$TPNAME6= <>
##$TPNAME7= <>
##$TPOAL= (0..7)
0.5 0.5 0.5 0.5 0.5 0.5 0.5 0.5 
##$TPOFFS= (0..7)
0 0 0 0 0 0 0 0 
##$TUNHIN= 0
##$TUNHOUT= 0
##$TUNXOUT= 0
##$USERA1= <user>
##$USERA2= <user>
##$USERA3= <user>
##$USERA4= <user>
##$USERA5= <user>
##$V9= 5
##$VALIST= <valist>
##$VCLIST= <CCCCCCCCCCCCCCC>
##$VD= 0
##$VDLIST= <DDDDDDDDDDDDDDD>
##$VPLIST= <PPPPPPPPPPPPPPP>
##$VTLIST= <TTTTTTTTTTTTTTT>
##$WBST= 1024
##$WBSW= 4
##$XGAIN= (0..3)
0 0 0 0 
##$XL= 0
##$YL= 0
##$YMAX_a= 311006
##$YMIN_a= -526050
##$ZGOPTNS= <>
##$ZL1= 120
##$ZL2= 120
##$ZL3= 120
##$ZL4= 120
##$ABSF1= 10
##$ABSF2= 0
##$ABSG= 5
##$ABSL= 3
##$ALPHA= 0
##$AQORDER= 0
##$ASSFAC= 0
##$ASSFACI= 0
##$ASSFACX= 0
##$ASSWID= 0
##$AUNMP= <proc_1d>
##$AZFE= 0.1
##$AZFW= 0.1
##$BCFW= 1
##$BC_mod= 2
##$BYTORDP= 1
##$COROFFS= 0
##$CY= 11.3945322036743
##$DATMOD= 1
##$DC= 2
##$DFILT= <>
##$DTYPP= 0
##$F1P= 18.9103706918063
##$F2P= -1.10871071338519
##$FCOR= 0.5
##$FTSIZE= 0
##$FT_mod= 4
##$GAMMA= 1
##$GB= 0.15
##$INTBC= 1
##$INTSCL= 1
##$ISEN= 128
##$LB= 0.24
##$LEV0= 0
##$LPBIN= 0
##$MAXI= 10000
##$MC2= 0
##$MEAN= 0
##$ME_mod= 0
##$MI= 1.114404
##$NCOEF= 0
##$NC_proc= 0
##$NLEV= 6
##$NOISF1= 3.799351
##$NOISF2= 2.8
##$NSP= 1
##$NTH_PI= 0
##$NZP= 0
##$OFFSET= 15.70392
##$PC= 1
##$PHC0= -8507.678
##$PHC1= 20.40097
##$PH_mod= 1
##$PKNL= yes
##$PPARMOD= 0
##$PSCAL= 0
##$PSIGN= 0
##$REVERSE= no
##$SF= 200.130013532006
##$SI= 16384
##$SIGF1= 3
##$SIGF2= 2
##$SINO= 400
##$SIOLD= 16384
##$SREGLST= <1H.CDCl3>
##$SSB= 0
##$STSI= 0
##$STSR= 0
##$SW_p= 3612.71676300578
##$SYMM= 0
##$S_DEV= 0
##$TDeff= 0
##$TDoff= 0
##$TI= <>
##$TILT= no
##$TM1= 0
##$TM2= 0
##$TOPLEV= 0
##$USERP1= <user>
##$USERP2= <user>
##$USERP3= <user>
##$USERP4= <user>
##$USERP5= <user>
##$WDW= 1
##$XDIM= 8192
##$YMAX_p= 0
##$YMIN_p= 0
$$ End of Bruker specific parameters
$$ ---------------------------------
##NTUPLES= NMR FID
##VAR_NAME=  TIME,          FID/REAL,        FID/IMAG
##SYMBOL=    X,             R,               I
##VAR_TYPE=  INDEPENDENT,   DEPENDENT,       DEPENDENT
##VAR_FORM=  AFFN,          ASDF,            ASDF
##VAR_DIM=   8192,          8192,            8192
##UNITS=     SECONDS,       ARBITRARY UNITS, ARBITRARY UNITS
##FACTOR=    0.0002004,     1,               1
##FIRST=     0,             0,               0
##LAST=      1.6414764,     0,               0
##MIN=       0,             -526050,         0
##MAX=       1.6414764,     311006,          0
$$ Real data points
##PAGE= N=1
##DATA TABLE= (X++(R..R)), XYDATA
0@%%%%Qj6J6j6K4l2M0n6P2q8J04j25J50j78K15k55K97l48M06m68N38o20P09q08
$$ 0 0 0 0 0 8 -8 8 -8 16 -16 24 -32 40 -48 56 -69 81 -97 118 -137 160 -188 218 -250 288 -332 377 -431
28d31R19j039J173j323J485j661J857k073K307k563K849l162L503l878M292m753
$$ -431 488 -551 622 -701 784 -877 980 -1093 1214 -1349 1500 -1662 1841 -2037 2255 -2498
44b498N266n837O478p203Q031q987J0103j1426J3027j5010J7542k0905K5618l2757
$$ -2498 2768 -3069 3409 -3794 4237 -4750 5353 -6073 6954 -8056 9486 -11419 14199 -18558
58a8558M4974p1446K24963k19345l81597M58077K44812j75445j72258R9211k9735
$$ -18558 26416 -45030 179933 -39412 -421009 37068 281880 106435 -65823 33388 3653
69C653q4135M2687J15100m8151o2587M757l0398r7859R3127J91649n9367k50146
$$ 3653 -80482 -37795 77305 29154 -33433 -28676 -59074 -156933 -63806 127843 68476 -181670
81a81670p167J60653K8677q513O7534j08900j83251J34909K68200q4814k27292
$$ -181670 -188837 -28184 493 -8020 59514 -49386 -232637 -97728 170472 85658 -141634
92a41634O5740J70097p4118j14425J15913J45374r1869j56965L7604J28834K1681
$$ -141634 -75894 94203 20085 -94340 21573 166947 75078 -81887 -44283 84551 106232
103A06232k0602o711p9528n8204J14892R7898q8944o7862M6485l5482o6856R6810
$$ 106232 85630 78919 -609 -58813 56079 153977 65033 -2829 43656 8174 -58682 38128
115C8128R1284r9805r6054K7705l858j6117J13783P1143j82412j91841J31076
$$ 38128 129412 29607 -66447 -38742 -42600 -58717 55066 126209 -56203 -248044 -116968
126a16968K50417m5637k20986Q626J39698o0684r0549J42443J11135j44434j17294
$$ -116968 133449 87812 -133174 -124548 15150 -45534 -136083 6360 117495 -26939 -144233
137a44233P2315O4346L3868Q0836m3890j89071j2456K13015R6282j16383q4276
$$ -144233 -71918 -7572 26296 107132 63242 -125829 -138285 74730 171012 54629 -29647
148b9647K4691J873r96J00744O4284j39638j31935J18066J29429j03989p0409
$$ -29647 -4956 -3083 -4079 96665 160949 21311 -110624 7442 136871 32882 -37527
159c7527J30933q48k01878r60K19284L3080j69314o8330M8310K5382L3866M4379
$$ -37527 93406 92558 -109320 -110280 109004 142084 -27230 -95560 -47250 -21868 11998 56377
171E6377n4851j07772P755J05072K3652o9182o257M6655m4969o0330Q2969Q6602
$$ 56377 1526 -106246 -98491 6581 30233 -38949 -45206 1449 -43520 -103850 -20881 65721
183F5721o8013n8691M6451j2571m2877J01583R0427j19997j18683Q6172J05239
$$ 65721 -2292 -60983 -14532 -27103 -69980 31603 122030 2033 -116650 -30478 74761
194G4761k8794l3198K7359j8128o4545J7626R5766K4071p2443l7371J3853j9443
$$ 74761 45967 12769 40128 22000 -42545 -24919 70847 94918 22475 -14896 -1043 -20486
206b0486J4347J03986Q509j50384o0290J04440N5679k4446R842k9878j07362P234
$$ -20486 -6139 97847 106356 -44028 -104318 122 55801 31355 41197 11319 -96043 -88809
218h8809J39597L8600j02380n5677L0408Q567q109N1485M9724p0517j07800L3733
$$ -88809 50788 89388 -12992 -68669 -38261 -29694 -37803 13682 63406 -7111 -114911 -81178
230h1178J13893J1937m6330k133l5008n7746P6644J22718m9811j20444J2210O2088
$$ -81178 32715 44652 -1678 -3811 -38819 -96565 -19921 102797 52986 -67458 -55248 6840
242F840j432J4078M0883l5893p5017R922P3374K7270k8862j7101n288l3847m951
$$ 6840 5408 19486 60369 24476 -50541 -40619 32755 60025 31163 14062 8774 -25073 -30024
255c0024Q0925M5855q4325o6957M8851L0125k5213L2235L1542p7339n8890O2759
$$ -30024 50901 96756 12431 -54526 -5675 24450 -763 31472 63014 -14325 -73215 -10456
267a0456N1990k8761j2930J0339l8105l9712M1553P1455n612p2896l2492L1334
$$ -10456 41534 12773 -157 10182 -27923 -67635 -26082 45373 39761 -33135 -65627 -34293
279c4293K2010Q407L1930j1761p7950j0029P8035K1311l2687J5710J541o7998
$$ -34293 -12283 -3876 28054 16293 -61657 -71686 6349 27660 -5027 10683 12224 -55774
291e5774n052R6914M4783n7903n4751m862K2881M5474M0675j8888p2779l7647
$$ -55774 -60826 36088 80871 22968 -31783 -36645 -13764 31710 72385 53497 -19282 -56929
303e6929N8203P2361j7927n3124J688N46l2051K9992O9696k2091p6677j1304K2369
$$ -56929 1274 73635 55708 2584 4272 4818 -27233 2759 72455 50364 -26313 -37617 -15248
316a5248R820L8225K3662o6178p4997K7803Q0668K5866m4844n3723r657K6342
$$ -15248 -5428 32797 56459 -9719 -84716 -56913 23755 49621 4777 -48946 -58603 -32261
328c2261K9559K2532q904m7105j7203L9249J3906j7374K9405K5628o0208m4451
$$ -32261 -2702 19830 10926 -36179 -53382 -14133 -227 -17601 11804 37432 -22776 -67227
340f7227N8119O0662j4306l2302j5186r382J8965M0154J0774k7536k9158J5K1881
$$ -67227 -9108 51554 37248 4946 -10240 -19622 -657 39497 50271 22735 -6423 -6408 15473
353A5473J1888k927P618l601m0375j5778M2046K5421j6933j2913k3076l4889K6360
$$ 15473 27361 24434 32052 28451 -11924 -27702 14344 39765 22832 9919 -13157 -48046 -21686
366b1686O6120p536o5359k1224K2446J5949J1787P950j1545k8630k1482J6413
$$ -21686 44434 36898 -28461 -49685 -27239 -11290 497 8447 -3098 -31728 -53210 -36797
378c6797M8650J9813l3837l5587q414J7133M9691L4105m4720o0015J7581M7897
$$ -36797 11853 31666 -2171 -37758 -46172 -29039 20652 54757 10037 -49978 -32397 15500
390A5500J1773K847j985l3927k2144K7631L6350R575j2841l1190k4776J2687L6470
$$ 15500 27273 30120 28135 -5792 -27936 -305 36045 45620 32779 1589 -23187 -10500 25970
403B5970K6242j1235n2734l4462L5539M8290n033k6556j7015k0593K354L9620
$$ 25970 52212 40977 -11757 -46219 -10680 37610 32577 6021 -10994 -31587 -29233 10387
415A0387J5713k7997j9335k881m469J1894K4636L243j7096k2628j4376K3164M2196
$$ 10387 26100 -1897 -21232 -24113 -28582 -16688 7948 11191 -5905 -28533 -42909 -19745 22451
428B2451K042l4908k0253N208K1811K7887k218k8304m563J2312n191L744K7995
$$ 22451 24493 -10415 -30668 -25460 -3649 24238 22020 -6284 -10847 1465 -3726 18 28013
441B8013M005k8518k0301L274K4616L0551o882m1089j6714J6755J7685J4974K801
$$ 28013 32018 3500 -16801 -13527 11089 41640 34758 -6331 -23045 -6290 11395 26369 29170
454B9170k8311k7565Q711K1024J5316O941k1872l5386m57K7796K0633O920j6419
$$ 29170 859 -26706 -17995 3029 18345 25286 3414 -31972 -32429 -4633 16000 22920 6501
467F501l9015j2399L4356L3612K978k2047l7703j1907M0704L6239j0415k4208
$$ 6501 -32514 -44913 -10557 23055 26033 3986 -33717 -45624 -4920 31319 20904 -3304
479c304j5722j0341J6700L5658O816k2571k1379j1377R389L5614J9894k3696l2619
$$ -3304 -19026 -29367 -12667 22991 29807 7236 -14143 -25520 -16131 19483 39377 15681 -16938
492a6938j1154J7935L5824J1390l0752k4035N926P471J1348K0113p268l1480o377
$$ -16938 -28092 -10157 25667 37057 6305 -17730 -11804 -4333 7015 27128 19860 -11620 -17997
505a7997J3528O487J2417R118k1563k6396N913K2521J4335j304j9210j7114L153
$$ -17997 -4469 2018 14435 23553 1990 -24406 -18493 4028 18363 17059 -2151 -19265 -16112
518a6112J1818J2784J0686j3727k8719J945K0617K884M369R861k1643k9553J4901
$$ -16112 -4294 8490 19176 5449 -23270 -21325 -708 2176 6545 16406 -5237 -34790 -19889
531a9889L2150N798q645j4407k1331J884L1483K1076j1362k7195j5580J2753K5213
$$ -19889 12261 18059 9414 -4993 -26324 -24440 7043 28119 16757 -10438 -26018 -13265 11948
544A1948P778l618p421k4173j1781L2957L1503j5082k2691q516r801J2080M0959
$$ 11948 19726 16108 8687 -15486 -27267 5690 37193 22111 -580 -9096 -18897 -6817 34142
557C4142N864m3220k5764J5438K1865J2540j58j6918k1800p112J6461K9442L457
$$ 34142 40006 -3214 -28978 -13540 8325 20865 20707 3789 -18011 -25123 -8662 20780 24237
570B4237l0075j8745N534N585J5008K4485j6213m6197m7L9054J0519q449j101
$$ 24237 -5838 -24583 -19049 -13464 1544 26029 9816 -36381 -36428 2626 13145 4696 3595
583C595j3958j8548J4734L0026M837j7466j4464j094Q475Q858J1949P168j9611
$$ 3595 -10363 -28911 -14177 15849 20686 3220 -11244 -12338 -3863 4995 16944 24112 4501
596D501k6666J3507L0856j402j0094K221j6395j6426K5831K8236j8307k3018M355
$$ 4501 -22165 -8658 22198 20796 10702 12923 -3472 -19898 5933 34169 15862 -7156 -2801
609b801N98o848J2967J6825r412k5685j1597J3926K0299L625q544j2892k0347
$$ -2801 -2203 -9051 3916 20741 11329 -14356 -25953 -12027 8272 11897 3353 -9539 -29886
622b9886J626L7171J7566l1529k0765J2484J672m75K8317R220l6912k1518K1768
$$ -29886 -28260 8911 26477 -5052 -25817 -13333 -11661 -12136 16181 25401 -11511 -33029 -11261
635a1261K2743O605l47j3446k2274k356K8267K8388q739l4801j1490J6922J0481
$$ -11261 11482 18087 17740 4294 -17980 -20336 7931 36319 27580 -7221 -18711 -1789 8692
648H692Q619J4150j8723m1038O797M1651N210j9364k930r353j9487J4377L4645
$$ 8692 17311 31461 12738 -28300 -21503 20148 25358 5994 3064 -6289 -25776 -11399 23246
661B3246p17l0262j7620O005J4351J1525M950q001k2948j1613K3997K5094j2045
$$ 23246 22529 -7733 -25353 -19348 -4997 6528 11478 3477 -19471 -31084 -7087 18007 5962
674E962j4816P238q790j4676K6427K9759k1522k9730Q505J2858L99J1472P728
$$ 5962 -8854 -1616 -10406 -25082 1345 31104 9582 -20148 -11643 1215 1614 13086 20814
687B0814j9218j8911R529K0311M774q225m633l861j2411N19K9495J2005l1279
$$ 20814 1596 -17315 -7786 12525 17299 9074 4441 580 -11831 -11312 18183 30188 -1091
700a091j9032J4703N243j926J9884J812l7848j3872L0549J7727q914n130o155
$$ -1091 -20123 -5420 -177 -2103 17781 19593 -18255 -32127 -1578 16149 7235 2105 -4050
713d050j6877k21K6690J9220j4507k8263m961J6254R972P253J0228j9605l5297
$$ -4050 -20927 -21148 5542 24762 10255 -18008 -22969 -6715 3257 10510 20738 1133 -34164
726c4164J1656M3663M213k4025n429m667j2123J9778L1658r815l3146p387J2779
$$ -34164 -22508 21155 25368 1343 -4086 -8753 -20876 -1098 30560 20745 -12401 -19788 -7009
739g009J0096R983N490j3053k5909m515L0288K2708j8003k2082M284J009m821
$$ -7009 3087 13070 18560 5507 -20402 -24917 5371 28079 10076 -12006 -7722 -6713 -11534
752a1534K1714J7238k7496k5036J7037J4849m878O808N702k2017j5768J8526K1791
$$ -11534 10180 27418 -78 -25114 -8077 6772 1894 8702 14404 -7613 -23381 -4855 16936
765A6936l638j4759m640K48l102N753J9548K88k7931q835J9706N459o785J2777
$$ 16936 13298 -1461 -6101 -5853 -8955 -3202 16346 16634 -11297 -20132 -426 5033 -1752 11025
779A1025J296l1481p351L2467J2704j5482o301j268j1973L976K5000R465k0399
$$ 11025 12321 -19160 -26511 5956 18660 3178 -3123 -4391 -16364 -12388 12612 22077 1678
792A678k0238M242J5720O720L106L737j7294k4310J4740L7281j740k4505m328
$$ 1678 -18560 -14318 1402 8122 11228 14965 -2329 -26639 -11899 25382 23642 -863 -5191
805e191r15p953J9310K7656j7395l4416O43J9680O829L407J874j4464k1175L063
$$ -5191 -6106 -14059 5251 32907 15512 -18904 -18261 1419 8248 11655 13529 -935 -22110 -19047
819a9047K8057J5333j9330k1141K586M236J867J9317R061l1463k1199K3409J9970
$$ -19047 9010 24343 5013 -16128 -13542 -9306 -7439 11878 20939 -10524 -31723 -8314 11656
832A1656q163l49K870j9304r466K4479K0028j0936j6985j789L946K515Q771J1989
$$ 11656 3493 3144 6014 -13290 -22756 1723 21751 10815 -6170 -7959 -4013 -1498 7273 19262
846A9262o998k4396k702K4053P263j1560K470J037k0166k092K8601O609k0752
$$ 19262 12264 -12132 -14834 9219 16482 4922 7392 8429 -11737 -13829 14772 21381 629
859F29p176L536o320M272J9026J089k1931j3000Q401J3345M058j799k538j2674
$$ 629 -6547 -3011 -9331 -5059 13967 15056 -6875 -19875 -11474 1871 5929 4130 1592 -11082
873a1082j2845J4341K7305m634k2779k686L287k970J6652K1066j7794k9741N719
$$ -11082 -23927 -9586 17719 13085 -9694 -12380 -9093 -12063 4589 25655 7861 -21880 -16161
886a6161K0636O359K314n21j6253j4967J2239K5045O057j8493j6418K152O576
$$ -16161 4475 10834 13148 12627 -3626 -18593 -6354 18691 24748 6255 -10163 -8011 -1435
899a435O026J5023L80l0249j6178K5410J9496j1061n626j09j7691m276K6542J3924
$$ -1435 4591 19614 19994 -10255 -26433 -1023 18473 7412 1786 1677 -16014 -20290 6252 20176
913B0176j8054j6865J693N474M858Q740M766j2535j9419M844K3902N766j3993
$$ 20176 2122 -14743 -13050 -7576 -2718 6022 10788 -1747 -21166 -16322 7580 13346 -647
926f47k342J644j1421M078K5190J103k3807l263J0911k263J967J4428j706k0184
$$ -647 -2989 -1345 -12766 -8688 16502 17605 -6202 -9465 1446 -817 1150 15578 13872 -6312
940f312p207J2883J2240l80n924n127o946m406J2109J7592p587k0567j347P510
$$ -6312 -13519 -636 11604 11224 5300 173 -6773 -11179 930 18522 10935 -9632 -10979 -3469
954c469p10Q398J2533j5006k3229O826J9309L189j657l218j3750q565J4316J9649
$$ -3469 -4179 4219 16752 1746 -21483 -14657 4652 7841 6184 2966 -10784 -19349 -5033 14616
968A4616L41j7807j2154M578J0207O415O799k536k1450j0606K1663J8061p962
$$ 14616 14957 -2850 -15004 -10426 -219 6196 12995 10459 -10991 -21597 66 18127 10165
981A0165q788m081j1030K917K4369Q283k0595j4888M518P592O778O391l654j3956
$$ 10165 1377 -2704 -13734 -10817 13552 21835 1240 -13648 -9130 -1538 5240 11631 7977 -5979
995e979r858Q029J8134L063j3241o269K68l877P466J8697m342k3218l171J4088
$$ -5979 -15837 -7808 10326 13389 148 -6121 -5853 -9730 -2264 16433 12091 -11127 -14298 -210
1009b10L349Q58N491p466j3932K524J2942N063k944m589n174l423J694J0772Q921
$$ -210 3139 3997 9488 2022 -11910 -9386 3556 8619 5675 1086 -4088 -7511 -5817 4955 13876
1024A3876q958j6295R66J0806J777L140M483j2529j4848J0937J5387k014m254
$$ 13876 4918 -11377 -10411 395 2172 5312 9795 -2734 -17582 -6645 8742 6728 2474
1037B474j689r257m931J3488J3813l245j3964r137L714J1610P835M13p839j4735
$$ 2474 785 -8472 -13403 85 13898 10653 -3311 -12448 -8734 2876 10711 11124 3285 -11450
1051a1450k554J8468J3514r787r904k059n741L802J9325M467j9042j2475M860
$$ -11450 -14004 4464 17978 8191 -1713 -3772 -9513 -5711 13614 18081 -961 -13436 -8576
1064h576Q157Q210M352q598j4689m155J1284J5061Q54j4779r742L583M785N812
$$ -8576 -419 7791 12143 3545 -11144 -15299 -4015 11046 11900 -2879 -12621 -9038 -4253 1559
1078A559R341n473j8070j368J3157O053PJ549r489j0543P470J4206K379o383o612
$$ 1559 10900 5427 -12643 -14011 -854 5199 5206 6755 -2734 -13277 -5807 8399 10778 4395 -2217
1093b217l671K687P209N138O09p582r300K148J0145K423j735q4q403p960Q960
$$ -2217 -5888 -3201 4008 9146 9755 2173 -7127 -4979 5166 7589 5854 5770 -2633 -10593 -1633
1108a633J2055l291p077l191n610R19J1720N520p717q870l637K806R136O384l812
$$ -1633 10422 7131 54 -3137 -8747 -7828 3892 9412 1695 -7175 -10812 -8006 1130 7514 3702
1123C702p962p650j50J3840J0779p364j1130k424O81O735J3774J04j6087q046
$$ 3702 -4260 -11910 -12060 1780 12559 5195 -5935 -8359 -7678 -943 12831 12935 -3152 -11198
1137a1198O853P907P271J845j0377j1599K002J1292Q496lj1683j0516K749R234
$$ -11198 -4345 3562 10833 12678 2301 -9298 -7296 3996 12492 12489 806 -9710 -6961 2273
1151B273O173K690q476j4618J70J3736N505k529m009r135n313R837J0767j831
$$ 2273 8446 11136 2660 -11958 -11788 1948 7453 4924 915 -8220 -13533 -3696 7071 5240
1165E240p274n372k919N509R206J510n343n056l923L100R836L363n264l795l296
$$ 5240 -2034 -7406 -10325 -4816 4390 5900 557 -4499 -8422 -5322 4514 7877 2613 -1182 -4478
1180d478q72Q289P794m759o993j157n92K557Q949P46q612m724k03K520P196L509
$$ -4478 -5350 2939 10733 5974 -1019 -2176 -2768 -211 8738 9484 872 -3852 -4055 -1535 5661 9170
1196I170o605p941j370K531P465O104o445j0834r96M196N464P043k804j2033m756
$$ 9170 2565 -5376 -6746 -4215 3250 9354 2909 -7925 -8921 -4725 739 7782 4978 -7055 -11811
1211a1811O590P198M690n12j0171q395O224J0052M527j320q982r271N051J1830
$$ -11811 -5221 1977 6667 6155 -4016 -12411 -6187 3865 8392 7072 -1910 -11181 -6130 5700
1225E700L803k603o984q358J103J2012O385m609o892o561k05R561Q074l876p330
$$ 5700 9503 6900 -84 -8442 -7339 4673 11058 6449 -443 -7004 -7209 2352 10426 6550 -780
1240g80n288j950O979R626j796r242l670O5L226Q600J808r309n394K003K781N003
$$ -780 -6068 -8018 -1039 8587 6791 -2451 -6121 -6056 -2830 5770 7578 -1731 -7125 -5122 -2341 2662
1256B662M050m985o886k98L244M288M622k866p599j039L139K257M934J670r193
$$ 2662 6712 1727 -5159 -5457 -2213 2075 6697 3831 -3768 -4807 -1668 589 5523 7193 -2000
1271b000m611M258L397K241L055m116q990M93O863L971Q48k909p807k712O158
$$ -2000 -6611 -2353 1044 3285 6340 2224 -6766 -6273 590 4561 5409 2500 -5307 -8019 -1861
1286a861O066K066k804q840m096P667O820O11j693o470p520M813J2543J427o760
$$ -1861 4205 6271 3467 -5373 -9469 -1802 5018 5629 3936 -2534 -10054 -5241 7302 8729 1969
1301A969m060m105N49R870O561n886q509l802K769Q669N539n104p705l403O77
$$ 1969 -2091 -6196 -5647 4223 10784 4898 -3611 -7413 -4644 4025 9564 4460 -3245 -6648 -5971
1316e971P445Q086n334r979q45K659K962O245J768j0242o733N592N677K312O97
$$ -5971 1474 9560 4226 -5753 -6598 -3939 -977 5268 7036 -3206 -9939 -4347 1330 3642 4339
1331D339m635o706Q73O584M689K33n430n550K378M426J366K507j57q012k948P447
$$ 4339 -296 -7002 -6129 455 5144 5377 -53 -5603 -3225 1201 2567 5074 4917 -3095 -6043 1404
1347A404L902k030P40k327p016J148Q916J427m611k543k610p72M445M006r1m161
$$ 1404 5306 3276 4016 1689 -5327 -4179 4737 6164 1553 -990 -3600 -4372 73 4079 3988 -173
1363a73o390o73P395L853k252j637l646n785M936J0860m03q722j868n1N20P209
$$ -173 -6563 -7236 159 4012 1760 123 -3523 -9308 -4372 6488 6085 -2637 -4505 -4556 -4036 3173
1379C173N674o097q997K05N312O093K049m053n795k570K455P534O424p360r635
$$ 3173 8847 2750 -6247 -6042 -730 5363 7412 3359 -2436 -5006 -2551 4983 11407 4047 -5588
1394e588J310N222J172M556N69j0327o579P783P686k067k310k941n747J398P898
$$ -5588 -4278 944 2116 6672 7241 -3086 -9665 -1882 5804 3737 1427 -1514 -7261 -5863 2035
1409B035L597l591o747l116M050N359L83j41j934o490l63R563L563o212m56L91
$$ 2035 5632 2041 -4706 -7822 -3772 1587 1970 1829 -105 -6595 -6958 2605 6168 -44 -500 -109
1425a09m663K737R148m03p572j719J836J075K419K736j639m638l094K374O113
$$ -109 -4772 -2035 7113 6710 -862 -2581 -745 330 2749 5485 3846 -792 -3886 -1512 4601
1440D601J098m405j681j269l275M054P910k627r070j67K850l17L679M482o369
$$ 4601 5699 1294 -387 -1656 -4931 -877 7033 4406 -4664 -4831 -1981 -2298 1381 5863 -506
1455e06p884K157O534K574p2l254m532j154L844O664K926p081p850L864N968L06
$$ -506 -8390 -6233 301 2875 2803 -451 -4983 -6137 -2293 4371 7297 216 -7634 -3770 2198 2504
1471B504K037Q07r125m353R570P175l807l822j799l920J898Q418K782o528o902
$$ 2504 4541 5348 -3777 -8130 1440 8615 4808 986 -813 -4733 -2835 5583 8365 1837 -5065
1486e065n42N191M285j76k471k920m955J838R596J002p951j801K116k526K147
$$ -5065 -5607 -416 3869 3693 1222 -1698 -6653 -4815 4781 5783 -2168 -3969 -1853 -4379 -2232
1501b232Q430j863r566r16N309K204N56J162k849m007K18M148M714j297n072j064
$$ -2232 6198 4335 -5231 -6147 -838 1366 1922 3084 235 -3772 -3554 594 5308 4011 -1061 -2125
1517b125J580o84K487N248l793p886K117N088j040P54L125n441o504M193O749
$$ -2125 -545 -1229 1258 6506 2713 -5173 -3056 2032 992 1746 4871 -570 -7074 -2881 3868
1532C868k86k783k138k601J0L385M327M36n899n614M133N790J0q9j085o037k801
$$ 3868 3582 799 -1339 -3940 -3930 -545 3782 4218 -1681 -7295 -3162 2628 2638 2549 1464 -4573 -7374
1549g374R212O171n806m255M31k284K217P789R12p465n300K073N072L553o91l482
$$ -7374 1838 8009 2203 -2052 -1621 -3905 -1688 6101 7013 -452 -5752 -3679 1393 4946 4255 773
1565G73l735k572L378Q284n5q629k571L416n8J869N984l380r837R57O835K043
$$ 773 -2962 -5534 -2156 6128 6073 -2556 -5127 -1711 -1769 100 6084 2704 -7133 -6176 659 2702
1581B702j005J93l710l365K662N553J920l408m331m58L120R74J959K068m322o263
$$ 2702 1697 1890 -1820 -5185 -2523 3030 4950 1542 -2789 -3247 -127 847 2806 4874 552 -5711
1597e711M237O051k072j988K283l845m221N159N246k634l516r22m13K36L331K390
$$ -5711 -1474 4577 2505 517 2800 -1045 -5266 -107 5139 2505 -1011 -1933 -2346 -2110 1221 3611
1613C611k166m934k445M149M563r12j803o82m199j026Q174M628o791m376K153
$$ 3611 1445 -3489 -5934 -1785 2778 1866 63 -619 -4818 -5844 2330 6958 167 -4209 -2056
1628b056k62J201O595P2p765l311L626N054J760j156l889l374K53M179O110j263
$$ -2056 -2318 -1117 5478 5550 -2215 -5526 -1900 3154 4914 3758 -131 -3505 -3252 927 7037 5774
1644E774q351k030M020J611Q17L627m150q210J633P932J183k628j027l579k558
$$ 5774 -2577 -4607 -587 1024 1841 5468 1318 -6892 -5259 2673 3856 1228 201 -3378 -5936
1659e936M111N765q52m336l636R86L587J878L91K32m453l860M817O521k632l402
$$ -5936 -1825 3940 3088 -1248 -4884 -3898 -311 1567 1958 2190 -2263 -6123 -1306 5215 2583 -819
1675h19R92j637j954N567M544m815l666M24J424R41K594J54l204l524K08M126
$$ -819 173 -1464 -3418 2149 6693 1878 -1788 -1364 60 1001 3595 3749 545 -2979 -2771 1355
1691A355K811k235k896l29k032M00N835J893o279l722K947R04O44M024m78o996
$$ 1355 4166 1931 -965 -1294 -3326 -2926 2909 4802 -1477 -5199 -2252 -1348 -704 3320 2842 -4154
1707d154j887M894L648lj173k906k648J149M681M174j980o790j759M791K388P34
$$ -4154 -6041 -1147 2501 2498 1325 -1581 -4229 -3080 1601 5775 3795 -2995 -4754 37 2425 3159
1723C159J463l358o935K292P887N81l385j630k563j690M960M960k172n609k524
$$ 3159 4622 1264 -5671 -3379 4508 5089 1704 74 -2489 -4179 781 5741 3569 -2040 -4564
1738d564J445L885J930r08k022l524j372M536N439k621n132M52N42q43M918K540
$$ -4564 -3119 766 2696 1788 -234 -3758 -5130 -594 4845 2224 -2908 -2456 -1914 -2757 2161 4701
1754D701n546l934K967K161J002J569q94l448j349K305L026J557k791k952J91
$$ 4701 -845 -4779 -1812 349 1351 2920 2026 -1422 -2771 -466 2560 4117 1326 -1626 -1435
1769a435J082L37L709M84n778k476L908J212j70J660j117n504q00N334K434j605
$$ -1435 -353 -16 3693 4177 -1601 -4077 -169 1043 873 2533 1416 -4088 -4888 446 2880 1275
1785A275j309k964j262K637L509J566k649m560q24M273L089o78k16k570m523K973
$$ 1275 -34 -2998 -4260 -1623 1886 3452 803 -3757 -4581 -308 2781 2103 1887 -683 -5206 -2233
1801b233O648N6l914j783r30k83M195L816k900n232q59K105L394K246k411l102
$$ -2233 4415 4471 557 -1226 -2156 -2439 1756 5572 2672 -2560 -3419 -1314 2080 4326 1915 -1187
1817a187k389J19M478M113l440n089R6J865P27L277J365n684l832L524L286O38
$$ -1187 -3576 -3457 1021 5134 1694 -3395 -3299 -1434 -707 2570 3935 -1749 -5581 -2057 1229 1867
1833A867J29j742l507K96L356K482o2k633k749O58K780J067J033p24m085j896
$$ 1867 1996 254 -3253 -2957 399 2881 2819 186 -2563 -1905 875 1942 2975 2251 -1834 -3730
1849c730M514K145j354j71j237l059N79M325J171k152j733j563n80L033K232n34
$$ -3730 784 2929 1575 1404 167 -2892 -2313 2012 3183 1031 -702 -2265 -2845 188 2420 1886
1865A886k400k496p05L676K676j291j530j806j894K502M926k38l839j706J09M50
$$ 1886 -514 -3010 -3715 -39 2637 1346 -184 -1990 -3884 -1382 3544 3306 -533 -2239 -2130 -1680
1881a680L965K658m068l825R1K902K854J590k641l970l65J829L001K237k384n220
$$ -1680 2285 4943 875 -2950 -2859 43 2897 4487 1846 -2124 -2489 -660 2341 4578 2194 -3026
1897c026j35K740K060J455o44m959k595M030L364m31p13k306l227J382M253J281
$$ -3026 -3161 -421 1639 3094 2450 -2509 -5104 -1074 2290 1859 1146 -1160 -4387 -3005 1248 2529
1913B529j479k343k109J101L274J108l90j504k676m47L686K479j701j530m73j662
$$ 2529 1050 -1293 -3402 -2301 973 2081 1691 187 -2489 -2936 750 3229 1528 -2 -475 -2137
1929b137J621L893l57k828j182m96M85L121J072j986j997j424N11K773J903k270
$$ -2137 -516 3377 3020 192 -990 -1486 -1001 2120 3192 1206 -791 -2215 -1704 1069 2972 702
1945G02k104m92l6J511K838o24l947r82J157J370K305P72l085k544Q27J941K549
$$ 702 -1402 -1894 -1930 -419 2419 1795 -2152 -3134 -1977 -607 1698 2470 -615 -3159 -2332 -391 2158
1962B158N92k621l379J124K650K012Q01k008l663l83L098K126P92j256l621k104
$$ 2158 2750 129 -3250 -2126 524 2536 3337 1329 -2334 -2717 381 2507 3299 2043 -1578 -3682
1978c682L751L056k80j936k122k191K447L433K83k227k231j875J320L726J469
$$ -3682 69 3125 2845 909 -1213 -3404 -957 2476 2759 532 -1699 -3574 -2254 1472 2941
1993B941k671k461q49P93K960K100k051k519j25J61K072K379o31l245m13R74Q38
$$ 2941 270 -2191 -3040 -2247 713 2813 762 -1757 -1882 -1721 351 2730 2099 -1146 -1559 -585 253
2010B53K176J57k812j333J047J99J710J729k247k564L55J400P59J672j050l328
$$ 253 2429 2586 -226 -1559 -512 -313 1397 3126 879 -1685 -1330 70 829 2501 1451 -1877
2026a877l76J445J116J342j52k634j866J634J583J231N97l062k675J569L099Q91
$$ -1877 -2253 -808 308 1650 1498 -1136 -3002 -1368 215 1446 2043 -1019 -3694 -2125 974 1865
2042A865q1j718l092J86L750K042j115j753k144l69K786L153j021k480j985n01
$$ 1865 1784 66 -3026 -2840 910 2952 1837 84 -2060 -2429 357 3510 2489 9 -1976 -2477
2058b477K862K911n64k648j349j020J329L590P13l647k128M55J004K233J341k521
$$ -2477 385 3296 2732 84 -1265 -2285 -956 2634 3347 -300 -2428 -1973 -969 1264 2605 84
2074H4k912K97J436J994J096j778k440j00J262J665J443o44k937p57J554J749
$$ 84 -2828 -2531 -1095 899 1995 217 -2223 -2323 -1061 604 2047 1403 -1534 -2291 -737 1012
2090A012L51O69k223k245J697K173K92L8j177j926n31K438J194j18j058j959o14
$$ 1012 1363 2032 -191 -2436 -739 1434 1726 1764 587 -1339 -1870 568 1762 1644 586 -1373 -1987
2107a987K044J149K25q12j940j310J794K386l82j033j093j270K38K987J328j790
$$ -1987 57 1206 1431 619 -1321 -2631 -837 1549 1167 134 -959 -2229 -1991 996 2324 534
2123E34k002l72j33K230K405r32k568j171L38K252K452j218k663m80k4J541K889
$$ 534 -1468 -1840 -1973 257 2662 1730 -838 -2009 -1671 581 3033 1815 -848 -1328 -1352 189 3078
2140C078k61l772j233J552Q53J375J425k988k802R42K064J522k83j644k383N4
$$ 3078 2817 -955 -2188 -636 217 1592 3017 29 -2773 -1831 233 1755 1472 -172 -2555 -2501
2156b501K356J755j18j578k686K86K354J078l81J94j757j764K094K685p08j212
$$ -2501 -145 1610 1492 -86 -2772 -2486 -132 946 565 759 -998 -2762 -668 2017 1309 97
2172I7o67q56N55K366O58j268j207m23J57J731N04n72m81j268j045K009J994j008
$$ 97 -570 -1426 -871 1495 2153 885 -322 -745 -588 1143 1647 1075 594 -674 -1719 290 2284 1276
2190A276j757Mr69R9K621P53k066k002O39N06J541R82j388j922m56N69K467J110
$$ 1276 -481 -477 -1446 -1347 1274 2027 -39 -2041 -1402 -896 645 1627 239 -1683 -2139 -1570 897 2007
2208B007j416k045l52N19J629K114p27l355p02K551J234K43J56j761k522J439
$$ 2007 591 -1454 -1806 -1287 342 2456 1729 -1626 -2328 223 1457 1700 1856 95 -2427 -988
2224i88K678N70j091j401j683L12K497J275o99j882j968N79K479J150j066n27
$$ -988 1690 2260 1169 -232 -1915 -1603 894 2169 1470 -412 -2380 -1801 678 1828 762 235
2240B35j983r76K746K155j738j983L23Q6R1K009N41j377j700L24Q01J417N21j255
$$ 235 -1748 -2724 22 2177 439 -1544 -1221 -1135 -1044 965 1506 129 -1571 -1247 -446 971 1492 237
2258B37l95j063N29J761J547k165j763J276J30j12J741J26k310j215J420O01K7
$$ 237 -158 -1221 -692 1069 2616 451 -1312 -36 94 -18 1723 1849 -461 -1676 -256 345 372
2275C72R92r18k038k65J726J633k61j661j171R6P83R27J188n27l058r4K727N82
$$ 372 1364 446 -1592 -1857 -131 1502 1241 -420 -1591 -1495 -712 215 1403 876 -2182 -2276 451 1033
2293A033o42N16j316j654Q17L111N3j198j369j005O27K630R12j511j911j068J328
$$ 1033 391 907 -409 -2063 -1246 1865 1918 720 -649 -1654 -1027 1603 2515 1004 -907 -1975 -647
2310f47K308K64j463q43q42k97K090K141k094k226K48M77K73K027N1k508j290
$$ -647 1661 1925 462 -381 -1223 -1520 570 2711 617 -1609 -1361 -884 -611 1416 1467 -1041 -2331
2327b331R90J741M37k49j192p56K11R62J315N52j941j016J069N17L7R66L68k794
$$ -2331 -1341 400 837 588 -604 -1360 -1149 -187 1128 1680 -261 -1277 -208 309 346 1312 1680 -1114
2345a114l57K049Q16l46k0j164j091P66J189M06l99j379o53M88J188K5M58p64
$$ -1114 -1471 578 1394 1048 1028 -136 -1227 -461 728 1134 735 -644 -1297 -809 379 404 862 98
2363I8k022M4K215Q18j318l41n22q83J887J803p46j701l32j50Q82J568M93j338
$$ 98 -1924 -1880 335 1153 -165 -506 -1028 -1911 -24 1779 1033 -668 -1000 -1150 -268 1300 1793 455
2381D55j158p52J021K139J71j488j071l55N46J927J035j783k416P08J305M90N21
$$ 455 -703 -1455 -434 1705 1876 388 -683 -1038 -492 1435 2470 687 -1729 -1021 284 774 1295
2398A295o64j718p17J544J071J97q68j027j007J081P54J163k19j918j132J621
$$ 1295 631 -1087 -1804 -260 811 1008 140 -887 -1894 -813 -59 1104 885 -1033 -2165 -544
2414e44J513l94J58p66j481M88K183N1j344N6J41j012J021J302l49p40p83m51
$$ -544 969 575 733 -33 -1514 -1026 1157 1208 -136 -80 61 -951 70 1372 1023 283 -500 -951
2432i51J426Q15j27o41j211m41N83J785l97j060j90J94j053P17J925n99j951l97
$$ -951 475 1290 1163 522 -689 -1130 -547 1238 841 -219 -409 -215 -1268 -551 1374 775 -1176 -1573
2450a573O26N44J589J78k041r82J92J382J209k02j460q20O61N79J347O12j766
$$ -1573 -947 -403 1186 1364 -677 -1659 -1467 -85 1124 922 -538 -1358 -697 -118 1229 1841 75
2467G5j925J033J322L08P29m13k431p7K021J225p47o67j470l90J410Q88K82j096
$$ 75 -1850 -817 505 813 1542 1129 -1302 -1379 642 1867 1120 453 -1017 -1407 3 891 1173 77
2485G7j166l50J323J043m68o06l75j257N66K151J38j376q81k9M25J225J121j232
$$ 77 -1089 -1439 -116 927 459 -147 -522 -1779 -1213 938 1076 -300 -1181 -1210 -785 440 1561 329
2503C29j064j74N19J160K91n48q36k21J38O51J083q9j484m03Q68m18Q49R04j379
$$ 329 -735 -909 -390 770 1061 513 -323 -544 -406 245 1328 1239 -245 -648 220 -198 651 1555 176
2522A76j564P33J207j23J52K5j610k65Q51N71L10k13j217m72O65O98R11m6j397
$$ 176 -1388 -655 552 429 581 606 -1004 -1269 -418 153 463 250 -967 -1439 -774 -76 835 789 -608
2541f08j308J294J723j30l42o62j384M22J863P05j082p13n79j07J299J129r1j321
$$ -608 -1916 -622 1101 971 629 -33 -1417 -995 868 1573 491 -222 -801 -908 391 1520 1429 108
2559A08j254Q6J190J395n26j573m67j19P83J749o04j708l64M31O22O85O12j101
$$ 108 -1146 -1060 130 1525 999 -574 -1041 -1160 -377 1372 768 -940 -1304 -873 -251 434 1046 -55
2577e5j329N32P11N17N82o08j629J39J157R89j63l59j378n5J452RlK12p83j063
$$ -55 -1384 -852 -141 376 958 350 -1279 -1140 17 1006 843 484 -894 -949 503 512 509 721 -62 -1125
2597a125J002Q20J08J21m72j424Q7J239Q38n17o20p72l45J345K21k14m13o57n14
$$ -1125 -123 697 805 926 454 -970 -883 356 1194 677 57 -715 -1060 285 506 292 -121 -778 -1292
2616a292J001J134p24j1k43j192M36J880L64j366n38l67P3J589Q48j012j266P
$$ -1292 -291 843 119 108 -135 -1327 -891 989 1353 -13 -551 -918 -845 744 1592 580 -686 -679
2634f79K24J145O25p26q95j98L69M83J021j16j822p58P57O59P65L17j487j541
$$ -679 -455 690 1315 589 -306 -504 -135 348 1369 1253 -569 -1327 -570 89 854 1171 -316 -1857
2652a857J328J136L0Oj206n51n8J361M64j53n61j078j9J475L07K6l85j153j29
$$ -1857 -529 607 637 643 -563 -1114 -1172 189 653 500 -61 -1139 -1158 317 624 650 265 -888 -1017
2671a017J275J186q39m91l57l89N12J048J81j121J07o08j28R74P76m83r11q8n24
$$ -1017 258 1444 605 114 -243 -632 -120 928 1109 -12 95 -513 -641 333 1109 626 -285 -373 -897
2690h97J050O51j39j178l87J35J29J250R7j337j99K18j69J105R74j420r36L15
$$ -897 153 804 665 -513 -900 -765 -636 614 711 -626 -825 -607 -776 329 1303 -117 -1053 -738
2708g38M77P67R04j477r32J61O97R26L96l76j626k52R48P77M36k79j031r57J021
$$ -738 -261 506 1410 -67 -999 -838 -141 785 1181 805 -821 -1073 -125 652 1088 809 -222 -1179 -158
2727a58J054M8m04r21o41K25J508N40r83p49r35M42J659K77j201n99j55Q1R40
$$ -158 896 944 540 -381 -1022 -797 711 1251 268 -481 -1416 -974 685 962 -239 -838 -993 -912 28
2746B8P13r22m68j27j7M48J210j89j067k33p7M91J539K22j643o33N68J18O64L55
$$ 28 741 -181 -649 -776 -793 -345 865 676 -391 -624 -701 -210 1329 1551 -92 -725 -157 -39 625 980
2766I80p13r44M30L00Q3N89r2r71p09P33K07P90r5j095n84M22O46M75n8o34j061
$$ 980 267 -677 -247 53 136 725 633 -338 -1047 -314 -107 683 588 -507 -1091 -669 -23 452 394 -240 -1301
2787a301R24O54J19J10k92j147k86J223Q38k5k53j260l60R35J422l66r95k70n11
$$ -1301 -377 277 396 506 214 -933 -1219 4 842 817 564 -696 -1056 -121 1301 935 -60 -330 -841
2806h41Q63J375k96j095k23l65K45J314K71j241m81Rn9O67J082r65j247r3M33
$$ -841 22 1397 1101 6 -217 -582 -337 977 1248 7 -474 -465 -524 143 1225 260 -987 -1080 -647
2825f47R22P11n04j551Q5P09M08K0M71j266k84O11N47M3M04m63j134M10J024Q0
$$ -647 275 986 482 -1069 -984 -275 133 153 624 -642 -926 -315 232 275 679 216 -918 -508 516 596
2845E96Q5m35j156N93N18R1J74j36p49m63Q42N63j24j18n25q41O73R03n2n16o8
$$ 596 681 246 -910 -317 201 292 466 330 -419 -882 -40 523 399 281 -244 -1085 -412 491 439 -77 -145
2866a45p12m1R71P24p60m56m46N1R10O90k85p97k35l46N77J548l63r71n98J72
$$ -145 -857 -898 73 797 37 -419 -865 -814 96 786 501 -296 -531 -877 -300 1248 885 -86 -684 -512
2886e12K21J638O0j652n53O47N86K92M55j022j140N84L69O58K06n65q60o8N14
$$ -512 -291 1347 1407 -245 -798 -151 435 727 1182 160 -980 -396 -27 631 837 272 -588 -656 -142
2905a42M50P15m51j300m67J133L67j8M52r46j048R32R12j42l69j34m83J32O04
$$ -142 308 1023 572 -728 -1195 -62 305 287 739 -207 -1255 -323 589 447 78 -56 -539 -407 197
2924A97O13m35m96k78o6J032K41l80l73k70m21O64O88l52l14j59r2k50J115M5
$$ 197 810 375 -121 -399 -465 567 808 428 55 -215 -636 28 716 364 50 -109 -201 -451 664 709
2944G09r76j00Q2m22P97O31n58n21n01L35O40P46l49j095n0O36J28M52K50q69
$$ 709 -267 -367 -285 -707 90 721 163 -358 -859 -524 116 862 513 -582 -632 4 132 584 834 -35
2964c5o28M66O78L02k13l6j342N15O56P72l28j061n00j17J527P9q2j22j478K41
$$ -35 -663 -197 481 783 570 534 -808 -293 363 1135 807 -254 -754 -871 656 735 653 531 -947 -706
2984g06R08K62k75m88k78k38P28Q77k54p95J14n10K88J243k33n20o54J69K20P36
$$ -706 202 464 189 -299 -577 -815 -87 790 536 -259 -145 -655 -367 876 643 123 -531 -362 -142 594
3004E94J22n90m37j97J97K20J347p65o54j05R4J13N63K01j011j27K48M33m6J49
$$ 594 716 126 -311 -508 -311 -91 1256 491 -163 -268 -174 -61 502 703 -308 -435 -187 246 200 349
3024C49k39r62M42L68O2P12l95r18j2N53P2J49J59q41n99Q59P27K26n25n97l83
$$ 349 110 -852 -410 -42 20 732 337 -581 -593 -40 32 181 340 -501 -1100 -241 486 712 187 -410 -793
3045g93Q51P25j87q6q44k39L44O77M21n79l35p23J37J131Q01p48q16o5k28O87
$$ -793 58 783 596 510 -334 -573 -229 448 869 290 -45 -768 -631 500 1301 553 -263 -328 -556 131
3065A31N24k08r77j55K19N62K68L12p94o22R7K36P15R4o78k21L95j86M66N95j061
$$ 131 655 447 -530 -685 -466 96 364 676 -118 -740 -643 -407 308 402 -276 -497 -102 -288 178 773 -288
3086b88m80M61P85m24L76N1p93J44M18R6P4q0n73k64L06O20K02k85m14m51K06
$$ -288 -768 -307 478 54 430 481 -312 -168 250 346 420 340 -233 -497 -191 429 631 346 -68 -519 -313
3107c13Q71m01K11m92o15J51P80J50k02o4n54l38L44R70k31m69m2l53L91N14M32
$$ -313 558 157 368 -124 -739 -588 192 342 140 76 -478 -816 -472 498 267 -202 -244 -597 -206 308 740
3128G40o15k48q33Q49J060K9j007m55K65o6M65J010m60j423L18K55N62L66k76
$$ 740 125 -123 -956 -107 953 982 -25 -480 -215 -281 184 1194 734 -689 -371 -116 446 812 536
3147E36r70j15J77O44J22m23m18K41p1K79L32j0p54n56M03R42J6l58J73n33l74
$$ 536 -434 -549 -372 272 394 -29 -447 -206 -277 2 334 324 -430 -986 -583 359 375 17 190 -343 -717
3168g17J187R7k46k25l04o8L28O14l01r7k66m13J87R21o21K95k49m15k16O69O30
$$ -717 470 567 321 96 -208 -276 52 666 365 268 2 -411 -224 697 76 371 122 -293 -509 160 790
3189G90n58m34q3l81N72R88p84n23K2L68j77O45m44J30l29j87R1N92L69r38j53
$$ 790 232 -202 -285 -666 -94 894 110 -413 -391 -23 -200 445 1 131 -198 -385 -294 298 667 -271 -424
3210d24l5J90M44M97n64o38J07P62j21L36l06o87O5N07J22L82l12o11j79O18J78
$$ -424 -459 -269 175 672 108 -530 -423 339 218 554 248 -439 -374 133 255 637 325 -286 -465 153 331
3231C31J90j48m27p54J83R66k19rl13k33r5P90J78l40n56N2n5K84O42k76l87k0
$$ 331 521 373 -54 -808 -625 341 122 113 -200 -433 -528 262 440 100 -456 -404 -459 -175 467 191 -196 -216
3253b16o9L19N05j66l34K40k16k04P58k77n28P0J51r6P4M96l50m69q2L44J49o5
$$ -216 -285 34 539 373 39 279 63 -141 617 340 -188 -118 33 -63 11 507 157 -312 -394 -50 99 34
3275C4K24o16J4J19J52L22k8l10m35L12M8L21J90m09n45O7Q41j52j04J85r61J85
$$ 34 258 -358 -344 -225 -73 249 221 -89 -524 -212 -164 157 347 -62 -607 -540 301 149 45 230 -731 -546
3297e46M62P40l7p01k91j0O00L41p2m85l04m84O50Q72m80m48l9l19J96P82J38
$$ -546 -84 656 619 -82 -373 -383 217 558 486 1 -303 -787 -137 735 255 -193 -232 -551 -355 427 565
3318E65m57k35k08n9M70K24m9q06N5L73K90r9j6p05J3N67J19J47J76m67j52K38
$$ 565 108 -127 -335 -394 76 300 251 -555 -500 -127 163 64 48 -657 -644 -77 42 189 365 -102 -254 -16
3340a6q4M66K75p18l11M6N86L37r4j98m61m7L18K64l59ll87k05J31N87q2M9l80
$$ -16 -100 366 641 -77 -388 -342 244 581 487 289 -172 -219 99 363 4 1 -386 -591 -460 127 45 94 -286
3363b86r3J15M94n4k74K45n86P2N27J90J6m66k17j44L22Q50l86q1l56j29L18M45
$$ -286 -379 -264 230 176 -98 147 -439 -367 160 350 366 -100 -317 -461 -139 711 325 244 -112 -241 77 522
3385E22m77r7kj23J58M74j3o75j55L81L48j4J40p23j99Q4L29K70l1p0p43K13Q8
$$ 522 45 -52 -54 -177 -19 455 442 -233 -388 -7 341 327 467 -256 -455 -371 -42 228 197 127 -616 -403 -315
3408c15L67N44o27m18j16O08J45j37K50l95m99M88K50j24O4k03L76o09O73K33
$$ -315 52 596 -31 -449 -565 43 188 51 301 -94 -593 -105 145 21 85 -118 258 -351 322 555
3428E55l71k65o9o3M67M24m85k44J2k51J62M16q3l36j98K58n9M25p0n94J36m3
$$ 555 184 -81 -150 -213 254 678 193 -51 -39 -290 -128 288 205 -131 -329 -71 -130 295 225 -369 -233 -276
3450b76r4L56K29n37k82L39O1L10M11j90p33P5K74J05K5n5k10K22N3J7J40J20
$$ -276 -370 -14 215 -322 -604 -265 -204 106 517 327 -406 -331 -57 48 73 18 -192 30 83 100 240 360
3472C60o37j40M65K47j78K54o02j56M08Q3J73r8l82n14L56K26P59o13j66k76p7
$$ 360 -277 -417 48 295 117 371 -231 -387 21 104 277 179 -203 -717 -361 -135 624 11 -155 -431 -508
3493e08P38Q6r4o35N6Q6k9O00Rl09M8l33J77N05m4m85M4m9J42NN97l39o77N54
$$ -508 230 316 222 -413 -357 -271 -300 300 309 0 48 -285 -108 397 353 -132 -88 -137 5 10 607 268 -409 145
3517A45l43K52M46l30m77k22L00L84J24j34j07l79L20k91J70N26j63p76J24N16
$$ 145 -198 54 500 170 -307 -529 -229 155 279 145 38 -341 -21 -312 -142 384 221 -555 -431 85
3537H5K0LN6n62O9L50L03k46L87n03l97N53K98R9m03P2o04K50N91k3l05l97R4
$$ 85 105 108 164 -398 -329 21 324 78 465 -38 -435 118 416 515 112 184 -420 -170 421 398 93 -304 -210
3560b10L79K77o5j80m92J44k49M41K31P6n75m5L1L83K04j51m68j9J5L50K79O4
$$ -210 169 446 381 201 -291 -147 -396 45 276 352 -223 -268 -237 146 350 199 -269 -288 -273 77 356 420
3582D20n43j66J3L06J06K29k77l02M08JK6N8k55j90J33K73q0m7K85n17j64J69
$$ 420 -123 -289 -276 30 136 365 88 -214 194 195 221 279 24 -166 -33 240 160 113 398 -119 -283 -114
3604a14O43n27j66O7j98J05N86k00o3j09k63m8L45L07k71l86P7p0M18M64o27J41
$$ -114 529 2 -164 -97 -295 -190 396 196 133 24 -239 -287 58 365 94 -292 -215 -285 133 597 -30 111
3626A11l44j71P3N54m0o9m47J09M02k52N44o34P4J83m5J02K44j08o82R7N06k05
$$ 111 -233 -404 -331 223 183 114 -333 -224 178 -74 470 -164 -90 93 48 150 394 286 -396 -299 207 2
3648BN01n31k47O5j96K36J4M27l94l45L76j69M39k2k82l37K44N06j23J11m71J41
$$ 2 503 -28 -275 -210 -406 -170 -156 271 -123 -468 -92 -261 178 156 -126 -463 -219 287 164 275 -196 -55
3670e5j81Q56n55L20m90r9p2L38P4k20L29j3m38K2Q64m25K0k85J68n49M26L5l07
$$ -55 -236 620 65 385 -105 -204 -276 62 136 -84 245 232 -206 -184 680 255 275 -10 158 -391 35 70 -237
3693b37J5J0j64N79M68l87n53j12Q5M33j09L14n85J52J84o8J9J32m36pK21M2L91
$$ -237 -222 -212 -376 203 671 284 -269 -381 -296 137 28 342 -243 -91 93 25 44 176 -260 -267 -46 -4 387
3716C87j92l81k74K82J56P5L00Rp68K14K64M4O9j28l22k71P43R6r6k32Q4q2j62
$$ 387 195 -186 -460 -178 -22 53 353 362 -406 -192 72 116 185 57 -265 -536 207 303 207 -25 59 -23 -185
3739a85K52L12k36o61Q0K19L50Q9m42J07J24k59L26M25m22k30LJ98l15O14n1p64
$$ -185 67 379 143 -518 -438 -219 131 220 -222 -115 9 -250 76 501 79 -151 -148 50 -265 349 298 -466
3761d66L22j21J79N09k10j88m05K01L28Lq8P4k99l1J05l0K33j04j19j61L03j76
$$ -466 -144 -265 -86 423 213 25 -380 -179 149 152 64 138 -161 -192 -87 -117 116 12 -107 -268 35 -141
3783a41j02N98n14m54L42N52j79M03m39m18L28n3O08j22k32k49k70N54Q4l6l39
$$ -141 -243 355 -159 -613 -271 281 102 505 66 -352 -24 -77 531 409 177 -72 -342 212 296 260 -79
3804g9K42l36J41K44m38M00m16J5J82L89j42m74J71k27LP67j30m80k27N39k33
$$ -79 163 -173 -32 212 -226 174 -242 -227 -45 344 202 -272 -101 -328 -325 442 312 -168 -395 144 -89
3825h9J01R2k32q3J75j38J79J76n9l33J18P2o6M00j94l6j0l7J53r3p9J5j88m1
$$ -89 12 104 -128 -211 -36 -174 5 181 122 -211 -93 -21 -87 313 119 83 73 36 189 96 17 32 -156 -197
3849a97R1L82j95m6k58j8N01rk32Jm59J15M98mk2k4k25l20K38M22k17Q0k4l96
$$ -197 -106 276 81 35 -223 -241 260 251 19 20 -439 -324 174 170 148 124 -101 -421 -183 239 22 102 78 -318
3873c18K32J78O2l1l13J07j55N48J05l50l24J55o5K11L45j74m21n7j04N15J88
$$ -318 -86 92 154 123 -190 -83 -238 310 415 65 -259 -104 -169 42 387 213 -208 -265 -369 146 334
3894C34k44j41m29M82N3L06j87k02l50M61l22K89n8j09r9J54K93j82k78M17k98
$$ 334 90 -51 -480 2 55 361 174 -28 -378 83 -239 50 -8 -117 -216 -62 231 49 -229 188 -110
3915a10J21J33J16k7k68k50R0J56L26l32J52k4k78J27J68r9K10L41q10N1K07L09
$$ -110 11 144 260 233 -35 -285 -195 -39 287 -45 107 83 -195 -68 100 1 211 552 -258 -207 0 309
3937C09k23j66k3K84k28J16k05J02j17l90O34J4K24m44k55J55j97O38L29o24q5
$$ 309 86 -80 -103 181 -47 69 -136 -34 -151 -541 93 107 331 -113 -368 -213 -410 228 557 -67 -152
3958a52k1q8J9N71o8k83k60K75M15k68K13l48j4j66R4L19P8l56q7j04N68j70n5
$$ -152 -173 -261 -242 329 261 -22 -282 -7 408 140 353 5 -9 -175 -81 238 316 -40 -127 -231 337 167 112
3981A12n4l87J0L59J62k58K5j13l50N59K57k89l1l75N67m08J02K36k50kl97N95
$$ 112 58 -329 -319 40 202 -56 -31 -144 -494 65 322 33 2 -373 194 -214 -112 124 -126 -128 -525 70
4003G0J53j95j81K82k47K9K19J75l99l01M43j64L11K95m81j51r6K54L16k51K60
$$ 70 223 28 -153 129 -118 -89 130 305 -94 -395 48 -116 195 490 9 -142 -238 16 332 81 341
4024C41l64L2k6j61r6N51l83k0q4M13k39J39p1l2j64K99l7k43Q0lJ19K3L43j23
$$ 341 -23 9 -17 -178 -274 277 -106 -126 -210 203 -36 103 32 0 -164 135 98 -145 -65 -68 51 74 417 294
4048B94Ok52l93L83N08j55m94J18k47J40M89l17p4l1k38L73p3K19m44K28j39J7
$$ 294 300 48 -345 38 546 391 -103 15 -232 -92 397 80 6 -25 -263 110 37 256 -188 40 -99 -82
4070h2J27j4r3j7P5k14n1M11J9o6n45J06K39K76J31l81r4Kn5M01K49j31j72J83
$$ -82 45 31 -62 -79 -4 -218 -269 142 161 95 -450 -344 -105 171 302 -79 -173 -171 -226 175 424 293 121 304
4094C04l88J3L06O6q74J98M15j88J74J07j56K3p8K34Q6l16l32J49R0J41Q0j55
$$ 304 -84 -71 235 301 -573 -375 40 -148 26 133 -23 0 -78 156 242 -74 -406 -257 -167 -26 54 -101
4116a01J48L0p83P63q1k77J87Q6j33pK13R4m2l55J97k47N14L3k42k50M02k47K44
$$ -101 47 77 -706 57 -24 -301 -114 -28 -161 -168 45 139 97 -258 -61 -308 206 239 -3 -253 149 -98 146
4139A46J9N3l88k91M48J64j67J01l59R5K44m69P62j06l64l9j54K35m8K57j3m17
$$ 146 165 218 -170 -461 -13 151 -16 85 -274 -179 65 -404 358 252 -112 -151 -305 -70 -118 139 126 -291
4161b91L32J89K81l60o6j36k4N6Q0R7k96P7k90L73j99K59k68J3J35j15L65j82
$$ -291 41 230 511 151 85 -51 -75 -19 61 158 -138 -61 -351 22 -177 82 -186 -173 -38 -153 212 30
4183C0L10n43m8k67Q54k08K9n4k29M2J75j34r8K66k56N5j6K20k5r1o9qk01L07
$$ 30 340 -203 -251 -518 336 128 157 103 -126 -84 91 -43 -141 125 -131 -76 -92 128 103 12 -57 -65 -266 41
4207D1lk31k30J75L61M1L07m02M2K61k61M8N9n1m68M28K3m8O7j18l30L04K20l58
$$ 41 38 -193 -423 -248 113 154 461 59 101 362 101 149 208 157 -311 117 140 92 159 41 -289 15 235 -123
4231a23m2J21j03RK23J5J7L7l90K9mK10p0L6Kk97K93L67J12m12k60K09j09M94
$$ -123 -165 -44 -147 -138 85 100 117 154 -236 -207 -211 -1 -71 -35 -33 -330 -37 330 442 30 -230 -21 -130 364
4255C64j94j0N2j00j91K41K35k11k59O3j15j9J70p7K0N4J78l62J14j75K66j52
$$ 364 170 160 212 112 -79 162 397 186 -73 -10 -125 -144 26 -51 -31 23 201 -161 -47 -222 44 -108
4277a08P3k33L6M77l74J56k25O9J51M4J38j11N4m05K59l4l3J80n10L88j31K18
$$ -108 -35 -268 -232 245 -129 27 -198 -129 22 66 204 93 147 -258 1 -33 -66 114 -396 -8 -139 79
4299G9J92l74K03l12K56j05q3J24k08k3K69L56k11J12k73Q3J2J86l64j36MJ33
$$ 79 271 -103 100 -212 44 -61 -144 -20 -228 -251 18 374 163 275 2 85 97 283 -81 -217 -213 -80
4321h0k14M39r2L7j66r4Q2J02J37j67k76J18J86j68K50J66l94n5K13J53j94K89
$$ -80 -294 145 53 90 -76 -170 -88 14 151 -16 -292 -174 12 -156 94 260 -134 -189 24 177 -17 272
4343B72k20k41K20rj76K26J2l18K47K23l84L95m54J46k8j68K79j23K71l27k13
$$ 272 52 -189 31 22 -154 72 84 -234 13 236 -148 247 -207 -61 -89 -257 22 -101 170 -157 -370
4364c70L05j45J52r5J10M1K2m9K23j06R0j86k57L35q5K60l34O8q0K02n1J50k62
$$ -370 -65 -210 -58 -153 -43 -2 20 -29 194 88 178 -8 -265 70 -15 245 -89 -21 -101 101 50 200 -62
4387f2p3J50m56N04K94n63k2p5L29L04l23r6K0l5L35n60M85j86J98l05J43q6L38
$$ -62 -135 15 -441 63 357 -206 -228 -303 26 330 7 -89 -69 -104 231 -329 156 -30 168 -137 6 -80 258
4410B58k44q3j15N04j48l13K68k08j76R3n9J98N4K81n30J0N52k70K03m44K56j01
$$ 258 14 -69 -184 320 172 -141 127 -81 -257 -164 -223 -25 29 310 -220 -210 342 72 275 -169 87 -14
4432a4K71N0j06k63J08j48m5K61j0N4k60q8K59nk49L89l33r5j51K17M94p45L76
$$ -14 257 307 201 -62 46 -102 -147 114 104 158 -102 -190 69 64 -185 204 -129 -224 -375 -158 336 -409 -33
4455c3k31mJ78K94l67O4K26l38J52J23K93m37J36j28l8J59L12j84m26K98k79L20
$$ -33 -264 -268 -90 204 -163 -99 127 -211 -59 64 357 -80 56 -72 -110 49 361 177 -249 49 -230 90
4477I0J4J09m43P0J46j45N23l54J46J17k69j86L86k91r6R6K64l18L05J6J20l06
$$ 90 104 213 -230 -160 -14 -159 364 10 156 273 4 -182 204 -87 -183 -87 177 -141 164 180 300 -6
4499fJ50J77j91L4n53L58j83L36n9l1J6j0r2K64J56j48p8j47p7J16N9k66N8K01
$$ -6 144 321 130 164 -389 -31 -214 122 63 32 48 38 -54 210 366 218 140 -7 -84 32 91 -175 -117 84
4523H4J09k56p0L19N5j93L0k65M25l7k89l0nJ04L3j49K19j81K3J80J9J93l7m12
$$ 84 193 -63 -133 186 241 48 78 -187 238 201 -88 -118 -123 -19 14 -135 84 -97 -74 106 125 318 281 -131
4547a31oL37k72J91Jq3Mk13K92k43Q7J62l52J51J04J09j97J54j72j54jN39n68
$$ -131 -137 200 -72 119 120 37 41 -172 120 -123 -36 126 -226 -75 29 138 -59 95 -77 -231 -232 307 -261
4570b61Q7k1L70k92J22PL6l81L12J02O5k22J77l99M33j17p7L13l85N2L64j72j55
$$ -261 -174 -195 175 -117 5 12 48 -333 -21 81 146 -76 101 -298 135 18 -59 254 -131 -79 285 113 -42
4593d2L61m98n4J02J33QK03m50J36L43j9j45L2R7k1m32n0K57JK20k17P0K59l67
$$ -42 319 -179 -233 -131 2 10 213 -237 -101 242 223 78 110 207 186 -246 -296 -39 -38 182 -35 35 294 -73
4617g3Q8J07K3l28pJ65J69q0k18K31Oj81m5L30m35N41m13j78O50l30J4m92L68
$$ -73 15 122 145 -183 -190 -25 144 64 -154 77 83 -98 -143 187 -248 293 -120 -298 352 22 36 -456 -88
4640h8j63K09K12k23o4J12J1r9K58k11K8jj84J38J68Rj67j49jO8L74j47j36j4
$$ -88 -251 -42 170 -53 -117 -5 6 -93 165 -46 -18 -19 -203 -65 103 112 -55 -204 -205 -137 237 90 -46 -60
4664f0p6J65p6P6j15j76L35Qj1k87Q9L3J35r4J08J31o5k39K81j92j3l8P6j41J50
$$ -60 -136 29 -47 29 -86 -262 73 81 70 -217 -128 -95 40 -54 54 185 120 -119 162 -30 -43 -81 -5 -146 4
4689DM5J21Pj54J19k86j6m3J60k55M67l84J81j45J29J21l71L83k72L62J4j40M9
$$ 4 49 170 177 23 142 -144 -160 -203 -43 -298 169 -215 -34 -179 -50 71 -300 83 -189 173 187 47 96
4712I6m67L21J46j56M17p82N96J97j90K4j90l4J15k13K5L76O6k62j49l69R9K44
$$ 96 -371 -50 96 -60 357 -425 171 368 178 202 12 -22 93 -120 -95 281 347 85 -64 -433 -334 -90
4734i0K58L0k26j79L15k5j43m0k2k29K76n6J38R9j02k62q1O61k60M0J8j50J61
$$ -90 168 198 -28 -207 108 83 -60 -100 -122 -351 -75 -131 7 106 4 -258 -339 322 62 102 120 -30 131
4757A31J53K2m18J72l8j22O9L3k7J6N7k37p8M27q6j22o7o3P8k71O62m59p8l9N9
$$ 131 284 306 -112 60 22 -100 -31 2 -25 -9 48 -189 -267 160 74 -48 -115 -178 -100 -371 291 -168 -246 -285 -226
4782b26Q2K81k48o3P4K04pJ49l6n0r0k7kr2K89k51k03J37o9L36n08K63J92k51
$$ -226 -144 137 -111 -174 -100 104 97 246 210 160 70 43 41 -51 238 -13 -216 -79 -148 188 -320 -57 135 -116
4806a16L50k63J44j2l67m8K25Qr0k09K22J13O4J53k89K19oO8j51J57n53M72k18
$$ -116 234 -29 115 103 -264 -312 -87 -79 -169 -378 -156 -43 21 174 -115 104 98 166 15 172 -381 91 -127
4829a27J09J65j66J86j30kk96l4K64L65l24j58J85j10L57n2j17j35n4k5K62k89
$$ -127 -18 147 -19 167 37 35 -261 -295 -31 334 10 -148 37 -73 284 232 115 -20 -74 -99 163 -126
4851a26L02j43M5R4k23J26j73K76k71N9j23j33K25r4L64k83k17L16P8k29k4J81
$$ -126 176 33 78 172 -51 75 -98 178 -93 -34 -157 -290 -65 -159 205 -78 -295 21 99 -130 -154 27
4873B7k58K39J91m81P78p48L95m57N5L34K16k37k33J4L18k09j1L5l7N7o9J39k94
$$ 27 -231 8 199 -282 496 -252 143 -314 -259 75 291 54 -179 -165 153 -56 -67 -32 -69 -12 -81 58 -236
4896b36J59J72%k43J82P5l97K30L01k99L05R7k56j50j77O21l58J60Q7l80J8K84
$$ -236 -77 95 95 -148 34 109 -288 -58 243 -56 249 346 90 -60 -237 384 26 186 273 -107 -89 195
4918A95l18K03j62K83k40K1J74l11K10q0J43jK05j44k39rK36k46N00m92J66L4
$$ 195 -123 80 -82 201 -39 -18 156 -155 55 -25 118 117 322 178 -61 -70 166 -80 420 -72 94 128
4940A28k00P9Q6p5j07K35n17L06K01q0k85J65N7K03n12L38K85m18m2K08p9p9K25
$$ 128 -72 7 93 18 -89 146 -371 -65 136 56 -229 -64 -7 196 -316 22 307 -111 -153 55 -24 -103 122
4963A22j77j03L06j50J53q2j52J78j98N81k11m9m43Q8N60l69j55O6J64m86J71
$$ 122 -55 -158 148 -2 151 69 -83 95 -103 478 267 218 -225 -137 423 54 -101 -35 129 -357 -186
4984a86L52k27K04Kl48n2J62J31L80l83j37m0J54J03p9k25K45l87K99MK37o4l10
$$ -186 166 -61 143 145 -203 -255 -93 38 418 35 -102 -142 12 115 36 -189 56 -331 -32 -28 209 145 -165
5007a65J6K26l8J12l64J65k24Q2J47n7J77k77J64k54R3N30l67n56N00J50r0j5
$$ -165 -149 77 39 151 -213 -48 -272 -190 -43 -100 77 -200 -36 -290 -197 333 -34 -590 -90 60 -30 -45
5029d5j39r6J90K45m20M08j5j52q7K5L50j96j8L48o75J45K03P1k05J98j80k98
$$ -45 -184 -280 -90 155 -265 143 128 -24 -111 -86 264 68 50 398 -277 -132 71 142 -63 135 -45 -343
5051c43J38J78j78n4K60k95M60M3k9l04kJ18k15L95J02k37j70J82j05K3N9jqp6
$$ -343 -205 -27 -205 -259 1 -294 166 209 180 -124 -126 -8 -223 172 274 37 -133 49 -56 -33 26 25 17 -59
5075e9J47j23J28o4m6J31j5J9j80K08k89L72j03q8K9l39L46j36j02K2K53L1j1
$$ -59 88 -35 93 29 -17 114 99 118 -62 146 -143 229 126 38 67 -272 74 -62 -164 -142 111 142 131
5098A31k9j71N9j38K1n6J87n0m0r4j2J52J91l82Q0K97k16j41P1Nl1N5q2K10Q2
$$ 131 102 -69 -10 -148 -127 -183 4 -46 -86 -180 -192 -40 151 -231 -151 146 -70 -211 -140 -135 -166 -111 -193 17 99
5123I9r4l41M02J78l50%K29k55j39M08O0k66J11j38K28j14K79l45l65K17j06J60
$$ 99 5 -336 66 244 -106 -106 123 -132 -271 137 197 -69 42 -96 132 18 297 -48 -413 -196 -302 -142
5145a42J97K9j68J14k11L57m70J71L87m92q8N71m10K90k04n1K0m3J55nK30l97
$$ -142 55 84 -84 30 -181 176 -294 -123 264 -228 -316 255 -155 135 -69 -120 -100 -143 12 7 237 -160
5167a60K30k41J90K48k83k9m3J98l1J55k1k35l69L99M6m5J20n62N63j27P9j89
$$ -160 70 -171 19 267 -16 -45 -88 110 79 234 213 -22 -391 8 54 9 129 -433 130 3 82 -107
5189a07k00R9K09K21k11P2j10O0O3k19K83j22j87Q4j65K75r6R1J20j66k39L94
$$ -107 -307 -208 1 222 11 83 -27 33 96 -123 160 38 -149 -65 -230 45 -51 40 160 -6 -245 149
5211A49j08O3l03K66M6j29J75l36N29k81k68N2L8K25K0J00m12k30M86O1k44J65
$$ 149 41 104 -199 67 113 -16 159 -177 352 71 -197 -145 -107 118 138 238 -174 -404 82 143 -101 64
5233F4l22KL14J09R0m01m6K5J86p4L1J30k12q3J29Q9J10j82j4n8K46J71j67O4
$$ 64 -258 -256 58 167 257 -144 -190 -165 21 -53 -22 108 -104 -187 -58 31 141 -41 -55 -113 133 304 137 201
5257B01J8j37l59K96n9j96k65L18j14L44j9L0k39L2k33L77k0K23N0m43R2l19K09
$$ 201 219 82 -277 19 -40 -236 -501 -183 -297 47 28 58 -181 -149 -382 -5 -25 198 248 -195 -103 -422 -213
5280b13M24k65K9k18L18J48K1J07l78K78l45K1J93j76l57L06J13L9N0p4J1M0k05
$$ -213 211 -54 -25 -243 75 223 244 351 -27 251 -94 -73 120 -56 -413 -107 6 45 95 21 32 72 -133
5303a33J7qK81M5m11M4L45k50K86l62K27k49J63k21M30n7j6k33O0P8j3J65l69
$$ -133 -116 -124 157 202 -209 -165 180 -70 216 -146 81 -168 -5 -226 204 147 131 -102 -42 36 23 188 -181
5326a81K24j20L61j14J82l06k02R7k4j34K36k03J8J51K59Q4j89M8m6r6j7k99M34
$$ -181 43 -77 284 170 352 46 -156 -59 -83 -217 19 -184 -166 -15 244 328 139 187 141 45 28 -271 163
5349A63l53O60o80J34K52j72k87L61l42N5J39j17L04p7j16K42j98k97K79m0j09
$$ 163 -190 470 -210 -76 176 4 -283 78 -264 -209 -70 -187 117 40 -76 166 -32 -329 -50 -90 -199
5370a99P4o9M63j36l16K55k46K97k53j69M74o8p7J9l7K1r1P8O0m5J21j03P2L4
$$ -199 -125 -194 269 133 -183 72 -174 123 -130 -299 175 107 30 49 12 33 -58 20 80 35 156 53 125 159
5394A59l93J77K17O8j44j13L4j38m7P7N1L94jl05M9o1r5qP7p0K16K6j05J9k66
$$ 159 -234 -57 160 228 84 -29 5 -133 -180 -103 -52 342 341 36 85 24 -71 -79 -2 -72 144 170 65 84 -182
5419a82L77k95j19P7K17j18K43q0l9j58Pm0j10K34n0j38M06j84k78K80M7l36J83
$$ -182 195 -100 -219 -142 75 -43 200 120 81 -77 -70 -110 -220 14 -36 -174 232 48 -230 50 97 -239 -56
5442e6J51k12K38n5L8k16K00j93p1M86j86j52j51K70l40K36J6K23J02j54p2N6
$$ -56 95 -117 121 66 104 -112 88 -105 -176 310 124 -28 -179 91 -249 -13 3 226 328 174 102 158
5464A58N2m68M85l48%K25q1N8M0o6k76L70j90M04m61J02j66K35R0q3J21l23k1
$$ 158 210 -258 227 -121 -121 104 23 81 121 55 -221 149 -41 363 -98 4 -162 73 163 80 201 -122 -143
5487a43J25k62K91q6R3J1Q8k29L6L25j16j45R8p4N4J17k44M4K51p3k17J13J8m
$$ -143 -18 -280 11 -75 18 29 117 -112 -76 249 133 -12 86 12 66 183 -61 -17 234 161 -56 57 75 71
5511G1j98j9Q6l46N36l61M49m6J2j41N4k9k43K03j04J46k51J82M5l08L54L95n64
$$ 71 -127 -146 -60 -406 130 -231 218 172 184 43 97 68 -175 28 -76 70 -181 1 46 -262 92 487 -77
5534g7m6J05j7K01Mk30jk48L96Q2q3l17K61l06K39L63k61L6k44r8N41l08k37M35
$$ -77 -123 -18 -35 166 170 -60 -61 -309 87 169 86 -231 30 -276 -37 326 65 101 -143 -241 300 -8 -245 190
5558A90k73j2p3J23J89l8j15J75m00L11O1k0o1j41j69K03n7N3L71m11K57l37K9
$$ 190 -83 -95 -168 -45 144 106 -9 166 -234 77 138 118 57 -84 -253 -50 -107 -54 317 -94 163 -174 -145
5581a45M0j78J33L2L51k81J04R9ok59j57J44L14l52P0M2l6J23j47Kk16K85K36
$$ -145 -105 -283 -150 -118 233 -48 56 155 149 -110 -267 -123 191 -161 -91 -49 -85 38 -109 -107 -323 -38 198
5604A98k12K40j67j05J50O3l15R8J07R2k03J40m67K85K69K9k67N5N6J14m60M27
$$ 198 -14 226 59 -46 104 167 -148 -50 57 149 -54 86 -381 -96 173 202 -65 -10 46 160 -300 127
5626A27j25J31j79k05M29n0r2j19J19j6K11l50Q7j63j64K45L8J68J4k32k23K72
$$ 127 2 133 -46 -251 178 128 36 -83 36 20 231 -119 -32 -195 -359 -114 -76 92 106 -126 -349 -77
5648g7M08l11Q7k17J01m5K47j02j52o1K73j65J07l10M98m5l97K52j44o9L18j16
$$ -77 331 20 107 -110 -9 -54 193 91 -61 -122 151 -14 93 -217 281 236 -161 91 -53 -122 196 80
5670H0J4j07L9J91j7m83K30jL2ko6k6K08k89J80J93j44Q5j20k5m8J09j11Q8j17
$$ 80 94 -13 26 217 200 -283 -53 -54 -22 -24 -90 -116 92 -197 -17 176 32 117 -3 -28 -76 33 -78 10 -107
5695a07r3K58k10J88p0K06j65m0K75j68L8j68Q6J3J3j40J5O9P4k6nj6o2K92l33
$$ -107 -200 58 -152 36 -34 172 7 -33 242 74 112 -56 30 43 56 -84 -69 0 74 48 43 27 -35 257 -76
5720g6k2L21n2l71L17k54n7L8N2P6J07j4j5q8K46J08m49P6q7K09J3O2j82J63m88
$$ -76 -98 223 171 -200 117 -137 -194 -156 -104 -28 79 65 50 -38 208 316 -133 -57 -144 65 78 140 -42 121 -367
5745c67L81P2K0j92j38L77K04k87r8l85K81L44ok19K9j10j28J87r0J0m7j8Q4j55
$$ -367 14 86 106 -86 -224 153 357 70 -28 -413 -132 212 206 -13 16 -94 -222 -35 -125 -115 -162 -180 -96 -251
5769b51L31k33j9K03j13k79J13J45K94k50N8j54J99j29n6K52j93K96k79J1L05
$$ -251 80 -153 -172 31 -82 -361 -248 -103 191 -59 -1 -155 44 -85 -141 111 -82 214 -65 -54 251
5790B51m19J81k1j89M77l47k70M80l5j44M52n44J57k74L33n17L49J44%k20J06
$$ 251 -168 13 -8 -197 280 -67 -337 143 108 -36 416 -128 29 -245 88 -429 -80 64 64 -156 -50
5811e0J31J17k73L45j93q1J18j18K94k09j63P0J4J95j25J02j63k11L07m2q3J26
$$ -50 81 198 -75 270 77 -4 114 -4 290 81 -82 -12 2 197 72 174 11 -200 107 65 -18 108
5833A08J7j21pK81k02k34J24j81L95k1k71Q0L2j95m7K51k42M75j13k3j54l2L51
$$ 108 125 4 -3 278 76 -158 -34 -215 180 159 -112 -32 0 -195 -242 9 -233 242 129 106 -48 -80 271
5856B71o8j70k6k02L30j70P6O8M2j36p0R6K83k30Q5o8l5o0o8J74q8K40j97j67
$$ 271 203 33 7 -195 135 -35 41 109 151 15 -55 41 324 94 179 111 76 16 -52 122 34 274 77 -90
5880i0nJ68j25LM5o1l7J56J36l70L05m0K7j99J23L2k52K47k71K98K73o00K20O5
$$ -90 -95 73 -52 -49 -4 -65 -102 54 190 -180 125 85 112 -87 36 68 -184 63 -208 90 363 -237 -17 48
5904D8J46k48n1L52m56L44J16k73L71m76K33m40K19o4J25K18J01k59J14j00JJ0
$$ 48 194 -54 -105 247 -209 135 251 -22 349 -127 106 -334 -115 -179 -54 164 265 6 120 20 21 31
5926C1J07J3L3j66J09l51q7L23NQ4q1P7O3l47L52l90K5P4l7K73r1K54m91K06K91
$$ 31 138 151 184 18 127 -224 -311 12 17 101 20 97 160 -187 165 -225 -200 -126 -163 110 19 273 -218 -12 279
5951B79k4k51K03j76J11J0j82k01JL20j63k0Nj06Q1K25O9j17Nj01o9Q1n3j0K51
$$ 279 255 4 207 31 142 152 -30 -231 -230 90 -73 -93 -88 -194 -113 112 181 64 69 -32 -101 -20 -73 -83 168
5976A68l48J54PM6l2J38N8j74k45n7K90j43O54n99Q1R2j51M3J51q1k9j15K10p4
$$ 168 -180 -26 -19 27 -5 133 191 17 -228 -285 5 -138 516 -83 -2 90 -61 -18 133 52 23 -92 118 44
6000D4J35j07j32J30K38m28N0L19m01M8J62q0J41l70K94r0J28j81j22J64O9K20
$$ 44 179 72 -60 70 308 -120 -70 249 -152 -104 58 -22 119 -251 43 -47 81 -100 -222 -58 11 231
6022B31l85L38k45J17j69j0M11k01L7R5o40M35J34k49j1j01M99l73j76j32O86
$$ 231 -154 184 -61 56 -113 -123 288 87 124 219 -421 14 148 -101 -112 -213 286 -87 -263 -395 291
6043B91l90o8J62J08J5l47q8K94m57L23L24k33LR9o0L19j68p9p8nL5j5L8j17L9
$$ 291 -99 -167 -5 103 118 -229 -317 -23 -480 -157 167 -66 -63 36 -24 295 127 48 -30 -35 0 -15 23 -94 -55
6068e5J06P9l90K90J58k52O8K25l05N01k26j91J29k17K50l31j0K97k64P8N0p8
$$ -55 51 130 -260 30 188 -64 4 229 -76 425 199 8 137 -80 170 -161 -171 126 -138 -60 -10 -88
6090h8M3J71n7mP6j21M0R8J43k16k6l08K29m3j83J02K61j17K07m6r6j08r7J71
$$ -88 -45 126 69 65 141 20 60 158 301 85 59 -249 -20 -63 -246 -144 117 0 207 161 65 -43 -140 31
6114C1p1k1K97L9m85J84k3L7J19l62K67r3J53Jj20J62m4rj30j25L32k37lj10O37
$$ 31 -40 -61 236 275 -210 -26 -49 -12 107 -255 12 -81 72 73 -47 115 71 62 -68 -193 139 -98 -101 -211 426
6139D26o83L08j81J09j32L15j41J29k8k85N9J5J85k60J46r1J67k8L31jJ12p19
$$ 426 -257 51 -130 -21 -153 162 21 150 122 -163 -104 -89 96 -164 -18 -109 58 30 361 360 472 -247
6161b47K96j97L62L51j86k82j44L96k74j03k3j15P0J42r6P5K10k67L7J40j47j6
$$ -247 49 -148 214 565 379 97 -47 349 75 -28 -51 -166 -96 46 -50 25 235 -32 5 145 -2 -18
6183a8J62n74M24q9J07l6K11j10J6j71K1K62k74K25K4n01L25mq5r9L18n75J19
$$ -18 144 -430 -6 -95 12 -24 187 77 93 -78 -57 205 -69 156 180 -321 4 0 -85 -184 134 -441 -322
6206c22L84P9j43j59j75L47O8k55K49l2K2LK45m10J13L2k21l9J13K97j87j84J63
$$ -322 62 141 -2 -161 -336 11 79 -176 73 41 63 66 311 -99 14 46 -175 -214 -101 196 9 -175 -12
6229a2M5k07o4J57M7l31M18j48K28Pm11L43K10k47j90L88J64m24q2K44l58L46
$$ -12 33 -174 -238 -81 -34 -365 53 -95 133 140 -271 72 282 35 -155 233 397 -27 -109 135 -223 123
6251A23o6P2o2J21k08j65N83O0o13L62k88K7O3N7j17Q4k5J16j45L4k6j45J30K09
$$ 123 57 129 67 188 -20 -185 398 458 -155 207 -81 -54 9 66 -51 33 8 124 -21 13 -13 -158 -28 181
6275A81m46N91o8k96jK14J18m76J65r3J00R6J63j56l3N7lj60J52K22m44O8K88
$$ 181 -265 326 258 -38 -39 175 293 -183 -18 -111 -11 85 248 92 59 116 113 -47 105 327 -117 -49 239
6298B39o1l03o3L23l6k41m4N28m35J55J18k43K41k98P0j25J35M0K1j39KK95l24
$$ 239 178 -125 -188 135 99 -142 -186 342 -93 62 180 -63 178 -120 -50 -175 -40 0 21 -118 -116 179 -145
6321a45m9J91j39L31l58L2Q3K92m45R0N0k3K2N7J32r6L91l75j21oj79J35J50L7
$$ -145 -194 -3 -142 189 -169 -137 -54 238 -207 -117 -67 -90 -68 -11 121 25 416 41 -80 -86 -265 -130 20 57
6345E7l10N53l85J48nj97J67l70M41j56L66j71l15J28j88j03N19n7n2j08l27N37
$$ 57 -253 300 -85 63 58 -139 28 -342 99 -57 309 138 -177 -49 -237 -340 179 122 70 -38 -365 172
6367A72mp4k09J35OL32j26k95k4j46M24k77J22q1r5j24PO4J81J11j00k54K06K85
$$ 172 168 94 -115 20 26 358 232 -63 -87 -233 191 -86 36 -45 -140 -264 -257 -193 -12 99 -1 -255 -49 236
6391B36l86j38L09N1k07K29Pn1k42L08m63K70L90m02n4k9J16k88N83j95R4M4j77
$$ 236 -150 -288 21 72 -135 94 101 50 -192 116 -347 -77 313 -89 -143 -172 -56 -344 239 44 138 182 5
6414Er4M64l85M9J9j80L41j9qp1PJ2j53j58J56K35j19j43R2J06j06Q2j78J6R3
$$ 5 -89 375 -10 39 58 -122 219 200 192 121 128 140 -13 -171 -15 220 101 -42 50 156 50 132 -46 -30 63
6439F3M5j67k99N19n9m3j94J30O4j9j60J30m54K00j4K26p1J97j96K43j92J18l19
$$ 63 108 -59 -358 161 102 59 -135 -5 59 40 -120 10 -444 -244 -258 -32 -103 94 -102 141 -51 67 -252
6462b52N9M19k16M20o27K37O8p7N7j44P9n1j44P1P4J78j69k5R1j60R7M4mqj0J6
$$ -252 -193 226 10 430 -197 40 108 31 88 -56 23 -28 -172 -101 -27 151 -18 -43 48 -112 -15 29 25 17 7 23
6488B3l79N43k20K87k98rJ21o2q6l4o7J13O7k57L86j72M8J14j09Q6J89q5j85k03
$$ 23 -356 187 -33 254 -44 -53 68 6 -80 -114 -181 -68 -1 -258 128 -44 4 118 9 95 284 199 14 -189
6512a89L60q7j47n9P2L2j28j09Q0J97k37%K6M98j18m73J11J11K64l84J3J22j10
$$ -189 171 84 -63 -122 -50 -18 -146 -255 -175 22 -215 -215 -189 309 191 -282 -171 -60 204 -180 -167 -45 -155
6535a55O8j7kM17j72l21L22j06l5j95K48p5N9k73K76pj12K8j97J72O6p4J47J38
$$ -155 -87 -104 -106 311 139 -182 140 34 -1 -196 52 -23 36 -237 39 32 -80 -52 -249 -77 -11 -85 62 200
6559B00j02m5j15J26J1K40m56J80j25O5k6o4K65Nl48J29j56M51k44J30J38rl05
$$ 200 98 53 -62 64 75 315 -141 39 -86 -21 -47 -111 154 159 -189 -60 -216 235 -9 121 259 250 -55
6582e5P5j58PJ46J05j19j3R1l16L08N7O1l92K09n93O62rRj39J86p9K34k54r8P3
$$ -55 20 -138 -131 15 120 1 -12 79 -237 71 128 189 -203 6 -587 75 66 75 -64 122 43 277 23 -75 -2
6607bJ48l02J12J32k07K75q4j43j95K00K67j40k51J66k77N9J03K73l67N57l37
$$ -2 146 -156 -44 88 -119 156 72 -71 -266 -66 201 61 -190 -24 -301 -242 -139 134 -233 324 -13
6628a3J0j8N0j0k2l8k38O70m86P5J83k40p3J36m2j04J42J16j51j20J64J42j48
$$ -13 -3 -21 29 19 -3 -41 -279 391 -95 -20 163 -77 -150 -14 -56 -160 -18 98 -53 -173 -9 133 -15
6651a5m3J33J25j69J2J7k56j29L91P0m17N88m59l4J28J63L6lj57k86K26K11l8
$$ -15 -58 75 200 31 43 60 -196 -325 66 136 -281 307 -152 -186 -58 105 141 138 -19 -305 -79 132 94
6674I4k85O1j6K47j49J7n0k36K57o3RJ12J19k22L90l36K37M9l17M2Q2L02k76K98
$$ 94 -191 -130 -146 101 -48 -31 -81 -317 -60 -123 -114 -2 117 -105 285 -51 186 235 -82 -40 42 344 68 366
6698C66l18j5j84K47J12l00m6R1R9L0j1j14j2K03j74K12qq0k22L19k73R0O4J9
$$ 366 48 33 -151 96 208 -92 -138 -47 52 82 71 -43 -55 148 -26 186 178 98 -124 195 -78 12 76 95
6722I5Q8j99j48J65j09M02j35j19O0l33N50m6j16j67j13J85J9PJ0j3k42J59j84
$$ 95 183 -16 -164 1 -108 294 159 40 100 -233 317 271 155 -12 -125 60 79 86 96 83 -159 0 -184
6745a84J14J27J25j82j09J61l7K80o3k16n3j27J50J42p3l20P5p8M8L68k70J30
$$ -184 -70 57 182 0 -109 52 15 295 232 16 -37 -164 -14 128 55 -265 -190 -268 -220 148 -122 8
6767Hl09L79l58K11J61k21R4L57n06K55l5j6j44L36k84l5J10K98j00k78J11k52
$$ 8 -301 78 -280 -69 92 -129 -35 322 -184 71 36 20 -124 212 -72 -107 3 301 201 -77 34 -218
6789b18m4J18K76j73J14p4r0L07j74j04K09n3l97K87L1o7l3j33L92k82K22M7m13
$$ -218 -262 -144 132 -41 73 -1 -91 216 42 -62 147 94 -303 -16 15 -52 -85 -218 174 -108 114 161 -252
6812b52L71o1j31M68j49l36J29m7p1Q3n7L19l19P2N1J08Kj15j83M25k99L30l40
$$ -252 119 58 -73 395 246 -90 39 -8 -79 4 -53 266 -53 19 70 178 180 65 -118 307 8 338 -2
6835bJ67j63P7p3j5j46J4j33J17O4J54K3k07J06o6r1K69q9n5K70k56l5L58n56
$$ -2 165 2 79 6 -9 -155 -141 -274 -157 -93 61 84 -123 -17 -83 -174 95 6 -49 221 -35 -70 288 -268
6859b68J69K36k8q7R4K11k45l3M0J42l3k80K29P7p8J01r7p5m4k2n3N6m5K8J34
$$ -268 -99 137 109 22 116 327 82 49 89 231 198 -82 147 224 146 247 150 75 31 9 -44 12 -33 -5 129
6884A29j52J17N1l95L3K30KJ64m92K12J78p2P6l6k11L37l41L82l86J43k9Q8K01
$$ 129 -23 94 145 -250 -217 13 15 179 -313 -101 77 5 81 45 -166 171 -170 212 -174 -31 -60 28 229
6907B29k86K9M9j96K21J45j81l4j0j37P3r6J16l4m3N85l37O6j46%j75L85l17M8
$$ 229 -57 -28 21 -175 46 191 10 -24 -34 -171 -98 -194 -78 -112 -155 430 93 159 13 13 -162 223 -94 -46
6931d6M1O0p3j32L86n10L52r0N9k15M40n12kK9J80K36l35Q7n8K22K6N6k28J74
$$ -46 -5 55 -18 -150 236 -274 78 -12 47 -168 272 -240 -242 -213 -33 203 -132 -45 -103 119 145 201 -27 147
6955A47n44M14k5K73l32n2l4O1k48L13r9M30l55K23l15L37k83nn4m2L40l0k43
$$ 147 -397 17 -8 265 -67 -119 -153 -92 -340 -27 -126 304 -51 172 -143 194 -89 -94 -148 -190 150 120 -123
6978a23o5K65J48j43j07M2j77P9k24M18k76L96l80L31k5l27J87J0k54K27N5J7
$$ -123 -188 77 225 82 -25 17 -160 -81 -305 113 -163 233 -147 184 159 -168 19 29 -225 2 57 74
7000G4n4l9j45j57K90LK7J44j31Q1n7K51k53J21j68k72L2K61Ko5L98l09n1k22
$$ 74 20 -19 -164 -321 -31 -28 -1 143 12 93 36 287 34 155 -13 -285 -253 8 10 -55 343 34 -17 -239
7024b39N60l80j36K48L8L29l15m7j35L08k67n0R8j41R9j61K63j6j77r5L3r6L14
$$ -239 321 -59 -195 53 91 420 105 58 -77 231 -36 -86 12 -129 -30 -191 72 56 -121 -216 -183 -279 35
7047C5J13N0m06m2K05j07J50k13J91k4L06k1k43J2P9q5k78R4J17k46M0L00j31
$$ 35 148 198 -208 -250 -45 -152 -2 -215 -24 -48 258 237 -6 6 85 0 -278 -184 -67 -313 -273 27 -104
7070a04j12L44oj04l72K89K44k57L78n52L55r4J82j60J19j16m01J81N23l28K98
$$ -104 -216 128 122 18 -354 -65 179 -78 300 -252 103 9 191 31 150 34 -367 -186 337 9 307
7091C07n04L98J45m38J59K09o02L40k61L36Kk55K67j53J86j88J81k65K70l34Q4
$$ 307 -197 201 346 -92 67 276 -326 14 -247 89 91 -164 103 -50 136 -52 129 -136 134 -200 -116
7112a16J07j63K01j67J79R3l83J69k04K63k4K3J87k6k2l58M36k87rj21L40J57
$$ -116 -9 -172 29 -138 41 134 -249 -80 -284 -21 -45 -22 165 139 117 -241 195 -92 -101 -222 118 275
7134B75m53J74m6n5K80m35L71j02j3k82M35k7k46J20k32J72M0K1J48k17J41j48
$$ 275 -178 -4 -50 -105 175 -260 111 9 -4 -286 149 122 -124 -4 -236 -64 -24 -3 145 -72 69 -79
7156g9K70k46l3m4p9N95l74o9K8j9P7L43n98L93m36K24m8O0J13k35L17m32M06
$$ -79 191 -55 -88 -132 -211 384 10 -59 -31 -50 27 370 -228 165 -271 -47 -95 -35 78 -157 160 -272 134
7179A34K9l05K11j72n0K38q2o2j62K35j69P1J29Oj22M2J35o6j3j51K28j11O3m3
$$ 134 163 -142 69 -103 -153 85 3 -59 -221 14 -155 -84 45 51 -71 -29 106 40 27 -124 104 -7 56 13
7203A3l50K16L09m25J69m7K99r6J89j63j24j29L1P0m27J88J85O1K54l05L02l62
$$ 13 -337 -121 188 -237 -68 -115 184 88 277 114 -10 -139 -108 -38 -465 -277 -92 -31 223 -82 220 -142
7225a42m4O2j57N37k23P9j37N4l12K44k72K45P7K08k78m9M1k78J74J76Q1k99J28
$$ -142 -186 -124 -281 256 33 112 -25 29 -283 -39 -311 -66 11 219 -59 -108 -67 -345 -171 5 86 -213 -85
7248h5R6J14K3r7k65N5K77J08k82J2j33J38K11N9j23J44l94N9J79K87n33j42P32
$$ -85 11 125 148 51 -214 -159 118 226 -56 -44 -177 -39 172 231 108 252 -142 -83 96 383 -150 -292 440
7271D40o85N5J72q3K5K44k19r1K30K11k00r8j7j42K43K87m75J56P0n7k60J46l5
$$ 440 -245 -190 -18 -101 -76 168 -51 -142 88 299 99 1 -16 -158 85 372 -103 53 123 66 -194 -48 -83
7294h3J41N2l67M94k27l45N29l45J13K44n04M05p5Jl85L42J6k13L39j81K59k81
$$ -83 58 110 -257 237 10 -335 194 -151 -38 206 -298 107 32 33 -352 -10 6 -207 132 -49 210 -71
7316g1L37L6J0k25j67J73j18p6Q4J2J06l09L75j46J55Q0j74k30M13l28K43j38
$$ -71 266 302 312 87 -80 93 -25 -101 -17 -5 101 -208 167 21 176 256 82 -148 265 -63 180 42
7338D2P5l83L77m44J72J78K32j57j86J40k04L20P2j12o7o9o6R9L2o5J3j04P8K91
$$ 42 117 -266 111 -333 -161 17 249 92 -94 46 -158 162 234 122 55 -14 -80 19 51 -14 -1 -105 -27 264
7362B64o7k3j6l57j6L91j52j34k53L51J58k15J35J17j98j28m2L03m4k64K41Nl7
$$ 264 197 174 158 -199 -215 176 24 -110 -363 -12 146 -69 66 183 -15 -143 -185 118 74 -190 51 56 19
7385A9lj41K56j30Q4q1J5m3j10M36l56j06L19j55j6M2o6M6k24L76j0k08K76l78
$$ 19 16 -125 131 1 85 4 19 -24 -134 302 -54 -160 159 4 -12 30 -36 10 -214 162 152 -56 220 -158
7409a58kL01K15l80j9J85J12l04m8j3P2Q4o8L3j28L46k09R2j37k19M18k67j12
$$ -158 -160 141 356 -24 -43 142 254 -50 -98 -111 -39 45 -23 10 -118 228 19 111 -26 -245 173 -94 -206
7432b06J81l2K36l80K83ro2J87l34K99j62M3m00L13m1K82o4j57m7J03l8j06P5
$$ -206 -25 -57 179 -201 82 73 11 198 -136 163 1 44 -356 -43 -84 198 134 -23 -70 33 -5 -111 -36
7455c6j70J35m7J6K1k22M55k01k44K37L08j62l15L69j52K02k22j7l03M58J74n4
$$ -36 -206 -71 -118 -102 -81 -303 152 -49 -293 -56 252 90 -225 144 -8 194 -28 -45 -348 110 284 230
7477B30m64K18K04l30l3O6n8l1J61R0J17n8j55k4J54j23m2pj27K81k50K51o9P9
$$ 230 -234 -16 188 -142 -175 -109 -167 -198 -37 53 170 112 -43 -67 87 -36 -78 -85 -212 69 -181 70 1 80
7501H0L0m8J1k33L00k02J27k65Q5k7M6L64n08K47K09Lj1Pk87n6J50N8j01q5n2
$$ 80 110 62 73 -160 140 -62 65 -200 -115 -142 -96 268 -240 7 216 219 208 215 -72 -128 22 80 -21 -106 -158
7526a58R2K70l54N33n05M5j85q3J17L10j86O5n8K04N1m1r1KJ30K5k85N7Q8J38
$$ -158 -66 204 -150 383 -122 -77 -262 -345 -228 82 -104 -39 -97 107 158 117 26 28 158 183 -102 -45 43 181
7550A81j12L0pJ67l92L14k88J49J30oj77K56k91j70L90m29J12L29j89J36N3k73
$$ 181 69 99 92 259 -133 181 -107 42 172 166 -11 245 -46 -216 174 -255 -143 186 -3 133 186 -87
7572h7k6L1K88k92M40m89K45k91K09P2Q8k35lM8M3N2p3Nj9R7J53k61l7N8l45K59
$$ -87 -113 -82 206 -86 354 -135 110 -181 28 100 188 -47 -50 -2 41 93 20 25 6 103 256 -5 -42 16 -329 -70
7598g0L85o8l52L24o7j02R8j30L8j71L31j99j74K75j52l0m5J09O2l61J91J91j77
$$ -70 315 247 -105 219 152 50 148 18 56 -115 216 17 -157 118 -34 -64 -109 0 62 -299 -108 83 -94
7621i4r1L33l48P27o65J1K25J29l51J78k77K62k40M08k82Q3J40l05J69n6Q3l53
$$ -94 -185 148 -200 527 -138 -127 98 227 -124 54 -223 39 -201 207 -75 8 148 -157 12 -44 39 -314
7643c14K47O2P7k66J49j00L0k25L37K95j27j17j61J96j44l1r9K08k34R0J27R3
$$ -314 -67 -5 72 -194 -45 -145 -115 -340 -3 292 165 48 -113 83 -61 -92 -191 17 -217 -127 0 93
7665I3l56L1O06l53P4l5j0%J83j01J1j42l5L1JJ49r8P8o6k51K71q5N9J75k45n4
$$ 93 -263 -232 374 21 95 60 50 50 233 132 143 1 -34 -3 -2 147 49 127 61 -190 81 -4 55 230 -15 -69
7691f9q4J47N4j86n3L34p8J76m19K41J2j60j56L33j14j07K38p4K7O6j31K57l26
$$ -69 -153 -6 48 -138 -191 143 65 241 -178 63 75 -85 -241 92 -22 -129 109 35 62 128 -3 254 -72
7714g2J40l48L77j27K1L06j06j81o6M7k3j8L03j89J1r6j44J49J97j20p7R5J4N2
$$ -72 68 -280 97 -30 -9 297 191 10 -56 -9 -32 -50 253 64 75 -21 -165 -16 181 61 -16 79 93 145
7738A45l42M4J2K29j57M2K3J60r5J31k41P1m9K43m27L27m46N05j20j84l0J73j69
$$ 145 -197 -153 -141 88 -69 -27 -4 156 61 192 -49 22 -27 216 -211 116 -330 175 55 -129 -159 14 -155
7761a55J08K81k12R0K98p00K01r7R2N8O8Oj48J04j63L29k65K56j65p6m4L39j1
$$ -155 -47 234 22 112 410 -290 -89 -186 -94 -36 32 38 -110 -6 -169 160 -105 151 -14 -90 -134 205 194
7784A94j39j28J62J78j19%j75K64l10N36n30q7k69K84M09l95K39k27J52j72K14
$$ 194 55 -73 89 267 148 148 -27 237 -73 463 -67 -154 -423 -139 270 -125 114 -113 39 -133 81
7805H1k35K24j00o4M98o17l8K48pK6J84k26j96N5L24k0j59j31J84J9q9M50j36
$$ 81 -154 70 -30 -94 404 -213 -251 -3 -10 16 200 -26 -222 -167 157 137 -22 -153 31 50 -39 411 275
7828B75n34L70m35L35n8l4O5K6j59m7K65k01J23K62m99R9L29j51NJ41K2n5k38
$$ 275 -259 111 -324 11 -47 -81 -16 10 -149 -196 69 -132 -9 253 -246 -147 182 31 36 177 199 144 -94
7851i4n6j6J5J24k23N6L63j44N9P1k06o3P2p5N8R2k2j31K05l16M76l62Q7K7%l68
$$ -94 -150 -166 -151 -27 -250 -194 169 25 84 155 -51 -114 -42 -117 -59 33 11 -120 85 -231 245 -117 -30 -3 -3 -371
7877c71J82J85J86j16j3R4j51n2J23lJ00j14k4k90K32J91k75K50k59K20n9l74
$$ -371 -189 -4 182 66 53 147 -4 -56 67 64 164 50 26 -264 -32 159 -116 134 -125 95 36 -338
7899c38L83j12J53k57L16j76J38j16K4J89k0J21l08j35N7k38L53j74J67J46k51
$$ -338 45 -67 86 -171 145 -31 107 -9 15 204 184 305 -3 -138 -81 -319 34 -140 27 173 -78
7920g8K58m32J32J44k40M08j82m7K0o4j54J14j47L13j76N9J91j58L20j86o9m9
$$ -78 180 -252 -120 24 -216 192 10 -37 -17 -81 -235 -121 -268 45 -131 -72 119 -39 281 95 26 -23
7942b3K9M0j03j15j08L60j65J94k26J54l30n5L77j02J77j97P4J48K3N3Ql30r0
$$ -23 6 46 -57 -172 -280 80 -85 109 -117 37 -293 -348 29 -73 104 -93 -19 129 152 205 213 -117 -207
7965b07j00K17L8J03J13j35Jk10J76p8M30o16J84J76L76n16qM12m34Q3O2kP4J25
$$ -207 -307 -90 -52 51 164 29 30 -180 -4 -82 348 -268 -84 92 468 -48 -56 356 -78 5 67 65 139 264
7989B64l76K68j65K8j12M67o27J83J21l81L60n47L22J35J17p5O3j09P0J27j59
$$ 264 -112 156 -9 19 -93 374 -253 -70 51 -330 30 -517 -195 -60 57 -18 45 -64 6 133 -26
8010b6L39m36J82m4J17j58M6k53M08j49j25L60m29j71M31j47L9J54q1j73J77k76
$$ -26 313 -123 59 15 132 -26 20 -233 175 26 -99 261 -168 -339 92 -55 -16 138 57 -116 61 -215
8032b15L02n08L85J49n35K84J25K93q9l76K14k1q4Q9j93M22o20M80l9k88J86o0
$$ -215 87 -421 -36 113 -422 -138 -13 280 191 -185 29 8 -76 13 -180 242 -378 102 63 -225 -39 -99
8054i9J5J66N5j2j21j29K30K3Jp4J8m9n1l44N33j43j61J16m8K7M5l2J02k04K25
$$ -99 -84 82 137 125 4 -125 105 128 129 55 73 24 -27 -371 162 19 -142 -26 -74 -47 -2 -34 68 -136 89
8079H9j61k25K81n5q3Olm6L95k66K83k51K44n0Pl09k6l57J95L11j68M9K23j5k
$$ 89 -72 -297 -16 -71 -154 -148 -151 -197 198 -68 215 -36 208 158 165 -144 -170 -527 -332 -21 -189 -140 83 68 66
8104F6P0j6J35l03N0Qk57k2J96M8pK29l3j93j0k13K17K62j74m2Q3k02L20k53j78
$$ 66 136 120 255 -48 2 10 -247 -269 -73 -25 -32 197 164 -29 -39 -252 -35 227 53 11 94 -108 212 -41 -219
8129b19J08k49J72L48L9j40J5p1L2k41j9K9J26OJ05J35j32m3j17O7j86L22m9J01
$$ -219 -111 -360 -188 160 199 59 74 3 35 -206 -225 -196 -70 -64 41 176 44 1 -116 -49 -235 87 38 139
8153A39r9l80L45O4O2R7k73j04L13k34J68l86N0J82J0j36K13l2Q6k94K99j28K23
$$ 139 40 -340 5 69 131 228 -45 -149 164 -70 98 -288 -238 -56 -46 -182 31 -1 85 -209 90 -38 185
8176A85k98k8j20K10R9n4l6j13k61L22j42N17j17k71N0
$$ 185 -113 -141 -261 -51 48 -6 -42 -155 -416 -94 -236 281 164 -107 -57
8191e7
$$ Imaginary data points
##PAGE= N=2
##DATA TABLE= (X++(I..I)), XYDATA
0@%%%%qQqJ6j6J9k7L4m2N6o9Q1r9J19j37J60j88K20k55K92l36L85m38M98n64O37
$$ 0 0 0 0 0 -8 0 -8 8 -8 11 -16 18 -24 32 -37 44 -55 64 -73 87 -101 119 -136 156 -180 205 -233 265 -299 338
30C38p21Q10r04J012j131J259j400J555j726J912k116K344k595K873l184L533
$$ 338 -383 427 -477 535 -596 663 -737 818 -908 1004 -1112 1232 -1363 1510 -1674 1859
46A859l927M375m888N485o190P040q083R394j1112J3466j6899K2390l2561N7524
$$ 1859 -2068 2307 -2581 2904 -3286 3754 -4329 5065 -6047 7419 -9480 12910 -19651 37873
60C7873k24591l39332N48830K88226k83560k39611J35728N1667p0711M4125J14447
$$ 37873 -186718 -526050 22780 311006 27446 -212165 -76437 -24770 -95481 -51356 63091
71F3091n4647r0014J5794K5789m0908Q0012J46883p9525k34885L1016K22192L5867
$$ 63091 8444 -81570 -65776 -39987 -80895 -883 146000 66475 -168410 -137394 84798 120665
83A20665q5884J3892n9410j23348J34494K39982j13023k57181O9703K00290o5968
$$ 120665 34781 48673 -10737 -134085 409 240391 127368 -129813 -60110 140180 74212
94G4212j35107R4914J23569j13454j56991O5847J50187n263q3152k6397l7692
$$ 74212 -60895 34019 157588 44134 -112857 -47010 103177 97914 14762 -11635 -49327
105d9327k6654J04859Q3141j09885r6322O1183J7031n2439P2947P8578j09761
$$ -49327 -75981 28878 112019 2134 -94188 -33005 -15974 -68413 4534 83112 -26649
116b6649j03796O4250N4801j1674O1500L3237j59035j29802J69701K34542q5492
$$ -26649 -130445 -66195 -11394 -23068 38432 71669 -87366 -217168 -47467 187075 101583
127A01583k44200J8853J83803k2607j03685J07240R8248j52892j17120J19077
$$ 101583 -142617 -123764 60039 37432 -66253 40987 139235 -13657 -130777 -11700
137a1700J05142j2107N060n0769j42671K3935K17388O0767j73043j03815O4108
$$ -11700 93442 81335 86395 35626 -107045 -83110 134278 195045 22002 -81813 -17705
148a7705M8258j870N2046K3700j31843j06133J30351J37452j10489j07871J07630
$$ -17705 30553 28683 80729 104429 -27414 -133547 -3196 134256 23767 -84104 23526
159B3526K6883j69827N287K16697J1951k06854n7997J09811N3671O7P531n4559
$$ 23526 50409 -119418 -114131 102566 114517 -92337 -150334 -40523 13148 13215 20746 -33813
171c3813q1312L5765J15552J5181q6144j9094N6137j5397m6131P3070Q0155p7081
$$ -33813 -115125 -79360 36192 51373 -34771 -53865 2272 -13125 -59256 13814 93969 16888
183A6888p7033N9424L1319l6498O3606O6384j18513j07481J09909J20478n4672
$$ 16888 -60145 -721 30598 -5900 57706 124090 5577 -101904 8005 128483 73811
194G3811p2313J9916J042m4965K3314Q2811p41r4320m1773M0334J3181L286N8457
$$ 73811 1498 21414 22456 -22509 805 83616 82875 -11445 -53218 -12884 297 3583 62040
207F2040j3399j39985l9422J33893O4990o7069l2154j2483o2630K6296J33628
$$ 62040 48641 -91344 -130766 3127 68117 1048 -31106 -43589 -106219 -79923 53705
218E3705J7027j27755n2899O6718L9899q400K6748K6183o5466p8036O0992J23288
$$ 53705 70732 -57023 -109922 -43204 -3305 -11705 15043 41226 -24240 -102276 -41284 82004
230H2004m001q3194j2514O809k0571O6622R6593o7747j30389K9914R6810m68k1887
$$ 82004 78003 -5191 -17705 -10896 -31467 35155 131748 64001 -66388 -36474 60336 59868 37981
243C7981J6370l4759o3260K5277P7429R373n6573l2537M698r316K489N8665K1743
$$ 37981 54351 19592 -43668 -18391 59038 68411 11838 -20699 -16001 -25317 -22828 35837 57580
256E7580r1725o4672O6442N3289l4841p19K3638o0843m5658P6989O1799m4539
$$ 57580 -34145 -98817 -32375 20914 -13927 -14646 8992 -51851 -97509 -20520 41279 -3260
268c260l4838J6344j3019j8225M9256O0096k4026p5457j4565N8015L7434o038
$$ -3260 -38098 -21754 -34773 -52998 -3742 56354 32328 -43129 -57694 321 37755 31717
280C1717M502j3981n7456L500Q5312K1343n7673p893J2567m3392J159Q8394K2289
$$ 31717 36219 22238 -35218 -31718 53594 74937 17264 9371 21938 -21454 -20295 68099 90388
293I0388q5842n7116K4208M2798K9661O523m1729o4871j0504O9613N9079l9433
$$ 90388 4546 -52570 -28362 14436 44097 50620 8891 -55980 -66484 3129 62208 22775
305B2775p1054L092K7265j2675J9186N2695l0972p9779N520N5303J7589J1510
$$ 22775 -48279 -45187 -17922 -30597 -11411 41284 10312 -69467 -63947 -8644 8945 20455
317B0455M342n8577m9959N4846Q6068K238o5994m4753J7380M6482K6570n90k1867
$$ 20455 24797 -33780 -83739 -28893 57175 59413 -6581 -51334 -33954 12528 39098 38508 16641
330A6641l8795n657M7132K1049k7059N169J7402m8582l4652O3818N5521l9347
$$ 16641 -22154 -27811 19321 40370 13311 18480 35882 -12700 -47352 16466 71987 32640
342C2640n1686m675J0358K0996K8099o552l9315k3509J2761K8240R612j2984n859
$$ 32640 -19046 -23721 -13363 7633 35732 29180 -10135 -33644 -20883 7357 16969 3985 -1874
355a874l943k5660m742M5347K2500l1434k3934m924q692K9162N4507j9134p0879
$$ -1874 -5817 -31477 -36219 9128 31628 194 -23740 -28664 -37356 -8194 46313 27179 -43700
368d3700q224M6984K3727k488m882j6003k1252k176K7681L8710J641m6155l1756
$$ -43700 -51924 -4940 18787 16299 11417 -4586 -25838 -28014 -333 38377 40018 -6137 -37893
381c7893J4997L2470L2980P829n2186n1432L3382N9461M48k3578j1048k2802r884
$$ -37893 -22896 9574 42554 50383 -1803 -53235 -19853 39608 40056 16478 5430 -17372 -27256
394b7256L5807L2960j0278k8749k5470o683K6138L5031N487k9272m3903j3321
$$ -27256 8551 41511 31233 2484 -22986 -29669 -3531 31500 36987 7715 -36188 -49509
406d9509M7837M5964k1256m3094j0212J793J2156L4868O933l8039k1100J1550
$$ -49509 -1672 44292 23036 -20058 -30270 -28477 -16321 18547 25480 -12559 -33659 -22109
418b2109R723J0884J7099o071k4039j4438L683K7350L1954j1154m2210j1518K2513
$$ -22109 -12386 -1502 15597 9526 -14513 -28951 -25268 2082 34036 22882 -19328 -30846 -8333
431h333K4986J5050j1431l0836l115K2259K935j056J7312k729l1554j2330J8758
$$ -8333 16653 31703 20272 -10564 -13679 8580 11515 10459 27771 25042 -6512 -18842 -84
444h4K4721J4619j9090m1063p013L0857J9968j258r977k7894j8133K0373K6796
$$ -84 24637 39256 20166 -20897 -27910 2947 22915 21657 11680 -16214 -34347 -13974 12822
457A2822L910j0271k3192k4768J1779L6302J2059j2408k2299k5967L758M2738
$$ 12822 16732 6461 -16731 -41499 -29720 6582 18641 6233 -16066 -42033 -38275 4463
469D463K6531j7185l1060k2225P504M5339K8792k5814l3742l875R071K1535K8422
$$ 4463 30994 13809 -17251 -39476 -31972 13367 42159 16345 -17397 -21272 -12201 9334 37756
482C7756m958l3499j6272P050J8869K8105M399l4043l0010O471K7457K6049l788
$$ 37756 32798 -701 -16973 -9923 8946 37051 41450 7407 -22603 -16132 11325 37374 33586
495C3586l8320k2717J7694J7655L633N489j3111l0602m54K4266P607o18o47k0749
$$ 33586 -4734 -27451 -9757 7898 11531 17020 3909 -26693 -27147 -2881 4726 4108 3461 -17288
509a7288j9971J6113K7438N391j2579j9071r301J4007J8538O979L1j4607k0875
$$ -17288 -37259 -21146 6292 11683 -896 -19967 -29268 -15261 3277 10256 10287 -4320 -25195
522b5195R659K9126M161p945K192j4668j9248K1714L4711m435k2828j2513p526
$$ -25195 -15536 13590 17751 9806 11998 -2670 -21918 -204 34507 30072 7244 -5269 -12795
535a2795J0400K9466R667k4814k7937m149K1168K3366k741j8065j2123j2201j443
$$ -12795 -2395 27071 36738 11924 -16013 -20162 1006 24372 21631 3566 -8557 -20758 -22201
548b2201L1515K3154k7668l1675J106Q047J3756K7623n276m6059j7133L1936K7420
$$ -22201 9314 32468 4800 -26875 -25769 -17722 -3966 23657 18381 -27678 -44811 -12875 14545
561A4545J000j1681j7616j1952P556K3350K0603o368l2020j3522J9574J6931O897
$$ 14545 15545 3864 -13752 -25704 -18148 5202 25805 19437 -12583 -26105 -6531 10400 17297
574A7297Q836j8233l7970R270M6144P472k4760r391m648r258J6802K6866o391
$$ 17297 26133 7900 -30070 -20800 25344 32816 8056 -1335 -5983 -15241 1561 28427 22036
587B2036k6943j2116O760J3648P211J738l828j8405j7804J7982L1135o529k2801
$$ 22036 -4907 -17023 -10263 3385 10596 12334 8506 -9899 -27703 -9721 21414 14885 -7916
600g916p78l251q478K3845K4327k3657k8263J1380J2605l296Q399J1718j3653
$$ -7916 -8694 -11945 -20423 3422 27749 4092 -24171 -12791 -186 -3482 4917 16635 2982
613B982k3325j49K2029J8901n010j7563j0716n062R508L0525R159l7313k2489
$$ 2982 -20343 -20492 1537 20438 15428 -2135 -12851 -17913 -8405 22120 31279 -6034 -28523
626b8523K2524J3519m239J3861K614l6181j5735L2046K4639p176j2829j3007j2561
$$ -28523 -5999 7520 3281 17142 19756 -16425 -32160 -114 24525 17349 4520 -8487 -21048
639b1048Q615K8676J6012k0528l4438l229K8408J5158l349m09j6938k9082J4825
$$ -21048 -12433 16243 32255 11727 -22711 -25940 2468 17626 14277 13868 -3070 -32152 -17327
652a7327M5372o0l3029p103L702q164J5227K9339r879l5949r999J8656J8580M701
$$ -17327 28045 27985 -5044 -12147 -8445 -16609 -1382 27957 18078 -17871 -27870 -9214 9366 14067
666A4067o161j3323j5670o50K5549K0770j8487k2349P911L787q673K0078K3138
$$ 14067 7906 -5417 -21087 -21737 3812 24582 6095 -16254 -8343 -4556 -13229 6849 29987
679B9987k6129l2044J6169K3641k288R37K751j7533j3847J6552K1969j748j4845
$$ 29987 3858 -28186 -12017 11624 9336 10273 13024 -4509 -18356 -1804 20165 18417 3572
692C572o895N87k865M046K2453M903l3533j8253K3588J4403p461O381j137l1600
$$ 3572 -3323 -2736 -5601 -1555 20898 25801 -7732 -25985 -2397 12006 4545 10926 9789 -21811
706b1811q078L6034J7657k0951j3508j609o445N420K4520R562k2735k6383M668
$$ -21811 -29889 6145 23802 2851 -10657 -12266 -18711 -13291 11229 20791 -1944 -28327 -23659
719b3659K5223J0914l705j876j5440k2685J8457M3560k192l6314o995J0050q58
$$ -23659 1564 12478 8773 6897 -8543 -31228 -12771 30789 28597 -7717 -14712 -4662 -5520
732e520J5033K3657j6962l5182J192K4415J1369l44m407j4668j7032N629K9292
$$ -5520 9513 33170 16208 -18974 -17782 6633 18002 17658 13251 -1417 -18449 -12820 16472
745A6472J4752k6085k6583R384J2680l017J0647J0021k8325k2733K3021K2096
$$ 16472 31224 5139 -21444 -12060 620 -2397 8250 18271 -10054 -32787 -9766 12330
757A2330j0457m380L522j6356j0608K3147K0961j1263j9445j550P598L245N549
$$ 12330 1873 -2507 1015 -15341 -25949 -2802 18159 6896 -12549 -14099 -6501 -3256 2293
770B293J1776l592k4528m885K6196R496j2522L134K402k2791l279L4206J1436
$$ 2293 14069 10477 -14051 -18936 7260 16756 4234 7368 9770 -13021 -16300 17906 29342
783B9342k5987j1694N996k640M707J9831Q72k5591j6877J2105J9923K875p668
$$ 29342 3355 -8339 -2343 -4983 -276 19555 20427 -5164 -22041 -9936 9987 12862 5194
796E194m677j2221j4053J8012L2545q817l3392l176J2248N0J2524J8658k0822
$$ 5194 517 -11704 -25757 -7745 24800 15983 -17409 -20585 -8337 -8287 4237 22895 2073
809B073l3331R862K9987N518p670l761j1254j1445J1557K7661O799k5340k0732
$$ 2073 -31258 -21396 8591 14109 6439 2678 -8576 -20021 -8464 19197 25996 656 -20076
822b0076J0562J4902K170Q114J766k7842j6330K9390K2694j5559j2089L490j0726
$$ -20076 -9514 5388 7558 15672 17438 -10404 -26734 2656 25350 9791 -2298 1192 -9534
835i534n734K3795J5695j9425k0748L650J0850M440K956L618r437j9284K295K6291
$$ -9534 -15268 8527 24222 4797 -15951 -12301 -1451 2989 5945 9563 126 -19158 -16863 9428
849I428P099j8915l897N140j1043N03K6274M484k6353p879J2169J485K433J4024
$$ 9428 16527 -2388 -6285 -1145 -12188 -11685 14589 19073 -7280 -15159 -2990 -1505 928 14952
863A4952l142k2432p899J6172J5309j307q918n704o243m276J5379K1597j0793
$$ 14952 11810 -10622 -18521 -2349 12960 11653 2735 -2969 -9212 -13488 1891 23488 12695
876A2695k7335n79J3854J852P989J1497j9316k7162J2656K7054K144r549n288
$$ 12695 -14640 -15219 -1365 487 8476 19973 657 -26505 -13849 13205 15349 5800 512
889E12j1310o809J6917K1885l057k3592j3381J0576J3915M120M032m791k4786
$$ 512 -10798 -17607 -690 21195 18138 -5454 -18835 -8259 5656 9776 13808 9017 -15769
902a5769q359L0142J9471j8506j4473L322o316j86K3723R453k4997j7775R737
$$ -15769 -24128 6014 25485 6979 -7494 -4172 -10488 -10674 13049 22502 -2495 -20270 -10533
915a0533J3002L141J811j823j2799j2314J0084K3415J441k0338n653P334l501
$$ -10533 2469 5610 7421 5598 -7201 -19515 -9431 13984 15425 -4913 -10566 -3232 -6733
928f733L450J9441k160k6136k623J8571K322l556Q680k934j8599k361J8050J1057
$$ -6733 -3283 16158 13998 -12138 -14761 3810 6132 2576 11256 8322 -10277 -12638 5412 16469
942A6469o221j0804m160o26J495J0539J1600j1420k1507K088J5774Q39J013N422
$$ 16469 10248 -556 -4716 -5342 -3847 6692 18292 6872 -14635 -12547 3227 4066 5079 10501
956A0501j4351j9193J1440K3650j455j1357n203p549j524J6132J5433p834k0143
$$ 10501 -3850 -23043 -11603 12047 10592 -765 -5968 -13517 -15041 1091 16524 8690 -11453
969a1453p425J1304J4630K720k594o216j4515l241K3847J6682j5267j4988Q55
$$ -11453 -18878 -7574 7056 9776 7182 966 -13549 -16790 7057 23739 8472 -6516 -5661
982e661p02N237J9789K523k5091j2921J2775J3037K474q11p817j2017l036J1582
$$ -5661 -6363 -1126 18663 21186 -3905 -16826 -4051 8986 11460 10649 2832 -9185 -12221 -639
996f39J5280k549j7150p804O460K535M189J1901p288k3089K64K0277M029o230
$$ -639 14641 12092 -5058 -12862 -6402 -3867 322 12223 4935 -18154 -17890 2387 6416 186
1010A86P05n390j0302O238J5555J758q311n486k203J916N856P990L626j0939j3480
$$ 186 891 -4499 -14801 -8563 6992 8750 439 -5047 -7250 -5334 522 8512 12138 1199 -12281
1025a2281N688J5297J614l922L17r430r553J2947J6075o234j1647j099l398j392
$$ -12281 -6593 8704 10318 6396 6713 -2717 -12270 677 16752 10518 -1129 -2228 -5626 -7018
1039g018J3205R380j0411j5480l831R222J1910K644p121r548q379K871J8700R310
$$ -7018 6187 15567 5156 -10324 -14155 -4933 6977 9621 2500 -7048 -15427 -12556 6144 15454
1053A5454j5391j3681L239M014M366J3710j2k0827q987J3077J2349L099j809j0489
$$ 15454 63 -13618 -10379 -6365 -1999 11711 11699 -9128 -18115 -5038 7311 10410 8601 -1888
1067a888j0821L918J4796J0522n159j6524o668R784Q330K540J780p233j5326J758
$$ -1888 -12709 -8791 6005 16527 11368 -5156 -11824 -2040 6290 8830 10610 3377 -11949 -10191
1081a0191J7610L977o958l403o563o345R826J3321k789j1708n697P68N753P100
$$ -10191 7419 11396 4438 1035 -5528 -11873 -2047 11274 8485 -3223 -8920 -8152 -2399 4701
1095D701Q84m257o689n343N142J1358J082o674k344l574l389J0337J1434p036
$$ 4701 5585 1328 -5361 -10704 -5562 5796 6878 204 -2140 -5714 -9103 1234 12668 5632
1109E632j0514m22J006K827J0147K355j0896q288J676O558P847K098q161q066
$$ 5632 -4882 -5304 -4298 -1471 8676 11031 135 -8153 -6477 81 7928 10026 1865 -6201
1123f201k641M957J2016N644j1667j2934J846P177N865P360m556j6934m359J2825
$$ -6201 -8842 -3885 8131 13775 2108 -10826 -8980 -1803 4062 11422 6866 -10068 -14427 -1602
1137a602R554R36l860j0887p186P637J3050L586n877j1135o632Q002J1885K143
$$ -1602 7952 8888 5028 -5859 -13045 -5408 7642 11228 5351 -5784 -12416 -4414 7471 9614
1151I614l963q321r622N105J5447L204q946o285l550o13J0492R109o822j0386
$$ 9614 5651 -2670 -12292 -7187 8260 11464 2518 -3767 -7317 -7930 2562 11671 4849 -5537
1165e537k525K359O602P083k581q391m279R05M764Q314L21q736m228J393J705
$$ -5537 -8062 -5703 899 7982 5401 -2990 -7269 -6364 -1600 6714 7035 -1701 -5929 -4536 -2831
1180b831O963N204p565p871K029L613K674N576j080r642l203M269M707M147P44
$$ -2831 4132 9336 1771 -6100 -4071 -458 2216 7792 6712 -2930 -6133 -1864 2843 6990 7734
1195G734q376o983L096N820N113J934q279j0116K392Q801M054Q58m828j1083j290
$$ 7734 -642 -7625 -4529 1291 6404 8338 59 -10057 -7665 1136 5190 6048 1220 -9863 -11153
1210a1153J0910O994j360m657q971l746R149J0538k23o552p647m442Q448J2428
$$ -11153 -243 6751 5391 734 -8237 -11983 -2834 7704 7481 929 -6718 -11160 -2712 9716
1224I716k67q350o292k564M844J2253K945r581p841o01L326R402N253q321r057
$$ 9716 9449 1099 -5193 -7757 -2913 9340 12285 2704 -5137 -5738 -2412 6990 12243 3922 -5135
1239e135o81L360O722O186n669j1045j122M485M006M997j519j0358m485N962N092
$$ -5135 -5816 -2456 4266 10452 4783 -6262 -7384 -2899 1107 6104 4585 -5773 -10258 -4296 796
1254G96J961N66n983o235K459O525K859R16m085o613J008O366K762J409m79p703
$$ 796 2757 3323 -2660 -8895 -6436 89 2948 3864 -221 -6834 -5826 540 3302 4711 4232 -3471
1270c471l649P580N701o41o96l916o536K619R348J773l650l781n136K47P371M790
$$ -3471 -7120 460 6161 5520 4824 908 -5628 -3009 6339 8112 4462 681 -4455 -4208 3163 7953
1286G953k542n490o624q37R024N998l582n808m317l283O229J1125j957j0597l696
$$ 7953 5411 -79 -6703 -7540 1484 7482 3900 -1908 -6225 -9508 -3279 7846 5889 -4708 -8404
1301h404J785L335Q039L217q701q362J079O695P747K025p782p351R40N000P046
$$ -8404 -6619 -3284 4755 7972 -729 -9091 -8012 -1317 6430 8455 673 -6678 -5738 -738 6308
1316F308M057p401j0121K251P338K777J932q36r823m738Q792O991k064l057m288
$$ 6308 10365 2964 -7157 -4906 2432 5209 7141 6305 -3518 -8256 536 7527 5463 2406 -1882
1331a882m747L046P408K302m027n957l448M378N343o1j506j137n760j594Q493
$$ -1882 -6629 -3583 3825 6127 2100 -3857 -7305 -2927 2416 2355 849 -288 -6048 -7642 851
1346H51M557m880k542K3l552K207Q869L17o881k387P55J076M621L253k808n102
$$ 851 5408 528 -2014 -1991 -5543 -3336 5533 5850 -1031 -3418 -2663 -1587 3034 6287 3479 -1623
1362a623l385K255P642K626n295l859r58j709M494R411l069j1378j575M885K013
$$ -1623 -5008 -2753 4889 7515 2220 -1639 -2597 -4306 188 9599 6530 -4848 -6423 -1538 475
1377D75L748K475q071p932L704P727L502j657n665n044R02N322N700K207q271
$$ 475 4223 6698 -1373 -9305 -5601 2126 5628 3971 -1694 -6738 -5836 -514 5186 7393 -878
1392h78q748M475Q617N50j89o48q805l062J0018P904n231n423j509j532L233O992
$$ -878 -9626 -5151 3466 4016 3827 3179 -5626 -8688 1330 9234 4003 -1420 -2929 -4461 -1228 5764
1408E764J261o154n984m87N801N373k260l147j872l738J086Q919K014q212l082
$$ 5764 7025 871 -5113 -5600 201 5574 3314 167 -1705 -5443 -4357 4562 6576 -1636 -4718
1423d718L046j256J573P160j452q823j164N078J828J421O07k828m031l04M221
$$ -4718 -1672 -2928 -1355 5805 4353 -4470 -5634 -556 1272 2693 3300 472 -3559 -3863 358
1438C58N198n35o215j700J865m08K503O500m135r505J287O404J85P89J801n991
$$ 358 5556 5021 -1194 -2894 -1029 -1437 1066 7566 3431 -6074 -4787 1617 1802 2591 4392 -1599
1454a599o962N131P945J17l837l451k871J213M994M376n27p449o165N826P930
$$ -1599 -8561 -3430 4515 4632 795 -2656 -5527 -4314 680 5056 4529 -2920 -9085 -3259 4671
1469D671r73k327l47n731k610J0162O959p332o004P80J58K753O834L88q537n254
$$ 4671 3698 1371 1024 -4707 -7317 2845 9804 2472 -3532 -2752 -2594 159 6993 7381 -1156 -6410
1485f410L165O914K889l214m145k116j107K544P736q7r836k633N348L77p1N417
$$ -6410 -3245 3669 6558 3344 -801 -2917 -4024 -1480 6256 6169 -3667 -6300 -952 -575 -646 4771
1501D771k611r389j72Q386J903j752j083k512k850K120N066K504k686n459Q2L847
$$ 4771 2160 -7229 -7401 985 2888 1136 53 -2459 -5309 -3189 1877 4381 1695 -3764 -3682 165
1517A65Q70J057L142l500p120K999P125j423k059J803l592m968N633O707j979
$$ 165 1035 2092 5234 1734 -5386 -2387 4738 3315 1256 3059 -533 -5501 132 6839 4860
1532D860n495j829p6J539L546J881k354o073l417N743O254k034l763p13l409p69
$$ 4860 -635 -2464 -2540 -1001 2545 4426 2072 -4001 -7418 -1675 4579 2545 -1218 -1931 -5340 -6109
1548f109Q418M955q306n414K912J190K071N265j37q410l848N610O142J481l366
$$ -6109 2309 7264 -1042 -6456 -3544 -2354 -283 4982 4845 -3565 -7413 -1803 4339 5820 2454
1563B454m143j758R59M276O016j617r769j883O470K284q12K844l322q841K312
$$ 2454 -1689 -3447 -2488 1788 7804 6187 -3582 -5465 1005 3289 2477 5321 1999 -6842 -4530
1578d530Q911O22m140j695j975j918L835M551p21m859l190J236M214O96j30K43
$$ -4530 4381 5003 863 -832 -2807 -4725 -890 3661 2940 -1919 -5109 -3873 341 1037 907 1150
1594A150l542m116M897O639l043m215K123j014l010N010N416m223m669O98J694
$$ 1150 -2392 -6508 -1611 5028 1985 -2230 -107 -1121 -4131 879 6295 2072 -2597 -1899 -205
1609b05J223K527M11l004m152j11N085L928k714m115l10j867P97O722K547q278
$$ -205 1018 3545 3956 952 -3200 -3311 1774 5702 2988 -1127 -1437 -3304 -2507 4215 6762 -1516
1625a516n119M342K541j6L466j069p755k090O612M453n46l592l217j077K356M473
$$ -1516 -6635 -2293 248 232 3698 2629 -5126 -7216 -604 3849 3303 -289 -3506 -4583 -2227 2246
1641B246L526l229p636o84O721L058j396N45l224o071L058R151l27n442j453j109
$$ 2246 5772 2543 -5093 -5777 944 4002 2606 3151 -73 -6144 -3086 6065 5738 296 -1157 -2266
1657b266o25M695M134k902n941j652K847L669Q29j911j426k791j988N193N971
$$ -2266 -2891 1804 5938 3036 -2905 -4557 -1710 1959 2788 877 -549 -3340 -5328 -135 5836
1672E836l964o201J958R29j183M483L226n659m631L281K892M57J041p0m074k057
$$ 5836 1872 -4329 -2371 -1442 -2625 1858 5084 -575 -5206 -1925 967 1424 2465 2395 -1679 -3736
1688c736K985L806J639l656l373J016J062L6L899J126o430l793N082K456r55J580
$$ -3736 -751 3055 4694 1038 -2335 -1319 -257 -221 3678 4804 -1626 -5419 -337 2119 1164 2744
1704B744j198o597j44O050L202k336k771k295r80L058M208J362l557n942j12O396
$$ 2744 1546 -5051 -5195 855 4057 1721 -1050 -3345 -4325 -1267 2941 4303 746 -5196 -5308 1088
1720A088K751k007p16k419m407L569P879m54o339j078j15O97M271L278l904n850
$$ 1088 3839 1832 1116 -1303 -5710 -2141 5738 5284 -1055 -2133 -2248 -1551 2720 5998 2094 -3756
1736c756j5L951L380K41k775k906j243N37M146M112m184o059J700K657k11K342
$$ -3756 -3771 180 3560 3801 1026 -1880 -3123 -2586 1560 5672 1488 -4571 -2871 -214 -425 1917
1752A917J433n563l989M630L735p03m36j420k960K81L429K673j14l467k366J573
$$ 1917 3350 -2213 -6202 -1572 2163 1460 1024 -396 -3356 -3075 354 3027 2913 -554 -2920 -1347
1768a347K208M62J692r8n229j842N034L080k131l28r48m019O54N631J875l942
$$ -1347 861 1323 3015 2917 -2312 -4154 880 3960 1829 1501 553 -3466 -2812 2819 4694 752
1784G52k190j360J90K888K940p41l444l867N65N265K277k285k003j546k009K823
$$ 752 -1438 -2798 -2608 280 3220 2479 -965 -4832 -4267 998 3275 990 -1013 -2559 -4568 -1745
1800a745O564j539n941q08J672J020L292J945m195m747J478M172K739k35l326
$$ -1745 4819 3280 -2661 -3469 -1797 -777 2515 4460 265 -4482 -3004 1168 3907 3672 346
1815C46k884k84K580L502K088m393n109J748L599N67Q37n6n295k473M750L870
$$ 346 -2538 -2822 -242 3260 5348 955 -4154 -2406 1193 1760 2597 2541 -2754 -5227 -477 3393
1831C393j467k051j483j960R47L735J889k334k909j808K122L346L44p93j306k589
$$ 3393 1926 -125 -1608 -3568 -2621 1114 3003 669 -2240 -4048 -1926 1420 1764 971 -335 -2924
1847b924o88N191J957k920j546K15j420J433M185M00l768j367k83R98L009J213
$$ -2924 -3612 1579 3536 616 -930 -715 -2135 -702 3483 3883 115 -1252 -1535 -537 2472 3685
1863C685k038l027q89R72L379J750k763k850o54J17K430L684j211n416j211K314
$$ 3685 1647 -1380 -2269 -1297 2082 3832 1069 -1781 -2435 -2318 112 3796 2585 -2831 -4042 -1728
1879a728J534K385O45m146l663K238L513J726k48l079l052J024L393K777J18l264
$$ -1728 -194 2191 2836 -1310 -4973 -2735 778 2504 2256 -823 -3875 -2851 542 3319 3437 173
1895A73l902J052M575J133n52j198m026j193M960L657k291k683j434j163J961
$$ 173 -3729 -2677 1898 3031 2479 1281 -2745 -3938 1022 4679 2388 -295 -1729 -2892 -931
1910i31L998j35l207k179r67K172L399K13k523j744j033J037L348J403k910k073
$$ -931 3067 2932 -275 -2454 -3421 -1249 2150 2363 -160 -1904 -2937 -1900 1448 2851 -59 -2132
1926b132N94p8J356L196j091l429o97R37J861J690N68k933k021J134J121K122
$$ -2132 -1538 -1616 -260 2936 1845 -1584 -2281 -1344 517 2207 2775 -158 -2179 -1045 76 2198
1942B198J077k785k393M74J312J640J495j538l867m80K771J431R86p80l374j836
$$ 2198 3275 490 -1903 -1429 -117 1523 3018 1480 -2387 -2867 -96 1335 2321 1541 -1833 -3669
1958c669K371K736O65p58k795k586J808L729Q11r99k173k400P13M276J634j625
$$ -3669 -1298 1438 2103 1345 -1450 -4036 -2228 1501 2312 1313 -860 -3260 -2547 1729 3363 1738
1974A738k142k340K9L922K874j841k794j283j5K677L180j517l435j393O77J892
$$ 1738 -404 -2744 -2715 1207 4081 2240 -554 -1837 -1852 825 4005 2488 -947 -2340 -1663 229
1990B29K788N5l748k341R79J440K408R79l339k622J319J579J274R80j740k706
$$ 229 3017 3072 -676 -3017 -2038 -598 1810 2789 -550 -3172 -1853 -274 1000 1980 240 -2466
2006b466L1J849J094J057n39k768o24J966J453M98J21j742k366J587K136P85l06
$$ -2466 -2435 -586 508 1565 1026 -1742 -2366 -400 1053 1551 1672 -70 -2436 -849 1287 2072 1766
2023A766r74k859N26K689J308l65j043k540j048K634K014l26j004k390j575J940
$$ 1766 792 -2067 -1541 1148 2456 2091 1048 -1492 -2540 94 2108 1782 778 -1612 -3187 -1247
2039a247L434n4k183j402k003J539L548J227k575k528n17O63L264K113k304k666
$$ -1247 2187 2133 -50 -1452 -3455 -1916 1632 2859 284 -2244 -2761 -2098 1166 3279 975 -1691
2055a691j053J156K976K034j645l473j61R26J592K986q27m154j142J842J726J496
$$ -1691 -2744 -1588 1388 3422 1777 -1696 -1857 -931 661 3647 2820 -1334 -2476 -634 1092 2588
2071B588j93k726k468J322K576J098q98j622k276M30K539Q92K2j063k902qK731
$$ 2588 2395 -331 -2799 -1477 1099 2197 1299 -323 -2599 -2169 370 1262 1284 221 -2681 -2689 42
$$ [...]
8191A28
##END NTUPLES=NMR FID
##END=
