##TITLE=1H_CA-8615
 CDCl3, 8 sc, 
 28.6.2019
##JCAMPDX= 6.0         $$ Bruker NMR JCAMP-DX V2.0
##DATA TYPE= NMR FID
##DATA CLASS= NTUPLES
##ORIGIN= UXNMR, Bruker Analytische Messtechnik GmbH
##OWNER= root
$$ XWIN-NMR		Version 3.5
$$ Fri Jun 28 14:00:13 2019 Russian Standard Time (UT+4h)  she@DPX200
##.OBSERVE FREQUENCY= 200.13155
##.OBSERVE NUCLEUS= ^1H
##.DELAY= (6, 6)
##.ACQUISITION MODE= SIMULTANEOUS
##.ACQUISITION SCHEME= undefined
##.AVERAGES= 8
##.DIGITISER RES= 18
##SPECTROMETER/DATA SYSTEM= spect
##.PULSE SEQUENCE= zg30
##.SOLVENT NAME= CDCl3
##.SHIFT REFERENCE= (INTERNAL, CDCl3, 0, 15.7039)
##AUDIT TRAIL= $$ (NUMBER, WHEN, WHO, WHERE, WHAT)
$$ ##TITLE= Audit trail, XWIN-NMR		Version 3.5
$$ ##JCAMPDX= 5.01
$$ ##ORIGIN= Bruker BioSpin GmbH
$$ ##OWNER= she
$$ F:/spectra/data/she/nmr/H-F/1/audita.txt
$$ ##AUDIT TRAIL=  $$ (NUMBER, WHEN, WHO, WHERE, WHAT)
(   1,<2019-06-28 13:59:16.65 +0400>,<she>,<DPX200>,
      <created by zg, POWCHK disabled, PULCHK disabled
       configuration hash MD5:
       00 E9 B6 7A A2 85 ED C7 34 08 36 98 17 FE 4E 26
       data hash MD5: 16K
       8C DC FA A8 BA 68 35 EF 54 36 95 A4 A3 C2 4C 90>)
$$ ##END=
$$ 
$$ hash MD5
$$ C3 67 F3 65 0B 9E BA F7 D3 19 4A 88 CB 09 51 3B
##$RELAX= 
##$RELAX= 
##$RELAX= 
##$RELAX= 
##$RELAX= 
##$RELAX= 
$$ Bruker specific parameters
$$ --------------------------
##$DU= <F:/spectra>
##$EXPNO= 1
##$NAME= <H-F>
##$PROCNO= 1
##$TYPE= <nmr>
##$USER= <she>
##$AMP= (0..31)
100 100 100 100 100 100 100 100 100 100 100 100 100 100 100 100 100 100 
100 100 100 100 100 100 100 100 100 100 100 100 100 100 
##$AQSEQ= 0
##$AQ_mod= 1
##$AUNM= <au_zg>
##$AUTOPOS= <>
##$BF1= 200.13
##$BF2= 200.13
##$BF3= 200.13
##$BF4= 200.13
##$BF5= 200.13
##$BF6= 200.13
##$BF7= 200.13
##$BF8= 200.13
##$BYTORDA= 1
##$CFDGTYP= 0
##$CFRGTYP= 5
##$CHEMSTR= <none>
##$CNST= (0..31)
1 1 145 1 1 1 1 1 1 1 1 1 1 1 1 1 1 1 1 1 1 1 1 1 1 1 1 1 1 1 1 1 
##$CPDPRG= <>
##$CPDPRG1= <>
##$CPDPRG2= <>
##$CPDPRG3= <>
##$CPDPRG4= <mlev>
##$CPDPRG5= <mlev>
##$CPDPRG6= <mlev>
##$CPDPRG7= <mlev>
##$CPDPRG8= <mlev>
##$CPDPRGB= <>
##$CPDPRGT= <>
##$D= (0..31)
0 1.2 0 0 0 0 0 0 0 0 0 0.03 0 0 0 0 0 0 0 0 0 0 0 0 0 0 0 0 0 0 0 0 
##$DATE= 1561715956
##$DBL= (0..7)
120 120 120 120 120 120 120 120 
##$DBP= (0..7)
150 150 150 150 150 150 150 150 
##$DBP07= 0
##$DBPNAM0= <>
##$DBPNAM1= <>
##$DBPNAM2= <>
##$DBPNAM3= <>
##$DBPNAM4= <>
##$DBPNAM5= <>
##$DBPNAM6= <>
##$DBPNAM7= <>
##$DBPOAL= (0..7)
0.5 0.5 0.5 0.5 0.5 0.5 0.5 0.5 
##$DBPOFFS= (0..7)
0 0 0 0 0 0 0 0 
##$DE= 6
##$DECBNUC= <off>
##$DECIM= 24
##$DECNUC= <off>
##$DECSTAT= 4
##$DIGMOD= 1
##$DIGTYP= 9
##$DL= (0..7)
0 120 120 120 120 120 120 120 
##$DP= (0..7)
150 150 150 150 150 150 150 150 
##$DP07= 0
##$DPNAME0= <>
##$DPNAME1= <>
##$DPNAME2= <>
##$DPNAME3= <>
##$DPNAME4= <>
##$DPNAME5= <>
##$DPNAME6= <>
##$DPNAME7= <>
##$DPOAL= (0..7)
0.5 0.5 0.5 0.5 0.5 0.5 0.5 0.5 
##$DPOFFS= (0..7)
0 0 0 0 0 0 0 0 
##$DQDMODE= 0
##$DR= 18
##$DS= 0
##$DSLIST= <SSSSSSSSSSSSSSS>
##$DSPFIRM= 0
$$ [...]
##$SUBNAM2= <"">
##$SUBNAM3= <"">
##$SUBNAM4= <"">
##$SUBNAM5= <"">
##$SUBNAM6= <"">
##$SUBNAM7= <"">
##$SUBNAM8= <"">
##$SUBNAM9= <"">
##$SW= 24.9336996594482
##$SWIBOX= (0..15)
0 0 2 0 0 0 0 0 0 0 0 0 0 0 0 0 
##$SW_h= 4990.01996007984
##$TD= 16384
##$TD0= 1
##$TE= 0
##$TE2= 300
##$TE3= 300
##$TEG= 300
##$TL= (0..7)
0 120 120 120 120 120 120 120 
##$TP= (0..7)
150 150 150 150 150 150 150 150 
##$TP07= 0
##$TPNAME0= <>
##$TPNAME1= <>
##$TPNAME2= <>
##$TPNAME3= <>
##$TPNAME4= <>
##$TPNAME5= <>
##$TPNAME6= <>
##$TPNAME7= <>
##$TPOAL= (0..7)
0.5 0.5 0.5 0.5 0.5 0.5 0.5 0.5 
##$TPOFFS= (0..7)
0 0 0 0 0 0 0 0 
##$TUNHIN= 0
##$TUNHOUT= 0
##$TUNXOUT= 0
##$USERA1= <user>
##$USERA2= <user>
##$USERA3= <user>
##$USERA4= <user>
##$USERA5= <user>
##$V9= 5
##$VALIST= <valist>
##$VCLIST= <CCCCCCCCCCCCCCC>
##$VD= 0
##$VDLIST= <DDDDDDDDDDDDDDD>
##$VPLIST= <PPPPPPPPPPPPPPP>
##$VTLIST= <TTTTTTTTTTTTTTT>
##$WBST= 1024
##$WBSW= 4
##$XGAIN= (0..3)
0 0 0 0 
##$XL= 0
##$YL= 0
##$YMAX_a= 411375
##$YMIN_a= -740343
##$ZGOPTNS= <>
##$ZL1= 120
##$ZL2= 120
##$ZL3= 120
##$ZL4= 120
##$ABSF1= 10
##$ABSF2= 0
##$ABSG= 5
##$ABSL= 3
##$ALPHA= 0
##$AQORDER= 0
##$ASSFAC= 0
##$ASSFACI= 0
##$ASSFACX= 0
##$ASSWID= 0
##$AUNMP= <proc_1d>
##$AZFE= 0.1
##$AZFW= 0.1
##$BCFW= 1
##$BC_mod= 2
##$BYTORDP= 1
##$COROFFS= 0
##$CY= 11.3945322036743
##$DATMOD= 1
##$DC= 2
##$DFILT= <>
##$DTYPP= 0
##$F1P= 18.9103706918063
##$F2P= -1.10871071338519
##$FCOR= 0.5
##$FTSIZE= 0
##$FT_mod= 4
##$GAMMA= 1
##$GB= 0.15
##$INTBC= 1
##$INTSCL= 1
##$ISEN= 128
##$LB= 0.24
##$LEV0= 0
##$LPBIN= 0
##$MAXI= 10000
##$MC2= 0
##$MEAN= 0
##$ME_mod= 0
##$MI= 1.114404
##$NCOEF= 0
##$NC_proc= 0
##$NLEV= 6
##$NOISF1= 3.799351
##$NOISF2= 2.8
##$NSP= 1
##$NTH_PI= 0
##$NZP= 0
##$OFFSET= 15.70392
##$PC= 1
##$PHC0= -8501.401
##$PHC1= 14.60098
##$PH_mod= 1
##$PKNL= yes
##$PPARMOD= 0
##$PSCAL= 0
##$PSIGN= 0
##$REVERSE= no
##$SF= 200.130013532006
##$SI= 16384
##$SIGF1= 3
##$SIGF2= 2
##$SINO= 400
##$SIOLD= 16384
##$SREGLST= <1H.CDCl3>
##$SSB= 0
##$STSI= 0
##$STSR= 0
##$SW_p= 3612.71676300578
##$SYMM= 0
##$S_DEV= 0
##$TDeff= 0
##$TDoff= 0
##$TI= <>
##$TILT= no
##$TM1= 0
##$TM2= 0
##$TOPLEV= 0
##$USERP1= <user>
##$USERP2= <user>
##$USERP3= <user>
##$USERP4= <user>
##$USERP5= <user>
##$WDW= 1
##$XDIM= 8192
##$YMAX_p= 0
##$YMIN_p= 0
$$ End of Bruker specific parameters
$$ ---------------------------------
##NTUPLES= NMR FID
##VAR_NAME=  TIME,          FID/REAL,        FID/IMAG
##SYMBOL=    X,             R,               I
##VAR_TYPE=  INDEPENDENT,   DEPENDENT,       DEPENDENT
##VAR_FORM=  AFFN,          ASDF,            ASDF
##VAR_DIM=   8192,          8192,            8192
##UNITS=     SECONDS,       ARBITRARY UNITS, ARBITRARY UNITS
##FACTOR=    0.0002004,     1,               1
##FIRST=     0,             0,               0
##LAST=      1.6414764,     0,               0
##MIN=       0,             -740343,         0
##MAX=       1.6414764,     411375,          0
$$ Real data points
##PAGE= N=1
##DATA TABLE= (X++(R..R)), XYDATA
$$ plain form
0 0 0 0 0 -8 8 -8 8 -16 24 -24 32 -40 54 -64 78 -96 113 -134 160 -188 218 -256 297 -343 393 -454 515
27 515 -585 665 -753 846 -951 1067 -1195 1332 -1485 1656 -1838 2037 -2259 2505 -2772 3067
43 3067 -3398 3765 -4175 4638 -5163 5767 -6466 7292 -8277 9484 -11000 12970 -15643
56 -15643 19510 -25622 36786 -63824 265074 89401 -510003 -84304 298012 174539 -162694
67 -162694 -46072 148465 48020 -253695 -253600 -38122 77696 -51827 -199985 -252880 -111406
78 -111406 96928 80306 -218442 -277108 72443 252548 -86967 -325726 -275 364013
88 364013 136215 -278332 -147322 324024 316940 -148754 -277265 97704 297058 69679
98 69679 -110651 12712 151613 82397 -81966 -129437 10454 186100 158208 -76661 -212489
$$ packed form
0@%%%qJ6j6J6k4M0m8N6p2R4j18J42j74K09k47K94l48M06m74N53o40P36q47R69
27E15j100J250j418J599j797K018k262K527k817L141l494L875m296M764n277N839
43C067o465P163p940Q813r801J0930j2233J3758j5569J7761k0484K3970k8613
56a5643L5153m5132O2408j00610L28898j75673n99404M25699L82316j23473l37233
67a62694J16622J94537j00445l01715R5K15478J15818j29523j48158n2895J41474
78a11406K08334j6622k98748n8666L49551J80105l39515k38759L25451L64288
88C64013k27798m14547J31010M71346p084m65694j28511L74969J99354k27379
98F9679j80330J23363J38901o9216j64363m7471J39891J75646k7892k34869j35828
$$ plain form
109 -212489 -32311 216507 120435 -208349 -214290 134189 206321 -148113 -274435 72723 259268
120 259268 -63684 -346832 -117948 245941 179221 -172645 -249945 10776 161138 34073
130 34073 -82627 -26233 61864 54788 -39567 -107628 677 203105 181775 -83106 -187168
141 -187168 39489 218886 45450 -188585 -59997 245748 195433 -162357 -231732 79491
151 79491 207599 -39613 -195499 -16583 159395 50977 -154061 -156817 18013 97323 -18474
162 -18474 -133323 -82800 43263 68795 -46403 -150195 -53167 147788 124782 -115671 -165225
173 -165225 75565 203569 30263 -113177 24658 199733 100687 -122635 -97669 141234
183 141234 200650 6077 -104262 4415 97215 25207 -91961 -96497 17743 99048 15176
$$ packed form
109b12489J80178K48818r6072l28784n941L48479P2132l54434j26322L47158J86545
120B59268l22952k83148K28884L63889o6720l51866p7300K60721J50362j27065
130C4073j16700N6394Q8097p076r4355o8061J08305K02428k1330k64881j04062
141a87168K26657J79397j73436k34035J28588L05745n0315l57790o9375L11223
151G9491J28108k47212j55886J78916J75978j08418k05038k756J74830P9310j15797
162a8474j14849N0523J26063K5532j15198j03792R7028K00955k3006k40453m9554
173a65225K40790J28004j73306j43440J37835J75075r9046k23322K4966K38903
183A41234N9416j94573j10339J08677R2800p2008j17168m536J14240Q1305q3872
$$ plain form
194 15176 -126666 -118787 6899 39622 -60856 -114788 -9258 107357 25843 -156983 -135896
205 -135896 76917 141536 -19068 -110399 -4275 92260 25678 -83841 -55962 77890 110462
216 110462 -11963 -88180 -8770 70506 23353 -56537 -39080 61806 107068 10383 -100937
227 -100937 -44005 98360 101390 -18931 -60318 26037 100806 59698 -37547 -46857 41828 72232
239 72232 -4231 -44935 8969 40965 -11322 -69692 -51717 21568 35644 -55617 -117283 -44735
251 -44735 34769 -9215 -80403 -58092 7871 17648 -35049 -71369 -27378 43820 42622 -6005
263 -6005 -9224 26886 41153 24685 -3920 -5013 52628 96373 48438 -13517 5049 38401 10353
276 10353 -20447 12645 65128 52261 -28511 -73195 -23337 23377 -10826 -38333 -2764 12561
$$ packed form
194A5176j41842P879J25686L2723j00478n3932J05530J16615q1514j82826K1087
205a35896K12813O4619j60604r1331J06124R6535o6582j09519K7879J33852L2572
216A10462j22425p6217P9410P9276m7153p9890J7457J00886M5262r6685j11320
227a00937N6932J42365L030j20321m1387Q6355P4769m1108r7245r310Q8685L0404
239G2232p6463m0704N3904L1996n2287n8370J7975P3285J4076r1261o1666P2548
251d4735P9504m3984p1188K2311O5963R777n2697l6320M3991P1198j198m8627
263f005l219L6110J4267j6468k8605j093N7641M3745m7935o1955J8566L3352k8048
276A0353l0800L3092N2483j2867q0772m4684M9858M6714l4203k7507L5569J5325
$$ plain form
288 12561 -24280 -48408 -42887 -33121 -8228 20979 13520 -20058 -37342 -21102 8986 14361 -3858
301 -3858 7318 36559 16224 -17452 6074 32364 2583 -8294 38254 55898 9977 -29355
313 -29355 -18601 10671 17983 7779 13882 16961 -25127 -57718 -13170 31387 -550 -29502 248
326 248 9443 -33423 -49237 -12798 20652 16041 -7874 -15179 -3015 -4973 -16524 -2824 14703
339 14703 8992 17693 35093 1070 -41213 -7983 44148 25048 -11114 11577 47429 23222
351 23222 -35284 -35996 33142 62940 3940 -33370 14886 45164 562 -33627 -12840 12729
363 12729 18535 7057 -19344 -27517 -5056 3078 -24005 -45543 -28146 10191 10970 -44146 -67286
376 -67286 -5986 29827 -34231 -72159 1357 62745 11904 -61265 -42944 37363 69320 18670
$$ packed form
288A2561l6841k4128N521R766K4893K9207p459l3578j7284J6240L0088N375j8219
301c858J1176K9241k0335l3676K3526K6290k9781j0877M6548J7644m5921l9332
313b9355J0754K9272P312j0204O103L079m2088l2591M4548M4557l1937k8952K9750
326B48R195m2866j5814L6439L3450m611k3915p305J2164j958j1551J3700J7527
339A4703n711Q701J7400l4023m2283L3230N2131j9100l6162K2691L5852k4207
351B3222n8506p12O9138K9798n9000l7310M8256L0278m4602l4189K0787K5569
363A2729N806j1478k6401q173K2461Q134k7083k1538J7397L8337P79n5116k3140
376f7286O1300L5813o4058l7928P3516O1388n0841p3169J8321Q0307L1957n0650
$$ plain form
388 18670 -22796 13484 55183 29761 -4917 11503 47847 58902 29556 -17718 -17991 37793
400 37793 49226 -15032 -40830 19187 58701 -124 -81225 -67415 28042 60196 -22774 -78571
412 -78571 -16357 37483 -16367 -76831 -40563 36225 51007 -11316 -65098 -32817 30297 20439
424 20439 -31481 -21634 35874 47189 -7758 -57236 -26138 52188 55106 -27423 -49972 31459
436 31459 71601 -2556 -69910 -27115 63102 70892 -16892 -65847 3547 71095 22539 -51235
448 -51235 -25675 47810 53504 -12186 -53648 -6915 56683 26958 -50573 -38347 40323 44503
460 44503 -35877 -74716 -13208 62100 39016 -60391 -84346 9280 66918 -1537 -72680 -32360
472 -32360 50421 52811 -27729 -67628 3191 75072 28526 -49479 -17777 65290 56242 -24606
$$ packed form
388A8670m1466L6280M1699k5422l4678J6420L6344J1055k9346m7274k73N5784
400C7793J1433o4258k5798O0017L9514n8825q1101J3810R5457L2154q2970n5797
412g8571O2214N3840n3850o0464L6268P6788J4782o2323n3782L2281O3114r858
424B0439n1920R847N7508J1315n4947m9478L1098P8326K918q2529k2549Q1431
436C1459M0142p4157o7354M2795R0217P790q7784m8955O9394O7548m8556p3774
448e1235K5560P3485N694o5690m1462M6733O3598k9725p7531J2226P8670M180
460D4503q0380l8839O1508P5308k3084r9407k3955R3626N7638o8455p1143M0320
472c2360Q2781K390q0540l9899P0819P1881m6546p8005L1702Q3067r048q0848
$$ plain form
484 -24606 -49969 14756 70398 27989 -49386 -33726 46503 45705 -39322 -74223 -13351 48321
496 48321 23680 -56159 -72642 6156 51096 -22655 -90885 -31444 63671 50865 -39914 -67354
508 -67354 10608 71801 18170 -51203 -3038 85295 62140 -27984 -40805 30214 74109 34371
520 34371 -28092 -16863 49394 51742 -28696 -65477 676 66779 33693 -57554 -80867 -1000
532 -1000 54689 -9129 -77447 -26906 46742 7531 -75526 -63844 23475 55925 -10704 -70518
544 -70518 -25896 47572 26429 -47591 -45597 27655 63064 18007 -45507 -38396 36101 63029
556 63029 -5145 -47258 15135 76417 31777 -47301 -39055 43358 73793 3918 -49268 7165
568 7165 69479 21905 -52347 -31239 40661 51248 -6591 -50756 -20816 36547 25274 -43380
$$ packed form
484b4606k5363O4725N5642m2409p7375J5660Q0229p98q5027l4901O0872O1672
496D8321k4641p9839j6483P8798M4940p3751o8230N9441R5115j2806r0779k7440
508f7354P7962O1193n3631o9373M8165Q8333k3155r0124j2821P1019M3895l9738
520C4371o2463J1229O6257K348q0438l6781O6153O6103l3086r1247k3313P9867
532a000N5689o3818o8318N0541P3648l9211q3057J1682Q7319L2450o6629n9814
544g0518M4622P3468k1143p4020J994P3252L5409m5057o3514P111P4497K6928
556F3029o8174m2113O2393O1282m4640p9078Q246Q2413L0435o9875n3186N6433
568G165O2314m7574p4252K1108P1900J0587n7839m4165K9940N7363j1273o8654
$$ plain form
580 -43380 -57066 4208 39169 -1941 -56506 -45236 18884 33628 -33628 -68062 948 58994
592 58994 8466 -58569 -33123 34820 43026 -10173 -35446 12130 52770 12969 -40408 -14467
604 -14467 47406 50108 -4729 -44323 -17494 43372 47203 -20732 -51927 4861 47693 6098
616 6098 -45492 -26237 27745 30323 -22716 -40405 15134 45186 -8834 -50819 -8557 44400
628 44400 31553 -15428 -29765 3125 37540 16581 -33517 -28236 29361 50619 3294 -46440
640 -46440 -33242 22385 35473 -16041 -39603 9781 34993 -16041 -50595 -11228 30007 12243
652 12243 -25515 -25968 9169 22549 -9458 -33206 -6763 26402 21018 -6999 -22930 -6953 28805
665 28805 28802 -18745 -30727 23269 48537 -2715 -42829 -6996 42198 29674 -22072 -31910 11764
$$ packed form
580d3380j3686O1274L4961m1110n4565J1270O4120J4744o7256l4434O9010N8046
592E8994n0528o7035K5446O7943Q206n3199k5273M7576M0640l9801n3377K5941
604a4467O1873K702n4837l9594K6829O0866L831o7935l1195N6788M2832m1595
616F098n1590J9255N3982K578n3039j7689N5539L0052n4020m1985M2262N2957
628D4400j2847m6981j4337L2890L4415k0959n0098N281N7597K1258m7325m9734
640d6440J3198N5627J3088n1514k3562M9384K5212n1034l4554L9367M1235j7764
652A2243l7758m53L5137J3380l2007k3748K6443L3165n384k8017j5931J5977L5758
665B8805lm7547j1982N3996K5268n1252m0114L5833M9194j2524n1746r838M3674
$$ plain form
678 11764 27808 -8453 -23543 7712 20050 -2963 -16030 -9841 743 13524 11628 -11955
690 -11955 -16812 12537 26948 -1456 -29832 -9563 36013 32264 -24321 -38302 17907 41379
702 41379 -8245 -36022 -1303 19091 -3390 -17644 -2541 8741 -2667 -21501 -20538 -2300
714 -2300 8054 6828 -122 -18729 -26544 3392 24817 -6865 -27669 11448 34109 -8464 -38419
727 -38419 -933 41015 22005 -21453 -18457 20920 26047 -4761 -5540 19540 12975 -6135 5570
740 5570 16699 3300 4229 20257 7155 -17319 -4190 26160 17347 -19897 -23571 14363 22629
753 22629 -23194 -38415 9263 24688 -25385 -44197 -2207 16485 -10571 -24469 -11290 -5914
765 -5914 -10708 -4765 5874 555 -13314 -4125 16210 4065 -16595 7183 34085 575 -30440
$$ packed form
678A1764J6044l6261j5090L1255J2338k3013j3067O189J0584J2781j896k3583
690a1955m857K9349J4411k8404k8376K0269M5576l749n6585j3981N6209K3472
702D1379m9624k7777L4719K0394k2481j4254J5103J1282j1408j8834R63J8238
714b300J0354j226o950j8607p815K9936K1425l1682k0804L9117K2661m2573k9955
727c8419L7486M1948j9010m3458K996L9377N127l0808p79K5080o565j9110J1705
740E570J1129j3399R29J6028j3102k4474J3129L0350q813l7244l674L7934Q266
753B2629m5823j5221M7678J5425n0073j8812M1990J8692k7056j3898J3179N376
765e914m794N943J0639n319j3869R189K0335j2145k0660K3778K6902l3510l1015
$$ plain form
778 -30440 11657 51626 12990 -35837 -14495 33079 31869 -3568 -10293 12289 10624 -12966 -5069
791 -5069 21187 11955 -8886 663 5621 -14568 -11073 17423 11727 -19805 -17041 12752 9968 -25353
805 -25353 -28734 16483 32747 -17640 -48148 -1672 34794 508 -28322 -1865 18036 96
817 96 -12356 -2894 4806 5148 8011 9938 -1425 -16774 -6113 19668 11838 -15874 -2068 24254
831 24254 -5314 -41931 -6324 43131 16679 -36373 -28909 17728 23022 -14218 -23019 13441 26669
844 26669 -8229 -25092 976 16905 11776 14018 5572 -19490 -14758 21699 28025 -2114 -10562
857 -10562 10809 12733 -16070 -20147 21698 39704 -11284 -47295 -1000 42804 5732 -37741
869 -37741 -15689 18578 10372 -11781 -13511 -3629 -299 -4870 -6780 -5359 -4760 1696 7851 -10409
$$ packed form
778c0440M2097L9969l8636m8827K1342M7574j210l5437o725K2582j665k3590P897
791e069K6256r232k0841R549M958k0189L495K8496n696l1532K764K9793k784l5321
805b5353l381M5217J6264n0387l0508M6476L6466l4286k8830K6457J9901j7940
817I6j2452R462P700L42K863J927j1363j5349J0661K5781p830k7712J3806K6322
831B4254k9568l6617L5607M9455k6452n3052P464M6637N294l7240q801L6460J3228
844B6669l4898j6863K6068J5929n129K242q446k5062M732L6457O326l0139q448
857a0562K1371J924k8803m077M1845J8006n0988l6011M6295M3804l7072m3473
869c7741K2052L4267q206k2153j730R882L330m571j910J421N99O456O155j8260
$$ plain form
883 -10409 -31794 -4789 34025 11597 -32965 -17102 22963 10580 -21168 -6632 30163 22823
895 22823 -22467 -33634 11889 41679 13630 -16725 -7193 7578 6041 6457 6290 -82 7890 17617
909 17617 -2501 -23583 -3410 31244 25793 -13706 -29549 2271 27687 2580 -23117 2366
921 2366 23634 -8643 -36160 -7771 27036 15688 -19111 -32184 -12624 13115 10960 -12343
933 -12343 -20149 -7685 3216 1591 -10301 -14657 4303 16526 -7885 -25819 3613 31642 8148
946 8148 -23379 -11942 20847 26454 -1749 -17845 5471 28702 9742 -15920 -5296 18428
958 18428 18453 2119 -11302 -7528 13545 19176 -4580 -18322 1509 16586 2544 -14282 -8619
971 -8619 11232 13013 -13460 -26221 2235 24877 1578 -25931 -14721 8174 9282 -6119 -17698
$$ packed form
883a0409k1385K7005L8814k2428m4562J5863M0065j2383l1748J4536L6795p340
895B2823m5290j1167M5523K9790k8049l0355R532J4771j537M16j67o372P972R727
909A7617k0118k1082K0173L4654n451l9499j5843L1820K5416k5107k5697K5483
921B366K1268l2277k7517K8389L4807j1348l4799j3073J9560K5739k155k3303
933a2343p806J2464J0901j625j1892m356J8960J2223k4411j7934K9432K8029k3494
946H148l1527J1437L2789N607k8203j6096K3316K3231j8960k5662J0624K3724
958A8428K5j6334j3421L774K1073N631k3756j3742J9831J5077j4042j6826N663
971h619J9851J781k6473j2761K8456K2642k3299k7509J1210K2895J108j5401j1579
$$ plain form
984 -17698 -7277 12749 6272 -19336 -18790 8640 19426 507 -19831 -14327 12289 21540 -3196
997 -3196 -17434 4237 18117 -1639 -12943 3986 17707 9185 -9885 -14577 5119 22600 6803
1010 6803 -18286 -13115 10197 18478 3085 -17505 -14540 13191 21530 -6866 -20397 4490 18999
1023 18999 1011 -11684 -47 12980 7557 -9447 -9537 12090 18207 -4261 -16568 -1601 11856
1036 11856 9108 -2355 -14623 -10166 11530 13477 -13581 -22883 1300 16764 -413 -22332 -15609
1049 -15609 10951 14118 -13799 -23883 3551 15735 -4724 -15412 -1363 6840 1577 -2435 -3414
1062 -3414 2056 8089 3145 -5416 -779 11120 13454 3107 -10649 -4825 22241 25263 -9375 -22537
1076 -22537 10985 30737 5982 -16916 -6628 13780 13546 -3791 -11057 1311 7902 -3892 -7798
$$ packed form
984a7698J0421K0026o477k5608N46K7430J0786j8919k0338N504K6616R251k4736
997c196j4238K1671J3880j9756j1304J6929J3721q522j9070m692J9696J7481j5797
1010F803k5089N171K3312Q281j5393k0590K965K7731Q339k8396j3531K4887J4509
1023A8999j7988j2695J1637J3027n423j7004r0K1627O117k2468j2307J4967J3457
1036A1856k748j1463j2268M457K1696J947k7058r302K4183J5464j7177k1919O723
1049a5609K6560L167k7917j0084K7434J2184k0459j0688J4049Q203n263m012r79
1062c414N470O033m944q561M637J1899K334j0347j3756N824K7066L022l4638j3162
1076b2537L3522J9752k4755k2898J0288K0408k34j7337p266J2368O591j1794l906
$$ plain form
1089 -7798 756 831 -4865 -4666 -8011 -7604 5793 6875 -15714 -23415 642 17955 2242 -22212
1103 -22212 -19201 7848 16874 -7147 -19992 1996 14054 -4347 -12975 2597 11659 4863 -3618
1116 -3618 -6392 1507 13486 11258 -2741 -6200 3826 14345 12268 -3772 -9367 10209 20590
1129 20590 -2400 -16140 6851 21623 1408 -17998 -7296 13519 14338 -7289 -19515 -2911
1141 -2911 13077 2890 -11766 -8729 -687 2759 1439 -7883 -11459 3736 9425 -8268 -16913 863
1155 863 13699 2173 -16054 -12841 10518 17813 -7658 -23418 667 21987 5470 -15274 -9407
1168 -9407 6965 13316 3659 -10281 -6523 10212 10136 -4493 -5258 6590 10052 -1329 -12663 -6201
1182 -6201 17732 22006 -10085 -27932 -2267 24102 12791 -12093 -15225 2721 14726 2807
$$ packed form
1089g798Q554P5n696J99l345M07J3397J082k2589p701K4057J7313j5713k4454
1103b2212L011K7049R026k4021j2845K1988J2058j8401q628J5572R062o796q481
1116c618k774P899J1979k228j3999l459J0026J0519k077j6040n595J9576J0381
1129B0590k2990j3740K2991J4772k0215j9406J0702K0815Q19k1627j2226J6604
1141b911J5988j0187j4656L037Q042L446j320r322l576J5195N689j7693q645J7776
1155H63J2836j1526j8227L213K3359P295k5471j5760K4085K1320j6517k0744N867
1168i407J6372O351r657j3940L758J6735p6j4629p65J1848L462j1381j1334O462
1182f201K3933M274l2091j7847K5665K6369j1311k4884l132J7946J2005j1919
$$ plain form
1194 2807 -13854 -3063 15238 6006 -11749 -6191 10100 13348 -156 -13843 -6599 15503 15442
1207 15442 -10800 -18003 4207 16042 1476 -16324 -12745 8431 14413 -10607 -27762 -4653
1219 -4653 20977 6186 -22083 -21503 1531 15408 2059 -18405 -11184 12844 10061 -12807 -11943
1232 -11943 9925 15477 852 -11085 -3074 17038 18394 -5663 -13145 11340 24838 5096 -13581
1245 -13581 -3138 21715 25306 -3419 -26659 -4698 30219 21362 -13558 -20426 307 12235
1257 12235 890 -13911 -8045 9104 2895 -21958 -19190 7990 12168 -11907 -25177 -11493 12211
1270 12211 13884 -13595 -28624 -3654 21610 7511 -17712 -12546 10467 17796 -1742 -18766
1282 -18766 -1036 26681 15487 -16838 -13708 16581 23045 1801 -12429 -1279 17927 13894
$$ packed form
1194B807j6661J0791J8301r232j7755N558J6291L248j3504j3687P244K2102o1
1207A5442k6242p203K2210J1835j4566j7800L579K1176N982k5020j7155K3109
1219d653K5630j4791k8269N80K3034J3877j3349k0464P221K4028k783k2868Q64
1232a1943K1868N552j4625j1937Q011K0112J356k4057p482K4485J3498j9742j8677
1245a3581J0443K4853L591k8725k3240K1961L4917q857l4920o868K0733J1928
1257A2235j1345j4801N866J7149o209k4853K768K7180M178k4075j3270J3684K3704
1270A2211J673k7479j5029K4970K5264j4099k5223N166K3013P329j9538j7024
1282a8766J7730K7717j1194l2325L130L0289O464k1244j4230J1150J9206m033
$$ plain form
1294 13894 -9528 -11903 12530 20419 -2037 -17226 -5169 14510 14861 -8330 -24004 -2301 23515
1307 23515 6525 -24428 -17244 11988 14268 -10455 -24208 -3193 22429 10743 -21732 -20598
1319 -20598 8194 15320 -1821 -8290 1289 9630 3664 -12902 -13605 11969 25139 1229 -23433
1332 -23433 -12318 15017 16919 -7696 -23117 -1376 23560 5468 -25215 -13738 15793 12318
1344 12318 -10877 -14166 3164 14201 3274 -14441 -9188 14297 18641 -2171 -15053 -3722
1356 -3722 15026 17512 -2435 -16442 3553 24554 4833 -21705 -6707 22043 16444 -10271
1368 -10271 -16157 3858 17020 1022 -16444 -4090 14782 5770 -13221 -11262 1908 8364 3325
1381 3325 -12975 -18301 1820 16280 -1853 -21854 -9977 11824 7571 -15838 -20674 6369 23825
$$ packed form
1294A3894k3422k375K4433P889k2456j5189J2057J9679L51k3191j5674K1703K5816
1307B3515j6990l0953P184K9232K280k4723j3753K1015K5622j1686l2475J134
1319b0598K8792P126j7141o469R579Q341n966j6566p03K5574J3170k3910k4662
1332b3433J1115K7335J902k4615j5421K1741K4936j8092l0683J1477K9531l475
1344A2318k3195l289J7330J1037j0927j7715N253K3485M344k0812j2882J1331
1356c722J8748K486j9947j4007J9995K1001j9721k6538J4998K8750n599k6715
1368a0271n886K0015J3162j5998j7466J2354J8872r012j8991J959J3170O456n039
1381C325j6300n326K0121J4460j8133k0001J1877K1801m253k3409m836K7043J7456
$$ plain form
1394 23825 -11 -25664 -9658 15405 8046 -7491 -2067 9228 8048 -1392 -7322 -162 13328
1407 13328 12554 -1280 -5279 4499 13668 9363 -7733 -13257 10508 28312 5317 -22180 -7431
1420 -7431 17982 11933 -9619 -9941 6121 11039 -4384 -15833 -3199 8703 -1267 -10752 -3477
1433 -3477 938 -5355 -7666 -8448 -7413 3756 9432 -7414 -21886 -9768 11392 10570 -8415 -14412
1447 -14412 4468 17092 -2844 -20775 -988 21349 9031 -6819 -274 7824 3276 -1543 1185
1460 1185 6277 9128 6452 2226 572 -1461 513 7989 5172 -3515 3938 13889 -3375 -21036
1474 -21036 -3195 19700 8420 -14864 -13944 3512 8062 -6204 -13371 -2019 4976 -5511 -9276
1487 -9276 760 -782 -6927 186 4297 -6354 -7906 4945 6834 -2855 -2676 6110 5397 -6169
$$ packed form
1394B3825k3836k5653J6006K5063p359j5537N424J1295j180r440n930P160J3490
1407A3328p74j3834l999R778R169m305j7096n524K3765J7804k2995k7497J4749
1420g431K5413o049k1552l22J6062M918j5423j1449J2634J1902r970r485P275
1433c477M415o293k311p82J035J1169N676j6846j4472J2118K1160q22j8985n997
1447a4412J8880J2624j9936j7931J9787K2337j2318j5850O545Q098m548m819K728
1460A185N092K851k676m226j654k033J974P476k817q687P453R951j7264j7661
1474b1036J7841K2895j1280k3284R20J7456M550j4266p167J1352O995j0487l765
1487i276J0036j542o145P113M111j0651j552J2851J889r689J79Q786p13j1566
$$ plain form
1501 -6169 -8845 8708 19313 -138 -17452 -2554 14315 3056 -7136 1849 5083 -3561 -5457
1514 -5457 -365 897 32 2056 4037 -1052 -10027 -6956 8164 8778 -5714 -2419 12145 3037 -15578
1529 -15578 -6550 13725 11089 -1809 -1756 5497 3833 -5269 -7057 3305 10258 4918 2359 2644 -8493
1544 -8493 -13662 3545 13539 -2 -6887 3184 1783 -12895 -13542 2929 11422 -320 -13802
1557 -13802 -7870 4736 -2974 -13809 -2018 10217 -420 -10125 -5072 -962 -1063 5639 6649 -4339
1571 -4339 -8441 2775 12759 7608 -4889 -2407 12475 10812 -5541 -743 18125 10808 -11408
1584 -11408 -6293 14217 14900 940 -5537 -2283 2110 980 -2703 -1347 1263 -196 -675 -4130 -14946
1599 -14946 -12659 7727 11207 -10458 -16517 797 3957 -11323 -14203 2133 10581 -1089 -12717
$$ packed form
1501f169k676J7553J0605j9451j7314J4898J6869j1259j0192Q985L234q644j896
1514e457N092J262q65K024J981n089q975L071J5120O14j4492L295J4564r108j8615
1529a5578R028K0275k636j2898N3P253j664r102j788J0362O953n340k559K85j1137
1544h493n169J7207R994j3541o885J0071j401j4678o47J6471Q493j1742j3482
1557a3802N932J2606p710j0835J1791J2235j0637r705N053M110j01O702J010j0988
1571d339m102J1216R984n151j2497K482J4882j663j6353M798J8868p317k2216
1584a1408N115K0510O83j3960o477L254M393j130l683J356K610j459m79l455j0816
1599a4946K287K0386L480k1665o059J7314L160j5280k880J6336Q448j1670j1628
$$ plain form
1612 -12717 -3888 9622 1208 -13387 -3956 12527 10335 229 -2842 -4372 -426 10417 9012
1625 9012 -4038 -3780 10810 13706 -2510 -13848 -859 19596 12852 -11911 -10292 11539 10608
1638 10608 -8341 -6488 8268 6014 -6519 -8400 700 7801 3108 -8903 -10390 255 7152
1651 7152 4064 -5288 -13755 -5641 12282 7784 -14149 -11383 11871 10557 -12808 -16685 4653 17748
1665 17748 5106 -11718 -7260 6291 1810 -9975 -1131 14728 9935 -5060 -10935 -8202 1086
1678 1086 11364 6638 -5875 -3283 7760 3291 -13059 -14363 7038 23151 6929 -19595 -13008
1691 -13008 12832 10330 -10447 -7457 12165 12585 -3134 -10302 -1767 9472 8088 -2139 -4297
1704 -4297 5084 8473 1380 -5670 -5803 4904 14000 1438 -17356 -7689 15915 9033 -15672 -15507
$$ packed form
1612a2717Q829J3510q414j4595R431J6483k192j0106l071j530L946J0843j405
1625I012j3050K58J4590K896j6216j1338J2989K0455o744k4763J619K1831r31
1638A0608j8949J853J4756k254j2533j881R100P101m693j2011j487J0645O897
1651G152l088r352q467Q114J7923m498k1933K766K3254j314k3365l877K1338J3095
1665A7748j2642j6824M458J3551m481j1785Q844J5859m793j4995n875K733R288
1678A086J0278m726j2513K592J1043m469j6350j304K1401J6113j6222k6524O587
1691a3008K5840k502k0777K990J9622M20j5719p168Q535J1239j384j0227k158
1704d297R381L389p093p050j33J0707R096j2562j8794R667K3604o882k4705J65
$$ plain form
1718 -15507 6056 13476 -3731 -18559 -8762 8637 3545 -11775 -7528 6569 2970 -9507 -10899
1731 -10899 -2605 6484 7939 -3812 -12575 -147 14051 5409 -11804 -9130 9855 19628 4551
1744 4551 -12040 -1984 16398 7309 -11484 -1607 19892 17186 -2023 -11804 -3386 9028 8977 -1517
1758 -1517 -2740 7012 7210 -5993 -14467 -8294 6322 12299 -1950 -17607 -8275 8291 -818 -17673
1772 -17673 -9982 8289 8191 -7474 -14872 -4422 6667 -178 -11605 -2849 12759 7401 -7874
1785 -7874 -11025 -799 10406 11651 -1541 -7681 4732 12749 -307 -11850 -87 17489 16266
1798 16266 -4207 -16624 -2469 15261 7630 -7300 -1734 10229 4245 -8356 -8788 137 7329
1811 7329 4315 -5243 -4409 4973 2482 -10757 -12788 295 13327 9805 -7354 -16861 -2439 10338
$$ packed form
1718a5507K1563P420j7207j4828R797J7399n092j5320M247J4097l599j2477j392
1731a0899Q294R089J455j1751q763J2428J4198q642j7213K674J8985R773j5077
1744D551j6591J0056J8382r089j8793R877K1499k706j9209r781Q418J2414n1j0494
1758a517j223R752J98j3203q474O173J4616N977j4249j5657R332J6566r109j6855
1772a7673P691J8271r8j5665p398J0450J1089o845j1427Q756J5608n358j5275
1785g874l151J0226J1205J245j3192o140J2413Q017j3056j1543J1763J7576j223
1798A6266k0473j2417J4155J7730p631j4930N566J1963n984j2601m32Q925P192
1811G329l014r558Q34R382k491j3239k031J3083J3032l522j7159r507J4422J2777
$$ plain form
1825 10338 -363 -11714 -576 12815 6198 -8241 -10827 -561 8103 3007 -5954 -538 8020
1838 8020 2614 -7697 -7053 674 6180 3842 -5079 -6827 4898 7882 -7000 -14043 386 13721
1852 13721 6892 -8594 -11852 2439 12137 950 -10159 -533 10995 5285 -4129 -3664 1879 6582
1866 6582 5778 -801 -1635 5177 4242 -4091 -3721 4329 9330 4115 -5921 -7811 2974 7655 -4887
1881 -4887 -10449 3790 12316 666 -13179 -11691 -566 6876 2245 -5642 -2783 2171 -2783 -9152
1895 -9152 -6208 -279 3020 2436 -2676 -5554 370 567 -9113 -8201 6134 13469 4304 -7111 -8890
1910 -8890 1731 8680 3184 -1443 6903 11577 1984 -5756 -1224 6231 10056 8222 308 -2280 3663
1925 3663 4000 -1542 -941 3622 3877 -595 -5592 -5806 613 3025 -5464 -8663 179 3323 -5313 -10884
$$ packed form
1825A0338j0701j1351J1138J3391o617j4439k586J0266Q664n096q961N416Q558
1838H020n406j0311O44P727N506k338q921j748J1725K984j4882p043J4429J3335
1852A3721o829j5486l258J4291R698j1187j1109R626J1528n710r414M65N543M703
1866F582q04o579q34O812r35q333L70Q050N001n215j0036j890J0785M681j2542
1881d887n562J4239Q526j1650j3845J488J1125P442m631p887K859M954m954o369
1895i152K944N929L299n84n112k878N924J97r680R12J4335P335r165j1415j779
1910h890J0621O949n496m627Q346M674r593p740M532P455L825j834p914k588N943
1925C663L37n542O01M563K55m472m997k14O419K412q489l199Q842L144q636n571
$$ plain form
1941 -10884 -7905 -1190 3035 580 -5989 -5486 -1725 -4028 -5911 305 5509 4229 -500 -5332 -3940
1956 -3940 3741 6470 382 -348 6350 7457 1155 -2481 -1078 4205 8027 3280 -2295 2603 8000
1971 8000 3347 -3638 -4890 -1850 4037 7292 2172 -2455 -2363 -4082 -7204 -1324 6132 4320 -2013
1986 -2013 -5730 -6168 -2018 1635 -1367 -2774 1394 2238 -1704 -4289 -4330 -1892 2993 4104 -1955 -2642
2002 -2642 2444 1093 -3583 -2042 3290 5845 3829 -1690 -4045 -217 1605 -510 2979 7356 1712
2017 1712 -6426 -7004 -3277 2232 7277 3788 -5324 -7021 -1526 675 -1630 -2873 -160 6212 6038
2032 6038 -3726 -7416 1282 5094 1862 2321 5983 4814 1829 1343 -356 -546 1911 3087 4837 6206
2048 6206 1177 -5300 -6367 -4283 -492 6242 4908 -7423 -10694 -2342 937 -5130 -6828 -1529 2226
$$ packed form
1941a0884K979O715M225k455o569N03L761k303j883O216N204j280m729m832J392
1956c940P681K729o088p30O698J107o302l636J403N283L822m747n575M898N397
1971H000m653o985j252L040N887L255n120m627R2j719l122N880P456j812o333
1986b013l717m38M150L653l002j407M168Q44l942k585m1K438M885J111o059o87
2002b642N086j351m676J541N332K555k016n519k355L828J822k115L489M377n644
2017A712q138n78L727N509N045l489r112j697N495K201k305j243K713O372j74
2032F038r764l690Q698L812l232M59L662j169k985m86j699j90K457J176J750J369
2048F206n029o477j067K084L791O734j334j2331l271Q352L279o067j698N299L755
$$ plain form
2063 2226 297 -6138 -7363 -1356 2393 -1792 -1969 1811 793 -1520 62 -743 -532 4010 5455 663
2079 663 -806 2934 2815 -527 -4 4882 10345 6836 -5203 -7773 4968 11340 3731 -585 1791
2094 1791 1897 -168 -2198 -2208 212 3852 1766 -2692 -2776 -3037 -4010 -3591 -3443 -2230 2027 1512 -7470
2111 -7470 -8791 -46 1131 -5884 -6854 1398 7324 3588 -6464 -9465 -1236 5520 2509 1297 4986
2126 4986 2872 -2099 -2486 -869 3244 8499 6479 -1733 -2067 3833 4110 -1412 -2779 2777 8478 5212
2142 5212 -6658 -8590 2802 6705 -1015 -3354 1154 1239 -2084 -3728 -3265 1199 4951 1115 -4709
2157 -4709 -3601 451 462 -1104 -1444 1401 6319 1214 -9650 -7540 5068 6542 -2652 -3926 2288
2172 2288 2332 -2956 -6763 -3958 3751 5330 -323 -3457 -1436 -325 -871 -1106 -2485 1146 7291 3196
$$ packed form
2063B226j929o435j225O007L749m185j77L780j018k313J582q05K11M542J445m792
2079F63j469L740j19l342N23M886N463l509j2039k570J2741O372p609m316K376
2094A791J06k065k030j0K420L640k086m458q4k61r73M19J48J213M257n15q982
2111g470j321Q745J177p015r70Q252N926l736j0052l001Q229O756l011j212L689
2126D986k114m971l87J617M113N255k020q212l34N900K77n522j367N556N701l266
2142E212j1870j932J1392L903p720k339M508Q5l323j644M63M464L752l836n824
2157d709J108M052J1j566l40K845M918n105j0864K110J2608J474r194j274O214
2172B288M4n288l807K805P709J579n653l134K021J111n46k35j379L631O145m095
$$ plain form
2188 3196 -6674 -3744 5993 3696 -5857 -4529 6307 10103 944 -9205 -4786 6231 5748 -1844
2202 -1844 -1757 3173 2542 1428 458 -2830 -1311 4971 5234 -2069 -2191 2876 2386 -2949 -3568 2843 6483
2219 6483 -1165 -10057 -2457 8526 1745 -10470 -5445 5547 2887 -5279 -7690 -3814 1701 2656
2233 2656 -2352 -5193 -3426 -795 495 -1452 -4725 -461 8590 4552 -8135 -5731 6474 4975
2247 4975 -3313 519 10340 8665 -3896 -8650 1447 11363 6121 -2084 1884 7035 1968 -3463
2261 -3463 -2851 -1114 2950 9023 5956 -5505 -9124 -1592 2781 -236 -2924 1906 4566 -4350 -13340
2276 -13340 -4152 8450 1588 -10695 -4201 7023 1189 -9854 -7254 2541 6149 863 -4520 -4491
2290 -4491 -948 1204 3330 3188 -2622 -2520 5552 4172 -5462 -2480 9916 7580 -5214 -4663 7093
$$ packed form
2188C196r870K930R737k297r553J328J0836L796r159j0149M419J1017m83p592
2202a844Q7M930o31j114r70l288J519O282K63p303j22N067m90n335o19O411L640
2219F483p648q892P600J0983o781j2215N025J0992k660q166k411L876N515R55
2233B656n008k841J767K631J290j947l273M264R051m038j2687K404J2205j499
2247D975q288L832R821j675j2561m754J0097R916n242q205L968N151n067n431
2261c463O12J737M064O073l067j1461l619P532M373l017k688M830K660q916q990
2276a3340R188J2602o862j2283O494J1224n834j1043K600R795L608n286n383K9
2290d491L543K152K126j42n810J02Q072j380r634K982J2396k336j2794N51J1756
$$ plain form
2305 7093 7923 -3242 -7636 3255 11358 1989 -7307 -589 6691 55 -4584 -42 2025 -340 2069
2320 2069 2227 -3598 -5098 591 3139 -2110 -4726 2005 7782 -1126 -12814 -5596 8131 3224 -7628
2335 -7628 -569 9181 1056 -10834 -7354 3955 6727 1479 -1995 -678 -272 -3007 -1501 1822 -42
2350 -42 -158 4661 1892 -8360 -5639 6843 6051 -5250 -4912 5012 4922 -5294 -7610 3832 10789
2365 10789 962 -9039 -1087 7792 2740 -2720 1104 2929 1007 2632 3330 -1411 -2952 2228 5687
2380 5687 2071 -2243 -380 3874 -800 -7429 -1345 8939 2085 -9051 -3565 6107 100 -9957
2394 -9957 -6202 3417 5161 -1641 -6709 -4093 -470 -1732 -2352 -587 -1540 -1367 3988 1973 -7577 -6246
2410 -6246 4630 5960 -1477 -977 5081 4233 -3414 -5026 4283 10757 3790 -4580 684 7167 2053
$$ packed form
2305G093Q30j1165m394J0891Q103r369r296O718P280o636m639M542K067k365K409
2320B069J58n825j500N689K548n249k616O731N777q908j1688P218J3727m907j0852
2335g628P059R750q125j1890L480J1309K772n248l474J317M06k735J506L323j864
2350d2j16M819k769j0252K721J2482p92j1301L38R924r0j0216k316J1442O957
2365A0789r827j0001P952Q879n052n460L824J825j922J625O98m741j541N180L459
2380E687l616m314J863M254m674o629O084J0284o854j1136N486R672o007j0057
2394i957L755R619J744o802n068K616L623j262o20J765r53J73N355k015r550J331
2410f246J0876J330p437N00O058q48p647j612R309O474o967q370N264O483n114
$$ plain form
2425 2053 -3305 1564 5705 3282 1415 -896 -3230 121 5611 4584 -2463 -6717 -2598 4160 2765
2440 2765 -4030 -3673 2451 -1566 -8129 -2593 4418 -842 -7635 -4507 2081 2120 -3154 -6560 -2673 2855
2456 2855 1483 -1849 -1876 -400 1192 4009 1138 -5149 -1815 7360 6447 -1587 -2677 2918 4141 459
2472 459 -1927 1497 5213 2207 -2865 540 4248 -651 -4519 -938 3639 3744 2156 -1672 -5327
2487 -5327 -2244 3277 2194 -748 -1095 1120 1981 -2071 -5653 -1352 5887 2831 -4555 -2970 2161
2502 2161 391 -2004 -1088 992 973 -745 -3544 -2662 2263 2145 -1435 -2710 -1785 214 1874 -1031
2518 -1031 -4773 -873 5543 1936 -4739 -3451 1330 2064 -212 -827 963 3277 620 -3660 -1781
2533 -1781 3321 2957 543 762 727 1685 2762 -466 -3255 1649 6369 2645 -2017 -764 2230 2694
$$ packed form
2425B053n358M869M141k423j867k311k334L351N490j027p047m254M119O758j395
2440B765o795L57O124m017o563N536P011n260o793L128O588L9n274l406L887N528
2456B855j372l332k7J476J592K817k871o287L334R175r13q034j090N595J223l682
2472D59k386L424L716l006n072L405L708m899l868L581M577J05j588l828l655
2487e327L083N521j083k942l47K215Q61m052l582M301P239l056p386J585N131
2502B161j770k395R16K080j9j718k799Q82M925j18l580j275R25J999J660k905
2518a031l742L900O416l607o675J288M781P34k276o15J790K314k657m280J879
2533a781N102l64k414K19l5R58J077l228k789M904M720l724m662J253K994M64
$$ plain form
2549 2694 -63 -3229 -299 4613 1859 -3379 -1882 1332 -1250 -2691 -1734 -793 270 17 -3495 -5046
2565 -5046 -686 1236 -2420 -4550 -2179 1384 2170 -2778 -6542 -1017 5289 1352 -4087 -1348 2866
2580 2866 2201 533 206 1096 2917 2759 -333 501 3347 2748 983 975 854 2127 3560 -535 -3552
2597 -3552 1852 6933 922 -4581 -1541 3086 2497 -1828 -4184 -81 4551 1456 -4133 -3859 -1289
2612 -1289 -828 247 1368 -995 -2162 -1335 -2326 -3583 455 2081 -1757 -3380 -803 1960 1575 -3560
2628 -3560 -5773 1516 6799 1248 -5416 -1550 3810 2560 -652 -1445 -388 3230 4237 293 -2001
2643 -2001 -155 1429 2457 1901 -144 -282 1484 600 -1195 2400 4484 -1185 -5106 -72 4577 2987
2659 2987 -1575 -4089 -350 3921 785 -4216 -2011 2283 888 -923 -996 -1822 -878 740 -910 -3040
$$ packed form
2549B694k757l166K930M912k754n238J497L214k582j441R57R41J063k53l512j551
2565e046M360J922l656k130K371L563P86m948l764N525O306l937n439K739M214
2580B866o65j668l27Q90J821j58l092Q34K846n99j765qj21J273J433m095l017
2597c552N404N081o011n503L040M627n89m325k356M103M632l095n589K74K570
2612a289M61J075J121k363j167Q27r91j257M038J626l838j623K577K763l85n135
2628c560k213P289N283n551o664L866N360j250l212p93J057L618J007l944k294
2643b001J846J584J028n56k045j38J766q84j795L595K084n669l921N034M649j590
2659B987m562k514L739M271l136n001K205M294j395j811p3q26R44J618j650k130
$$ plain form
2675 -3040 -107 1984 -181 -2774 -2041 -622 273 -977 -3022 663 3797 -1326 -6090 -1323 4220
2690 4220 2148 -1685 -2721 -1124 2808 2742 -650 -1480 1035 1428 598 1404 1711 1442 2650 619 -2553
2707 -2553 345 4866 2512 -1276 213 1903 966 -726 -1574 822 3764 724 -3883 -1548 2713
2722 2713 1527 -1669 -2479 -1796 338 1459 -991 -3331 -924 518 -1528 -2374 -933 -125 -282 -1917
2738 -1917 -3361 -661 3228 -245 -4706 -2899 1271 2077 392 -1030 -1343 924 1101 -1179 -418 3872
2754 3872 3398 -340 -1030 231 1710 3331 2240 -477 522 2353 103 -71 2195 2308 439 -1269
2770 -1269 -2374 119 4485 3037 -3370 -4290 3 1748 -37 -1650 -1474 -61 582 -2341 -3497 246
2786 246 844 -1837 -1583 -34 -1273 -1570 -105 -1087 -1073 761 -222 -2487 -292 2302 1067 -620 -2528
$$ packed form
2675c040K933K091k165k593P33J419Q95j250k045L685L134n123m764M767N543
2690D220k072l833j036J597L932o6l392q30K515L93q30Q06L07k69J208k031l172
2707b553K898M521k354l788J489J690r37j692q48K396K942l040m607K335M261
2722B713j186l196q10O83K134J121k450k340K407J442k046q46J441Q08j57j635
2738a917j444K700L889l473m461J807M170Q06j685j422l13K267J77k280P61M290
2754C872m74l738o90J261J479J621j091k717R99J831k250j74K266J13j869j708
2770a269j105K493M366j448o407r20M293J745j785j613J76J413O43k923j156L743
2786B46N98k681K54J549j239k97J465r82J4J834r83k265K195K594j235j687j908
$$ plain form
2803 -2528 -649 3378 3459 -3148 -4073 2828 5504 1382 -1317 -1388 196 2243 2752 1482 959 518 -1285
2820 -1285 -390 2090 1804 1165 1447 -627 -1850 1163 2179 -1604 -1413 2528 2084 -2237 -4158 -1104
2836 -1104 2995 2947 -3017 -5602 -603 2524 -373 -1195 -363 -2366 -1904 351 -564 -1608 -469 355 -1288
2853 -1288 -770 -248 -566 -657 -1617 -992 2736 3510 -2903 -4208 2403 4474 94 -1099 1257 2510 1647
2870 1647 60 -1877 1109 3207 2098 565 201 -888 534 3450 1497 -1321 395 1468 -1797
2885 -1797 -1395 3263 3041 -1625 -3670 -1803 1662 1965 -1966 -3336 1025 1120 -2720 -2541 -598 49 24
2902 24 -87 -2577 -2804 325 1243 -1591 -2399 -571 863 752 -1050 -1368 1720 1953 -2067 -2352 2903
2919 2903 3585 -656 -1269 745 2211 1827 733 -451 1047 2552 1493 -409 509 788 1558 1715 -1040
$$ packed form
2803b528J879M027Q1o607r25O901K676m122k699p1J584K047N09j270n23m41j803
2820a285Q95K480k86o39K82k074j223L013J016l783J91L941m44m321j921L054
2836a104M099m8n964k585M999L127k897q22Q32k003M62K255r15j044J139Q24j643
2853a288N18N22l18r1r60O25L728P74o413j305O611K071m380j193K356J253q63
2870A647j587j937K986K098j109j533l64j089J422K916j953k818J716J073l265
2885a797M02M658k22m666k045J867L465L03l931j370M361R5l840J79J943O47k5
2902B4j11k490k27L129R18k834q08J828J434j11j802l18L088K33m020k85N255
2919B903O82m241o13K014J466l84j094j184J498J505j059j902R18K79P70J57k755
$$ plain form
2936 -1040 -1712 2529 3219 -1210 -2536 1791 1927 -1596 -2575 120 2418 958 -2875 -3365 784 2026
2952 2026 -1111 -2022 -710 -1344 -644 687 -1662 -3227 326 1122 -1629 -2238 90 962 -624 -2344
2968 -2344 -1259 2181 1743 -3080 -1926 3547 2341 -2455 -2176 1890 2795 1741 -46 -1335 -334 2831
2984 2831 3193 1154 -589 -1268 1228 3100 590 -1194 2726 2948 -2689 -2313 3327 3270 -1484 -2508
3000 -2508 644 1858 -499 -3052 -1078 2839 853 -3411 -3222 -230 -477 304 1420 -2710 -5502 -409
3016 -409 3024 -323 -3415 -1553 439 -567 -2059 -610 2708 799 -3799 -1829 4190 2068 -2931
3031 -2931 -873 3889 2406 -872 -454 191 1463 2655 2142 157 -1630 -782 3315 4308 -1211 -3776
3047 -3776 2002 4642 -985 -2985 1875 2076 -1664 -1554 1652 1937 -1657 -3554 -340 2969 665 -3461
$$ packed form
2936a040o72M241O90m429j326M327J36l523r79K695K298j460l833m90M149J242
2952B026l137r11J312o34P00J331k349j565L553P96k751o09K328Q72j586j720
2968b344J085L440m38m823J154N473j206m796K79M066R05j054j787j289J001L165
2984B831L62k039j743o79K496J872k510j784L920K22n637L76N640n7m754j024
3000b508L152J214k357k553J974L917j986m264J89K992k47P81J116m130k792N093
3016d09L433l347l092J862J992j006j492J449L318j909m598J970O019k122m999
3031b931K058M762j483l278M18O45J272J192n13j985j787Q48M097R93n519k565
3047c776N778K640n627k000M860K01l740J10L206K85l594j897L214L309k304m126
$$ plain form
3063 -3461 -1813 858 -1317 -839 1449 -1121 -3295 -201 2074 -1555 -3655 314 2993 501 -3613
3078 -3613 -3058 2299 2548 -2406 -2206 2791 1307 -3335 -795 3444 1409 -1651 -760 1040 645 300
3094 300 721 1076 417 -172 1418 2185 -1239 -2565 3122 4896 -1550 -3895 1633 3683 -452 -1325 1574
3111 1574 2430 -269 -2848 -637 3016 1017 -2680 -727 1446 -1177 -1856 456 -75 -2003 -311 1243
3127 1243 -2064 -3791 -942 1850 977 -3282 -3596 789 1910 -2666 -2563 2672 1832 -3446 -1776 2539
3143 2539 1648 -526 -236 892 1246 796 190 697 1274 864 1961 2798 -188 -2236 2094 4376 449
3160 449 -1737 1525 2435 -565 -1457 1112 1993 655 -2170 -1597 1089 432 -2855 -1260 1223 -584
3176 -584 -2305 -790 -1117 -1839 549 752 -2420 -3791 -982 1446 930 -1761 -2730 431 1862 -1190
$$ packed form
3063c461J648K671k175M78K288k570k174L094K275l629k100L969K679k492m114
3078c613N55N357K49m954K00M997j484m642K540M239k035l060Q91J800l95l45
3094C00M21L55o59n89J590P67l424j326N687J774o446k345N528K050m135q73K899
3111A574Q56k699k579K211L653j999l697J953K173k623o79K312n31j928J692J554
3127A243l307j727K849K792q73m259l14M385J121m576J03N235q40n278J670M315
3143B539q91k174K90J128L54m50o06N07N77m10J097Q37k986k048M330K282l927
3160D49k186L262R10l000q92K569Q81j338k825N73K686o57l287J595K483j807
3176e84j721J515l27p22K388K03l172j371K809K428n16k691r69L161J431l052
$$ plain form
3192 -1190 -1629 1327 1063 -1504 -312 2344 447 -910 -165 1105 1802 1894 -511 -756 1054 2000 1617
3209 1617 405 -1180 -1097 2582 3574 -963 -2497 878 2391 -37 -772 -523 225 1016 651 -426 -66
3226 -66 -608 -1769 -121 1877 360 -1623 -1036 -1302 -1147 1065 643 -2077 -1842 1231 917 -1340 -1953
3243 -1953 -1394 623 1792 -1420 -2569 -171 988 -584 -626 240 -957 -111 761 83 -758 415 346
3260 346 -377 701 1175 267 -74 -6 387 2815 1546 -1639 -1235 2715 2723 253 -238 167 837 1915 917
3279 917 -805 -472 492 459 364 631 -541 -750 -439 -1155 -1512 932 215 -2654 -1643 862 -200 -2618
3297 -2618 -2257 -788 1020 360 -1797 -2451 -352 130 -858 -387 51 -727 265 1358 -560 -1094 1551
3314 1551 1611 84 473 1728 1334 873 -142 576 2723 2470 -507 -252 2538 1723 -743 251 1063 297
$$ packed form
3192a190m39K956k64k567J192K656j897j357P45J270O97R2k405k45J810R46l83
3209A617j212j585Q3L679R92m537j534L375J513k428p35K49P48P91l65j077L60
3226f6n42j161J648J998j517j983N87k66J55K212m22k720K35L073l14k257o13
3243a953N59K017J169l212j149K398J159j572m2Q66j197Q46Q72o78q41J173o9
3260C46p23J078M74r08l41O8L93K428j269l185M04L950Qk470m91M05O70J078r98
3279I17j722L33R64l3r5K67j172k09L11p16l57K444p17k869J011K505j062k418
3297b618L61J469J808o60k157o54K099M82r88M71M38p78R92J093j918n34K645
3314A551O0j527L89J255l94m61j015P18K147k53k977K55K790q15k466R94Q12p66
$$ plain form
3332 297 373 666 -869 -34 520 73 -707 -509 -897 -703 443 -1314 -1892 770 196 -3153 -1699 1136
3350 1136 138 -2272 -1723 -141 1160 725 -1664 -2347 332 1035 -543 309 309 -743 -37 1305 -354
3367 -354 -1163 1221 1533 278 517 1321 438 -677 -636 672 3010 1553 -1766 -1440 2075 1516 -1282
3384 -1282 -727 875 1070 1076 116 -1559 -957 526 901 209 -198 -503 -487 708 -525 -1288 766 444 -1423
3403 -1423 -860 1122 -63 -2010 -822 780 829 -157 -2353 -2211 967 1760 -727 -1394 -849 -1301 19
3420 19 915 -1193 -1421 1030 1293 -626 -854 230 277 359 665 301 1136 939 -529 231 2260 971 -1180
3439 -1180 388 2172 2249 1141 -215 -1985 -93 2706 1749 -171 -573 -106 244 216 -666 -1338 263
3456 263 788 -870 -779 -159 -1955 -2357 -441 26 -38 -333 -1948 -2547 -596 476 -1386 -1580 402 378
$$ packed form
3332B97P6K93j535Q35N54m47p80J98l88J94J146j757n78K662n74l349J454K835
3350A136r98k410N49J582J301m35k389o83K679P03j578Q52%j052P06J342j659
3367c54q09K384L12j255K39Q04q83j115M1J308K338j457l319L26L515n59k798
3384a282N55J602J95Or60j675O02J483L75o92m07l05J6J195j233p63K054l22j867
3403a423N63J982j185j947J188J602M9r86k196J42L178P93k487o67N45m52J320
3420A9Q96k108k28K451K63j919k28J084M7Q2L06l64Q35j97j468P60K029j289k151
3439a180J568J784P7j108j356j770J892K799r57j920m02M67L50k8q82o72J601
3456B63N25j658R1O20j796m02J916M67o4k95j615n99J951J072j862j94J982k4
$$ plain form
3474 378 31 -1260 -2278 -325 3146 2089 -1482 -1124 285 708 1387 1211 739 564 741 -295 415
3491 415 2396 2319 281 561 1012 840 880 322 -907 323 1990 243 -1006 10 307 -531 -978 -976 -438
3510 -438 1364 479 -1980 -1859 -624 -1000 -975 295 470 -217 -770 -1840 -1819 424 1199 -782 -1344 223
3528 223 650 602 -240 -1655 -1005 1948 1890 -94 -111 515 -480 -797 510 1267 1601 1182 -1124 -1542 332
3547 332 1539 736 898 609 -353 -248 -127 -167 1341 2549 -172 -2205 -772 1253 1450 648 -524 -907
3565 -907 305 921 -750 -586 596 -497 -878 344 567 -397 -715 -1967 -1750 392 1214 -831 -1290
3582 -1290 -12 -122 -879 -1735 -1613 164 2125 809 -2306 -1627 30 313 488 692 -624 293 1624
3599 1624 944 -850 -200 357 279 1473 2780 1568 -403 -1179 -1091 2005 4136 1342 -1201 -112 719
$$ packed form
3474C78l47j291j018J953L471j057l571L58J409M23O79j76m72j75J77j036P10
3491D15J981p7k038K80M51j72M0n58j229J230J667j747j249J016K97q38m47KN38
3510d38J802q85k459J21J235l76K5J270J75o87n53j070K1K243P75j981n62J567
3528B23M27m8q42j415O50K953n8j984j7O26r95l17J307P57L34m19k306m18J874
3547C32J207q03J62k89r62J05J21m0J508J208k721k033J433K025J97q02j172l83
3565i07J212O16j671J64J182j093l81J222K23r64l18j252K17K142Q22k045m59
3582a290J278j10p57q56J22J777J961j316l115O79J657K83J75K04j316R17J331
3599A624o80j794O50N57p8J194J307j212j971p76Q8L096K131k794k543J089Q31
$$ plain form
3616 719 152 440 477 247 929 424 -2012 -2377 -99 830 480 -756 -2129 -1783 -483 -682 -1312 434
3634 434 390 -2343 -2172 -115 614 -886 -1270 -154 785 1215 -1080 -2867 -955 1211 1641 680 334 -978
3652 -978 854 2207 -169 -1456 781 2815 1378 143 330 733 322 -369 206 1516 2022 -546 -1057
3669 -1057 1281 882 -1254 -1101 294 481 1374 740 -1259 -2292 -488 1000 403 -436 -1312 -132 458
3686 458 -1370 -2154 695 1743 -1615 -2038 519 922 -988 -1778 -288 956 1044 -664 -1369 -360 609
3703 609 187 472 432 -888 43 1144 -453 -1802 1011 3221 233 -1750 -667 994 1107 -458 -198
3720 -198 2359 2392 -1379 -1709 1287 1496 -284 295 1744 835 -72 -140 -894 -1277 263 1639 812 -323
3738 -323 -1284 -245 721 -1833 -2618 1085 2691 -1000 -2870 -639 494 -1888 -2276 229 1678 455
$$ packed form
3616G19n67K88L7k30O82n05k436l65K278R29l50j236j373L46J300j99o30J746
3634D34m4k733J71K057P29j500l84J116R39M30k295j787J912K166M30r61l46j312
3652i78J832J353k376j287K237K034j437j235J87M03m11o91N75J310N06k568n11
3669a057K338l99k136J53J395J87Q93o34j999j033J804J488n97q39q76J180N90
3686D58j828p84K849J048l358m23K557M03j910p90J490J244Q8j708p05J009R69
3703F09m22K85m0j320R31J101j597j349K813K210k988j983J083J661J13j565K60
3720a98K557L3l771l30K996K09j780N79J449r09r07o8p54l83J540J376q27j135
3738c23r61J039R66k554p85L703J606l691j870K231J133k382l88K505J449j223
$$ plain form
3754 455 -2257 -2486 -409 977 -54 125 -97 -1826 -102 1971 9 -1807 906 2948 1216 -1448
3770 -1448 -557 1603 1834 155 318 2417 1984 -1980 -1387 2868 2659 -965 -424 1333 1126 -35 -142
3787 -142 -989 -1161 413 1842 763 -1474 -2593 -541 1124 -1447 -2500 995 2564 -1862 -3970 -1584
3803 -1584 19 -1075 -590 1077 1583 -424 -3179 -2016 1217 1707 -365 -280 158 160 474 1473 -753 -2554
3821 -2554 632 3990 1582 -1712 -803 1621 1623 -343 -278 2133 2060 -1179 -1720 1190 1834 -986 -123 1638
3839 1638 750 -758 -705 -277 444 1291 894 -939 -2266 -1332 1285 2227 -779 -2954 123 1991 -1131
3856 -1131 -3050 251 1408 -529 -1839 267 1150 55 -2217 -1969 333 1346 -47 264 256 -938
3872 -938 -1308 148 -267 -815 2166 3004 -832 -3135 -1000 2114 1790 -504 -835 1510 2194 -777 -2028
$$ packed form
3754D55k712k29K077J386j031J79k22j729J724K073j962j816K713K042j732k664
3770a448Q91K160K31j679J63K099m33l964N93M255k09l624N41J757k07j161j07
3787a42q47j72J574J429j079k237j119K052J665k571j053L495J569m426k108K386
3803a584J603j094M85J667N06k007k755J163L233M90k072Q5M38KL14R99k226j801
3821b554L186L358k408l294R09K424Kj966O5K411p3l239n41K910O44k820Q63J761
3839A638q88j508N3M28P21Q47l97j833j327R34K617R42l006k175L077J868l122
3856a131j919L301J157j937j310K106Q83j095k272K48K302J013j393L11qj194
3872i38l70J456m15n48K981Q38l836k303K135L114l24k294l31K345O84k971j251
$$ plain form
3889 -2028 715 2023 -103 155 1496 566 -569 49 -476 580 1257 1136 89 -811 -653 530 851
3906 851 -1082 -2026 1072 1629 -2000 -3481 374 1900 -226 -2062 -1414 -152 31 -1372 -1475 599
3922 599 611 -1164 -1305 -765 -248 433 803 -959 -1260 1272 2533 -574 -2195 -123 1631 1690 295 -31
3940 -31 1554 1522 -556 -1496 1461 2488 570 228 921 114 -579 -397 -553 610 1914 1086 -938 -1816
3958 -1816 -883 418 44 -1493 -1160 1531 1598 -1763 -3362 -445 1422 124 -823 -701 -665 -525 -774 -1136
3976 -1136 142 1034 -393 -959 -321 -89 618 558 -1101 -490 2014 1737 -1307 -2108 1104 2798 1060
3993 1060 -1047 -1399 356 1636 -89 -470 745 1262 185 582 381 -945 -408 407 448 535 1649 148
4011 148 -1805 -1567 346 1439 502 -1141 -846 1580 1060 -2359 -3054 692 2043 -46 -854 -944 -713
$$ packed form
3889b028K743J308k126K58J341r30j135O18n25J056O77j21j047r00J58J183L21
3906H51j933r44L098N57l629j481L855J526k126j836O48J262J83j403j03K074
3922E99J2j775j41N40N17O81L70j762l01K532J261l107j621K072J754N9j395l26
3940c1J585l2k078r40K957J027j918l42O93q07o93J82j56J163J304q28k024q78
3958a816R33J301l74j537L33K691O7l361j599K917J867j298r47J22L6J40k49l62
3976a136J278Q92j427n66O38K32P07o0j659O11K504k77l044q01L212J694j738
3993A060k107l52J755J280j725l81J215N17j077L97k01j326N37Q15M1Q7J114j501
4011A48j953K38J913J093r37j643K95K426n20l419o95L746J351k089q08r0K31
$$ plain form
4028 -713 -232 -218 -1160 -316 696 305 -667 -1326 -1479 -265 158 -362 -554 1236 1209 -1637 -1940 1485 2099
4047 2099 -133 -876 -340 1721 1557 -588 -1244 790 1882 829 534 -170 -582 936 1716 454 -457
4064 -457 881 944 -546 -881 755 1044 287 -943 -552 1306 495 -2323 -1599 1610 1945 -910 -2022
4081 -2022 -1343 -724 -12 -138 -1036 -669 594 358 -1014 -1783 -1148 428 1006 -611 -942 1291 1194 -1570
4099 -1570 -1654 1094 1903 501 -121 137 1074 712 -571 -684 1604 1695 607 372 276 -250 743 1019 69
4118 69 -412 933 1306 -442 -1056 135 822 413 -837 -887 736 565 -2137 -1899 1508 1097 -1126 -2146
4136 -2146 -801 -43 660 219 -1241 -710 390 -552 -1052 -701 -252 709 1383 -247 -1080 313 547 -1587
4154 -1587 -1038 1644 2449 42 -1265 -880 820 1215 -107 -541 1178 1948 667 -595 -444 -662 302
$$ packed form
4028g13M81J4r42Q44J012l91r72o59j53J214M23n20j92J790k7k846l03L425O14
4047B099k232p43N36K061j64k145o56K034J092j053k95p04m12J518P80j262r11
4064d57J338O3j490l35J636K89p57j230L91J858q11k818P24L209L35k855j112
4081b022O79O19P12j26q98L67J263k36j372p69O35J576N78j617l31K233r7k764
4099a570q4K748Q09j402o22K58R37l62j283j13K288R1j088k35r6n26R93K76r50
4118F9m81J345L73j748o14J191O87m09j250n0J623j71k702K38L407m11k223j020
4136b146J345P58P03m41j460N31J100r42n00L51M49R61O74j630q33J393K34k134
4154a587N49K682Q05k407j307L85J700L95j322m34J719P70j281j262J51k18R64
$$ plain form
4171 302 1494 534 -56 447 514 -640 -209 888 777 21 -445 91 1079 685 -1829 -1753 1248 1722 -630
4190 -630 -1650 -648 35 592 -732 -1634 -904 964 130 -1087 -767 -353 -155 444 -640 -1829 -294
4207 -294 328 -85 -531 662 347 -957 -877 -225 1083 1443 -382 -1023 1238 1874 -5 -883 -97 1266
4225 1266 1997 864 -342 -414 1003 1026 -124 -13 566 426 712 190 -191 -134 -76 -1128 -636 1098 980
4244 980 -952 -1792 -657 297 361 -924 -1432 -160 1488 -325 -2236 -1273 -258 381 -5 -336 -712 206
4262 206 204 -1036 -701 418 931 566 433 -406 -271 593 180 -350 1164 1391 -452 -1627 533 1762
4280 1762 1766 -23 -700 -59 858 389 -753 232 1039 566 -199 -419 -1046 -646 1006 587 -241 -10 -199
4299 -199 -952 -935 -260 523 784 -872 -1335 13 990 -908 -2321 -228 982 282 -494 -770 -682 -288 219
$$ packed form
4171C02J192r60n90N03O7j154M31J097j11p56m66N36R88l94k514P6L001M74k352
4190f30j020J002O83N57j324r02P30J868q34j217L20M14J98N99j084j189J535
4207b94O22m13m46J193l15j304Q0O52J308L60j825o41K261O36j879q78P86J363
4225A266P31j133j206p2J417K3j150J11N79j40K86n22l81N7N8j052M92J734j18
4244I80j932q40J135R54O4j285n08J272J648j813j911R63J015O39l86l31l76R18
4262B06kj240L35J119N13l65j33q39J35Q64m13n30J514K27j843j175K160J229
4280A762Mj789o77O41R17m69j142R85Q07m73p65k20o27M00J652m19q28K31j89
4299a99p53J7O75P83K61j656m63J348R77j898j413K093J210p00p76k76Q8L94N07
$$ plain form
4318 219 -615 -164 234 -53 152 95 -7 -304 347 -323 -1012 1085 2344 220 -1195 -230 549 613 634 471
4338 471 700 740 57 -575 623 1241 126 175 478 -198 -26 274 258 -241 376 112 -1223 -1003 352 831
4358 831 571 -766 -1487 -62 761 -780 -1647 -204 548 376 -946 -1289 -1068 -116 744 -291 -490 233
4376 233 -272 -435 -299 -722 -329 561 560 -400 -4 735 -798 -878 737 1511 810 -459 -468 835 1808 641
4396 641 -866 -358 956 823 1217 807 -276 -778 363 456 245 927 429 -454 -676 -292 154 -302 -697
4415 -697 -854 84 774 -1110 -1880 402 787 -681 -1125 -801 -579 368 847 -512 -871 -491 -199 179 46
4434 46 -237 71 959 273 -624 335 784 -66 -596 1207 1239 214 -278 -6 867 579 -410 -178 819 1480
4454 1480 -47 -270 -38 -579 537 1319 211 -1315 -315 844 9 -400 -165 -247 -251 -454 -288 695 502
$$ packed form
4318B19q34M51L98k87K05n7j02k97O51o70o89K097J259k124j415R65P79O4K1j63
4338D71K29M0o83o32J198O18j115M9L03o76J72L00j6m99O17k64j335K20J355M79
4358H31k60j337p21J425Q23j541q67J443P52j72j322l43K21R52Q60j035j99P23
4376B33n05j63J36m23L93Q90jr60L96P39j533q0J615P74p01j269rJ303R73j167
4396F41j507N08J314j33L94m10j083n02J141R3k11O82m98q83k22L84M46m56l95
4415f97j57R38O90j884p70K282L85j468m44L24K22R47M79j359l59L80K92L78j33
4434D6k83L08Q88o86q97R59M49q50n30J803L2j025m92K72Q73k88r89K32R97O61
4454A480j527k23K32n41J116P82j108j526J000J159q35m09K35q2mk03J66R83j93
$$ plain form
4473 502 -1759 -1769 435 802 -663 -332 -58 -472 -13 10 -779 -713 295 232 -36 -486 -718 -111 943 -127
4493 -127 -837 47 863 -311 -612 965 902 -280 -715 104 917 546 531 110 808 522 -505 168 751
4512 751 141 236 775 257 -765 64 834 -135 -397 304 168 127 -412 -664 96 -101 -1384 -955 1197 669
4532 669 -849 -1258 -179 -489 -264 106 -327 -687 -340 -107 -18 -498 -745 -366 915 -136 -1039 -74 811
4551 811 -445 -225 1031 683 -605 -638 1314 1250 566 -225 -168 1037 1035 590 499 494 -49 288 1386 261
4571 261 -730 30 811 247 -293 405 327 -495 -728 -322 656 389 -1214 -685 652 688 -1437 -1019 611
4590 611 -288 -465 33 -408 -803 100 135 -250 -592 -393 729 1151 -64 -1264 -68 865 -152 -254 845
4609 845 661 -249 261 861 426 -377 -601 681 1734 803 -298 -357 607 383 307 1239 -259 -931 389
$$ packed form
4473E02k261j0K204L67j465L31K74m14M59K3p89O6J008o3k68m50k32O07J054j070
4493a27p10Q84Q16j174l01J577o3j182m35Q19Q13l71j5m21O98k86j027O73N83
4512G51o10R5N39n18j022Q29P70r69k62P01j36m1n39k52P60j97j283M29K152n28
4532F69j518m09J079l10K25L70m33l60L47K33Q9m80k47L79J281j051r03R65Q85
4551H11j256K20J256l48j288l3J952o4o84p91N7J205km45r1nn43L37J098j125
4571B61r91P60P81n64n40O98p8q22k33M06R78k67j603N29J337L6k125M18J630
4590F11q99j77M98m41l95R03L5l85l42J99J122M22j215j200J196R33j017j02J099
4609H45j84r10N10O00m35q03k24J282J053r31j101n9R64k24p6R32j498o72J320
$$ plain form
4628 389 1451 -192 -865 50 695 128 -489 -237 94 516 -408 -252 589 -382 -1501 -452 1107 160
4646 160 -856 -630 -660 -641 -15 407 -302 -738 -437 77 601 -461 -1247 680 780 -673 -722 654 1001
4665 1001 -467 158 378 -85 188 431 603 660 26 -196 541 838 117 185 674 34 -289 933 887 -383
4685 -383 -967 304 1074 616 16 -587 -98 46 -865 -553 577 343 -959 -441 513 -483 -883 -144 -267
4704 -267 -492 66 113 -365 -327 -608 -144 407 -867 -1310 678 1295 -277 -786 118 411 -500 415 1085 355
4724 355 -99 28 120 768 440 -5 38 553 166 412 913 245 -574 555 755 24 -290 509 402 -132
4744 -132 -277 -215 327 347 -537 -986 101 450 -839 -179 301 -545 -953 224 -234 -253 114 -268 -1194 -653
4764 -653 -216 146 309 -364 -934 -4 596 -436 -1024 -40 530 -93 426 35 28 -63 508 351 240 520 -183
$$ packed form
4628C89J062j643o73R15O45n67o17K52L31M22r24J56Q41r71j119J049J559r47
4646A60j016K26l0J9O26M22p09m36L01N14N24j062p86J927J00j453m9J376L47
4665A001j468O25K20m63K73K43J72N7o34k22P37K97p21O8M89o40l23J222m6j270
4685c83n84J271P70m58o00o03M89J44r11L12J130k34j302N18R54r96m00P39j23
4704b67k25N58M7m78L8k81M64N51j274m43J988O17j572n09R04K93r11R15O70p30
4724C55m54J27R2O48l28m45M3N15l87K46N01o68q19J129K00p31l14P99j07n34
4744a32j45O2N42K0q84m49J087L49j289O60M80q46m08J177m58j9L67l82r26N41
4764f53M37L62J63o73n70R30O00j032n88R84N70o23N19l91pr1N71j57j11K80p03
$$ plain form
4785 -183 345 1010 343 -283 348 157 56 1187 869 -634 -442 543 606 281 -240 -430 90 497 104 -505
4805 -505 -161 157 -440 -511 520 -694 -622 0 -215 -394 -67 -314 -851 -127 257 58 -493 -469 -479 298 420
4826 420 -974 -567 342 452 -296 -325 -78 -127 427 649 -171 -26 472 613 309 626 86 -421 555 582 159
4847 159 729 238 -623 -58 1120 520 -409 -115 117 492 677 -145 -800 -237 323 177 8 -130 -765 -523
4867 -523 -85 -353 -745 66 -58 -711 -393 -177 -290 -472 -429 -214 -42 255 -673 -634 414 105 -348 -111
4887 -111 -63 -443 99 700 -123 -326 411 312 -146 48 321 263 731 111 299 582 608 -207 76 673 646 -282
4909 -282 230 488 -171 33 12 -220 481 420 -454 -174 -257 -561 -126 548 -553 -1072 -74 -241 -368 -400 227
4930 227 -316 -532 -257 -282 348 -130 -791 -641 522 304 -472 -155 -31 -532 2 804 -372 -661 264 516
$$ packed form
4785a83N28O65o67o26O31j91j01J131l18j503J92R85O3l25n21j90N20M07l93o09
4805e05L44L18n97p1J031j214P2O22k15j79L27k47n37P24L84j99n51K4j0P77J22
4826D20j394M07R09J10p48k9K47m9N54K22q20J45M98J41l04L17n40n07R76K7m23
4847A59N70m91q61N65J178o00r29K94K32L75J85q22o55N63N60j46j69j38o35K42
4867e23M38k68l92Q11j24o53L18K16j13j82M3K15J72K97r28L9J048l09m53K37
4887a11M8l80N42O01q23k03P37r9m58J94K73n8M68o20J88K83K6q15K83N97k7r28
4909b82N12K58o59K04k1k32P01o1q74K80q3l04M35O74j101n19R98j67j27l2O27
4930B27n43k16K75k5O30m78o61J50J163k18p76L17J24n01N34Q02j176k89R25K52
$$ plain form
4950 516 567 470 -46 -87 388 247 203 451 665 -266 206 1022 441 -372 -111 356 166 681 -150 -650 -38
4971 -38 516 113 -204 -435 -706 -78 203 107 -511 -311 -65 -649 -553 229 55 -351 -399 -476 -286 -113 -653 -681
4993 -681 678 362 -515 -671 348 390 234 379 -701 -291 573 520 2 -201 138 -118 1043 615 -253
5012 -253 114 547 338 -267 395 40 -158 400 598 437 166 -631 -549 626 895 -231 -823 -426 -22 270
5032 270 316 -399 -764 -404 92 -520 -613 -196 -443 -14 339 -492 -736 -195 -476 -255 302 460 -476 -411 -43
5053 -43 61 -63 5 -164 76 322 -517 -450 459 786 317 371 228 -636 256 972 393 113 457 93 41 486
5075 486 343 129 320 -187 -242 252 405 -409 -189 179 96 -117 -414 -601 -111 160 99 -479 -406 -532 -18
5096 -18 -311 176 -164 -650 82 -280 -686 -19 38 -338 -203 -307 273 -111 -130 -313 214 941 77 -569 -340
$$ packed form
4950E16N1r7n16m1M75j41m4K48K14r31M72Q16n81q13K61M67j90N15q31n00O12
4971c8N54m03l17k31k71O28K81r6o18K00K46n84R6P82j74m06m8p7J90J73n40k8
4993f81J359l16q77j56J019M2j56J45j080M10Q64n3n18k03L39k56J161m28q68
5012b53L67M33k09o05O62l55j98N58J98j61k71p97Q2J175K69j126n92L97M04K92
5032B70M6p15l65L60M96o12r3M17k47M29L53q31k44N41k81K21N57J58r36O5L68
5053d3J04j24O8j69K40K46q39O7R09L27m69N4j43q64Q92P16n79k80L44l64n2M45
5075D86j43k14J91n07n5M94J53q14K20L68q3k13k97j87M90K71o1n78P3j26N14
5096a8k93M87l40m86P32l62m06O67N7l76J35j04N80l84j9j83N27P27q64o46K29
$$ plain form
5117 -340 245 113 652 701 -217 -240 450 502 561 628 470 348 -156 -9 30 529 319 -259 65 298 -276 -482
5139 -482 202 593 167 -301 -694 -418 -18 -108 -180 -194 -240 -480 -187 119 -591 -306 222 124 -528 -205 1 -183
5161 -183 -139 -52 -206 -36 -594 -681 101 960 -64 -703 90 609 58 -69 -125 -50 421 658 426 -191 8
5182 8 228 750 1048 63 -275 219 349 108 647 585 -261 -536 582 671 147 -333 -512 -363 313 340 -805
5203 -805 -201 85 -169 -26 200 -855 -801 376 58 -728 -406 138 294 -168 36 -89 -300 -234 -295 66
5223 66 463 -425 -282 376 773 -90 -493 260 188 710 1032 202 56 -134 804 644 262 -41 -43 719 582
5244 582 -360 -188 602 92 -251 426 277 -344 -336 140 588 545 -433 -672 -426 13 176 10 -13 -754 -270
5265 -270 461 157 -903 -431 347 -60 -144 64 -178 -20 -402 -608 71 741 -109 -255 229 252 -277 258
$$ packed form
5117c40N85j32N39M9r18k3O90N2N9O7j58j22n04J47L9M99k10n78L24K33n74k06
5139d82O84L91m26m68l93K76M00r0p2j4m6k40K93L06p10K85N28r8o52L23K06j84
5161a83M4Q7j54J70n58q7P82Q59j024o39P93N19n51j27n6P5M71K37k32o17J99
5182HK20N22K98r85l38M94J30k41N39o2q46k75J118Q9n24m80j79J49O76K7j145
5203h05O04K86k54J43K26j055N4J177l18p86L22N44J56m62K04j25k11O6o1L61
5223F6L97q88J43O58L97q63m03P53p2N22L22q30j46j90R38j60l82l03kP62j37
5244E82r42J72P90n10l43O77j49o21QM76M48m3r78k39K46M39J63j66k3p41M84
5265b70P31l04j060M72P78m07q4K08k42J58l82k06O79O70q50j46M84K3n29N35
$$ plain form
5285 258 389 4 30 268 98 -434 47 581 818 200 -59 227 586 248 -456 314 925 228 -418 559
5305 559 232 55 20 92 -16 145 -8 -93 169 -209 -329 85 -8 -461 -344 216 -146 -1077 -467 426 -226
5326 -226 -803 -569 -164 29 -136 62 287 -14 -461 -744 386 626 -230 -300 320 -161 52 546 287 -296
5346 -296 -10 683 479 225 -327 84 544 325 -271 -18 579 181 -169 543 420 -538 -442 605 675 -45
5366 -45 -204 -201 132 234 63 147 -246 -651 45 622 -96 -1017 -413 130 -314 -641 -481 -10 -148 -352 -574
5387 -574 -17 164 -399 -134 205 64 -879 -167 733 249 -331 -4 418 -64 283 820 7 -308 -288 376
5407 376 843 328 -435 229 532 165 -141 140 103 -389 323 833 198 -210 -122 -293 151 225 -345 78 100
5428 100 -437 29 223 -712 -958 -219 835 -145 -858 -512 -196 -311 -141 -456 -395 -90 -360 55 274 -55
$$ packed form
5285B58J31l85K6K38j70n32M81N34K37o18k59K86L59l38p04P70O11o97o46R77
5305E59l27j77l5P2j08J61j53q5K62l78j20M14r3m53J17N60l62r31O10Q93o52
5326b26n77K34M05J93j65J98K25l01m47k83J130K40q56p0O20m81K13M94k59n83
5346b96K86O93k04k54n52M11M60k19n96K53N97l98l50P12j23r58R6J047P0p20
5366d5j59LL33J02j71Q4l93m05O96N77p18r21O04N43m44l27J60M71j38k04k22
5387e74N57J81n63K65L39j41r43P12R00m84n80L27M22m82L47N37q13l15K0O64
5407C76M67n15p63O64L03l67l06K81l7m92P12N10o35m08Q8j71M44P4n70M23K2
5428A00n37M66J94r35k46P39J054r80p13L46L16j15J70l15O1L05k70M15K19l29
$$ plain form
5448 -55 -618 66 245 -280 -405 284 527 -126 345 377 76 -1 240 392 36 170 -139 417 938 191 -263
5469 -263 326 293 547 519 287 -229 -341 325 199 -288 -111 -466 259 304 -424 -377 86 -18 -452 -19 673
5490 673 -74 -674 -514 9 -93 -225 -177 147 -2 -417 -570 -57 -25 -65 293 579 -153 -636 -30 69 -123
5511 -123 621 488 186 144 -193 231 336 184 -305 399 718 343 31 264 238 -255 327 652 126 -400 131
5532 131 257 -139 267 -120 249 -129 -258 -75 350 -30 -681 -37 397 -190 -582 -283 142 174 161 -430 -736
5553 -736 -351 145 -251 -179 -372 -194 568 352 -359 -796 134 569 -60 123 75 -510 -158 274 92 336 173
5574 173 -99 469 497 401 -442 58 357 505 437 105 -394 -100 579 540 -7 -96 -153 -71 192 -112 39 -219
5596 -219 -98 -484 148 603 -441 -558 -41 -39 379 -200 -430 -602 137 439 -541 -532 99 -81 246 344 -576
$$ packed form
5448e5n63O84J79n25j25O89K43o53M71L2l01p7K41J52l56J34l09N56N21p47m54
5469b63N89l3K54k8k32n16j12O66j26m87J77l55P25M5p28M7M63j04m34M33O92
5490F73p47o00J60N23j02j32M8L24j49m15j53N13L2m0L58K86p32m83O06R9j92
5511a23P44j33l02m2l37M24J05j52m89P04L19l75l12K33k6m93N82L25n26n26N31
5532A31J26l96M06l87L69l78j29J83M25l80o51O44M34n87l92K99M25L2j3n91l06
5553g36L85M96l96P2j93J78P62k16p11m37R30M35o29J83m8n85L52M32j82K44j63
5574A73k72N68K8r6q43N00K99J48o8l32m99K94O79l9n47q9n7Q2K63l04J51k58
5596b19J21l86O32M55j044j17N17KM18n79k30j72P39L02r80RO31j80L27R8r20
$$ plain form
5617 -576 -260 383 248 -15 6 -28 -152 282 193 -246 234 523 391 -144 486 12 -550 104 536 637 372
5638 372 115 -262 76 652 75 -250 339 471 -12 97 -572 -407 615 413 95 -225 -117 -518 -545 -4
5658 -4 -53 -144 -179 -155 -366 -151 66 -176 -231 -260 34 414 198 -548 -460 325 44 -114 -19 234 -66 128 164 -58
5682 -58 87 364 -86 -118 430 392 381 254 405 233 97 66 -326 294 853 -47 -202 303 434 -160 -180 -463
5704 -463 103 68 493 -295 -179 -3 -129 -81 -117 -332 -415 25 -120 -397 -54 100 -603 -583 267 356 178 -491
5726 -491 -622 -350 124 70 -316 72 206 328 -68 317 -197 27 393 467 252 482 -23 -326 148 711 722
5747 722 315 -176 -461 191 483 92 -185 392 332 -95 33 -208 -266 269 388 -194 -117 -339 -787 -86 348
5768 348 61 -311 -323 -343 -248 -38 94 -237 -227 -26 381 -221 -362 -518 -233 370 136 -226 177 9 47 -317
$$ packed form
5617e76L16O43j35k63K1l4j24M34q9m39M80K89j32n35O30m74n62O54M32J01k65
5638C72k57l77L38N76n77l25N89J32m83J09o69J65J022k02l18l20J08m01k7N41
5658dm9r1l5K4k11K15K17k42n5k9K94L80k16p46Q8P85k81j58R5K53l00J94L6k22
5682e8J45K77m50l2N48l8j1j27J51j72j36l1l92O20N59r00j55N05J31n94k0k83
5704d63N66l5M25p88J16J76j26M8l6k15q3M40j45k77L43J54p03K0Q50Q9j78o69
5726d91j31K72M74n4l86L88J34J22l96L85n14K24L66P4k15K30n05l03M74N63J1
5747G22m07m91k85O52K92l91k77N77o0m27J28k41n8N35J19n82P7k22m48P01M34
5768C48k87l72j2k0R5K10J32l31J0K01M07o02j41j56K85O03k34l62M03j68L8l64
$$ plain form
5790 -317 -180 -296 254 706 186 -433 -204 173 -84 650 440 216 -187 252 251 190 385 80 -179 679 658
5811 658 -253 -91 -245 66 750 437 -318 -497 54 -186 -6 -80 -287 -303 -7 -216 -404 -308 26 -227 -121
5832 -121 -92 -344 -547 -282 148 271 512 -183 -539 -435 358 120 -23 189 -75 243 475 -224 -355 57
5852 57 218 340 141 431 -77 167 175 -121 323 488 -16 185 508 330 -234 28 276 11 333 337 -154 149
5874 149 551 137 -589 -357 -90 356 285 -341 -699 -301 13 -450 -182 363 -252 -314 -202 -179 -232 193 -203
5895 -203 -547 -388 -103 100 -207 -6 -107 75 369 -357 -424 488 393 330 416 307 -303 -20 57 332 732 339
5917 339 -167 -101 328 146 -139 319 434 -69 454 115 -501 -325 230 217 -278 -273 -176 -22 -169 -574 -727 -84
5939 -84 48 -373 -104 140 -260 -869 -257 -220 -246 5 -161 -277 -282 311 -317 -113 -391 -275 397 694 -251 -679
$$ packed form
5790c17J37j16N50M52n20o19K29L77k57P34k10k24m03M39jo1J95l05k59Q58k1
5811F58r11J62j54L11O84l13p55j79N51k40J80p4k07j6K96k09j88R6L34k53J06
5832a21K9k52k03K65M30J23K41o95l56J04P93k38j43K12k64L18K32o99j31M12
5852E7J61J22j99K90n08K44Qk96M44J65n04K01L23j78n64K62K48k65L22Mm91L03
5874A49M02m14p26K32K67M46p1o26l58L98L14m63K68N45o15o2J12K3n3M25l96
5895b03l44J59K85K03l07K01j01J82K94p26o7R12r5o3Q6j09o10K83P7K75M00l93
5917C39n06O6M29j82k85M58J15n03N23l39o16J76N55j3m95NR7J54j47m05j53O43
5939h4J32m21K69K44m00o09O12L7k6K51j66j16nN93o28K04k78J16O72K97r45m28
$$ plain form
5961 -679 257 364 -18 -374 291 465 40 357 183 357 85 -189 333 553 -123 -409 288 258 205 423 42
5982 42 -474 -200 543 352 -346 -418 -166 93 -213 -413 -438 51 418 -440 -456 177 73 -688 -372 206 -190
6003 -190 -190 -38 -110 -25 -109 -302 -120 127 96 384 -203 -571 -484 431 505 -312 -120 374 198 47 -63 173 117
6026 117 -3 192 362 225 -374 -198 448 751 -187 83 119 -45 -65 630 404 -305 -312 379 241 -158 -457
6047 -457 -275 534 247 -688 -663 -252 -151 -487 276 187 -498 -255 -304 -440 -133 -216 164 -297 -178 268 -108
6068 -108 -488 -395 -361 578 620 -506 -301 416 166 -362 72 152 166 231 -134 -23 440 27 -168 184 278 132
6090 132 211 591 -48 -116 492 350 -374 10 282 160 -46 -440 -88 387 163 -620 -324 372 72 -501 -95
6111 -95 117 -389 -265 148 -93 -230 55 -212 -230 440 -380 -163 -271 -502 110 493 134 -548 -340 213 312
$$ packed form
5961f79R36J07l82l56O65J74m25L17j74J74k72k74N22K20o76k86O97l0n3K18l81
5982D2n16K74P43j91o98p2K52K59l06k00k5M89L67q58j6O33j04p61L16N78l96
6003a90%J52p2Q5q4j93J82K47l1K88n87l68Q7R15P4q17J92M94j76j51j10K36n6
6026A17j20J95J70j37n99J76O46L03r38K70L6j64k0O95k26p09pO91j38l99k99
6047d57J82Q09k87r35K5M11J01l36P63q9o85K43m9j36L07q3L80m61J19M46l76
6068a08l80R3L4R39M2j126K05P17k50n28M34Q0J4O5l65J11M63m13j95L52R4j46
6090A32P9L80o39o8O08j42p24L84K72j22k06l94L52M75k24p83K96O96l00n73M06
6111i5K12n06J24M13k41j37K85k67j8O70q20K17j08k31O12L83l59o82K08N53R9
$$ plain form
6132 312 -345 20 301 -26 160 94 -66 466 -2 -23 303 629 118 -41 303 -376 -150 628 209 -413 -82
6153 -82 643 258 -246 -656 -247 366 256 -578 -311 279 26 -325 138 -77 -410 -388 -266 -97 -39 238 -387
6174 -387 -333 -295 -64 -103 -257 -231 -88 526 23 -508 -85 651 125 -361 29 81 184 378 -83 -580 66 267
6196 267 72 429 94 -111 -242 204 1 261 392 89 -475 164 214 -242 -410 16 171 486 287 -712
6216 -712 -719 136 451 -155 -312 -232 -57 -64 100 -661 -323 -294 -526 11 86 -148 -158 -310 -285 -396 446 -290 -615
6239 -615 -20 522 -24 -107 -17 -8 244 -15 -17 -33 463 337 -74 -145 193 297 404 287 -85 -113 346 -205 -251
6262 -251 240 360 -268 -61 205 317 303 -282 -613 -160 377 93 -492 35 -159 -313 -396 53 -500 214 289
6283 289 -99 -123 -48 62 -204 -215 -34 288 -57 -74 -331 78 309 -40 -329 251 568 121 77 -154 -319 149
$$ packed form
6132C12o57L65K81l27J86o6j60N32m68k1L26L26n11j59L44o79K26P78m19o22L31
6153h2P25l85n04m10M09O13j10q34K67N90k53l51M63k15l33K2J22J69N8K77o25
6174c87N4L8K31l9j54K6J43O14n03n31M23P36n26m86L90N2J03J94m61m97O46K01
6196B67j95L57l35k05j31M46k03K60J31l03n64O39N0m56j68M26J55L15j99r99
6216g12pQ55L15o06j57Q0J75pJ64p61L38K9k32N37P5k34j0j52K5j11Q42p36l25
6239f15N95N42n46q3R0RK52k59kj6M96j26m11p1L38J04J07j17l72k8M59n51m6
6262b51M91J20o28K07K66J12j4n85l31M53N37k84n85N27j94j54q3M49n53P14P5
6283B89l88k4P5J10k66j1J81L22l45j7k57M09K31l49k89N80L17m47m4k31j65M68
$$ plain form
6305 149 466 -23 174 425 -34 59 336 -13 211 348 -191 -637 526 687 344 -617 -51 285 232 42
6325 42 -626 36 524 -154 -613 -230 -101 -261 -301 38 -345 -95 261 27 -389 -221 -163 -45 -147 160 -10
6346 -10 292 -414 -586 110 457 -213 -555 -213 619 50 -208 -82 -132 309 194 60 2 157 -26 330 321 -432
6368 -432 177 667 118 447 233 229 -150 -337 398 710 167 -2 -371 0 579 13 -416 -31 83 -124 34
6389 34 -50 -412 -258 164 56 -176 -267 -53 -155 -337 -105 -262 -60 -88 -334 -91 251 -88 -562 -36 197
6410 197 -206 78 -175 -46 415 5 -396 17 175 122 214 84 111 249 305 232 -358 269 226 -320 113 1
6432 1 118 55 35 -104 13 242 -222 -475 18 440 -41 -352 -351 -330 -156 107 169 -649 -241 -139 -205 -66 -172
6455 -172 -238 -97 -57 -130 -153 119 -225 -313 -172 344 245 -85 -111 12 211 56 -217 123 377 168 9 -53 204
$$ packed form
6305A49L17m89J97K51m59R3K77l49K24J37n39m46J163J61l43r61N66L36n3j90
6325D2o68O62M88o78m59L83J29j60m0L39l83K50L56k34m16J68N8J18j02L07j70
6346a0L02p06j72O96L47o70l42L42Q32n69k58J26n0M41j15j34n8J55j83L56rp53
6368d32O09M90n49L29k14ml79j87P35L12n43j69l69L71N79n66m29L85J14k07J58
6389C4q4l62J54M22j08k32r1K14j02j82K32j57K02k8k46K43L42l39m74N26K33
6410A97m03K84k53J29M61m10m01M13J58n3R2j30K7J38N6p3n90O27m3n46M33j12
6432AJ17o3k0j39J17K29m64k53M93M22m81l11JK1J74K63O2q18M08J02o6J39j06
6455a72o6J41M0p3k3K72l44q8J41N16r9l30k6J23J99j55k73L40K54k09j59o2K57
$$ plain form
6478 204 40 198 -3 -404 79 488 273 163 252 199 -5 244 -229 243 413 56 46 -277 56 -125 103
6499 103 146 -153 39 126 -313 -131 171 -95 -82 39 271 -128 -212 -248 -303 -94 -26 45 -203 40 395 -378 134
6522 134 -410 -220 307 132 -117 -399 357 287 -398 -88 -77 174 59 369 238 176 238 11 230 245 384 135
6544 135 224 52 97 202 315 -321 126 175 70 18 73 3 182 483 -355 -438 -179 256 225 -51 4 -349 -90
6567 -90 -101 -44 -411 130 77 -561 -107 153 -316 -174 92 -221 0 6 -283 39 202 98 -158 -34 153 253
6589 253 465 130 -475 291 331 5 2 207 32 199 244 67 -150 -168 184 -79 142 300 -211 -278 -230 92
6611 92 56 146 -393 -206 85 5 -194 -510 -182 -76 -120 -40 -452 -281 73 -199 -34 -209 -373 34 -47 120
6633 120 -188 165 50 -272 -189 252 149 -26 100 240 66 405 327 -217 515 326 -204 -231 175 67 195
$$ packed form
6478B04j64J58k01m01M83M09k15j10Q9n3k04K49m73M72J70l57j0l23L33j81K28
6499A03M3k99J92Q7m39J82L02k66J3J21K32l99q4l6n5K09O8P1k48K43L55p73N12
6522A34n44J90N27j75k49k82P56p0o85L10J1K51j15L10j31o2O2k27K19J5J39k49
6544A35Q9j72M5J05J13o36M47M9j05n2N5p0J79L01q38q3K59M35l1k76N5l53K59
6567i0j1N7l67N41n3o38M54K60m69J42K66l13K21Ok89L22J63j04k56J24J87J00
6589B53K12l35o05P66M0l26lK05j75J67M5j77k17j8L52k63K21J58n11o7M8L22
6611I2l6R0n39J87K91q0j99l16L28J06m4Q0m12J71L54k72J65j75j64M07q1J67
6633A20l08L53j15l22Q3M41j03j75J26J40j74L39p8n44P32j89n30k7M06j08J28
$$ plain form
6654 195 259 -39 99 415 345 49 -232 97 -156 -115 21 -479 -99 -74 127 40 89 -337 -374 -255 -50 217
6676 217 85 -164 -546 -257 -9 147 -152 92 74 75 -26 -306 -549 265 114 -318 232 390 -31 -400 130
6697 130 173 77 279 -26 -38 30 364 -170 -115 -33 143 276 382 99 367 179 239 -26 259 304 8 -89 93
6720 93 40 -106 117 -310 72 288 177 6 -103 122 -150 -158 107 -465 -456 10 28 -186 10 61 -81 211 -110
6743 -110 -83 36 17 -232 -249 744 42 -247 110 456 205 310 -55 -18 223 503 281 84 -31 243 216 274
6765 274 -220 -20 207 342 110 -167 281 -177 -1 341 237 145 -23 34 132 325 72 -370 -23 -82 9 -31
6787 -31 77 -460 -375 58 280 16 -17 404 372 -352 -295 -54 243 -17 -235 -314 258 -246 -106 164 240 122
6809 122 -113 127 -188 379 1 -66 161 362 466 -48 -118 -246 -229 521 321 -409 58 253 117 -39 -78
$$ packed form
6654A95O4k98J38L16p0k96k81L29k53M1J36n00L80K5K01q7M9m26l7J19K05K67
6676B17j32k49l82K89K48J56k99K44j8Jj01k80k43Q14j51m32N50J58m21l69N30
6697A30M3r6K02l05j2O8L34n34N5Q2J76J33J06k83K68j88O0k65K85M5k96r7J82
6720I3n3j46K23m27L82K16j11j71j09K25k72qK65n72RM66J8k14J96N1j42K92l21
6743a10K7J19j9k49j7R93p02k89L57L46k51J05l65L7K41K80k22j97j15K74k7N8
6765B74m94K00K27J35k32k77M48m58J76L42j04r2j68N7R8J93k53m42L47n9R1m0
6787c1J08n37Q5M33K22k64l3M21l2p24N7K41K97k60k18p9N72n04J40K70P6j18
6809A22k35K40l15N67l78o7K27K01J04n14p0j28J7P50k00p30M67J95j36j56l9
$$ plain form
6830 -78 -21 -63 97 -139 109 -5 -385 -208 17 51 -83 17 195 -130 -104 -46 3 -347 -11 432 228 75
6852 75 -272 -46 -3 88 -123 -133 445 -359 -154 359 111 22 -300 45 256 70 87 15 89 9 222 269 -93
6875 -93 190 -62 601 194 -6 -220 -65 56 -215 167 -44 28 153 346 -47 -181 -107 -54 219 69 -232
6896 -232 -17 141 -103 -213 -183 -87 -8 55 173 343 -226 -248 -285 -6 153 63 -16 151 -132 -414 322 238 -509
6919 -509 -337 36 31 125 -33 -261 -221 68 -92 -30 61 120 -340 330 117 -183 -319 327 258 30 30 134 -99
6942 -99 27 338 164 67 195 -94 271 -170 67 -367 33 -305 -46 496 86 -206 -227 -245 -321 -385 -262 -114
6964 -114 63 214 -182 -360 -23 227 -193 -51 -81 141 -211 314 -26 -334 20 128 43 164 -126 -280 149
6985 149 54 65 394 -81 -344 -269 78 491 -266 131 61 156 294 54 202 -154 343 165 -262 22 -138 -146
$$ packed form
6830g8N7m2J60k36K48j14l80J77K25L4j34J00J78l25K6N8M9l50L36M43k04j53
6852G5l47K26M3R1k11j0N78q04K05N13k48q9l22L45K11j86J7p2P4q0K13M7l62
6875i3K83k52O63m07k00k14J55J21k71L82k11P2J25J93l93j34P4N3K73j50l01
6896b32K15J58k44j10L0R6P9O3J18J70n69k2l7K79J59r0p9J67k83k82P36q4p47
6919e09J72L73nR4j58k28M0K89j60O2R1N9m60O70k13l00j36O46o9k28%J04k33
6942i9J26L11j74r7J28k89L65m41K37m34M00l38K59N42m10k92k1j8p6o4J23J48
6964a14J77J51l96j78L37K50m20J42l0K22l52N25l40l08L54J08q5J21k90j54M29
6985A49r5J1L29m75k63P5L47M13p57L97p0R5J38k40J48l56M97j78m27K84j60q
$$ plain form
7007 -146 384 300 21 -141 -562 -86 20 -3 -331 -252 63 21 -130 -76 -176 -215 82 226 -373 -316 176 157 -6
7030 -6 -14 -223 -224 244 -267 145 261 99 -199 -16 -120 177 120 144 233 348 33 -105 -125 204 128 -6 -323 40
7054 40 -102 -160 102 15 -70 -62 -67 62 176 87 -256 33 28 -267 -27 -31 -138 -340 39 -313 -449 -182 -144 -441 46
7079 46 130 -6 -70 -244 -251 -100 85 -11 16 137 -84 -47 221 9 103 78 111 -14 148 40 -193 312 449 162
7103 162 36 26 156 -1 157 -152 -277 20 -25 -152 41 53 -133 10 247 -91 -280 -18 -41 -123 -252 -62
7125 -62 -94 -282 -277 -157 -295 -151 -23 -468 177 -123 -113 -18 -28 115 277 -80 -42 -267 104 242 -49 74 -169
7148 -169 109 179 93 218 48 21 -100 90 459 -105 -429 443 132 102 236 -135 15 -43 256 59 -59 169
7170 169 -57 242 593 -115 -107 -50 -392 86 218 -225 -82 -149 122 -25 -459 -452 -88 -201 -202 -115 31 -146 34
$$ packed form
7007a46N30q4k79j62m21M76J06k3l28P9L15m2j51N4j00l9K97J44n99N7M92j9j63
7030fqk09jM68n11M12J16j62k98J83j04K97n7K4Q9J15l15j38k0L29p6j34l17L63
7054D0j42n8K62q7q5QnJ29J14q9l43K89nk95K40mj07k02L79l52j36K67L8k97M87
7079D6Q4j36o4j74pJ51J85r6K7J21k21L7K68k12R4k5L3j25J62j08k33N05J37k87
7103A62j26j0J30j57J58l09j25K97m5j27J93J2j86J43K37l38j89K62k3q2j29J90
7125f2l2j88NJ20j38J44J28m45O45l00J0R5j0J43J62l57L8k25L71J38k91J23k43
7148a69K78P0q6J25j70k7j21J90L69n64l24Q72l11l0J34l71J50n8K99j97j18K28
7170A69k26K99L51p08QN7l42M78J32m43J43o7K71j47m34PL64j13jQ7J46j77J80
$$ plain form
7193 34 -30 -142 -142 -471 -335 7 422 -56 -172 -92 254 329 3 12 -265 264 188 398 161 -49 -90 -130 21 -133
7217 -133 -10 -70 43 -102 271 -132 99 345 255 88 312 -214 -109 191 -224 -82 -162 -46 147 22 167
7238 167 155 -87 108 -113 2 -164 -335 -69 -43 53 142 -100 -185 120 0 169 -118 -70 -271 -116 -106 23
7260 23 27 -99 111 286 94 89 -16 44 -18 89 307 187 -115 16 149 127 253 -181 284 69 82 -154 448
7283 448 105 -457 178 -6 118 -190 26 -62 -164 48 -99 36 189 72 -65 -312 164 -60 -36 -29 99
7304 99 -50 -329 -138 -67 -63 -118 -101 225 124 193 248 204 152 -291 87 -18 -138 178 -111 19 444 490 -14 -149
7328 -149 224 243 469 280 38 -280 54 284 258 -228 -96 -416 131 -113 -58 117 19 134 63 -20 -211 -190
7350 -190 -144 -165 36 -30 -113 -304 145 215 -50 -428 -164 -111 -31 176 -215 -56 -55 519 100 101 306 -41 -50 257
$$ packed form
7193C4o4j12%l29J36L42M15m78j16Q0L46P5l26Rk77N29p6K10k37k10m1m0J51j54
7217a33J23o0J13j45L73m03K31K46r0j67K24n26J05L00m15J42q0J16J93j25J45
7238A67j2k42J95k21J15j66j71K66K6R6Q9k42q5L05j20J69k87M8k01J55J0J29
7260B3Mj26K10J75j92nj05O0o2J07K18j20l02J31J33k2J26m34M65k15J3k36O02
7283D48l43n62O35j84J24l08K16q8j02K12j47J35J53j17j37k47M76k24K4PJ28
7304I9j49k79J91P1Mn5J7L26j01O9N5m4n2m43L78j05j20L16k89J30M25M6n04j35
7328a49L73J9K26j89k42l18L34K30k6m86J32l20N47k44N5J75r8J15p1q3j91K1
7350a90M6k1K01o6q3j91M49P0k65l78K64N3Q0K07l91J59JN74m19JK05l47rL07
$$ plain form
7374 257 98 -117 41 -106 215 -36 194 -38 42 -172 82 -30 -65 -89 -122 515 -42 61 277 -210 86
7395 86 169 182 -32 157 110 223 54 87 3 15 331 124 -64 -320 -175 -298 200 262 24 -118 -127 -124 -79 117
7419 117 -239 -70 70 32 -220 2 8 87 26 -21 237 -114 169 -178 109 -109 228 171 61 196 221 163 148
7442 148 177 -207 466 101 66 -31 394 79 217 41 -9 177 68 -201 74 -76 107 91 219 -12 -495 -195
7464 -195 107 -7 -454 225 -162 -201 43 31 4 42 -28 -153 -249 2 -162 -140 -59 -43 -254 94 269 -59 64
7487 64 250 97 6 73 272 -50 395 -178 418 -25 -409 -79 187 318 112 -169 -331 298 21 -55 -103 -64
7509 -64 -63 235 3 163 255 -61 149 -37 -166 -20 6 -6 -150 69 -407 -371 -84 -157 -151 -3 -234 53 49 -103
7533 -103 -326 -288 120 -142 -176 366 -84 -363 41 239 323 -294 97 -117 466 3 -46 1 272 457 19 223
$$ packed form
7374B57j59k15J58j47L21k51K30k32Q0k14K54j12l5k4l3O37n57J03K16m87K96
7395H6Q3J3k14J89m7J13j69L3q4J2L16k07j88k56J45j23M98O2k38j42rLM5J96
7419A17l56J69J40l8k52K22OP9o1m7K58l51K83l47K87k18L37n7j10J35K5n8j5
7442A48K9l84O73l65l5r7M25l15J38j76n0J86j09k69K75j50J83j6J28k31m83L00
7464a95L02j14m47O79l87l9K44j2k7L8p0j25r6K51j64K2Q1J6k11L48J75l28J23
7487F4J86j53r1O7J99l22M45n73N96m43l84L30K66J31k06k81j62O29k77p6m8L9
7509f4JK98k32J60R2l16K10j86j29J46K6j2j44K19m76L6K87p3OJ48k31K87mj52
7533a03k23L8M08k62l4N42m50k79M04J98Q4o17L91k14N83m63m9M7K71J85m38K04
$$ plain form
7555 223 102 157 106 150 298 83 -52 136 29 411 -257 -12 -222 232 217 255 294 -672 7 9 -209 -308 37
7578 37 -348 -336 -40 411 -86 -135 96 115 33 87 -31 215 242 261 -14 -58 85 123 153 343 4 -323 69 -68
7602 -68 409 259 115 -304 274 168 -21 -128 -29 -32 489 237 -243 211 180 71 -204 -18 -137 -307 -153 -61
7624 -61 -1 -91 -231 -190 -26 267 3 -140 -6 -146 -251 8 -70 -527 209 206 -39 -183 -55 -343 81 1 -271
7647 -271 -13 -72 -137 -209 -157 167 -82 -383 -284 -184 41 16 -74 53 420 312 188 177 74 218 150 190 85
7670 85 97 181 186 7 -35 210 386 145 103 299 -26 -67 -69 29 97 -327 90 254 -201 -273 -161 73 40 -256 177
7695 177 7 -169 47 92 78 55 -57 -197 -90 -513 -151 248 67 -116 -146 100 -20 123 105 109 -289 45
7717 45 65 109 27 42 30 244 194 -61 21 98 400 38 40 -144 395 166 -86 -257 365 -326 38 76 271 -79
$$ packed form
7555B23j21N5n1M4J48k15j35J88j07L82o68K45k10M54j5L8L9r66O79Kk18r9L45
7578C7l85J2K96M51m97m9K31J9q2N4j18K46K7J9k75m4J43L8L0J90l39l27L92j37
7602f8M77j50j44m19N78j06j89j07R9lN21k52m80M54l1j09k75J86j19j70J54R2
7624f1O0r0j40M1J64K93k64j43J34j40j05K59p8m57P36lk45j44J28k88M24q0k72
7647b71K58n9o5p2N2L24k49l01R9J00K25k5r0J27L67j08j24j1j03J44o8M0j05
7670H5J2Q4Nj79m2K45J76k41m2J96l25m1kR8O8m24M17J64m55p2J12K34l3k96M33
7695A77j70j76K16M5j4k3j12j40J07m23L62L99j81j83l0K46j20J43j8Ml98L34
7717D5K0M4q2J5j2K14n0k55Q2P7L02l62Kj84N39k29k52j71O22o91L64L8J95l50
$$ plain form
7741 -79 -99 -201 75 -351 288 -135 -212 -42 88 -203 -176 -413 -110 266 149 -294 -258 156 -216 -341 175 -93
7763 -93 -12 -313 142 -14 -88 -44 421 376 172 256 -422 -127 -210 268 286 -36 -236 -178 229 202 -248 141 129 235
7787 235 -133 12 -287 400 -13 -95 -39 -40 -23 -293 -20 -9 -49 -26 -386 -239 -103 205 -76 -328 -23 31 82
7810 82 -145 -549 -338 99 467 -208 -202 189 -184 -74 162 -73 191 66 -131 121 154 -95 39 -25 434 106
7832 106 372 85 217 78 120 58 -315 -6 199 8 367 73 -353 74 -77 69 -110 185 150 -104 132
7853 132 -111 -400 -90 -13 -196 122 27 -122 -224 -121 54 -267 -364 -306 42 98 -266 -200 -135 -69 -126 -142 -25
7876 -25 -148 295 79 66 -359 163 47 -44 -112 323 369 -11 75 -38 -63 344 -136 -157 49 212 -58 -147 17
7899 17 84 162 183 -171 117 490 -193 -161 -310 272 -157 144 -99 -90 31 -225 -191 -180 -300 -204 -26 -37 -297 2
$$ packed form
7741g9k0j02K76m26O39m23p7J70J30k91K7k37L03L76j17m43L6M14l72j25N16k68
7763i3Q1l01M55j56p4M4M65m5k04Q4o78K95q3M78J8l22k00N8M07k7m50L89j2J06
7787B35l68J45k99O87m13q2N6jJ7k70K73J1m0K3l60J47J36L08k81k52L05N4N1
7810H2k27m04K11M37L68o75OL91l73J10K36k35K64j25j97K52L3k49J34o4M59l28
7832A06K66k87J32j39M2o2l73L09K05j91L59k94m26M27j51J46j79K95l5k54K36
7853A32k43k89L10P7j83L18r5j49j02J03J75l21r7N8L48N6l64O6O5O6n7j6J17
7876b5j23M43k16j3m25N22j16r1o8M35M6l80Q6j13k5M07m80k1K06J63k70q9J64
7899A7O7P8K1l54K88L73o83L2j49N82m29L01k43RJ21k56L4J1j20R6J78j1k60K99
$$ plain form
7923 2 219 257 -235 -414 110 -119 101 -2 105 -251 67 -147 140 -2 296 -176 -126 41 130 77 34 -21 235
7946 235 482 7 254 -144 366 274 -303 -219 126 247 333 165 -275 184 -47 -195 -139 -305 -451 -149 -24
7967 -24 85 -231 45 -450 -342 101 191 -248 -94 -367 -279 203 -398 -264 51 158 37 -104 -199 -595 -57
7988 -57 199 -28 -86 -136 -47 -284 115 -41 -208 -232 175 85 137 157 -80 41 153 428 61 -337 -163 202 237
8011 237 8 29 -453 278 10 -207 -43 -122 34 134 -128 -83 -350 -97 -13 -248 421 11 -47 -6 4 -31 65
8034 65 -48 -226 -73 313 13 -358 -310 -70 21 -115 124 -286 -45 358 -60 39 185 -40 57 -85 227 70
8056 70 169 -117 -65 -21 328 251 45 -3 67 60 109 105 -132 243 254 134 -84 19 -71 81 -99 227 45 50 3 -407
8082 -407 82 45 -146 -1 202 -24 -55 -152 -74 -386 106 72 8 126 129 0 -2 90 -388 17 -151 -216 83 165
$$ packed form
7923BK17L8m92j79N24k29K20j03J07l56L18k14K87j42K98m72N0J67Q9n3m3n5K56
7946B35K47m75K47l98N10r2n77Q4L45J21Q6j68m40M59k31j48N6j66j46L02J25
7967b4J09l16K76m95J08M43R0m39J54k73Q8M82o01J34L15J07j21j41r5l96N38
7988e7K56k27n8n0Q9k37L99j56j67k4M07r0N2K0k37J21J12K75l67l98J74L65L5
8011B37k29K1m82P31k68k17J64p9J56J00k62M5k67K53Q4k35O69m10n8M1J0l5R6
8034F5j13j78J53L86l00l71M8K40R1j36K39m10K41M03m18R9J46k25R7j42L12j57
8056G0R9k86N2M4L49p7k06m8P0pM9mk37L75J1j20k18J03r0J52j80L26j82Nm7m10
8082d07M89l7j91J45K03k26l1r7P8l12M92l4o4J18Lj29kR2m78M05j68o5K99Q2
$$ plain form
8106 165 -144 -56 -152 -50 122 118 118 78 356 392 -4 -378 -263 231 225 248 44 -49 288 689 -68 -451 66 335
8130 335 263 47 68 143 -105 -129 -258 42 221 -12 -107 180 -173 -73 -290 -118 -78 552 3 -432 -29 -54
8152 -54 203 20 -27 -303 136 161 69 -280 -155 -228 -382 141 102 263 313 -42 57 36 297 393 263 123 -112
8175 -112 86 221 -153 -36 551 30 -203 -32 290 102 302 108 -231 -68 228 -142
$$ packed form
8106A65l09Q8r6J02J72m%m0K78L6l96l74J15M94oK3k04r3L37M01p57l83N17K69
8130C35p2k16K1P5k48k4j29L00J79k33r5K87l53J00k17J72M0O30n49m35M03k5
8152e4K57j83m7k76M39K5r2l49J25p3j54N23l9J61N0l55R9k1K61R6j30j40k35
8175a12J98J35l74J17N87n21k33J71L22j88K00j94l39J63K96l70
8191a42
$$ Imaginary data points
##PAGE= N=2
##DATA TABLE= (X++(I..I)), XYDATA
$$ plain form
0 0 0 0 0 8 -8 0 -8 8 -8 16 -17 24 -32 32 -48 55 -64 73 -88 104 -120 142 -161 187 -216 247 -279 319 -361
29 -361 407 -454 513 -575 641 -713 798 -887 981 -1090 1209 -1337 1478 -1639 1814 -2009
45 -2009 2232 -2484 2770 -3100 3490 -3950 4506 -5202 6090 -7268 8923 -11412 15567 -23779
59 -23779 46209 -231397 -740343 -168127 291667 74810 -310838 -189424 43316 -57912
69 -57912 -309920 -232092 43586 127399 -45394 -165963 -115844 57850 201517 132334 -124488
80 -124488 -136416 196475 324911 -22131 -226817 109205 411375 123572 -273825 -100477
90 -100477 340448 260559 -221999 -291069 136330 307200 1667 -202707 -40623 108749
100 108749 7939 -143128 -125469 36336 150781 54706 -166140 -222167 -5497 193320
$$ packed form
0@%%%Qj6QqJ6j6K4l3M1n6O4q0J03j19J37j61J92k24K62l03L48m03M63n26N98o80
29c61P68q61R67j088J216j354J511j685J868k071K299k546K815l117L453l823
45b009M241m716N254n870O590p440Q456r708J1292j3358J6191k0335K6979l9346
59b3779O9988k77606n08946N72216M59794k16857l85648J21414K32740j01228
69e7912k52008P7828K75678Q3813j72793j20569N0119J73694J43667o9183k56822
80a24488j1928L32891J28436l47042k04686L36022L02170k87803l97397J73348
90a00477M40925p9889m82558o9070M27399J70870l05533k04374J62084J49372
100A08749j00810j51067J7659J61805J14445r6075k20846n6027K16670J98817
$$ plain form
110 193320 53445 -240452 -195420 149875 195344 -155328 -252528 101198 256708 -80247
120 -80247 -309133 -18909 315292 166402 -201422 -210303 107316 236044 45516 -94996
130 -94996 -11475 85982 53605 -33434 -56584 50852 182326 102479 -148853 -195854 55185
141 55185 201379 1475 -206082 -56697 208528 109671 -233695 -246208 96975 203370
151 203370 -75386 -218742 -5189 159432 12916 -178598 -122544 78174 128756 -15023
161 -15023 -112422 -24776 101798 91730 -26784 -86500 26085 182954 120254 -106665 -119655
172 -119655 127516 219533 7901 -135589 12396 162381 36172 -168301 -106483 127871
182 127871 141583 -87039 -184767 -38921 61918 -27706 -129872 -90767 30617 76439 -26532
$$ packed form
110A93320j39875k93897M5032L45295M5469l50672r7200L53726J55510l36955
120h0247k28886K90224L34201j48890l67824q881L17619J28728j90528j40512
130i4996Q3521R7457l2377q7039k3150J07436J31474p9847k51332m7001K51039
141E5185J46194j99904k07557J49385K65225r8857l43366j2513L43183J06395
151B03370k78756j43356K13553J64621j46516j91514N6054K00718N0582j43779
161a5023r7399Q7646J26574j0068j18514n9716J12585J56869o2700k26919j2990
172a19655K47171R2017k11632j43490J47985J49985j26209k04473O1818K34354
182A27871J3712k28622r7728J45846J00839q9624j02166L9105J21384M5822j02971
$$ plain form
193 -26532 -142160 -92286 52591 74862 -30915 -68021 37162 120306 24204 -125485 -67204
204 -67204 141157 166849 -26371 -111640 18772 111979 26577 -74340 -25745 96445 96675
215 96675 -37841 -98256 3170 84525 23258 -53939 -18801 71108 81019 -22811 -104416 -23733
227 -23733 108868 81561 -56184 -82045 19855 75365 7429 -84075 -72683 20949 41974
238 41974 -43255 -82567 -19487 14696 -38932 -81319 -42037 26102 25633 -55938 -91520 -2263
250 -2263 76899 22781 -49246 -12813 58764 55077 -824 -20395 32471 91466 69548 5680
262 5680 66 39430 44969 16505 -5124 1594 42780 60923 -1003 -64134 -36697 10118 -11936
275 -11936 -41500 -10349 26480 -3055 -75071 -92367 -22230 31674 -5225 -40658 -5959 14978
$$ packed form
193b6532j15628M9874J44877K2271j05777l7106J05183Q3144r6102j49689N8281
204f7204K08361K5692j93220q5269J30412R3207q5402j00917M8595J22190K30
215I6675j34516o0415J01426Q1355o1267p7197L5138Q9909R911j03830q1605Q0683
227b3733J32601k7307j37745k5861J01900N5510o7936r1504J1392R3632K1025
238D1974q5229l9312O3080L4183n3628m2387L9282O8139m69q1571l5582Q9257
250b263P9162n4118p2027L6433P1577l687n5901j9571N2866N8995k1918o3868
262E680n614L9364N539k8464k1629O718M1186J8143o1926o3131K7437M6815k2054
275a1936k9564L1151L6829k9535p2016j7296P0137N3904l6899l5433L4699K0937
$$ plain form
287 14978 -22800 -39457 -11994 11437 28208 40781 21469 -13200 -17860 10062 37760 35396
299 35396 10937 11411 32107 13154 -21547 -718 29772 2935 -15747 20713 29395 -22839 -54711
312 -54711 -25725 11527 13256 -6509 -12089 -9712 -34696 -49812 -1526 42643 5296 -33452 -4138
325 -4138 14455 -20495 -28139 16592 44230 24127 -6239 -10779 6728 11678 2153 12298 29396
338 29396 18672 10647 18693 -6315 -36695 -264 49665 23593 -21766 -4357 26997 131
350 131 -47408 -33782 32366 48406 -18221 -55629 -4369 27863 -20639 -52711 -18414 12331
362 12331 4945 -14887 -33197 -32468 -6452 3153 -19964 -31556 -5897 25723 18573 -26837 -37081
375 -37081 24480 58472 -894 -34235 37774 87924 23109 -43907 -6938 72934 81106 12567
$$ packed form
287A4978l7778j6657K7463K3431J6771J2573j9312l4669m660K7922K7698k364
299C5396k4459M74K0696j8953l4701K0829L0490k6837j8682L6460Q682n2234l1872
312e4711K8986L7252J729j9765n580K377k4984j5116M8286M4169l7347l8748K9314
325d138J8593l4950p644M4731K7638k0103l0366m540J7507M950r525J0145J7098
338B9396j0724q025Q046k5008l0380L6431M9929k6072m5359J7409L1354k6866
350A31m7539J3626O6148J6040o6627l7408N1260L2232m8502l2072L4297L0745
362A2331p386j9832j8310P29K6016R605k3117j1592K5659L1620p150m5410j0244
375c7081O1561L3992n9366l3341P2009N0150o4815o7016L6969P9872Q172o8539
$$ plain form
387 12567 -29924 9532 49537 16960 -23354 -3970 28775 19992 -18086 -51664 -39101 12798
399 12798 18706 -43099 -62160 -218 29737 -32739 -90912 -49591 44686 57427 -33069 -78991
411 -78991 -5341 51695 -3430 -56035 -5539 65913 54613 -18656 -55586 -7319 55380 38357
423 38357 -18308 -9245 43558 40748 -18776 -49000 -3421 63413 49734 -33625 -48694 32951
435 32951 62524 -17574 -70521 -9271 71540 53000 -39516 -70988 8087 68221 8751 -63749
447 -63749 -26352 47545 36040 -35937 -60501 -3900 49648 11595 -60735 -39760 38451 33662
459 33662 -46396 -65270 9274 67680 24144 -65349 -64966 36485 81195 45 -64444 -8133
471 -8133 70461 50982 -32305 -53914 23474 81537 21871 -56102 -18301 60572 36225 -47867
$$ packed form
387A2567m2491L9456M0005l2577m0314J9384L2745q783l8078l3578J2563N1899
399A2798N908o1805j9061O1942K9955o2476n8173M1321R4277J2741r0496m5922
411g8991P3650N7036n5125n2605N0496P1452j1300p3269l6930M8267O2699j7023
423C8357n6665R063N2803k810n9524l0224M5579O6834j3679q3359j5069Q1645
435C2951K9573q0098n2947O1250Q0811j8540r2516l1472P9075O0134n9470p2500
447f3749L7397P3897j1505p1977k4564N6601N3548l8053p2330K0975P8211m789
459C3662q0058j8874P4544N8406m3536q9493L83J01451M4710q1150o4489N6311
471h133P8594j9479q3287k1609P7388N8063n9666p7973L7801P8873k4347q4092
$$ plain form
483 -47867 -56815 15693 55900 569 -69260 -42120 36638 27802 -56559 -71955 5444 56455
495 56455 13933 -56888 -52058 30500 65198 -9570 -63684 7914 92618 56013 -38908 -47064
507 -47064 38643 85484 20233 -46814 2338 78777 38128 -55668 -52008 28635 56454 -1763
519 -1763 -58962 -37688 24460 19115 -56454 -75079 1822 53717 1873 -80008 -74512 16086 60568
532 60568 -8939 -71655 -13779 59184 15071 -60914 -31571 57738 69349 -8846 -56341 -167
544 -167 69370 37399 -36434 -23563 51531 67363 4794 -47359 -21286 49397 60915 -11736
556 -11736 -48414 16161 66022 8861 -63109 -36418 45932 57457 -20611 -66198 -4862 51946
568 51946 -1927 -71447 -35549 38767 32505 -34725 -63802 -19592 32950 13298 -50302 -49468 18213
$$ packed form
483d7867q948P2508M0207n5331o9829K7140P8758q836q4361j5396P7399N1011
495E6455m2522p0821M830Q2558L4698p4768n4114P1598Q4704l6605r4921q156
507d7064Q5707M6841o5251o7047M9152P6439m0649r3796L660Q0643K7819n8217
519a763n7199K1274O2148n345p5569j8625P6901N1895n1844q1881N496R0598M4482
532F0568o9507o2716N7876P2963m4113p5985K9343Q9309J1611p8195m7495N6174
544a67O9537l1971p3833J2871P5094J5832o2569n2153K6073P0683J1518p2651
556a1736l6678O4575M9861n7161p1970K6691Q2350J1525p8068m5587O1336N6808
568E1946n3873o9520L5898P4316o262o7230k9077M4210N2542j9652o3600Q34O7681
$$ plain form
581 18213 44210 -7251 -51990 -23955 37920 42356 -22075 -45763 25074 72736 11383 -51902
593 -51902 -12548 56975 49022 -12520 -31145 17769 49554 4924 -43552 -10182 47693 32773
605 32773 -29196 -51512 -9443 42419 30717 -36471 -55252 8377 46370 -2427 -49655 -18507
617 -18507 35672 28784 -24136 -34946 19574 43793 -11295 -47029 2922 51621 22593 -29850
629 -29850 -31801 7615 32809 5400 -37850 -23770 30904 37187 -19199 -56243 -24488 30937
641 30937 33249 -20818 -40892 9086 33940 -16227 -45301 2846 42749 14090 -25305 -16739
653 -16739 19909 27392 -5647 -24127 6894 36332 19669 -13211 -18810 3606 29754 21909 -21256
666 -21256 -28059 23225 40804 -14325 -46947 -2786 42129 18110 -34745 -35111 13472 28395 -11021
$$ packed form
581A8213K5997n1461m4739K8035O1875M436o4431k3688P0837M7662o1353o3285
593e1902L9354O9523p953o1542j8625M8914L1785m4630m8476L3370N7875j4920
605C2773o1969k2316M2069N1862j1702o7188j8781O3629L7993m8797m7228L1148
617a8507N4179o888n2920j0810N4520K4219n5088l5734M9951M8699k9028n2443
629b9850j951L9416K5194k7409m3250J4080N4674O283n6386l7044L1755N5425
641C0937K312n4067k0074M9978K4854n0167k9074M8147L9903k8659l9395Q566
653a6739L6648P483l3039j8480L1021K9438j6663l2880n599K2416K6148p845m3165
666b1256o803N1284J7579n5129l2622M4161M4915k4019n2855l66M8583J4923l9416
$$ plain form
679 -11021 -26971 7042 19803 -7742 -19864 -3871 8803 12941 6684 -12663 -14159 13084 21523
692 21523 -8054 -29424 -3631 32772 19341 -33216 -39409 17418 37224 -16973 -43776 -934
704 -934 23787 -3845 -20602 -2276 9902 -2936 -17512 -9566 11869 18575 7586 -2960 -11577
717 -11577 -10756 15713 32242 1151 -20155 14514 35581 -6001 -31947 9440 45885 17109
729 17109 -26981 -17281 24506 26284 -9312 -13877 13146 9531 -13324 -4196 10286 -3413 -9634
742 -9634 3846 -4651 -25723 -11782 14902 2660 -31172 -29340 8374 14751 -26553 -37737 9550
755 9550 25764 -22230 -38120 10114 30942 -3101 -18979 1928 13411 6661 8647 15951 9944
768 9944 -1888 5306 22300 12750 -8583 8926 31652 1743 -27280 10409 44484 1481 -43938
$$ packed form
679a1021j5950L4013J2761k7545j2122J5993J2674M138o257j9347j496K7243Q439
692B1523k9577k1370K5793L6403j3431n2557o193N6827J9806n4197k6803M2842
704i34K4721k7632j6757J8326J2178j2838j4576P946K1435O706j0989j0546q617
717a1577Q21K6469J6529l1091k1306L4669K1067m1582k5946M1387L6445k8776
729A7109m4090R700M1787J778l5596m565K7023l615k2855R128J4482j3699o221
742i634J3480q497k1072J3941K6684j2242l3832J832L7714O377m1304j1184M7287
755I550J6214m7994j5890M8234K0828l4043j5878K0907J1483o750J986P304o007
768I944j1832P194J6994r550k1333J7509K2726k9909k9023L7689L4075m3003m5419
$$ plain form
781 -43938 -13605 35741 24548 -18766 -24566 2879 6264 -15741 -10515 14566 5209 -19951 -11560
794 -11560 1242 -12823 -12013 13063 8048 -22594 -18298 12334 9700 -21062 -19899 21023 30775
807 30775 -18045 -41133 9111 44958 4816 -28909 1009 25469 3290 -12375 1315 11248
819 11248 7171 4037 2999 -5722 -14187 -2278 18887 10096 -17857 -8761 17210 -3971 -33965
832 -33965 893 44454 11927 -40660 -23309 28061 28076 -12674 -20030 16366 27043 -9099 -24213
845 -24213 7857 25562 9317 236 -3410 -18375 -10232 22615 22747 -12349 -21776 2194 7291
858 7291 -16670 -18286 17177 27154 -20914 -48758 1036 42158 458 -44467 -14619 25745 11402
871 11402 -16969 -14279 1592 5315 -1058 -2789 446 2300 4966 7261 -5263 -17399 6969 37425
$$ packed form
781d3938L0333M9346j1193m3314n800K7445L385k2005N226K5081r357k5160Q391
794a1560J2802j4065Q10K5076n015l0642M296L0632k634l0762J163M0922R752
807C0775m8820k3088N0244L5847m0142l3725K9918K4460k2179j5665J3690R933
819A1248m077l134j038q721q465J1909K1165q791k7953R096K5971k1181k9994
832c3965L4858M3561l2527n2587J7351N1370J5m0750p356L6396J0677l6142j5114
845b4213L2070J7705j6245r081l646j4965Q143L2847J32l5096r427K3970N097
858G291k3961j616L5463R977m8068k7844M9794M1122m1700m4925K9848M0364j4343
871A1402k8371K690J5871L723o373j731L235J854K666K295j2524j2136K4368L0456
$$ plain form
885 37425 12098 -31003 -11713 31484 18411 -16169 -3266 29825 16956 -24779 -25704 21229
897 21229 42824 4061 -29081 -11406 11905 7049 734 1246 -3383 -761 5658 -9029 -23232
910 -23232 -1257 26763 11854 -27251 -33300 3141 25729 -2479 -29064 -4888 17942 -11121
922 -11121 -34373 -1549 30051 8656 -27247 -28257 842 23111 13137 -12105 -15429 3222 13580
935 13580 8111 -2592 -3468 11589 20544 -1161 -16095 11648 34442 7128 -23484 -5687 26797
948 26797 23482 -7654 -19997 4767 24630 2790 -22867 -8291 17156 10808 -10358 -18314 -8125
961 -8125 9901 11012 -12384 -23172 -630 14609 -2635 -18820 -8991 9470 7238 -15601 -22448
974 -22448 5860 24305 -1949 -28087 -10133 16208 12126 -7346 -13541 94 16086 8166 -15043
$$ packed form
885C7425k5327m3101J9290M3197j3073l4580J2903L3091j2869m1735r25M6933
897B1229K1595l8763l3142J7675K3311m856o315N12m629K622O419j4687j4203
910b3232K1975K8020j4909l9105o049L6441K2588k8208k6585K4176K2830k9063
922a1121k3252L2824L1600k1395l5903j010K9099K2269r974k5242l324J8651J0358
935A3580n469j0703q76J5057Q955k1705j4934K7743K2794k7314l0612J7797L2484
948B6797l315l1136j2343K4764J9863k1840k5657J4576K5447o348k1166p956J0189
961h125J8026J111k3396j0788K2542J5239j7244j6185R829J8461k232k2839o847
974b2448K8308J8445k6254k6138J7954K6341m082j9472o195J3635J5992p920k3209
$$ plain form
987 -15043 -10557 17299 22293 -1578 -17431 -4811 19231 21747 -4712 -17480 5519 19392 -1522
1000 -1522 -13733 4812 16759 2774 -14685 -12038 7690 19278 671 -21798 -11076 14255
1012 14255 15842 -4220 -19060 -9442 15782 19092 -9940 -21553 5720 20118 -1457 -14893
1024 -14893 -588 11759 3207 -11930 -9431 9981 12428 -10734 -20471 -686 12908 3123 -10247
1037 -10247 -14921 -6852 11112 9881 -15163 -20461 6256 19022 -1933 -20158 -7351 17311 16078
1050 16078 -10921 -18117 10615 23339 -1057 -13046 5218 14589 5387 -373 1329 5755 8980
1063 8980 4120 -3588 1277 11615 9392 -2733 -10327 -2297 17670 15220 -17280 -26009 9261 25357
1077 25357 -4504 -27332 -10238 11596 6708 -12450 -17054 -2160 5825 -6230 -12060 -1432 563
$$ packed form
987a5043M486K7856M994k3871j5853J2620K4042K516k6459j2768K2999J3873k0914
1000a522j2211J8545J1947j3985j7459K647J9728J1588j8607k2469J0722K5331
1012A4255J587k0062j4840R618K5224L310k9032j1613K7273J4398k1575j3436
1024a4893J4305J2347q552j5137K499J9412K447k3162r737J9785J3594r785j3370
1037a0247m674Q069J7964j231k5044n298K6717J2766k0955j8225J2807K4662j233
1050A6078k6999p196K8732J2724k4396j1989J8264R371r202n760J702M426L225
1063H980m860p708M865J0338k223j2125p594Q030J9967k450l2500q729L5270J6096
1077B5357k9861k2828J7094K1834m888j9158m604J4894P985j2055n830J0628J995
$$ plain form
1090 563 -6445 -5601 -3542 -2952 6056 6081 -12060 -15845 9378 22283 2021 -19445 -9419 17604
1104 17604 21588 -4136 -15606 7569 20649 283 -9656 8215 16569 4534 -4432 -2839 5687
1117 5687 13691 7633 -6708 -7769 4953 11443 4293 -9417 -11612 5765 13759 -8503 -21206
1130 -21206 2166 16258 -6176 -23624 -7201 12644 7980 -13882 -20413 -875 14403 918
1142 918 -14794 -7658 4147 4241 647 -5806 -6805 5787 10720 -5728 -12524 5716 16375 1354
1156 1354 -14065 -5664 15034 17396 -7320 -19194 5987 25418 4409 -17337 -5960 13079
1168 13079 13287 -81 -10623 -4379 11235 9716 -6168 -7121 5622 6916 -4481 -10875 -2125 15846
1182 15846 13761 -15521 -27055 3377 27187 7900 -18372 -15028 6605 15087 415 -14129
$$ packed form
1090E63p008Q44K059N90R008K5j8141l785K5223J2905k0262k1466J0026K7023
1104A7604L984k5724j1470K3175J3080k0366r939J7871Q354j2035q966J593Q526
1117E687Q004o058j4341j061J2722O490p150j3710k195J7377P994k2262j2703
1130b1206K3372J4092k2434j7448J6423J9845m664k1862o531J9538J5278j3485
1142I18j5712P136J1805R4l594o453r99J2592M933j6448o796J8240J0659j5021
1156A354j5419Q401K0698K362k4716j1874K5181J9431k1009k1746J1377J9039
1168A3079K08j3368j0542O244J5614j519j5884r53J2743J294j1397o394Q750J7971
1182A5846k085k9282j1534L0432K3810j9287k6272L344K1633Q482j4672j4544
$$ plain form
1194 -14129 -2971 14524 4636 -14358 -6885 10742 9082 -6297 -14957 -4873 12944 9461 -15474
1207 -15474 -19853 5293 14966 -4137 -19025 -8758 10489 11765 -11091 -22642 2802 25119
1219 25119 5179 -21580 -12979 13803 21718 3340 -14315 -3768 19263 14547 -8690 -6967 15888
1232 15888 17944 -655 -9768 1510 17665 13676 -9447 -14157 10120 20462 -3434 -19844 -4770
1245 -4770 16332 11691 -16132 -30319 -4143 25794 9300 -27896 -27592 988 11242 -3359 -16678
1258 -16678 -9102 7262 1206 -18923 -12988 13955 15048 -10670 -18512 1372 21395 15344 -10239
1271 -10239 -18818 8538 29976 10285 -15250 -5658 18417 19181 -2064 -14319 3877 26413 11204
1284 11204 -19919 -12664 18760 20027 -6165 -17678 -2572 14079 6541 -15052 -14950 9497 14064
$$ packed form
1194a4129J1158J7495r888j8994P473J7627j660j5379q660J0084J7817l483k4935
1207a5474m379K5146R673j9103j4888J0267J9247J276k2856j1551K5444K2317
1219B5119j9940k6759Q601K6782P915j8378j7655J0547K3031m716k3237J723K2855
1232A5888K056j8599r113J1278J6155l989k3123m710K4277J0342k3896j6410J5074
1245d770K1102m641k7823j4187K6176K9937j6494l7196L04K8580J0254j4601j3319
1258a6678P576J6364o056k0129N935K6943J093k5718p842J9884K0023o051k5583
1271a0239q579K7356K1438j9691k5535R592K4075P64k1245j2255J8196K2536j5209
1284A1204l1123P255L1424J267k6192j1513J5106J6651p538k1593J02K4447M567
$$ plain form
1297 14064 -10829 -22097 -4414 13315 7045 -14664 -22756 540 21941 2195 -26376 -13680
1309 -13680 17101 15076 -11717 -19490 4300 24616 7500 -22431 -15744 16704 20412 -2652 -10094
$$ packed form
1297A4064k4893j1268J7683J7729o270k1709q092K3296K1401j9746k8571J2696
1309a3680L0781k025k6793p773K3790K0316j7116k9931O687L2448L708k3064p442
$$ [...]
8191c4
##END NTUPLES=NMR FID
##END=
