##TITLE=1H_CA-8612
 CDCl3, 8 sc, 
 25.6.2019
##JCAMPDX= 6.0         $$ Bruker NMR JCAMP-DX V2.0
##DATA TYPE= NMR FID
##DATA CLASS= NTUPLES
##ORIGIN= UXNMR, Bruker Analytische Messtechnik GmbH
##OWNER= root
$$ XWIN-NMR		Version 3.5
$$ Tue Jun 25 14:42:26 2019 Russian Standard Time (UT+4h)  she@DPX200
##.OBSERVE FREQUENCY= 200.13155
##.OBSERVE NUCLEUS= ^1H
##.DELAY= (6, 6)
##.ACQUISITION MODE= SIMULTANEOUS
##.ACQUISITION SCHEME= undefined
##.AVERAGES= 8
##.DIGITISER RES= 18
##SPECTROMETER/DATA SYSTEM= spect
##.PULSE SEQUENCE= zg30
##.SOLVENT NAME= D2O
##.SHIFT REFERENCE= (INTERNAL, D2O, 0, 15.7039)
##AUDIT TRAIL= $$ (NUMBER, WHEN, WHO, WHERE, WHAT)
$$ ##TITLE= Audit trail, XWIN-NMR		Version 3.5
$$ ##JCAMPDX= 5.01
$$ ##ORIGIN= Bruker BioSpin GmbH
$$ ##OWNER= she
$$ F:/spectra/data/she/nmr/H-F/1/audita.txt
$$ ##AUDIT TRAIL=  $$ (NUMBER, WHEN, WHO, WHERE, WHAT)
(   1,<2019-06-25 14:41:17.06 +0400>,<she>,<DPX200>,
      <created by zg, POWCHK disabled, PULCHK disabled
       configuration hash MD5:
       00 E9 B6 7A A2 85 ED C7 34 08 36 98 17 FE 4E 26
       data hash MD5: 16K
       84 50 EF 66 BA B3 76 5F BD B8 90 FB 35 E1 89 B9>)
$$ ##END=
$$ 
$$ hash MD5
$$ C5 D8 58 13 F9 F9 34 DB F8 A8 B0 68 A8 A9 A7 67
##$RELAX= 
##$RELAX= 
##$RELAX= 
##$RELAX= 
##$RELAX= 
##$RELAX= 
$$ Bruker specific parameters
$$ --------------------------
##$DU= <F:/spectra>
##$EXPNO= 1
##$NAME= <H-F>
##$PROCNO= 1
##$TYPE= <nmr>
##$USER= <she>
##$AMP= (0..31)
100 100 100 100 100 100 100 100 100 100 100 100 100 100 100 100 100 100 
100 100 100 100 100 100 100 100 100 100 100 100 100 100 
##$AQSEQ= 0
##$AQ_mod= 1
##$AUNM= <au_zg>
##$AUTOPOS= <>
##$BF1= 200.13
##$BF2= 200.13
##$BF3= 200.13
##$BF4= 200.13
##$BF5= 200.13
##$BF6= 200.13
##$BF7= 200.13
##$BF8= 200.13
##$BYTORDA= 1
##$CFDGTYP= 0
##$CFRGTYP= 5
##$CHEMSTR= <none>
##$CNST= (0..31)
1 1 145 1 1 1 1 1 1 1 1 1 1 1 1 1 1 1 1 1 1 1 1 1 1 1 1 1 1 1 1 1 
##$CPDPRG= <>
##$CPDPRG1= <>
##$CPDPRG2= <>
##$CPDPRG3= <>
##$CPDPRG4= <mlev>
##$CPDPRG5= <mlev>
##$CPDPRG6= <mlev>
##$CPDPRG7= <mlev>
##$CPDPRG8= <mlev>
##$CPDPRGB= <>
##$CPDPRGT= <>
##$D= (0..31)
0 1.2 0 0 0 0 0 0 0 0 0 0.03 0 0 0 0 0 0 0 0 0 0 0 0 0 0 0 0 0 0 0 0 
##$DATE= 1561459276
##$DBL= (0..7)
120 120 120 120 120 120 120 120 
##$DBP= (0..7)
150 150 150 150 150 150 150 150 
##$DBP07= 0
##$DBPNAM0= <>
##$DBPNAM1= <>
##$DBPNAM2= <>
##$DBPNAM3= <>
##$DBPNAM4= <>
##$DBPNAM5= <>
##$DBPNAM6= <>
##$DBPNAM7= <>
##$DBPOAL= (0..7)
0.5 0.5 0.5 0.5 0.5 0.5 0.5 0.5 
##$DBPOFFS= (0..7)
0 0 0 0 0 0 0 0 
##$DE= 6
##$DECBNUC= <off>
##$DECIM= 24
##$DECNUC= <off>
##$DECSTAT= 4
##$DIGMOD= 1
##$DIGTYP= 9
##$DL= (0..7)
0 120 120 120 120 120 120 120 
##$DP= (0..7)
150 150 150 150 150 150 150 150 
##$DP07= 0
##$DPNAME0= <>
##$DPNAME1= <>
##$DPNAME2= <>
##$DPNAME3= <>
##$DPNAME4= <>
##$DPNAME5= <>
##$DPNAME6= <>
##$DPNAME7= <>
##$DPOAL= (0..7)
0.5 0.5 0.5 0.5 0.5 0.5 0.5 0.5 
##$DPOFFS= (0..7)
0 0 0 0 0 0 0 0 
##$DQDMODE= 0
##$DR= 18
##$DS= 0
##$DSLIST= <SSSSSSSSSSSSSSS>
##$DSPFIRM= 0
$$ [...]
##$SUBNAM2= <"">
##$SUBNAM3= <"">
##$SUBNAM4= <"">
##$SUBNAM5= <"">
##$SUBNAM6= <"">
##$SUBNAM7= <"">
##$SUBNAM8= <"">
##$SUBNAM9= <"">
##$SW= 24.9336996594482
##$SWIBOX= (0..15)
0 0 2 0 0 0 0 0 0 0 0 0 0 0 0 0 
##$SW_h= 4990.01996007984
##$TD= 16384
##$TD0= 1
##$TE= 0
##$TE2= 300
##$TE3= 300
##$TEG= 300
##$TL= (0..7)
0 120 120 120 120 120 120 120 
##$TP= (0..7)
150 150 150 150 150 150 150 150 
##$TP07= 0
##$TPNAME0= <>
##$TPNAME1= <>
##$TPNAME2= <>
##$TPNAME3= <>
##$TPNAME4= <>
##$TPNAME5= <>
##$TPNAME6= <>
##$TPNAME7= <>
##$TPOAL= (0..7)
0.5 0.5 0.5 0.5 0.5 0.5 0.5 0.5 
##$TPOFFS= (0..7)
0 0 0 0 0 0 0 0 
##$TUNHIN= 0
##$TUNHOUT= 0
##$TUNXOUT= 0
##$USERA1= <user>
##$USERA2= <user>
##$USERA3= <user>
##$USERA4= <user>
##$USERA5= <user>
##$V9= 5
##$VALIST= <valist>
##$VCLIST= <CCCCCCCCCCCCCCC>
##$VD= 0
##$VDLIST= <DDDDDDDDDDDDDDD>
##$VPLIST= <PPPPPPPPPPPPPPP>
##$VTLIST= <TTTTTTTTTTTTTTT>
##$WBST= 1024
##$WBSW= 4
##$XGAIN= (0..3)
0 0 0 0 
##$XL= 0
##$YL= 0
##$YMAX_a= 636214
##$YMIN_a= -891731
##$ZGOPTNS= <>
##$ZL1= 120
##$ZL2= 120
##$ZL3= 120
##$ZL4= 120
##$ABSF1= 10
##$ABSF2= 0
##$ABSG= 5
##$ABSL= 3
##$ALPHA= 0
##$AQORDER= 0
##$ASSFAC= 0
##$ASSFACI= 0
##$ASSFACX= 0
##$ASSWID= 0
##$AUNMP= <proc_1d>
##$AZFE= 0.1
##$AZFW= 0.1
##$BCFW= 1
##$BC_mod= 2
##$BYTORDP= 1
##$COROFFS= 0
##$CY= 11.3945322036743
##$DATMOD= 1
##$DC= 2
##$DFILT= <>
##$DTYPP= 0
##$F1P= 18.9103706918063
##$F2P= -1.10871071338519
##$FCOR= 0.5
##$FTSIZE= 0
##$FT_mod= 4
##$GAMMA= 1
##$GB= 0.15
##$INTBC= 1
##$INTSCL= 1
##$ISEN= 128
##$LB= 0.24
##$LEV0= 0
##$LPBIN= 0
##$MAXI= 10000
##$MC2= 0
##$MEAN= 0
##$ME_mod= 0
##$MI= 1.114404
##$NCOEF= 0
##$NC_proc= 0
##$NLEV= 6
##$NOISF1= 3.799351
##$NOISF2= 2.8
##$NSP= 1
##$NTH_PI= 0
##$NZP= 0
##$OFFSET= 15.70392
##$PC= 1
##$PHC0= -8501.541
##$PHC1= 19.60097
##$PH_mod= 1
##$PKNL= yes
##$PPARMOD= 0
##$PSCAL= 0
##$PSIGN= 0
##$REVERSE= no
##$SF= 200.130013532006
##$SI= 16384
##$SIGF1= 3
##$SIGF2= 2
##$SINO= 400
##$SIOLD= 16384
##$SREGLST= <1H.CDCl3>
##$SSB= 0
##$STSI= 0
##$STSR= 0
##$SW_p= 3612.71676300578
##$SYMM= 0
##$S_DEV= 0
##$TDeff= 0
##$TDoff= 0
##$TI= <>
##$TILT= no
##$TM1= 0
##$TM2= 0
##$TOPLEV= 0
##$USERP1= <user>
##$USERP2= <user>
##$USERP3= <user>
##$USERP4= <user>
##$USERP5= <user>
##$WDW= 1
##$XDIM= 8192
##$YMAX_p= 0
##$YMIN_p= 0
$$ End of Bruker specific parameters
$$ ---------------------------------
##NTUPLES= NMR FID
##VAR_NAME=  TIME,          FID/REAL,        FID/IMAG
##SYMBOL=    X,             R,               I
##VAR_TYPE=  INDEPENDENT,   DEPENDENT,       DEPENDENT
##VAR_FORM=  AFFN,          ASDF,            ASDF
##VAR_DIM=   8192,          8192,            8192
##UNITS=     SECONDS,       ARBITRARY UNITS, ARBITRARY UNITS
##FACTOR=    0.0002004,     1,               1
##FIRST=     0,             0,               0
##LAST=      1.6414764,     0,               0
##MIN=       0,             -891731,         0
##MAX=       1.6414764,     636214,          0
$$ Real data points
##PAGE= N=1
##DATA TABLE= (X++(R..R)), XYDATA
$$ plain form
0 0 0 0 0 -8 8 -8 8 -18 24 -25 40 -48 57 -73 89 -103 124 -153 175 -209 247 -282 331 -382 438 -502 572
27 572 -653 738 -836 943 -1055 1186 -1328 1479 -1652 1838 -2038 2264 -2509 2780 -3077 3408
43 3408 -3774 4178 -4637 5150 -5731 6408 -7186 8100 -9204 10547 -12237 14440 -17440
56 -17440 21784 -28686 41387 -72510 306262 165031 -694891 -567895 -34791 388088 203333
67 203333 -136375 -213854 165821 438026 222923 -370649 -655332 -297294 376900 592577
77 592577 216199 -226638 -254317 -40623 79497 -42985 -217079 -168648 167500 433881
87 433881 312917 -115302 -445714 -390597 -22468 272059 257400 63679 -59283 -33225 66338
98 66338 46282 -183113 -369666 -177917 288401 561197 337965 -199182 -542355 -361414
$$ packed form
0@%%%qJ6j6J6k6M2m9O5q8J05j30J62j92K27k77L28l84M56n29O13p13Q20r40J074
27E72j225J391j574J779j998K241k514K807l131L490l876M302m773N289n857O485
43C408p182P952q815R787j0881J2139j3594J5286j7304J9751k2784K6677l1880
56a7440L9224n0470P0073j13897L78772j41231q59922J26996N33104M22879j84755
67B03333l39708p7479L79675K72205k15103n93572k84683L58038O74194K15677
77E92577l76378m42837k7679K13694J20120j22482j74094M8431L36148K66381
87D33881j20964m28219l30412N5117L68129K94527j4659j93721j22962K6058R9563
98F6338k0056k29395j86553J91749M66318K72796k23232n37147l43173J80941
$$ plain form
108 -361414 103827 335604 164338 -108888 -112818 170886 327316 5938 -491365 -517152
118 -517152 28161 551986 515668 9829 -391865 -290413 75068 179054 -71095 -268992
128 -268992 -79447 347669 503431 101815 -469600 -560499 -96664 359737 350318 5817
138 5817 -194784 -28228 201409 104769 -234876 -403048 -181073 259813 514551 299960
148 299960 -182582 -429218 -259677 41526 169787 97556 -4597 16390 121542 132704
158 132704 -29925 -253658 -329658 -109761 269239 425616 199308 -142535 -282503 -174119
168 -174119 25191 100204 -14244 -94448 71501 310557 260104 -128194 -470747 -365569
178 -365569 104577 422194 277846 -74297 -214376 -46503 159963 77441 -260607 -389386
$$ packed form
108c61414M65241K31777j71266k73226l930K83704J56430l21378m97303k5787
118e17152N45313N23825l6318n05839m01694J01452L65481J03986k50149j97897
128b68992J89545M27116J55762m01616n71415r0899M63835M56401r419l44501
138E817k00601J66556K29637r6640l39645j68172K21975M40886K54738k14591
148B99960m82542k46636J69541L01203J28261p2231j02153K0987J05152J1162
158A32704j62629k23733p6000K19897L79000J56377k26308l41843j39968J08384
168a74119J99310P5013j14448q0204J65949K39056n0453l88298l42553J05178
178c65569M70146L17617j44348l52143j40079J67873K06466q2522l38048j28779
$$ plain form
188 -389386 -15411 488517 518587 14104 -483376 -463511 -13319 316480 206532 -83946
198 -83946 -146144 68541 259573 124573 -267953 -462704 -167737 309924 455515 176621
208 176621 -182042 -276520 -100717 64633 28524 -82993 -57324 116531 265353 193885 -106670
219 -106670 -358706 -287427 24985 266318 258064 59020 -117988 -98053 36171 44424 -115097
230 -115097 -226971 -91016 234560 426588 212123 -240009 -460643 -240050 159950 329969
240 329969 132341 -149678 -134771 135671 236296 -36869 -379947 -361329 73048 483166
250 483166 401248 -76361 -395845 -256983 78290 193923 1394 -190647 -59924 269568
260 269568 344433 266 -401072 -415966 -21775 355228 320058 -14787 -200676 -69824
$$ packed form
188c89386L73975N03928L0070n04483m97480J9865M50192L29799j09948k90478
198h3946o2198K14685J91032j35000l92526j94751K94967M77661J45591k78894
208A76621l58663r4478J75803J65350l6109j11517K5669J73855J48822p1468l00555
219a06670k52036P1279L12412K41333q254j99044j77008J9935J34224Q253j59521
230a15097j11874J35955L25576J92028k14465m52132k20634K20593M00000J70019
240C29969j97628k82019J4907K70442J00625k73165l43078J8618M34377M10118
250D83166q1918m77609l19484J38862L35273J15633j92529j92041J30723L29492
260B69568P4865l44167m01338j4894L94191L77003l5170l34845j85889J30852
$$ plain form
270 -69824 114647 80052 -143051 -279697 -103778 257942 411008 173526 -211653 -375641
280 -375641 -197518 109017 225551 94107 -51831 -33789 77752 115132 -15489 -225180
290 -225180 -268193 -28413 278559 344003 111639 -198125 -295636 -110023 111543 115520 -31750
301 -31750 -79503 64378 227392 153676 -167647 -391547 -223424 169504 366924 195874
311 195874 -121527 -230637 -41740 145996 41356 -212816 -236624 70309 391788 338439
321 338439 -87097 -431608 -321703 71778 293321 166234 -83527 -135982 57333 203928
331 203928 50281 -245319 -316235 -56567 278316 354853 103688 -193220 -237459 -68719
341 -68719 65893 51236 -27147 -28275 88591 184681 95546 -123138 -259606 -184094 46814
$$ packed form
270f9824J84471l4595k23103j36646J75919L61720J53066k37482l85179j63988
280c75641J78123L06535J16534j31444j45938J8042J11541L7380j30621k09691
290b25180m3013K39780L06972O5444k32364l09764r7511J85613K21566L977j47270
301c1750m7753J43881J63014p3716l21323k23900J68123L92928J97420j71050
311A95874l17401j09110J88897J87736j04640k54172k3808L06933L21479n3349
321C38439m25536l44511J09905L93481K21543j27087k49761n2455J93315J46595
331B03928j53647k95600p0916K59668L34883P6537k51165k96908m4239J68740
341f8719J34612j4657p8383j128J16866R6090q9135k18684j36468P5512K30908
$$ plain form
352 46814 236350 208083 10165 -129934 -98818 4037 30787 -56112 -134289 -36240 192218
363 192218 284639 91932 -221867 -353852 -157992 177800 293312 90060 -140884 -122552
373 -122552 73705 156146 -26812 -276662 -243964 103619 384497 281911 -85875 -333346
383 -333346 -229216 69899 197581 42173 -120976 -41639 170984 219961 -9921 -295818
393 -295818 -298933 11714 289864 252974 3666 -167176 -108731 54765 78884 -76084 -177303
404 -177303 -48405 189314 280267 106937 -187229 -310069 -140568 121219 213652 99330
414 99330 -60576 -93388 17823 97733 2549 -166822 -193376 -10359 230827 286606 62911
425 62911 -226251 -278608 -71683 142246 151887 -6159 -101318 10421 170209 114560 -138748
$$ packed form
352D6814J89536k8267j97918j40099L1116J02855K6750q6899p8177R8049K28458
363A92218R2421j92707l13799j31985J95860L35792J15512k03252k30944J8332
373a22552J96257Q2441j82958k49850L2698L47583K80878j02586l67786k47471
383c33346J04130K99115J27682j55408j63149P9337K12623M8977k29882k85897
393b95818l115L10647K78150l6890k49308j70842N8445J63496K4119j54968j01219
404a77303J28898K37719R0953j73330k94166j22840J69501K61787R2433j14322
414I9330j59906l2812J11211P9910r5184j69371k6554J83017K41186N5779k23695
425F2911k89162n2357K06925K13929R641j58046r5159J11739J59788n5649k53308
$$ plain form
436 -138748 -299858 -163560 157647 333773 168546 -140370 -232141 -48260 130273 72727
446 72727 -129763 -181080 50901 311045 249895 -100406 -355515 -251161 85872 292027
456 292027 164504 -101158 -162568 18678 163127 65406 -170978 -256636 -47524 250864
466 250864 300262 54344 -208369 -239575 -56977 119470 109044 -24040 -68882 35060 132633
477 132633 80311 -97760 -229423 -150158 87530 237308 157101 -40513 -154939 -98764 33833
488 33833 62722 -43862 -111505 -9261 168233 215726 36903 -224638 -286658 -60320 206448
499 206448 233755 34258 -144589 -106633 76731 137817 -35023 -221491 -158648 115019 308901
510 308901 198307 -116747 -294844 -154350 102207 177941 40612 -99092 -57939 110588
$$ packed form
436a38748j61110J36298L21207J76126j65227l08916r1771J83881J78533n7546
446G2727k02490n1317K31981K60144o1150l50301k55109J04354L37033K06155
456B92027j27523k65662o1410J81246J44449r7721k36384q5658K09112K98388
466B50864M9398k45918k62713l1206J82598J76447j0426j33084m4842J03942R7573
477A32633n2322j78071j31663P9265K37688J49778q0207j97614j14426N6175J32597
488C3833K8889j06584o7643J02244J77494M7493j78823k61541o2020K26338K66768
499B06448K7307j99497j78847L7956J83364O1086j72840j86468O2843K73667J93882
510C08901j10594l15054j78097J40494K56557P5734j37329j39704M1153J68527
$$ plain form
520 110588 162618 -18151 -230278 -208443 33223 236911 197966 -22541 -169054 -100716 42667
531 42667 64803 -35487 -108849 -36994 135827 208407 53120 -181870 -243659 -81627 129969
542 129969 192984 68892 -83182 -92800 13787 76976 9489 -120004 -148723 10313 211405
553 211405 214366 1781 -203923 -207870 -26447 147746 135078 -16686 -92471 -1489 115858
564 115858 84863 -94039 -220448 -108209 146824 254346 102958 -121441 -184878 -51570
574 -51570 100753 78849 -73455 -118088 35596 200369 155829 -82911 -268403 -181787 88795
585 88795 238620 127484 -77287 -146732 -32490 104862 73404 -100687 -180187 -37443 176622
596 176622 225975 48776 -178944 -219992 -47841 124510 125847 7353 -73755 -30157 77756
$$ packed form
520A10588N2030j80769k12127K1835K41666K03688l8945k20507j46513O8338J43383
531D2667K2136j00290p3362P1855J72821P2580j55287k34990o1789J62032K11596
542A29969O3015j24092j52074r618J06587O3189o7487j29493k8719J59036K01092
553B11405K961k12585k05704l947J81423J74193j2668j51764p5785R0982J17347
564A15858l0995j78902j26409J12239K55033J07522j51388k24399o3437J33308
574e1570J52323k1904j52304m4633J53684J64773m4540k38740j85492Q6616K70582
585H8795J49825j11136k04771o9445J14242J37352l1458j74091p9500J42744K14065
596A76622M9353j77199k27720m1048J72151J72351J337j18494q1108M3598J07913
$$ plain form
607 77756 91559 -42074 -173838 -130025 60635 205653 152263 -44339 -166427 -95630 45674
618 45674 82676 841 -80477 -38320 111369 179658 29575 -196442 -229758 -21455 204011
629 204011 207842 1746 -165059 -109574 65962 127095 124 -162862 -142609 85990 263079
640 263079 147785 -138492 -264692 -114807 118502 184523 42036 -113356 -87735 68191
650 68191 136554 13193 -170948 -187165 18934 218090 174234 -38521 -162932 -100188 35236
661 35236 86563 7887 -88994 -51995 95462 168574 51413 -150804 -215370 -53985 156364
672 156364 183467 32129 -105402 -101983 9948 98039 42829 -102392 -136172 18960 189033
683 189033 167887 -36316 -208411 -161748 41606 168604 101156 -51818 -112921 -17379 113314
$$ packed form
607G7756J3803j33633j31764M3813J90660J45018n3390j96602j22088P0797J41304
618D5674L7002q1835q1318M2157J49689O8289j50083k26017l3316K08303K25466
629B04011L831k06096j66805N5485J75536O1133j26971j62986K0253K28599J77089
640B63079j15294k86277j26200J49885K33309O6021j42487j55392K5621J55926
650F8191O8363j23361j84141j6217K06099J99156m3856k12755j24411O2744J35424
661C5236N1327p8676r6881L6999J47457P3112j17161k02217o4566J61385K10349
672A56364K7103j51338j37531L419J11931Q8091n5210j45221l3780J55132J70073
683A89033k1146k04203j72095M6663K03354J26998o7448j52974o1103R5542J30693
$$ plain form
694 113314 89209 -89164 -190276 -67329 143605 205044 54845 -138910 -164583 -13987
704 -13987 108490 62078 -65465 -96459 25062 160351 117526 -93917 -227922 -119241 108137
715 108137 206455 88863 -99258 -141952 -10678 106736 62587 -76495 -135746 -28377 146954
726 146954 183622 12826 -173840 -166775 2066 137019 113157 -16766 -95080 -37463 68667
737 68667 83905 -17249 -126229 -105155 54421 173724 102172 -68033 -138157 -63628 46976
748 46976 78754 9235 -66691 -36248 75447 119154 11286 -150127 -171001 2329 178023
759 178023 150377 -26290 -138158 -87367 42704 103493 16083 -118160 -107755 64410 190928
770 190928 102490 -114113 -212260 -80473 120461 161907 30002 -100439 -95778 26061 120705
$$ packed form
694A13314k4105j78373j01112J22947K10934O1439j50199j93755k5673J50596
704a3987J22477m6412j27543l0994J21521J35289m2825k11443j34005J08681K27378
715A08137R8318j17592j88121m2694J31274J17414m4149j39082n9251J07369J75331
726A46954L6668j70796j86666P065J68841J34953k3862j29923p8314N7617J06130
737F8667J5238j01154j08980K1074J59576J19303p1552j70205p0124P4529J10604
748D6976L1778o9519p5926L0443J11695M3707j07868j61413k0874J73330J75694
759A78023k7646j76667j11868N0791J30071O0789q7410j34243J0405J72165J26518
770A90928q8438k16603r8147J31787K00934M1446j31905j30441M661J21839R4644
$$ plain form
781 120705 52674 -112222 -151638 2690 161367 140621 -22309 -141031 -97567 37212 99119
792 99119 33119 -62499 -67275 36680 126821 61757 -108819 -169982 -38151 129437 153599
803 153599 27829 -108935 -114280 7062 100804 51874 -72991 -114691 -2966 146217 138239
814 138239 -42517 -185656 -126922 53040 159252 92890 -64602 -129902 -27652 103032
824 103032 91174 -50240 -147894 -72896 105124 173707 42250 -127110 -137685 -4734 108206
835 108206 79964 -45762 -103962 -8364 119770 104601 -50131 -167441 -101456 89015 183798
846 183798 69169 -106450 -136086 -11219 108041 87688 -49398 -133728 -42681 123708 157457
857 157457 7061 -161249 -155838 20238 162513 111547 -49785 -125742 -50652 74667 106264
$$ packed form
781A20705o8031j64896l9416J54328J58677k0746j62930j18722M3464J34779O1907
792I9119o6000r5618m776J03955R0141o5064j70576o1163J31831J67588K4162
803A53599j25770j36764n345J21342R3742m8930j24865m1700J11725J49183p978
814A38239j80756j43139N8734J79962J06212o6362j57492o5300J02250J30684
824A03032j1858j41414r7654P4998J78020O8583j31457j69360j0575J32951J12940
835A08206k8242j25726n8200R5598J28134j5169j54732j17310O5985J90471R4783
846A83798j14629j75619k9636J24867J19260k0353j37086q4330R1047J66389L3749
857A57457j50396j68310N411J76076J42275n0966j61332p5957P5090J25319L1597
$$ plain form
868 106264 -4810 -130949 -100998 61602 156993 73566 -86169 -141362 -39643 87304 89469
879 89469 -15545 -87618 -43776 67470 112504 10246 -133842 -127972 33220 152614 98308
890 98308 -53177 -130551 -54623 78124 104260 -4208 -110725 -82317 60821 155335 68949
901 68949 -111479 -164636 -29602 124725 133176 5767 -113808 -93539 40571 118210 41660
912 41660 -90753 -116395 1617 129272 109978 -37604 -132517 -72439 51707 100487 31242
923 31242 -71648 -79701 26116 106389 47437 -82061 -125653 -27939 106441 121702 -2651
934 -2651 -113817 -85490 33002 101818 44816 -76058 -110039 1709 124818 102130 -42114
945 -42114 -143013 -89130 64561 143414 55910 -84871 -113408 -11158 97544 89356 -32313
$$ packed form
868A06264j11074j26139K9951J62600R5391q3427j59735n5193J01719J26947K165
879H9469j05014p2073M3842J11246M5034j02258j44088N870J61192J19394n4306
890I8308j51485p7374P5928J32747K6136j08468j06517K8408J43138R4514q6386
901F8949j80428n3157J35034J54327Q451j27409j19575K0269J34110P7639p6550
912D1660j32413k5642J18012J27655j9294j47582r4913O0078J24146M8780o9245
923C1242j02890q053J05817Q0273n8952j29498m3592R7714J34380J5261j24353
934b651j11166K8327J18492O8816n7002j20874l3981J11748J23109k2688j44244
945d2114j00899N3883J53691P8853q7504j40781k8537J02250J08702q188j21669
$$ plain form
956 -32313 -120638 -56748 82654 125331 25489 -98272 -109092 5092 106838 73789 -41983
967 -41983 -92067 -24677 75416 87294 -16675 -115283 -75125 61139 125878 46982 -81105
978 -81105 -113974 -13706 99931 84167 -39040 -114473 -52382 79147 128113 23016 -122163
989 -122163 -127433 13993 130659 95857 -42230 -128991 -63722 77514 120272 13143 -109071
1000 -109071 -101715 26715 129174 78622 -67292 -127141 -34694 88948 103019 -157 -100785
1011 -100785 -75196 49805 113258 31898 -89296 -102399 9757 118178 88289 -50483 -125159
1022 -125159 -46636 82935 111743 8557 -109514 -96467 42504 135125 62750 -85094 -135483
1033 -135483 -31689 111103 124684 -10987 -129804 -90540 50013 126119 53284 -86540
$$ packed form
956c2313q8325O3890J39402M2677r9842j23761j0820J14184J01746l3049j15772
967d1983n0084O7390J00093J1878j03969r8608M0158J36264O4739p8896j28087
978h1105l2869J00268J13637j5764j23207p5433O2091J31529M8966j05097j45179
989a22163n270J41426J16666l4802j38087q6761O5269J41236M2758j07129j22214
1000a09071P356J28430J02459n0552j45914n9849R2447J23642J4071j03176j00628
1011a00785K5589J25001O3453q1360j21194j3103J12156J08421k9889j38772p4676
1022a25159P8523J29571K8808j03186j18071J3047J38971R2621p2375j47844n0389
1033a35483J03794J42792J3581j35671j18817L9264J40553P6106p2835j39824
$$ plain form
1043 -86540 -126009 -11383 113924 97781 -30809 -118831 -68559 61842 115548 24087 -94818
1054 -94818 -93273 19059 105718 66045 -56075 -112148 -26406 93155 95216 -16398 -108344
1065 -108344 -72759 54502 123247 41556 -90733 -110677 734 111205 94495 -35889 -126781
1076 -126781 -62419 79649 124576 25623 -100414 -111877 8320 121639 88117 -48487 -120835
1087 -120835 -51346 72461 110726 15846 -98852 -89413 28191 104207 53161 -59790 -104447
1098 -104447 -24864 85770 88852 -17241 -96539 -58113 46166 93623 22472 -84213 -87074
1109 -87074 21673 105561 65611 -51185 -114260 -45665 79346 107894 6456 -95432 -80589
1120 -80589 30523 110087 59598 -69022 -117358 -25331 95043 108259 4259 -102138 -89019
$$ packed form
1043h6540l9469J14626J25307j6143j28590q8022N0272J30401N3706r1461j18905
1054i4818J545J12332Q6659l9673j22120n6073Q5742J19561K061j11614r1946
1065a08344L5585J27261O8745q1691j32289j9944J11411J10471j6710j30384r0892
1076a26781O4362J42068M4927r8953j26037j1463J20197J13319l3522j36604p2348
1087a20835O9489J23807L8265r4880j14698R439J17604P6016n1046j12951m4657
1098a04447P9583J10634L082j06093p9298L8426J04279M7457p1151j06685k861
1109h7074J08747Q3888l9950j16796o3075O8595J25011K8548j01438j01888J4843
1120h0589J11112P9564n0489j28620m8336R2027J20374J3216j04000j06397J3119
$$ plain form
1131 -89019 29291 105529 50522 -57137 -89945 -14730 82463 82774 -21420 -101178 -59062 48777
1143 48777 96887 35819 -65534 -86456 1404 81612 51806 -43713 -86584 -25031 76309
1154 76309 93981 -5993 -105941 -83703 30083 105148 59719 -55559 -102409 -19277 88349
1165 88349 82441 -26537 -110159 -70786 57388 128274 52402 -81151 -115214 -21815 86007
1176 86007 89121 -13755 -95188 -49943 62351 97126 14836 -87800 -93611 10184 105932
1187 105932 76755 -36955 -93473 -35875 58524 76642 -7292 -87986 -54281 57593 105797
1198 105797 30954 -83680 -111056 -13907 101035 94582 -22128 -101912 -54481 56915 98418
1209 98418 12195 -102859 -98858 26716 125719 87497 -45360 -131493 -72143 64527 111616
$$ packed form
1131h9019J18310P6238n5007j07659l2808P5215R7193L11j04194p9758M2116J07839
1143D8777M8110o1068j01353k0922Q7860Q0208k9806r5519m2871O1553J01340
1154G6309J7672r9974r9948K2238J13786P5065m5429j15278m6850Q3132J07626
1165H8349n908j08978q3622L9373J28174P0886p5872j33553l4063R3399J07822
1176H6007L114j02876q1433M5245J12294L4775q2290j02636n811J03795R5748
1187A05932k9177j13710n6518N7598R4399J8118q3934q0694L3705J11874M8204
1198A05797p4843j14634k7376R7149J14942o453j16710p9784M7431J11396M1503
1209I8418q6223j15054M001J25574R9003l8222j32857q6133N9350J36670M7089
$$ plain form
1220 111616 21095 -83187 -74620 27756 99903 48239 -72828 -114035 -22843 91991 103781
1231 103781 5457 -91796 -74255 33590 86200 17945 -72368 -67389 27839 104710 65504 -56977
1243 -56977 -120654 -46967 74489 107530 21041 -83252 -78009 31039 97697 33440 -77756
1254 -77756 -101721 -8399 106470 112980 -9045 -122191 -97037 27686 105694 56593 -53650
1265 -53650 -86577 -2221 85300 60771 -43471 -107298 -57062 61982 117864 40209 -76234
1276 -76234 -90798 -2428 70007 42603 -45050 -76144 746 92376 80450 -26433 -111776 -81374
1288 -81374 37515 113133 55967 -57315 -82134 100 76461 53219 -47740 -103483 -33604
1299 -33604 87323 118331 25487 -90734 -111140 -14173 89243 79021 -19934 -73539 -24854
$$ packed form
1220A11616r0521j04282Q567J02376P2147n1664j21067m1207R1192J14834J1790
1231A03781r8324r7253J7541J07845N2610o8255r0313M979R5228P6871l9206j22481
1243e6977o3677P3687J21456L3041q6489j04293N243J09048O6658o4257j11196
1254g7756k3965R3322J14869O510j22025j13146K5154J24723P8008m9101j10243
1265e3650l2927Q4356Q7521k4529j04242o3827N0236J19044N5882p7655j16443
1276g6234j4564Q8370P2435k7404q7653l1094P6890R1630j1926j06883q5343L0402
1288h1374J18889P5618n7166j13282k4819Q2234P6361k3242j00959n5743O9879
1299c3604J20927L1008r2844j16221k0406R6967J03416j0222r8955n3605M8685
$$ plain form
1310 -24854 54754 67106 -9599 -89390 -71112 29307 98203 65763 -28794 -86808 -45654 40063
1322 40063 55770 -10735 -57545 -21459 53624 78678 12674 -83359 -99023 -10432 84327 85957
1334 85957 -1132 -76326 -48796 42658 67232 -12095 -87172 -60905 42679 117681 75776 -53225
1346 -53225 -129699 -66627 59879 106291 30218 -67352 -62989 32249 82445 20883 -73030 -90401
1358 -90401 -10436 91013 104311 3860 -93622 -74361 21664 68334 18728 -51719 -44758 35532
1370 35532 83936 34702 -59813 -101995 -46689 60216 104130 30830 -64296 -63078 13720 55470
1382 55470 12161 -61149 -71594 10004 99224 93577 -10852 -112434 -105610 8933 104905 71690
1394 71690 -32264 -70654 -11956 57983 52169 -31215 -97812 -55036 62810 122109 53607 -67280
$$ packed form
1310b4854P9608J2352p6705p9791J8278J00419O8896l2440r4557n8014M1154Q5717
1322D0063J5707o6505m6810L6086P5083K5054o6004r6033j5664Q8591R4759J630
1334H5957q7089p5194K7530R1454K4574p9327p5077K6267J03584P5002m1905j29001
1346e3225p6474O3072J26506M6412p6073r7570M363R5238N0196o1562r3913j7371
1358i0401P9965J01449J3298j00451r7482J9261R6025M6670m9606p0447O961Q0290
1370C5532M8404m9234r4515m2182N5306J06905M3914p3300r5126J218P6798M1750
1382E5470m3309p3310j0445Q1598Q9220n647j04429j01582O824J14543R5972l3215
1394G1690j03954l8390N8698O9939n814q3384o6597M2776J17846N9299o8502j20887
$$ plain form
1406 -67280 -109341 -27746 70772 62002 -26690 -64473 -3839 76683 76162 -21715 -115394 -87164
1418 -87164 40029 120707 68595 -46726 -90627 -17592 68895 45827 -54952 -92631 -12252
1429 -12252 97236 115828 11567 -114071 -123701 -7810 97798 84541 -12853 -72027 -26729
1440 -26729 54152 53386 -32135 -90804 -53244 43295 106188 67735 -39532 -99644 -49896 36864
1452 36864 57605 3623 -44383 -17412 52085 66685 -2404 -79999 -85890 -8191 86107 96224
1464 96224 3558 -77709 -50151 32055 52557 -11575 -72596 -43344 58481 116550 54022 -71221
1476 -71221 -133353 -63820 70244 119202 30154 -71390 -55812 32103 64405 1227 -81701
1487 -81701 -82826 16017 111572 94445 -17493 -104714 -78309 22392 70176 15335 -47953 -23852
$$ packed form
1406f7280m2061Q1595R8518q770q8692l7783O0634Q0522n21r7877r3679K8230
1418h7164J27193Q0678n2112j15321m3901P3035Q6487k3068j00779l7679Q0379
1429a2252J09488J8592j04261j25638r630J15891J05608j3257r7394n9174M5298
1440b6729Q0881p66q5521n8669L7560R6539O2893l8453j07267o0112M9748Q6760
1452C6864K0741n3982m8006K6971O9497J4600o9089p7595n891P7699R4298J0117
1464I6224r2666q1267K7558Q2206K0502o4132o1021K9252J01825N8069o2528j25243
1476g1221o2132O9533J34064M8958q9048j01544J5578Q7915L2302o3178q2928
1487h1701j125R8843R5555j7127j11938q7221K6405J00701M7784n4841o3288K4101
$$ plain form
1499 -23852 46767 66484 8996 -71927 -93913 -22372 73934 90589 18315 -53587 -50794 9203
1511 9203 38310 -4657 -55613 -35472 38043 88326 62937 -29476 -108234 -83729 22700 94805
1523 94805 64561 -17138 -55600 -16461 39297 28522 -38693 -73362 -25249 66562 109103 42979
1535 42979 -73853 -111180 -32101 58451 62521 -2767 -44334 -6327 58382 50497 -37568 -103033
1547 -103033 -65620 41675 111639 67056 -41764 -85072 -22616 45498 28030 -41644 -64766
1558 -64766 3896 94028 92677 -10756 -109339 -103585 -3632 90581 84836 -4962 -60758 -23126
1570 -23126 36574 31570 -28700 -70718 -37110 50674 102250 57336 -40726 -98163 -62728 25908
1582 25908 69695 28575 -25835 -18062 27573 41419 -2256 -67375 -80018 -4593 90059 97929
$$ packed form
1499b3852P0619J9717n7488q0923k1986P1541R6306J6655p2274p1902K793N9997
1511I203K9107m2967n0956K0141P3515N0283k5389r2413p8758K4505J06429P2105
1523I4805l0244q1699l8462L9139N5758j0775o7215l4669M8113R1811M2541o6124
1535D2979j16832l7327P9079R0552M070o5288m1567L8007O4709p885q8065o5465
1547a03033L7413J07295O9964m4583j08820m3308O2456O8114j7468o9674k3122
1558f4766O8662R0132j351j03433r8583N754R9953R4213n745q9798n5796L7632
1570b3126N9700n004o0270m2018L3608Q7784N1576m4914r8062n7437L5435Q8636
1582B5908M3787m1120n4410P773M5635J3846m3675o5119j2643P5425R4652P870
$$ plain form
1594 97929 9953 -76538 -71801 6216 51520 6755 -54009 -33452 51515 99609 44523 -75988
1606 -75988 -137450 -58788 79236 121087 33252 -66149 -64824 18011 62669 2704 -82720 -74492
1618 -74492 28609 116676 92587 -27425 -118939 -82302 28284 77565 28865 -31392 -24615
1629 -24615 32220 56981 1707 -76718 -82406 -3419 82133 92273 18784 -60848 -62027 -1468
1641 -1468 31279 4786 -31453 -21881 34850 80313 46706 -48448 -108934 -70865 30408 100134
1653 100134 70763 -21183 -65977 -23870 32597 24671 -36134 -71543 -19150 81268 112403 24672
1665 24672 -92099 -116543 -29876 70278 77027 -1357 -49881 -6691 54196 38097 -45576 -101425
1677 -101425 -51383 65125 119864 50453 -57368 -85129 -21735 43602 30198 -35562 -48263
$$ packed form
1594I7929q7976q6491M737P8017M5304m4765o0764K0557Q4967M8094n5086j20511
1606g5988o1462P8662J38024M1851q7835r9401J325Q2835M4658n9965q5424Q228
1618g4492J03101Q8067k4089j20012r1514L6637J10586M9281m8700o0257O777
1629b4615N6835K4761n5274p8425n688P8987Q5552J0140p3489p9632j179O0559
1641a468L2747k6493l6239R572N6731M5463l3607r5154o0486L8069J01273O9726
1653A00134k9371r1946m4794M2107N6467p926o0805l5409N2393J00418L1135q7731
1665B4672j16771k4444Q6667J00154O749p8384m8524M3190O0887j6099q3673n5849
1677a01425N0042J16508N4739o9411j07821k7761O3394O5337j3404o5760j2701
$$ plain form
1688 -48263 25528 92787 63822 -38346 -112882 -80855 27430 98394 65451 -15226 -49185
1699 -49185 -17736 23279 15341 -36520 -57286 -7506 65548 85780 32767 -52368 -95174 -52298
1711 -52298 26872 61401 34611 -6895 -16969 7229 22013 -12161 -62231 -58722 10312 82766
1723 82766 85633 6639 -76439 -75096 -2705 43455 18885 -26405 -22087 39896 79887 24668
1735 24668 -82272 -117258 -33431 82660 113030 30759 -65219 -65117 11884 49518 32 -65233
1747 -65233 -52992 39953 113198 71901 -47084 -114841 -69027 27815 75186 39975 -18333 -21964
1759 -21964 20660 32552 -14125 -66362 -61390 7592 79962 80604 9860 -55473 -60380 -20776 16811
1772 16811 17603 -6382 -6891 28761 52202 22380 -44484 -89689 -60204 31935 96782 68512 -15465
$$ packed form
1688d8263P3791O7259k8965j02168p4536L2027J08285P0964l2943q0677l3959
1699d9185L1449M1015p938n1861k0766M9780P3054K0232n3013q5135m2806M2876
1711e2298P9170L4529k6790m1506j0074K4198J4784l4174n0070L509O9034P2454
1723H2766K867p8994q3078J343P2391M6160k4570m5290M318O1983L9991n5219
1735B4668j06940l4986Q3827J16091L0370q2271r5978J02P7001L7634m9486o5265
1747f5233J2241R2945P3245m1297j18985o7757M5814R6842M7371l5211n8308l631
1759b1964M2624J1892m6677n2237M972O8982P2370O42p0744o5333m907L9604L7587
1772A6811P92k3985n09L5652K3441k9822o6864m5205K9485R2139O4847k8270q3977
$$ plain form
1785 -15465 -66898 -42314 18366 34307 -16586 -57399 -14194 72762 99338 20551 -93269 -121099
1797 -121099 -27222 83674 91494 9790 -52248 -28488 35801 41602 -34806 -93915 -42996 69967
1809 69967 119523 51889 -60738 -100228 -33211 44880 39972 -18242 -34907 18564 75423 52800
1821 52800 -45448 -113559 -69657 38928 98878 63769 -17540 -58903 -27244 19188 13553 -29639
1833 -29639 -44001 -2027 62504 80263 20140 -66728 -94509 -41374 36965 72451 40811 -15550
1845 -15550 -30465 163 17738 -9409 -50177 -48144 17347 89462 81337 -8757 -86535 -75472
1857 -75472 563 55290 34151 -20838 -22585 36859 66797 8118 -84496 -105710 -16580 97338
1869 97338 111813 15115 -74488 -64208 9824 45931 230 -61281 -41022 53612 106978 48614
$$ packed form
1785a5465n1433K4584O0680J5941n0893m0813M3205Q6956K6576p8787j13820k7830
1797a21099R3877J10896P820q1704o2038K3760O4289N801p6408n9109N0919J12963
1809F9967M9556o7634j12627l9490O7017P8091m908n8214j6665N3471N6859k2623
1821E2800r8248o8111M3902J08585N9950l5109q1309m1363L1659M6432n635m3192
1833b9639j4362M1974O4531J7759o0123q6868k7781N3135P8339L5486l1640n6361
1845a5550j4915L0628J7575k7147m0768K033O5491P2115q125r0094p7778J1063
1857g5472P6035N4727k1139n4989j747N9444K9938n8679r2614k1214Q9130J13918
1869I7338J4475r6698q9603J0280P4032L6107m5701o1511K0259R4634N3366n8364
$$ plain form
1881 48614 -63567 -115463 -57905 44117 81639 31633 -23706 -21727 12600 20595 -18458 -61108
1893 -61108 -45368 25697 79062 61841 -3006 -57778 -59915 -15899 21559 21305 5914 7081 22835
1906 22835 29707 3511 -47730 -72904 -32276 44783 87305 57027 -20279 -68982 -41642 16143
1918 16143 28185 -9627 -33500 346 65005 78114 -282 -96794 -103073 -9433 85750 88001
1930 88001 7591 -55321 -31296 27390 26414 -35590 -71728 -23939 67198 103599 34719 -68030
1942 -68030 -93287 -28652 39155 40930 -3741 -21830 17007 54012 22962 -51906 -87559 -43938
1954 -43938 41929 90422 54933 -21864 -57325 -30869 6763 11660 -10697 -20625 8732 51668
1966 51668 55619 6134 -58657 -83446 -37843 44311 82395 44463 -17995 -41385 -17779 11972
$$ packed form
1881D8614j12181n1896N7558J02022L7522n0006n5339J979L4327P995l9053m2650
1893f1108J5740P1065N3365j7221o4847n4772k137M4016L7458k54j5391J167J5754
1906B2835O872k6196n1241k5174M0628P7059M2522l0278p7306m8703K7340N7785
1918A6143J2042l7812k3873L3846O4659J3109p8396r6512o279R3640R5183K251
1930H8001q0410o2912K4025N8686r76o2004l6138M7789R1137L6401o8880j02749
1942f8030k5257O4635O7807J775m4671j8089L8837L7005l1050p4868l5653M3621
1954d3938Q5867M8493l5489p6797l5461K6456L7632M897k2357r928K9357M2936
1966E1668L951m9485o4791k4789M5603Q2154L8084l7932o2458k3390K3606K9751
$$ plain form
1978 11972 4260 -32816 -39598 15987 80174 74854 -8499 -91201 -84977 2520 67562 44542 -14264
1991 -14264 -25442 17802 47682 6862 -74674 -93414 -6713 97567 103861 8531 -82197 -74190
2003 -74190 8823 51586 6849 -49798 -30042 47627 89722 35302 -69899 -112137 -42914 58054
2015 58054 87473 33507 -30413 -36839 3620 20436 -13804 -48637 -29802 28481 72175 58373
2027 58373 -7870 -66581 -63756 -12761 31574 37226 14528 -172 9845 18570 -4216 -44429
2039 -44429 -58885 -22468 46800 89188 50898 -35706 -78747 -40463 22523 36756 -2723 -33072
2051 -33072 -290 60113 62335 -14683 -96737 -92076 6816 100564 84702 -13728 -69968 -31121
2063 -31121 30183 28461 -30948 -64898 -13716 73608 93962 17386 -76948 -93210 -19309 55367
$$ packed form
1978A1972p712l7076o782N5585O4187n320q3353q2702O224Q7497O5042k3020n8806
1991a4264j1178M3244K9880m0820q1536j8740Q6701J04280O294r5330r0728Q007
2003g4190Q3013M2763m4737n6647J9756P7669M2095n4420j05201m2238O9223J00968
2015E8054K9419n3966o3920o426M0459J6816l4240l4833J8835N8283M3694j3802
2027E8373o6243n8711K825N0995M4335N652k2698j4700J0017Q725k2786m0213
2039d4429j4456L6417O9268M2388l8290q6604m3041L8284O2986J4233l9479l0349
2051c3072L2782O0403K222p7018q2054M661R8892R3748j5862r8430n6240L8847
2063c1121O1304j722n9409l3950N1182Q7324K0354p6576r4334j6262P3901P4676
$$ plain form
2075 55367 49074 -7214 -21323 19214 43027 6324 -55634 -75768 -22653 58370 87245 38794
2087 38794 -32538 -59808 -28392 12035 13336 -9671 -8153 22195 43249 31787 -10322 -59237
2099 -59237 -68422 -15979 52551 73081 31653 -26522 -46171 -18088 10908 4350 -21246 -23116
2111 -23116 16062 63164 57405 -18152 -88871 -71715 10896 66748 46765 -9089 -27922 5832
2123 5832 30134 -4667 -61447 -63753 8628 89569 88605 -2528 -84136 -67914 9747 46692 12795
2136 12795 -30204 -16161 43616 67802 11466 -70595 -89664 -24671 61693 84983 28511 -36912
2148 -36912 -40393 -2341 13721 -7864 -30491 -17761 26642 59408 41905 -13527 -59766 -59753 -12127
2161 -12127 38417 45307 15826 -5564 -3658 123 -8511 -28973 -40433 -14267 43162 75444 39547
$$ packed form
2075E5367o293n6288j4109M0537K3813l6703o1958k0134N3115Q1023K8875m8451
2087C8794p1332k7270L1416M0427J301k3007J518L0348K1054j1462m2109m8915
2099e9237r185N2443O8530K0530m1428n8175j9649K8083K8996o558k5596j870
2111b3116L9178M7102n759p5557p0719J7156Q2611N5852j9983n5854j8833L3754
2123E832K4302l4801n6780k306P2381Q0941r64r1133q1608J6222P7661L6945l3897
2136A2795m2999J4043N9777K4186n6336q2061j9069O4993Q6364K3290n6472o5423
2148c6912l481L8052J6062k1585k2627J2730M4403L2766j7503n5432m6239J3M7626
2161a2127N0544O890k9481k1390J906L781q634k0462j1460K6166N7429L2282l5897
$$ plain form
2174 39547 -37683 -80565 -44118 26326 46925 7363 -23397 -1988 39912 42786 -15965 -85311
2186 -85311 -76280 19740 101715 78622 -17595 -76392 -40521 28475 35794 -18875 -50777 -8370
2198 -8370 62565 80345 13882 -76701 -91383 -13442 62189 56036 -396 -26171 1159 29771
2210 29771 7499 -45629 -62148 -13705 54558 78900 33540 -39950 -68043 -28803 18582 23568
2222 23568 703 -7789 10073 33443 26709 -17733 -61354 -57834 -1891 63045 74481 16908
2234 16908 -47563 -53158 -10825 21655 13085 -17757 -22751 18814 62312 43697 -32588 -87321
2246 -87321 -59062 26714 77917 44058 -21420 -34581 3608 26557 -3696 -52717 -51808 19131
2258 19131 88401 71751 -17720 -82654 -59268 15730 51257 14640 -29992 -13154 41116 52770
$$ packed form
2174C9547p7230m2882L6447P0444K0599l9562l0760K1409M1900K874n8751o9346
2186h5311R031R6020Q1975k3093r6217n8797L5871O8996P319n4669l1902M2407
2198h370P0935J7780o6463r0583j4682P7941P5631o153n6432k5775K7330K8612
2210B9771k2272n3128j6519M8443O8263K4342m5360p3490k8093L9240M7385M986
2222B3568k2865q492J7862K3370o734m4442m3621L520N5943O4936J1436n7573
2234A6908o4471n595M2333L2480q570l0842m994M1565M3498j8615p6285n4733
2246h7321K8259Q5776N1203l3859o5478j3161L8189K2949l0253m9021R09P0939
2258A9131O9270j6650q9471o4934K3386P4998L5527l6617m4632J6838N4270J1654
$$ plain form
2270 52770 -2438 -70012 -76606 -7407 71167 76461 12236 -45987 -44882 -3511 19182 -590
2282 -590 -25736 -11621 29091 49104 26164 -23673 -61434 -49175 5203 47350 42426 9420
2294 9420 -15085 -14395 -2370 -4951 -23107 -27050 438 42895 60969 24389 -43982 -71884 -29142
2307 -29142 30780 42949 9976 -16619 -2514 31742 28663 -25810 -72785 -49058 31979 89842
2319 89842 60084 -27233 -73313 -33658 26188 31666 -10466 -35268 -3289 52044 58927 -4746
2331 -4746 -72612 -69980 -1678 58566 53582 757 -30080 -10752 13131 790 -30273 -37363 -2716
2344 -2716 47001 60237 16804 -40927 -57127 -25372 16664 30265 11718 -4363 4173 19998
2356 19998 13238 -18021 -48303 -42385 8613 63238 62884 6889 -49144 -54377 -9799 31088 22609
$$ packed form
2270E2770n5208o7574o594O9199P8574N294o4225n8223J105M1371K2693j9772
2282e90k5146J4115M0712K0013k2940m9837l7761J2259N4378M2147m924l3006
2294I420k4505O90J2025k581j8156l943K7488M2457J8074l6580o8371k7902M2742
2307b9142N9922J2169l2973k6595J4105L4256l079n4473m6975K3727Q1037N7863
2319H9842k9758q7317m6080L9655N9846N478m2132k4802L1979N5333O883o3673
2331d746o7866K632O8302O0244m984n2825l0837J9328K3883j2341l1063p090L4647
2344b716M9717J3236m3433n7731j6200L1755M2036J3601j8547j6081Q536J5825
2356A9998o760l1259l0282N918N0998N4625l54n5995n6033n233M4578M0887q479
$$ plain form
2369 22609 -14004 -20959 16600 50553 31306 -35004 -80608 -45228 38744 78599 37871 -28512
2381 -28512 -46210 -7981 27050 7013 -39360 -38715 20386 71921 52405 -24786 -79953 -52257
2393 -52257 22470 54518 18778 -24204 -18398 23612 39611 -3886 -63032 -61278 6365 70193
2405 70193 66752 4026 -53893 -49795 -655 26985 9412 -16406 -12060 21095 44375 22349
2417 22349 -31523 -62574 -37054 19617 56460 43002 -3849 -32416 -19271 5096 5642 -13654
2429 -13654 -23486 808 43166 52652 5695 -52208 -61131 -13263 40669 45254 2381 -28029 -6434
2442 -6434 29070 21280 -28932 -63426 -31625 45020 83864 35864 -44555 -70670 -24283 33266
2454 33266 36559 -9646 -35915 -587 49824 44794 -16948 -71317 -56681 14310 66378 47289
$$ packed form
2369B2609l6613o955L7559L3953j9247o6310m5604L5380Q3972L9855m0728o6383
2381b8512j7698L8229L5031k0037m6373O45N9101N1535j9516p7191n5167K7696
2393e2257P4727L2048l5740m2982N806M2010J5999m3497n9146J754O7643O3828
2405G0193l441o2726n7919M098M9140K7640j7573k5818M346L3155K3280k2026
2417B2349n3872l1051K5520N6671L6843j3458m6851k8567J3145K4367N46j9296
2429a3654r832K4294M2358R486m6957n7903q923M7868N3932M585m2873l0410K1595
2442f434L5504p790n0212l4494L1801P6645L8844m8000q0419k6115M6387N7549
2454C3266L293m6205k6269L5328N0411n030o1742n4369J4636P0991N2068j9089
$$ plain form
2466 47289 -9258 -36283 -16608 11263 8566 -20420 -30466 3607 46737 47685 3344 -43553
2478 -43553 -50143 -12733 28156 31142 7200 -8648 -420 14223 10379 -18629 -43261 -25901 23411
2491 23411 57162 41800 -10352 -52225 -41744 4868 32710 16518 -13818 -16075 14705 39002
2503 39002 14583 -41965 -63980 -20693 44171 65822 24144 -34558 -45431 -6788 23187 7061
2515 7061 -24990 -23449 19586 55424 33614 -30647 -65922 -34689 23838 47668 20095 -18499
2527 -18499 -18823 14360 26036 -6901 -45181 -39385 11764 60098 51911 -5869 -51039 -41042 1726
2540 1726 29368 18259 -10623 -15583 12034 33544 14847 -27279 -51262 -28139 25309 56561
2552 56561 33483 -15223 -39463 -23168 7917 17064 -4235 -20463 -716 34295 37945 -1636
$$ packed form
2466D7289n6547k7025J9675K7871k697k8986j0046L4073M3130R48m4341m6897
2478d3553o590L7410M0889K986k3942j5848Q228J4643l844k9008k4632J7360M9312
2491B3411L3751j5362n2152m1873J0481M6612K7842j6192l0336k257L0780K4297
2503C9002k4419n6548k2015M3287O4864K1651m1678n8702j0873L8643K9975j6126
2515G061l2051J541M3035L5838k1810o4261l5275L1233N8527K3830k7573l8594
2527a8499l24L3183J1676l2937l8280N796N1149M8334q187n7780m5170R997M2768
2540A726K7642j1109k8882m960K7617K1510j8697m2126k3983K3123N3448L1252
2552E6561k3078m8706k4240J6295L1085R147k1299j6228J9747L5011L650l9581
$$ plain form
2564 -1636 -48695 -52556 -3886 45555 41587 -1877 -28442 -12491 19123 18229 -21988 -49307 -18340
2577 -18340 44463 66871 22092 -45185 -64218 -16325 38976 37866 -6940 -31338 -5262 36679
2589 36679 38024 -13468 -61475 -44866 20328 63254 42714 -13520 -45432 -23956 15224 20548
2601 20548 -7005 -23183 -3810 31599 40038 3811 -43386 -48189 -6907 34694 37161 6030
2613 6030 -21284 -15042 11183 14367 -12891 -34962 -20830 23424 54525 32464 -25397 -57141
2625 -57141 -31099 19069 39447 13113 -23309 -20574 18321 37702 6595 -42613 -54192 -7550
2637 -7550 52473 59839 5691 -45119 -39463 4336 29515 10014 -24128 -21758 20273 47255 21000
2650 21000 -31796 -55115 -22399 32512 47546 10754 -26082 -19261 11402 21908 -3770 -35140
$$ packed form
2564a636m7059l861M8670M9441l968m3464k6565J5951L1614q94m0217k7319L0967
2577a8340O2803K2408m4779o7277j9033M7893N5301j110m4806k4398K6076M1941
2589C6679J345n1492m8007J6609O5194M2926k0540n6234l1912K1476L9180N324
2601B0548k7553j6178J9373L5409Q439l6227m7197m803M1282M1601K467l1131
2613F030k7314O242K6225L184k7258k2071J4132M4254L1101k2061n7861l1744
2625e7141K6042N0168K0378k6334l6422K735L8895J9381l1107m9208j1579M6642
2637g550O0023P366n4148n0810N656M3799K5179j9501l4142K370M2031K6982k6255
2650B1000n2796k3319L2716N4911J5034l6792l6836O821L0663J0506k5678l1370
$$ plain form
2662 -35140 -28724 16826 52031 34957 -16543 -50033 -33901 12837 36003 13517 -17508 -16655
2674 -16655 9700 26844 11049 -27104 -45579 -16539 32379 50510 20749 -25276 -40926 -14414
2686 -14414 17981 17122 -6364 -16755 469 26874 29187 -6419 -44233 -37771 8874 42636 30688
2699 30688 -8527 -28641 -9030 18908 14008 -17424 -32032 -7507 35619 49117 9083 -44365
2711 -44365 -48095 -1702 37949 29612 -8645 -28927 -6004 28659 27275 -13637 -45886 -31150
2723 -31150 18918 53497 32989 -19839 -44397 -20001 15029 21892 650 -18861 -8505 21227
2735 21227 29415 1838 -33175 -38908 -6096 33346 36508 2220 -24715 -16846 6598 14715 -2056
2748 -2056 -23213 -17064 16870 41105 22819 -21798 -46603 -23523 24268 40236 8462 -25424
$$ packed form
2662c5140O416M5550L5205j7074n1500l3490J6132M6738K3166k2486l1025Q53
2674a6655K6355J7144j5795l8153j8475K9040M8918J8131k9761m6025j5650K6512
2686a4414L2395q59k3486j0391J7224K6405K313l5606l7814O462M6645L3762j1948
2699C0688l9215k0114J9611K7938m900l1432j4608K4525M3126J3498m0034n3448
2711d4365l730M6393L9651q337l8257k0282K2923L4663j384m0912l2249J4736
2723c1150N0068L4579k0508n2828k4558K4396L5030O863k1242j9511J0356K9732
2735B1227Q188k7577l5013n733L2812L9442L162l4288k6935P869K3444Q117j6771
2748b056k1157O149L3934K4235j8286m4617k4805K3080M7791J5968l1774l3886
$$ plain form
2760 -25424 -20613 12449 31223 10666 -30917 -44399 -4800 46191 49144 924 -44536 -38687
2772 -38687 7538 35469 14249 -20278 -21571 8732 33927 20742 -23261 -49571 -20146 31847
2784 31847 45627 10257 -28340 -27942 4741 23562 4206 -24556 -23660 8222 38431 30950 -14024
2797 -14024 -48484 -29227 20324 38929 12566 -22547 -25177 5314 30511 16341 -21840 -40258
2809 -40258 -15441 30755 48780 14015 -34783 -39849 -2140 28032 20866 -8489 -23381 -4627
2821 -4627 26146 27554 -7344 -39398 -30125 13823 44434 24844 -19334 -32571 -6424 20311
2833 20311 15453 -11256 -27307 -6999 30310 36736 -1022 -40812 -37399 6203 40192 24616
2845 24616 -17842 -32423 -3898 27631 24474 -10857 -40051 -26395 21306 47611 21740 -25269
$$ packed form
2760b5424M811L3062J8774k0557m1583j3482L9599N0991K953m8220m5460N849
2772c8687M6225K7931k1220l4527j293L0303K5195j3185m4003k6310K9425N1993
2784C1847J3780l5370l8597L98L2683J8821j9356k8762Q96L1882L0209p481m4974
2797a4024l4460J9257M9551J8605k6363l5113k630L0491K5197j4170l8181j8418
2809d0258K4817M6196J8025l4765m8798n066L7709L0172p166k9355j4892J8754
2821d627L0773J408l4898l2054R273M3948L0611j9590m4178j3237K6147K6735
2833B0311m858k6709j6051K0308L7309O426l7758l9790L413M3602L3989j5576
2845B4616m2458j4581K8525L1529l157l5331k9194J3656M7701K6305k5871m7009
$$ plain form
2857 -25269 -41089 -12355 25165 26395 -5081 -25060 -8974 19891 27217 3435 -29729 -33321
2869 -33321 2060 36092 28403 -7233 -28217 -14935 13538 20066 -2271 -21042 -11236 15381
2881 15381 29974 13056 -23862 -38132 -8083 30503 31106 -2821 -28456 -17674 14550 27659
2893 27659 5091 -27569 -30801 794 35734 34962 -6823 -40930 -26270 14504 29753 7918
2905 7918 -19677 -21192 4749 27208 16889 -17360 -35152 -14790 23890 36510 6882 -27122
2917 -27122 -23818 5840 21334 8015 -13852 -19768 1638 27092 22515 -11367 -34855 -18816
2929 -18816 19150 35436 10238 -24882 -25458 4711 26720 17834 -13379 -33096 -14414 26440
2941 26440 38932 6230 -32294 -33650 1188 31286 22470 -12201 -27791 -7975 20967 26241
$$ packed form
2857b5269j5820K8734L7520J230l1476j9979J6086K8865P326k3782l3164l592
2869c3321L5381L4032p689l5636k0984J3282K8473O528k2337j8771R806K6617
2881A5381J4593j6918l6918j4270L0049L8586O03l3927k5635J0782L2224J3109
2893B7659k2568l2660l232L1595L4940p72m1785l4107J4660M0774J5249k1835
2905G918k7595j515K5941K2459j0319l4249j7792K0362L8680J2620k9628l4004
2917b7122L304K9658J5494j3319k1867n916K1406K5454m577l3882k3488J6039
2929a8816L7966J6286k5198l5120n76L0169K2009q886l1213j9717J8682M0854
2941B6440J2492l2702l8524j356L4838L0098q816l4671j5590J9816K8942N274
$$ plain form
2953 26241 -1168 -32358 -28156 11255 37162 18769 -17676 -30400 -8299 20471 20590 -7377
2965 -7377 -25329 -9862 19319 28038 3474 -29989 -29714 7276 35553 20295 -16934 -31213 -8396
2978 -8396 25107 28622 -4043 -32323 -22531 14658 37605 18872 -22858 -38555 -7282 30466
2990 30466 29036 -4462 -29037 -18599 15332 31321 8961 -25544 -30089 182 31115 26839
3002 26839 -9097 -32909 -14795 18258 23911 528 -22379 -18419 9867 29255 12367 -22558
3014 -22558 -31641 -4140 28733 27557 -7473 -33345 -17078 18785 30386 5576 -26019 -29985
3026 -29985 1431 34267 26385 -13634 -36203 -16083 21532 33137 5493 -27811 -25493 6794
3038 6794 29572 18147 -13745 -30785 -10348 24402 28977 -1407 -26892 -18923 10290 26023
$$ packed form
2953B6241k7409l1190M202L9411K5907j8393l6445j2724K2101K8770J19k7967
2965g377j7952J5467K9181Q719k4564l3463K75L6990K8277j5258l7229j4279K2817
2978h396L3503L515l2665k8280R792L7189K2947j8733m1730j5697L1273L7748
2990C0466j430l3498k4575J0438L3931J5989k2360l4505m545L0271L0933m276
3002B6839l5936k3812J8114L3053N653k3383k2907L960K8286J9388j6888l4925
3014b2558r083K7501L2873j176l5030k5872J6267L5863J1601k4810l1595l966
3026b9985L1416L2836p882m0019k2569K0120L7615J1605k7644l3304K318L2287
3038F794K2778j1425l1892j7040K0437L4750M575l0384k5485P969K9213J5733
$$ plain form
3050 26023 10296 -18265 -22077 2196 23555 17442 -10388 -28414 -12033 20879 27821 285
3062 285 -26266 -21313 7390 28454 15845 -17516 -30477 -7445 23688 27214 -503 -28987 -23859
3075 -23859 10548 31157 13265 -18765 -28341 -6712 23123 26215 -2434 -26929 -18639 10384
3087 10384 26283 11259 -17727 -24330 -102 23938 17892 -8123 -23367 -11619 14453 24013
3099 24013 2352 -21674 -17530 8464 25368 12770 -17285 -27468 -3709 24897 23644 -4596
3111 -4596 -26853 -19333 11671 29320 10919 -21160 -26914 -1340 25871 23464 -7448 -31196 -17770
3124 -17770 15331 29059 9968 -18978 -26150 -2402 23416 18769 -9751 -24694 -9683 16734
3136 16734 24476 2874 -23450 -21330 5332 23378 13224 -11796 -22288 -3758 21867 19262
$$ packed form
3050B6023j5727k8561l812K4273K1359o113k7830j8026J6381L2912O942k7536
3062B85k6551M953K8703K1064j2609l3361j2961K3032L1133L526k7717k8484N128
3075b3859L4407K0609j7892l2030r576K1629K9835L092k8649k4495Q290K9023
3087A0384J5899j5024k8986o603K4228K4040o046k6015j5244J1748K6072R560
3099B4013k1661k4026M144K5994J6904j2598l0055j0183K3759K8606j253k8240
3111d596k2257P520L1004J7649j8401l2079n754K5574K7211k407l0912k3748J3426
3124a7770L3101J3728j9091k8946p172K3748K5818m647k8520j4943J5011K6417
3136A6734P742k1602k6324K120K6662J8046j0154k5020j0492J8530K5625k605
$$ plain form
3148 19262 -8613 -27225 -13698 16263 30224 10015 -22433 -27652 -104 26423 20603 -8882
3160 -8882 -28751 -12486 21555 30534 2921 -28113 -27652 3245 31148 23254 -11501 -30172 -12358
3173 -12358 17522 24340 1225 -24149 -19646 11403 28756 10782 -19273 -27481 -5421 22067
3185 22067 22707 -4732 -23697 -10663 15361 21612 -381 -25401 -21684 10149 32198 17327 -16069
3198 -16069 -30462 -10693 20198 26186 -1207 -26055 -16425 14562 30030 11348 -22958 -32945
3210 -32945 -4527 28547 28526 -1855 -25981 -19787 9854 25420 7644 -19730 -20800 4414 26301
3223 26301 18868 -11321 -29838 -13456 16909 24611 3901 -17943 -16538 7249 21523 6149
3235 6149 -20841 -23789 1609 27111 24031 -6944 -30671 -19101 12094 24848 7536 -17683
$$ packed form
3148A9262k7875j8612J3527K9961J3961k0209l2448n219K7548K6527n820k9485
3160h882j9869J6265L4041Q979k7613l1034M61L0897K7903p894l4755j8671J7814
3173a2358K9880O818k3115k5374M503L1049J7353j7974l0055q208K2060K7488
3185B2067O40k7439j8965J3034K6024O251k1993k5020L717L1833K2049j4871l3396
3198a6069j4393J9769L0891N988k7393k4848R630L0987J5468j8682l4306r987
3210c2945K8418L3074k1l0381k4126O194K9641J5566j7776k7374j070K5214K1887
3223B6301p433l0189j8517J6382L0365P702k0710k1844J405K3787J4274j5374
3235F149k6990k948K5398K5502l080l0975k3727J1570L1195J2754j7312k5219
$$ plain form
3247 -17683 -20387 4453 26817 16633 -16153 -31648 -12994 18942 31481 10123 -20332 -24194
3259 -24194 -249 19031 12370 -9661 -20409 -3867 21289 22812 -2577 -24882 -19812 5165
3271 5165 23064 14690 -9423 -17653 -1239 15693 11169 -10355 -22803 -8037 20541 27748 4296
3284 4296 -23189 -24656 -921 21890 17305 -8813 -21503 -4355 19899 20391 -4918 -29020 -23131
3297 -23131 10135 32251 19347 -11101 -26485 -12969 12710 18518 -1555 -18840 -9728 13800
3309 13800 23268 7386 -19494 -26595 -5217 19708 20382 1046 -14710 -10204 8287 14381 -2197
3322 -2197 -19711 -12910 11267 26397 15530 -12733 -27754 -12291 14824 21528 3411 -16032
3334 -16032 -13347 9973 23417 6199 -22724 -28163 -2596 26955 30000 1351 -27035 -23666 4396
$$ packed form
3247a7683k704K4840K2364j0184l2786j5495J8654L1936J2539k1358l0455l862
3259b4194K3945J9280o661k2031j0748J6542K5156J523k5389k2305N070K4977
3271E165J7899q374k4113q230J6414J6932m524k1524j2448J4766K8578P207k3452
3284D296k7485j467K3735K2811m585k6118j2690J7148K4254M92k5309k4102N889
3297b3131L3266K2116j2904l0448j5384J3516K5679N808k0073j7285R112K3528
3309A3800R468j5882k6880p101K1378K4925O74j9336j5756M506J8491O094j6578
3322b197j7514O801K4177J5130j0867k8263j5021J5463K7115O704j8117j9443
3334a6032K685K3320J3444j7218k8923n439K5567K9551L045k8649k8386L369K8062
$$ plain form
3347 4396 21359 9062 -14401 -19033 4064 26713 17188 -14556 -31487 -16184 14736 27962
3359 27962 11139 -15631 -18362 3222 16643 4331 -17998 -20244 4274 29338 23131 -8684
3371 -8684 -29542 -19174 8726 24139 11016 -14178 -17092 5846 22866 10829 -17357 -29581
3383 -29581 -9599 23191 32043 9207 -19691 -25680 -4841 17808 16110 -7332 -18884 -1581
3395 -1581 20433 20133 -4220 -27306 -24014 4436 26707 19888 -5745 -19841 -8782 11233 11330
3408 11330 -10142 -22018 -4080 22732 27456 3458 -25842 -29690 -2488 23795 19270 -6771
3420 -6771 -19604 -3935 20247 18723 -11392 -32686 -18016 17730 34999 17971 -15815 -29865
3432 -29865 -10400 16769 17515 -3855 -18237 -5872 18240 23502 -535 -25943 -23885 465 22354
$$ packed form
3347D396J6963j2297k3463m632K3097K2649r525l1744j6931J5303L0920J3226
3359B7962j6823k6770k731K1584J3421j2312k2329k246K4518K5064o207l1815
3371h684k0858J0368K7900J5413j3123k5194k914K2938J7020j2037k8186j2224
3383b9581J9982L2790Q852k2836k8898n989K0839K2649j698k3442j1552J7303
3395a581K2014l00k4353k3086L292K8450K2271o819k5633j4096J1059K0015R7
3408A1330k1472j1876J7938K6812M724k3998k9300l848K7202K6283m525k6041
3420f771j2833J5669K4182j524l0115k1294J4670L5746J7269j7028l3786j4050
3432b9865J9465K7169P46k1370j4382J2365K4112N262k4037k5408K058K4350K1889
$$ plain form
3445 22354 21297 1192 -15659 -9891 6113 7546 -6153 -15409 -5593 15465 24749 7779 -17792
3458 -17792 -25599 -10133 12123 19775 6315 -11620 -9481 8435 15116 -1540 -22349 -22167 2921
3471 2921 29049 26276 -2204 -26149 -22382 1907 19893 10054 -12661 -14668 8195 23982 11066
3484 11066 -17147 -30122 -12761 17751 28674 10625 -12858 -16998 -1153 12071 2819 -16003
3496 -16003 -13437 11742 27708 14831 -12583 -27948 -16732 9031 22059 10422 -8304 -11149
3508 -11149 3844 14363 2585 -19702 -22529 9 23624 25238 5605 -19199 -25328 -6742
3520 -6742 14321 13499 -2796 -12043 -1038 16020 15090 -6750 -25842 -20360 3681 25212 23467
3533 23467 -605 -20800 -14103 5725 10096 -4828 -14398 -2720 19792 25488 2075 -26076 -28592
$$ packed form
3445B2354j057k0105j6851N768J6004J433j3699r256R816K1058R284j6970k5571
3458a7792p807J5466K2256P652j3460j7935K139J7916O681j6656k0809J82K5088
3471B921K6128k773k8480k3945L767K4289J7986r839k2715k007K2863J5787j2916
3484A1066k8213j2975J7361L0512J0923j8049k3483m140J5845J3224r252j8822
3496a6003K566K5179J5966j2877k7414j5365J1216K5763J3028j1637j8726k845
3508a1149J4993J0519j1778k2287k827K2538K3615J614j9633k4804o129J8586
3520f742K1063q22j6295r247J1005J7058r30k1840j9092N482K4041K1531j745
3533B3467k4072k0195O697J9828M371j4924r570J1678K2512N696k3413k8151k516
$$ plain form
3546 -28592 -3517 22521 23719 -86 -18414 -6463 15225 13264 -11282 -27145 -12692 20135
3558 20135 35382 14995 -19944 -31468 -11918 15111 19894 -136 -16193 -5121 17792 19046
3570 19046 -4331 -26629 -23496 1746 25336 23642 1085 -16505 -14051 -80 7363 -1763 -12243
3583 -12243 -3902 16202 22704 5510 -17814 -27466 -12410 13149 23063 9536 -9383 -11686 3441
3596 3441 12175 -595 -21159 -19364 8375 31048 24640 -5206 -30312 -25466 4783 25018 12890
3609 12890 -11808 -14889 6817 23641 9550 -22283 -32120 -7495 23951 31242 9354 -17704
3621 -17704 -21942 -1449 12743 2228 -14920 -9372 14283 27117 11001 -18849 -30495 -13534
3633 -13534 12329 21570 9990 -7541 -9929 4167 10193 -3979 -20439 -15285 7080 25819 21760
$$ packed form
3546b8592K5075K6038J198k3805j8328J1951K1688j961k4546j5863J4453L2827
3558B0135J5247k0387l4939j1524J9550K7029M783k0030j6057J1072K2913J254
3570A9046k3377k2298L133K5242K3590j694k2557j7590K454J3971P443r126j0480
3583a2243Q341K0104O502j7194k3324r652J5056K5559R914j3527j8919k303J5127
3596C441Q734j2770k0564J795K7739K2673o408k9846k5106M846L0249K0235j2128
3609A2890k4698l081K1706J6824j4091l1833r837K4625L1446P291k1888k7058
3621a7704m238K0493J4192j0515j7148N548K3655J2834j6116k9850j1646J6961
3633a3534K5863R241j1580j7531k388J4096O026j4172j6460N154K2365J8739m059
$$ plain form
3646 21760 -1378 -22150 -21960 -3784 13480 14206 79 -9017 164 13338 8568 -10149 -22363
3659 -22363 -15047 8645 28019 21174 -4524 -22096 -15596 3529 10883 -492 -10567 80 19351
3672 19351 19575 -3236 -26738 -26475 -1046 24737 22836 -691 -15419 -6399 9161 6881 -12773
3685 -12773 -23696 -5249 24938 31243 6682 -22950 -29553 -8989 15540 17215 -515 -10460 -639
3698 -639 13456 10672 -8979 -24972 -16297 8406 24383 18911 179 -15563 -14899 -2534 5476
3711 5476 1358 -3449 1723 11568 14137 2322 -16416 -22419 -9249 12024 22264 13252 -5261
3724 -5261 -13659 -3500 6260 -1024 -13757 -11560 8336 27294 22120 -7651 -32199 -25308 4418
3737 4418 24833 16340 -7998 -15097 3519 18779 5401 -21799 -28643 -5234 26231 32944 6860
$$ packed form
3646B1760k3138k0772J90J8176J7264P26j4127r096R181J3174m770j8717j2214
3659b2363P316K3692J9374o845k5698j7572O500J9125P354j1375j0075J0647J9271
3672A9351K24k2811k3502K63K5429K5783j901k3527j4728R020J5560k280j9654
3685a2773j0923J8447L0187O305k4561k9632o603K0564K4529J675j7730r945R821
3698f39J4095k784j9651j5993Q675K4703J5977n472j8732j5742O64J2365Q010
3711E476m118m807N172R845K569j1815j8738o003J3170K1273J0240r012j8513
3724e261q398J0159R760p284j2733K197J9896J8958n174k9771k4548O891K9726
3737D418K0415q493k4338p099J8616J5260j3378k7200o844K3409L1465O713k6084
$$ plain form
3750 6860 -22920 -24322 -2865 12994 6179 -8901 -8534 11250 23356 7387 -19299 -28124 -11422
3763 -11422 14269 24369 10325 -8065 -9806 170 4933 -3690 -14076 -10205 9678 24913 18018
3776 18018 -4852 -23187 -22253 -3108 16363 16609 1948 -7060 -2076 7498 5786 -9706 -22363
3789 -22363 -12774 13812 30119 19117 -9008 -27545 -18355 6231 15333 2509 -8977 -1802 15441
3802 15441 17847 -4044 -28632 -26061 3960 28376 22761 -2887 -18906 -9558 8938 7585 -11809
3815 -11809 -20260 -670 25838 29220 2393 -28192 -29637 -2716 20348 17482 -640 -10140 -669
3828 -669 12507 7162 -13161 -23524 -9642 14567 26812 16078 -6920 -19333 -13339 -896 5615
3841 5615 4012 138 2499 10019 9836 -3163 -17248 -18923 -4934 13935 22027 10433 -7209 -13183
$$ packed form
3750F860k9780j402K1457J5859o815j5080L67J9784J2106j5969k6686q825J6702
3763a1422K5691J0100j4044j8390j741R976M763q623j0386L871J9883J5235o895
3776A8018k2870j8335R34J9145J9471K46j4661r008M984R574j712j5492j2657
3789b2363R589K6586J6307j1002k8125j8537R190K4586R102j2824j1486P175J7243
3802A5441K406k1891k4588K571L0021K4416n615k5648j6019R348J8496j353j9394
3815a1809q451J9590K6508L382k6827l0585j445K6921K3064k866j8122r500R471
3828f69J3176n345k0323j0363J3882K4209J2245j0734k2998j2413N994J2443O511
3841E615j603l874K361P520j83j2999j4085j675J3989J8869Q092j1594j7642n974
$$ plain form
3855 -13183 -5628 1928 -331 -8262 -7142 9972 24339 14702 -12282 -30096 -20492 7965 25119
3868 25119 14017 -7844 -12323 2779 12891 1801 -19420 -23143 1098 29256 28157 630
3880 630 -24400 -23127 -1682 14055 8135 -5120 -3381 10399 15551 1731 -18872 -23574 -5845
3893 -5845 17013 22082 8305 -6111 -9794 -3961 363 -4267 -8759 -2445 11368 18748 11017 -7047
3907 -7047 -22009 -19010 -1180 14492 15889 4869 -5933 -5562 2166 2677 -7835 -16066 -7804 12826
3921 12826 26847 16484 -11236 -28346 -17423 6605 17571 7997 -6123 -4978 9703 13715
3933 13715 -4579 -24849 -21043 5234 28299 23605 -3286 -20453 -11720 5278 6998 -5494 -12776
3946 -12776 893 22513 24136 -1705 -27239 -26188 -1361 20277 19300 1114 -10170 -2718 7935
$$ packed form
3855a3183P555P556k259p931J120J7114J4367r637k6984j7814R604K8457J7154
3868B5119j1102k1861m479J5102J0112j1090k1221l723K4241K8158j099k7527
3880F30k5030J273K1445J5737n920j3255J739J3780N152j3820k0603m702J7729
3893e845K2858N069j3777j4416l683N833M324m630m492O314J3813P380p731j8064
3907g047j4962K999J7830J5672J397j1020j0802L71P728N11j0512q231Q262K0630
3921A2826J4021j0363k7720j7110J0923K4028J0966r574j4120J145J4681M012
3933A3715j8294k0270L806K6277K3065m694k6891j7167Q733J6998J720j2492p282
3946a2776J3669K1620J623k5841k5534J051K4827K1638r77j8186j1284P452J0653
$$ plain form
3959 7935 3440 -10774 -19034 -7320 14921 25407 13096 -9134 -21233 -15624 -417 10429 7963
3972 7963 632 -215 4817 5868 -1897 -14439 -17769 -3558 16474 22877 9052 -10644 -18014 -7862
3986 -7862 5521 4578 -5220 -4758 9101 20231 11104 -13798 -30049 -16930 12961 27281 13182
3999 13182 -9311 -14546 586 12227 1241 -19156 -18766 6380 29787 25195 -4122 -28433 -22274
4012 -22274 3140 16764 8365 -4945 -4295 8195 13450 -1148 -20181 -20920 -1080 18246 20533
4025 20533 6062 -9595 -11685 -3564 862 -2864 -4918 685 10873 15424 5875 -10854 -19844 -13296
4039 -13296 2491 15267 15159 3138 -7412 -6239 564 726 -5938 -11301 -3315 15115 23866 9901
4053 9901 -14495 -26120 -13984 9479 19721 8057 -7046 -4243 7706 8795 -6447 -21346
$$ packed form
3959G935m495j4214q260J1714K2241J0486j2311k2230j2099N609J5207J0846k466
3972G963p331q47N032J051p765j2542l330J4211K0032O403j3825j9696p370J0152
3986g862J3383r43r798M62J3859J1130r127k4902j6251J3119K9891J4320j4099
3999A3182k2493n235J5132J1641j0986k0397L90K5146K3407m592k9317k4311O159
4012b2274K5414J3624q399j3310O50J2490N255j4598j9033p39J9840J9326K287
4025B0533j4471j5657k090Q121M426l726k054N603J0188M551r549j6729q990O548
4039a3296J5787J2776j08j2021j0550J173O803J62o664n363P986J8430Q751j3965
4053I901k4396j1625J2136K3463J0242j1664j5103K803J1949J089j5242j4899
$$ plain form
4065 -21346 -15925 9295 27178 18338 -6239 -20044 -11914 4107 7594 -3813 -9469 3598 19175
4078 19175 15106 -6806 -24547 -19847 2682 20082 15107 -882 -8842 -3416 4390 1317 -10145
4091 -10145 -13463 -758 15779 18995 7239 -9808 -19536 -13120 1727 11744 10281 2974 -1517
4104 -1517 51 1821 -2809 -10931 -11504 -840 13958 20410 8997 -11223 -19893 -8831 5653 8073
4118 8073 437 -2978 4944 14117 7701 -12307 -24375 -12845 11598 25483 13412 -9295 -15681
4131 -15681 -1655 9454 1394 -14129 -13970 5925 25415 20045 -6973 -26536 -19849 2902 18172
4144 18172 11398 -4051 -6957 4211 9183 -1411 -15886 -15872 366 17985 19542 4208 -11338
4157 -11338 -13981 -5795 2353 3671 -609 953 8424 10819 2369 -9812 -16850 -10985 4847 16835
$$ packed form
4065b1346N421K5220J7883q840k4577j3805Q130J6021L487j1407n656J3067J5577
4078A9175m069k1912j7741M700K2529J7400m975j5989p960N426P806l073j1462
4091a0145l318J2705J6537L216j1756j7047r728O416J4847J0017j463p307m491
4104a517J568J770m630q122n73J0664J4798O452j1413k0220q670J1062J4484K420
4118H073p636l415P922R173o416k0008j2068J1530K4443J3885j2071k2707o386
4131a5681J4026J1109q060j5523J59J9895J9490n370k7018j9563O687K2751J5270
4144A8172o774j5449k906J1168M972j0594j4475J4J6238J7619J557j5334j5546
4157a1338k643Q186Q148J318m280J562P471K395q450j2181p038N865J5832J1988
$$ plain form
4171 16835 14500 1356 -9545 -8793 177 3586 -3843 -9878 -1495 14632 19698 6257 -15630 -25956
4185 -25956 -11143 13115 20727 6696 -9058 -7456 5527 8827 -5575 -19458 -12298 11071 25078
4198 25078 15219 -9058 -22723 -12385 6906 10620 -825 -7292 2038 15097 11452 -8604 -23148
4211 -23148 -14692 6898 19407 13998 -2251 -11480 -5348 5160 2375 -8593 -10638 1552 15673
4224 15673 16777 3470 -13165 -17760 -9198 5038 13150 9502 -405 -3485 749 1861 -4188 -9708
4238 -9708 -8294 2057 14896 17103 3673 -13551 -18003 -6329 7890 9633 263 -3309 4181
4251 4181 9653 2077 -12130 -18360 -7297 13263 21709 8278 -10857 -14355 -1992 8101 2349
4264 2349 -11075 -9426 8300 20530 12473 -9061 -22906 -15148 5412 17235 10201 -3489 -5811
$$ packed form
4171A6835k335j3144j0901P52Q970L409p429o035Q383J6127N066j3441k1887j0326
4185b5956J4813K4258P612j4031j5754J602J2983L300j4402j3883P160K3369J4007
4198B5078r859k4277j3665J0338J9291L714j1445o467R330J3059l645k0056j4544
4211b3148Q456K1590J2509n409j6249r229O132J0508k785j0968k045J2190J4121
4224A5673J104j3307j6635m595Q562J4236Q112l648r907l080M234J112o049n520
4238i708J414J0351J2839K207j3430j7224m452J1674J4219J743r370l572P490
4251D181N472p576j4207o230J1063K0560Q446j3431j9135l498J2363J0093n752
4264B349j3424J649J7726J2230q057k1534j3845P758K0560J1823p034j3690k322
$$ plain form
4277 -5811 1566 5907 -1513 -12553 -11374 3324 16021 14844 2555 -10105 -13682 -6105 3337 4865
4291 4865 2450 2514 4990 5259 217 -8742 -12662 -6341 5299 13667 11714 336 -10722 -9708 310
4306 310 4371 -1222 -5640 -607 10358 14305 2980 -15259 -20885 -6897 12896 19453 6418 -10276
4320 -10276 -9611 3472 7436 -3806 -14298 -8535 9608 21920 12726 -9130 -20716 -11672 5860
4333 5860 11828 3250 -5353 -107 9964 7425 -7372 -16932 -10701 5662 17430 12965 -2711 -11208
4347 -11208 -6337 2883 3373 -3413 -7387 653 12153 12846 1075 -12124 -15588 -7263 7428 14669
4361 14669 7851 -3313 -6726 -1996 2167 -281 -7514 -7783 2915 13818 14289 907 -15002 -17528
4375 -17528 -3220 11561 10535 154 -4860 834 7266 2843 -11050 -16288 -3879 14537 19269
$$ packed form
4277e811P377M341p420j1040J179J4698J2697j177j2289j2660l577P577R442J528
4291D865k415O4K476K69n042q959l920O321J1640Q368j953j1378j1058J014J0018
4306C10M061n593m418N033J0965L947j1325j8239n626J3988J9793O557j3035j6694
4320a0276O65J3083L964j1242j0492N763J8143J2312r194k1856j1586R044J7532
4333E860N968q578q603N246J0071k539j4797r560O231J6363J1768m465j5676q497
4347a1208M871R220M90o786l974Q040J1500O93j1771j3199l464Q325J4691P241
4361A4669o818j1164l413M730M163k448p233k69J0698J0903M71j3382j5909k526
4375a7528J4308J4781j026j0381n014N694O432m423j3893n238J2409J8416M732
$$ plain form
4388 19269 5773 -11960 -15286 -1335 9618 3325 -8521 -7069 7451 17366 9489 -10881 -21713
4401 -21713 -10606 9241 17674 8040 -5904 -8589 445 6888 -407 -10660 -8957 3506 14624
4414 14624 12762 -641 -12866 -12413 -2575 5440 6375 2127 -363 2111 4218 -979 -8843 -9770 -3350
4429 -3350 7316 13345 8265 -3733 -10995 -7179 893 4589 220 -4093 601 9891 10566 -1597
4443 -1597 -14663 -15483 -1215 14770 15814 1479 -10383 -7579 3261 6368 -2427 -11100 -5625 10359
4457 10359 17448 6996 -10156 -17284 -8199 7627 11822 2071 -4858 -1037 5837 4504 -5218 -12617
4471 -12617 -7465 7028 14740 8771 -3614 -10663 -6527 1916 3805 -1540 -3845 1643 8697 7999
4485 7999 -1126 -11349 -12887 -2974 8915 12282 5572 -4156 -7556 -2469 3040 384 -4993 -5058 2543
$$ packed form
4388A9269j3496j7733l326J3951J0953o293j1846J452J4520R915p877k0370j0832
4401b1713J1107J9847Q433r634j3944k685R034O443p295j0253J703J2463J1118
4414A4624j862j3403j2225M53R838Q015R35m248k490K474K107n197p864r27O420
4429c350J0666O029n080j1998p262L816Q072L696m369m313M694R290O75j2163
4443a597j3066q20J4268J5985J044j4335j1862K804J0840L107q795q673N475J5984
4457A0359P089j0452j7152p128R085J5826M195r751o929L821O874j333r722p399
4471a2617N152J4493P712n969j2385p049M136Q443J889n345k305N488P054o98
4485G999r125j0223j538R913J1889L367o710r728l400N087N509k656n377o5P601
$$ plain form
4500 2543 11232 11123 -1297 -14089 -13498 -701 10700 9930 217 -5609 -1663 5351 2303 -7714
4514 -7714 -11143 -2185 11540 15347 3363 -11202 -12849 -1537 7505 4762 -4050 -5792 3691 12070
4528 12070 5753 -9674 -17054 -7749 8960 16006 7555 -6993 -10296 -1761 5061 2487 -5416 -7915
4542 -7915 1394 11951 10983 -1071 -12277 -11961 -2073 8782 8942 1551 -3224 -1094 2317 1400 -4033
4557 -4033 -8550 -4097 7046 12559 6344 -5139 -10762 -6396 3535 6330 216 -4574 74 7431
4571 7431 8313 -2110 -13376 -12510 2370 14913 12245 -1655 -11452 -7555 4265 7646 -1419 -9628
4585 -9628 -4622 8365 14077 4713 -11375 -16272 -4302 9412 11293 1935 -5882 -3851 3850 5022
4599 5022 -3826 -10438 -5886 6211 12982 7567 -5107 -11139 -5369 3082 4867 -103 -3555 -189
$$ packed form
4500B543Q689j09j2420j2792N91J2797J1401p70r713n826L946P014l048j0017
4514g714l429Q958J3725L807j1984j4565j647J1312R042k743q812j742R483Q379
4528A2070o317j5427p380R305J6709P046q451j4548l303Q535O822k574p903k499
4542g915R309J0557r68j2054j1206L16R888J0855J60p391m775K130L411r17n433
4557d033m517M453J1143N513o215j1483n623M366R931K795o114m790M648P357
4571G431Q82j0423j1266Q66J4880J2543k668j3900r797L897J1820L381r065q209
4585i628N006J2987N712r364j6088m897J1970J3714J881r358p817K031P701J172
4599E022q848o612M552J2097O771n415j2674o032N770Q451J785m970l452L366
$$ plain form
4613 -189 6609 7512 -1359 -11073 -10400 -240 10288 11176 1943 -7246 -7165 20 4460 1647 -4426 -5045
4629 -5045 2813 10598 7539 -4662 -12895 -9140 2980 11263 7558 -2581 -6109 -956 4205 1877
4643 1877 -5580 -8073 -272 10593 10716 -565 -10168 -9481 -116 6983 3857 -3942 -3969 3624 7867
4658 7867 2968 -8251 -12394 -4128 9106 12616 3656 -6548 -8073 -1143 5354 2987 -4422 -5728
4672 -5728 1484 9004 7746 -1222 -10098 -9430 517 8765 7767 788 -4365 -3061 1850 2602 -2393 -5932
4688 -5932 -2165 5390 9119 4228 -5467 -10012 -4455 4141 6164 1050 -3634 -1878 4434 5991 -2253
4703 -2253 -10357 -8106 3071 11907 9719 -2978 -11114 -6100 3928 6745 -332 -7162 -4533 5927
4717 5927 10747 3207 -9245 -12315 -3536 8584 10785 1969 -6759 -5104 2604 5157 -469 -6451
$$ packed form
4613a89O798R03q871r714O73J0160J0528Q88r233r189Q1P185M440k813o073o19
4629e045P858P785l059j2201q233L755J2120Q283l705j0139l528N153N161k328
4643A877p457k493P801J0865J23j1281r603O87R365P099l126p799k7P593M243
4658G867m899j1219m143Q266J3234L510q960j0204j525O930O497k367p409j306
4672e728P212P520j258q968q876O68R947Q248r98o979n153J304M911P52m995l539
4688e932L767P555L729m891r695m545N557Q596K023n114m684J756O312J557q244
4703b253q104K251J1177Q836k188j2697q136N014J0028K817p077o830K629J0460
4717E927M820p540j2452l070Q779J2120K201q816q728J655P708K553n626n982
$$ plain form
4731 -6451 -5065 3757 10199 6056 -4046 -9571 -5421 3119 6632 1888 -4025 -2310 3916 5789 56
4746 56 -7480 -8494 -307 9754 9798 121 -8168 -7607 349 6530 2959 -4724 -5817 1950 8916 6000
4762 6000 -4501 -12026 -7766 4911 11372 5606 -4639 -7787 -1328 5710 3506 -4957 -7504 -319
4776 -319 8285 8882 -253 -9325 -8326 1429 7798 3733 -3716 -4682 1510 7352 3540 -6318 -10246 -2191
4792 -2191 8066 10509 2411 -7791 -8277 92 7162 3664 -3882 -5999 324 7819 7053 -2441 -10050
4807 -10050 -7311 1950 8837 6915 -2403 -7094 -2678 3708 3344 -1942 -5633 -2675 4267 7714 2360
4822 2360 -5766 -8002 -2316 4684 5644 -498 -4752 -1441 4950 4065 -2359 -7579 -5532 3287 9514
4837 9514 6041 -4194 -8506 -3320 4507 6444 -367 -6329 -2695 5548 7959 1481 -7129 -9208 -1078
$$ packed form
4731f451J386Q822O442m143j0102n525M150Q540L513m744n913J715O226J873n733
4746E6p536j014Q187J0061M4r677q289N61P956O181l571p683j093P767O966k916
4762F000j0501p525M260J2677O461n766j0245l148O459P038k204q463k547P185
4776c19Q604N97r135r072R99R755O369m065p449r66O192N842l812r858l928Q055
4792b191J0257K443q098j0202m86Q369P070l498p546k117O323P495p66r494p609
4807a0050K739R261O887j922r318m691M416O386l64n286l691K958O942L447n354
4822B360q126k236N686P000R60o142m254L311O391q85o424n220K047Q819O227
4837I514l473j0235m312N186P827J937o811n962L634Q243K411o478q610k079Q130
$$ plain form
4852 -1078 8306 8624 -25 -6989 -5209 2041 5281 747 -5056 -3923 2525 6713 3706 -3120 -7641
4867 -7641 -4139 3504 6214 932 -3847 -2828 2408 4531 421 -6093 -6120 455 6959 6846 -350 -7275
4883 -7275 -6163 1664 6307 2079 -4545 -4534 1229 6991 4615 -3602 -8849 -4293 4621 9172 4203
4898 4203 -5223 -7579 -823 5648 3932 -2581 -5484 -1278 5204 6374 161 -6791 -5666 1266 6655
4913 6655 4507 -3345 -5715 147 5320 2867 -3491 -6871 -2526 5176 8095 2048 -6401 -7340 -118
4928 -118 6137 4378 -3101 -6702 -1025 6554 5708 -1208 -7799 -6751 2019 9047 5953 -3706 -7793
4943 -7793 -3072 4834 5858 -529 -6071 -3733 3543 6186 2266 -4578 -7292 -1119 6595 5843 -1630
4958 -1630 -6037 -2272 4364 5256 -721 -6566 -4378 3007 7696 3865 -4175 -7957 -2522 5940 6131
$$ packed form
4852a078R384L18q649o964J780P250L240m534n803J133O448M188l007o826m521
4867g641L502P643K710n282m779J019N236K123m110o514k7O575O504j13p196o925
4883g275J112P827M643m228o624J1N763N762k376q217n247M556Q914M551m969
4898D203r426k356O756O471j716o513k903M206O482J170o213o952J125O932N389
4913F655k148p852k370N862N173k453o358l380M345P702K919o047q449r39P222
4928a18O255j759p479l601N677P579q46o916o591J048Q770P028l094r659m087
4943g793M721P906J024o387n542K338P276K643l920o844k714O173P714p52p473
4958a630m407L765O636Q92n977n845K188P385M689l831q040l782N435Q462J91
$$ plain form
4973 6131 -1598 -6761 -2818 4153 7015 1239 -6941 -7742 -31 7467 7068 -988 -7645 -4988 3407
4988 3407 6209 754 -5037 -4597 1481 6002 3379 -3095 -6593 -2582 4242 5724 255 -4995 -3934
5003 -3934 2596 5747 1211 -4596 -4561 516 6245 4854 -2090 -6436 -3176 3601 6518 885 -5826
5018 -5826 -5010 2258 6722 3112 -3963 -7060 -2817 4960 7505 1478 -6474 -5998 827 6249 3471
5033 3471 -3580 -5853 -862 4963 4202 -710 -5183 -4347 1708 5792 2228 -4110 -5211 184 4976
5048 4976 3166 -2473 -5197 -1463 4059 4777 220 -4649 -4460 1443 6070 2765 -4003 -5362 -238
5063 -238 4835 4989 -647 -5651 -4244 2220 6174 3466 -3586 -6715 -1563 5202 5340 -854 -5064 -3252
5079 -3252 2097 5052 2156 -3649 -5463 -486 4537 4082 -1498 -5733 -2674 3662 4895 403 -4881
$$ packed form
4973F131p729n163L943O971K862n776q180q01P711P498l99q056o657K657Q395
4988C407K802n455n791M40O078M521k623o474l498M011O824J482n469n250J061
5003c934O530L151m536n807L5N077N729j391o944m346L260O777K917n633o711
5018e826Q16P268M464l610p075l097M243P777K545o027p952M76O825N422k778
5033C471p051k273M991N825p61m912m473Q36O055M084l564o338j101N395M792
5048D976j810n639k724L734N522P18m557m869J89N903M627l305o768j359N124
5063b38N073J54n636n004J407O464L954k708p052l129N152O765J38o194m210J812
5079c252N349K955k896n805j814M977N023m55n580m235L059O336J233m492n284
$$ plain form
5094 -4881 -3821 1038 4861 2937 -3337 -5557 -781 4698 4849 -1509 -6384 -4057 3459 6336 2030
5109 2030 -4635 -6112 -453 5665 5271 -1920 -6795 -3227 3812 6528 1643 -5153 -5788 473 5456
5124 5456 3894 -1569 -5002 -2128 3892 5081 93 -5202 -3901 1893 5289 2763 -3247 -5053 -633
5139 -633 4408 3320 -1465 -4876 -2311 3698 5697 215 -5911 -4981 1590 5784 3621 -2953 -6288
5154 -6288 -2108 4254 5367 11 -5625 -4732 2029 7050 3425 -4077 -6608 -1841 4295 4971 138
5169 138 -4933 -3197 2364 5255 1600 -4325 -5165 450 5649 4097 -2150 -5210 -2287 2952 4211
5184 4211 14 -4549 -2985 2715 5606 1992 -4712 -5654 -512 5475 5108 -1243 -5718 -3309 2721
5199 2721 5389 1382 -4442 -5369 851 5973 4263 -2020 -6344 -3532 2828 5442 1409 -3045 -3737
$$ packed form
5094d881J060M859L823j924o274k220M776N479J51o358m875K327P516K877m306
5109B030o665j477N659O118l94p191m875L568P039K716m885o796o35O261M983
5124E456j562n463l433K874O020J189m988n295J301N794L396k526o010j806M420
5139f33N041j088m785l411K565O009J999n482o126R30O571M194k163o574l335
5154f288M180O362J113n356n636Q93O761N021l625p502k531M767O136O76m833
5169A38n071J736N561K891l655n925q40N615N199j552o247l060K923N239J259
5184D211m197m563J564N700K891l614o704r42N142N987l67o351m475K409O030
5199B721K668m007n824r27O220N122j710o283m324K812O360K614m033m454o92
$$ plain form
5214 -3737 230 4200 2325 -2984 -4857 -846 4179 4670 188 -4466 -3804 1073 3977 1044 -3067
5229 -3067 -3007 961 4589 3280 -2979 -6163 -2289 3711 5854 1438 -3784 -4497 614 4461 2306 -2560
5245 -2560 -4877 -1424 4573 5893 -26 -5477 -4616 606 4763 3440 -1584 -4241 -1339 2943 3144
5260 3144 -965 -4069 -2565 2181 5140 2008 -3509 -4464 -1173 2504 2793 -573 -3139 -501 3472
5275 3472 3029 -925 -5211 -4265 1421 5605 3576 -1868 -4405 -1630 2644 3477 -436 -4852 -2742 3293
5291 3293 5903 2244 -3744 -6175 -1942 4345 5066 477 -3746 -2978 1329 3647 829 -3880 -4045 959
5307 959 5141 3712 -1333 -5033 -3103 1805 3447 608 -2628 -1976 1930 3504 698 -4383 -4907 -66
5323 -66 5194 4792 -341 -4502 -3750 1245 3842 768 -3427 -3319 1082 5550 4211 -2619 -6748 -3883
$$ packed form
5214c737L967L970j875n309j873M011N025M91m482m654O62M877K904k933m111
5229c067O0L968L628j309o259l184L874O000K143m416n222p13N111L847k155m866
5245b560k317L453N997J320n919n451Q61N222M157j323n024k657K902M282K01
5260C144m109l104J504M746K959l132n517r55L291L677K89l366k566K638L973
5275C472m43l954m286R46N686M184k029n444k537K775M274Q33l913m416K110O035
5291C293K610l659n988k431M233O287P21m589m223P68M307K318k818m709j65N004
5307I59M182j429n045l700J930M908J642k839l236O52L906J574k806n081n24M841
5323f6N260m02n133m161P52M995K597l074m195J08M401M468j339o830m129K865
$$ plain form
5339 -3883 2615 5724 2990 -2430 -4144 -153 3463 1888 -2568 -4621 -1016 4601 5585 218 -4911
5354 -4911 -4426 370 3993 2169 -1920 -2909 1095 4265 1962 -3712 -5800 -1637 4508 5996 1157
5369 1157 -4240 -4356 381 3399 2039 -2808 -4355 275 5459 4204 -1746 -6423 -4527 1282 5464
5384 5464 3307 -1690 -3483 -512 2248 1710 -1679 -4391 -1516 3403 4939 1591 -3641 -4651 -1323
5399 -1323 2849 2944 -301 -2001 -38 2718 2177 -1422 -5064 -2821 2408 5478 3352 -2041 -4195 -1735
5415 -1735 2611 2856 -1029 -3712 -1277 3544 5417 896 -5343 -6042 -261 5072 4701 263 -3614 -2589
5431 -2589 1432 2459 -767 -3588 -2439 2331 5193 2767 -3159 -5132 -2384 1736 2759 750 -1388
5446 -1388 -697 2128 2058 -1408 -4506 -3365 1137 4764 3861 -720 -3599 -2437 886 1838 427 -1589
$$ packed form
5339c883O498L109k734n420j714L991L616j575m456k053L605N617R84n367n129
5354d911M85M796L623j824m089r89M004L170k303n674k088M163O145J488m839
5369A157n397j16M737L018j360m847j547M630N184j255n950m677J896N809M182
5384E464k157m997j793K971K760n38l389k712K875M919J536l348n232j010L328
5399a323M172R5l245j700J963K756n41l599l642K243N229L070k126n393k154K460
5415a735M346K45l885k683K435M821J873m521o239o99N781N333l71m438l877J025
5431b589M021J027l226k821J149M770K862k426n926j973K748M120J023k009k138
5446a388O91K825p0l466l098J141M502L627r03m581k879J162L323R52j411k016
$$ plain form
5462 -1589 -1541 2245 4331 1890 -2921 -5393 -2731 2655 5450 2934 -1702 -3354 -1014 1943 1740 -1751
5478 -1751 -3360 -274 4413 4547 -304 -4968 -4546 -212 3738 2755 -839 -2125 129 2666 965 -3107
5494 -3107 -5054 -965 4397 5206 758 -3911 -4462 -367 2281 1561 -2202 -2367 1126 4436 3271 -2037
5510 -2037 -6368 -3823 2330 5381 3521 -1076 -3130 -1584 1338 1350 -1399 -3019 -348 3429 4358 1254
5526 1254 -4126 -4947 -1373 2663 3655 953 -1566 -1529 1147 1710 -1294 -4128 -2586 2296 5575 3148
5542 3148 -2203 -5035 -2296 1630 2946 293 -2857 -1014 3804 4463 -440 -6173 -5892 251 5706
5557 5706 4898 -9 -4259 -2750 1078 2193 -542 -3677 -1907 3445 6028 1464 -3689 -5333 -1812
5572 -1812 2832 3901 1191 -1567 -552 1329 1169 -1443 -3710 -2410 2230 5035 2853 -1194 -3424
$$ packed form
5462a589M8L786K086k441m811k472K662N386K795k516m636j652K340K957k03l491
5478a751j609L086M687J34m851m664M22M334L950r83l594j286K254K537j701m072
5494c107j947M089N362Q09m448m669n51M095K648p20l763j65L493L310j165n308
5510b037m331K545O153L051j860m597k054J546K922J2k749j620K671L777R29l104
5526A254n380q21L574M036R92k702k519L7K676N63l004k834J542M882L279k427
5542C148n351k832K739L926J316k653l150J843M818O59m903n733K81O143N455
5557E706q08m907m250J509L828J115k735l135J770N352K583m564n153j644L521
5572a812M644J069k710k758J015J881j60k612k267J300M640K805k182m047k230
$$ plain form
5587 -3424 -2488 322 1874 151 -1223 -553 1882 3169 346 -4045 -5260 -1534 4130 5171 1885
5602 1885 -2250 -3807 -884 1815 1170 -1705 -2877 1136 4403 3761 -1559 -5893 -4249 1111 4062
5617 4062 3098 -438 -2243 -343 2214 563 -3300 -3744 627 5230 4233 -307 -3868 -3368 820 2431
5633 2431 895 -1178 -955 1900 3754 1389 -3523 -4958 -1785 3239 4630 2120 -1111 -2752 -1140
5648 -1140 340 567 -737 -1427 315 3175 3318 -491 -3850 -3748 -1403 2588 3630 1523 -728 -1868
5664 -1868 -489 422 -923 -2605 -1533 2416 4738 1991 -2508 -4476 -2346 1468 2878 642 -2057
5679 -2057 -913 2297 3218 -855 -5422 -4231 1235 5912 4462 -725 -4141 -2804 877 2153 -45
5694 -45 -2576 -825 3102 4228 631 -4098 -4955 -1230 3072 3690 1348 -809 -926 -5 384 -1333 -2639
$$ packed form
5587c424R36K810J552j723j374O70K435J287k823m391j215L726N664J041l286
5602A885m135j557K923K699o45k875j172M013L267o42n320m334J644N360K951
5617D062r64l536j805J900K557j651l863m44M371M603r97m540l561N00M188J611
5633B431j536k073K23K855J854k365m912j435L173N024J391k510l231j641J612
5648a140J480K27j304o90J742K860J43l809l359J02K345L991J042k107k251j140
5664a868J379R11j345j682J072L949K322k747m499j968K130L814J410k236k699
5679b057J144L210R21m073m567J191N466M677j450n187l416J337L681J276k198
5694d5k531J751L927J126l597m729q57L725M302O18k342k157j17R21L89j717j306
$$ plain form
5711 -2639 -744 2336 3798 1981 -1540 -3652 -2164 254 1700 1312 -194 -249 817 1972 111 -3519
5727 -3519 -4428 -800 3759 5041 1855 -3041 -4250 -1394 1752 1831 -1363 -2000 473 4432 3174 -2115
5743 -2115 -6034 -3717 1665 5494 3333 -1251 -2915 -707 1746 639 -2593 -3153 1238 5116 3977
5758 3977 -1241 -4926 -3185 972 2682 1482 -1084 -978 1859 2920 -40 -3871 -4876 -413 4267
5773 4267 4360 1304 -2191 -2504 -1175 483 563 -761 -988 1388 2610 1966 -1491 -4193 -3494 -224 3185
5790 3185 3685 1113 -1509 -1965 -750 282 -547 -1805 -467 2580 3677 1202 -2711 -4686 -1845 2180
5806 2180 3207 1121 -1045 -687 1839 2218 -2095 -5179 -2914 2929 5683 3129 -1761 -4396 -1931
5821 -1931 1449 1766 -554 -2193 393 3360 3633 -749 -4942 -3947 380 3310 3132 797 -1173 -942
$$ packed form
5711b639J895L080J462j817l521k112J488K418J446l88j506n5J066J155j861l630
5727c519r09L628M559J282l186m896j209K856L146P9l194o37K473L959j258n289
5743b115l919K317N382L829k161m584j664K208K453j107l232n60M391L878j139
5758C977n218l685J741M157J710j200k566J06K837J061k960l831j005M463M680
5773D267R3l056l495l13J329J658Q0j324k27K376J222o44l457k702O99L270L409
5790C185N00k572k622m56J215J032q29j258J338L047J097k475l913j975K841M025
5806B180J027k086k166L58K526L79m313l084K265N843K754k554m890k635K465
5821a931L380L17k320j639K586K967K73m382m193R95M327K930j78k335j970K31
$$ plain form
5837 -942 -252 -376 -1473 -1213 483 2374 2894 973 -1950 -2943 -1810 324 1822 1846 513 197 177 224
5855 224 -983 -2805 -2644 231 3748 3926 829 -2842 -3543 -1250 1709 1660 -330 -1219 675 3215 1890
5872 1890 -2393 -4996 -2795 2415 5074 2712 -1620 -2689 -1265 1090 584 -1989 -2072 1522 4490 2821
5888 2821 -1723 -4751 -2871 788 3026 1283 -539 -606 898 1303 -514 -3442 -2934 835 3969 3708
5904 3708 619 -2378 -2874 -696 910 825 221 70 653 1911 1146 -1411 -3387 -2794 470 3216 3458
5921 3458 812 -2538 -2825 -564 605 415 -744 -452 2207 3800 978 -3225 -4309 -1170 2643 3406
5937 3406 997 -2121 -986 1574 1092 -1951 -3731 -1871 2860 5557 2387 -2983 -4790 -1815 2026
5952 2026 1862 -240 -1650 330 2819 2682 -1645 -4493 -3072 1086 4037 3066 -267 -1987 -1605 -531
$$ packed form
5837i42O90j24j097K60J696J891N20j921k923r93J133K134J498K4j333l16k0M7
5855B24j207j822J61K875L517J78l097l671p01K293K959m9j990q89J894K540j325
5872A890m283k603K201N210K659k362m332j069J424K355n06k573q3L594K968j669
5888B821m544l028J880L659K238j743j822o7J504M05j817k928N08L769L134k61
5904C708l089k997m96K178J606q5o04j51N83J258p65k557j976N93L264K746K42
5921C458k646l350k87K261J169j90j159K92K659J593k822m203j084L139L813P63
5937C406k409l118J135K560m82l043j780J860M731K697l170n370j807K975L841
5952B026j64k102j410J980K489j37m327k848J421M158K951r71l333j720L82J074
$$ plain form
5968 -531 185 -723 -457 745 2520 2353 -5 -2565 -3212 -1707 1176 2377 1668 384 -332 -275 -37 -900
5986 -900 -1932 -1313 1106 3613 3163 -483 -3458 -3899 -258 2534 1856 -691 -990 777 2555 736
6002 736 -2944 -4478 -1433 3287 4662 1647 -2269 -3420 -493 1452 407 -1515 -980 1885 3406
6017 3406 1574 -2542 -4329 -2052 1758 3001 1348 -705 -413 728 380 -1557 -2787 -1122 1842
6032 1842 3456 2634 -583 -2578 -2682 -477 615 1175 535 423 622 1061 157 -1908 -2899 -1736 985
6049 985 3138 3085 7 -2317 -2775 -898 1324 573 -609 -242 1550 2263 299 -2946 -3907 -573 2930
6066 2930 3353 629 -1615 -1172 357 755 -1161 -2889 -471 3502 4397 999 -3217 -4014 -947 2571
6082 2571 2383 -262 -1143 417 2170 871 -1620 -3819 -2057 1786 4215 2486 -373 -2053 -2123 -321
$$ packed form
5968e31P16r08K66J202J775j67k358k560o47J505K883J201p09j284p16N7K38q63
5986i00j032O19K419K507m50l646k975m41L641K792o78k547k99J767J778j819
6002G36l680j534L045M720J375l015l916j151K927J945j045j922N35K865J521
6017C406j832m116j787K277L810J243j653k053K92J141l48j937j230J665K964
6032A842J614q22l217j995j04K205J092N60o40j12J99M39r04k065r91J163K721
6049I85K153n3l078k324m58J877K222p51j182L67J792P13j964l245r61L334L503
6066B930M23k724k244M43J529L98j916j728K418L973Q95l398m216p97L067L518
6082B571j88k645q81J560J753j299k491k199J762L843K429j729k859j680p0J802
$$ plain form
6098 -321 243 115 -20 1005 1326 1612 -13 -2357 -2699 -705 1123 2582 1758 76 -874 -1219 -284 -632
6116 -632 -808 -495 1171 3096 2459 -802 -3623 -3019 508 3123 2137 -668 -1567 491 2004 246 -2826
6133 -2826 -3851 -390 3865 4604 776 -3268 -3756 -184 1868 1111 -847 -1389 1363 3197 698 -2816
6149 -2816 -3759 -1119 2194 3290 1114 -985 -845 325 386 -1096 -2275 -644 1884 3405 1601 -1204
6165 -1204 -2778 -2167 -218 1450 1154 58 80 395 570 -76 -1620 -2435 -438 2144 3076 1978 -1153
6182 -1153 -3040 -2342 -13 1909 908 -402 -289 1346 2193 -336 -3183 -2780 332 3420 3033 164
6198 164 -1784 -1517 295 503 -1035 -1723 659 3140 3373 42 -3369 -3298 -263 2631 1720 -175 -1000
6215 -1000 352 1602 565 -2276 -3011 -697 2367 3290 1224 -1292 -2369 -1445 -155 952 437 169
$$ packed form
6098c21N64j28j35J025L21K86j625k344l42J994J828J459q24j682r50l45R35l48
6116f32j76L13J666J925o37l261k821O04L527K615r86k805q99K058J513j758l072
6133b826j025L461M255P39l828m044m88L572K052p57j958n42K752J834k499l514
6149b816r43K640L313J096k176k099J40J170O1j482j179J631K528J521j804k805
6165a204j574O11J949J668k96j096K2L15J75o46j544q15J997K582R32j098l131
6182a153j887O98K329J922j001j310J13J635Q47k529k847M03L112L088l87k869
6198A64j948K67J812K08j538o88K382K481K33l331l411P1L035K894r11j895q25
6215a000J352J250j037k841p35K314L064R23k066k516j077R24J290J107n15k68
$$ plain form
6231 169 709 1084 796 -850 -2095 -1727 -440 1330 2368 1161 -235 -1353 -1306 -216 -88 -282 -147
6248 -147 1517 2214 1169 -1269 -3218 -1922 944 2683 1917 -543 -1270 107 1047 -69 -2202 -2448
6264 -2448 580 3655 2984 -241 -3023 -2986 -311 2170 1459 -661 -819 839 1846 78 -2304 -3076
6280 -3076 -308 2343 2287 586 -555 -1073 -573 -162 -495 -938 -142 1348 2257 830 -1238 -2583 -1603
6297 -1603 389 1550 1340 496 -178 -156 368 -136 -1566 -1409 -272 2009 2865 1068 -1482 -3071 -1872
6314 -1872 689 1929 822 -708 -738 1021 1239 -683 -3074 -1998 926 3024 2261 -681 -2123 -1666
6330 -1666 551 1000 -604 -1198 4 2529 2398 -575 -3393 -2566 437 2294 1950 -231 -976 -142 1097
6347 1097 268 -1892 -2127 -270 2262 2960 640 -1744 -2203 -1133 725 966 704 -269 153 726 635 -813
$$ packed form
6231A69N40L75k88j646j245L68J287J770J038j207j396j118M7J090J28j94J35
6248a47J664O97j045k438j949J296K866J739p66k460p27J377R40j116k133k46
6264b448L028L075o71l225k782L7K675K481p11k120j58J658J007j768k382p72
6280c076K768K651n6j701j141n18N00M11l33m43P96J490R09j427k068j345R80
6297a603J992J161k10q44o74K2N24n04j430J57J137K281Q56j797k550j589J199
6314a872K561J240j107j530l0J759K18j922k391J076K924K098p63k942j442M57
6330a666K217M49j604n94J202K525j31k973k818Q27L003J857l44k181p45Q34J239
6347A097q29k160k35J857K532O98k320k384m59J070J858K41k62r73M22N73r1j448
$$ plain form
6365 -813 -1796 -1324 444 2170 2016 814 -896 -1558 -1042 236 451 -192 -90 1267 1602 764 -1415 -2780
6383 -2780 -1197 1526 2143 1150 -884 -1392 -28 1109 -238 -2176 -1475 1298 3298 2271 -1026 -3200
6399 -3200 -2109 525 2020 626 -711 -423 721 1275 -102 -2573 -2230 378 2335 2086 200 -1325
6415 -1325 -1215 -359 -37 -70 -187 324 1370 1691 181 -1735 -1792 -721 587 1420 1086 259 -546 -320 66
6434 66 -352 -696 -932 -119 1516 1878 441 -1823 -2585 -733 809 1507 297 -711 -473 709 796 -745
6452 -745 -2096 -1283 1370 2545 1397 -1187 -1976 -1354 494 1021 -71 -807 119 1717 1305 -830 -2274
6469 -2274 -1653 413 2114 1315 -247 -979 -541 335 256 -1149 -1546 516 2287 1874 559 -1414 -1724
6486 -1724 -620 1171 1149 642 -16 -225 166 347 -785 -1422 -819 476 1673 1814 -38 -1283 -1685 -363
$$ packed form
6365h13r83M72J768J726j54j202j710o62N16J278K15o43J02J357L35q38k179j365
6383b780J583K723O17r93k034n08J364J137j347j938P01K773K000j027l297k174
6399c200J091K634J495j394j337K88J144N54j377k471L43K608J957k49j886j525
6415a325J10Q56L22l3j17N11J046L21j510j916n7J071J308Q33l34q27q05K26L86
6434F6m18l44k36Q13J635L62j437k264p62J852J542O98j210j008K38J182Q7j541
6452g45j351Q13K653J175j148k584p89O22J848N27j092p36R26J598m12k135j444
6469b274O21K066J701p99j562p32M38Q76p9j405l97K062J771m13j315j973l10
6486a724J104J791k2n07o58k09L91J81j132o37O03J295J197J41j852j245m02J322
$$ plain form
6504 -363 634 744 42 -74 396 1114 225 -1679 -2089 -562 1158 2163 822 -1319 -1192 -78 800 140
6522 140 -1031 -928 693 2704 1423 -1345 -2858 -1479 952 2002 1051 -808 -946 525 1170 16
6538 16 -1692 -1689 478 2150 1952 -293 -1761 -1472 195 431 434 -469 6 774 970 -203 -1388 -1291 -222
6557 -222 796 1636 451 -405 -712 -428 668 -206 -654 -779 526 1826 1544 10 -1904 -1751 27
6574 27 1723 1315 -29 -675 -228 422 304 -633 -1689 -429 1205 1917 869 -1511 -2060 -813 1141
6591 1141 958 -171 -384 303 1301 738 -781 -1573 -954 875 1645 812 -475 -1170 -125 399 -6 -757
6609 -757 -783 726 1333 1423 -566 -1786 -1343 101 974 1043 88 -525 -612 366 198 -410 -817 -681 886 1442
6629 1442 1375 -353 -1342 -790 -342 768 584 -109 -52 400 690 -194 -715 -1295 -143 1131 1476 328 -883
$$ packed form
6504c63R97J10p02j16M70P18q89j904m10J527J720J005j341k141J27J114Q78o60
6522A40j171J03J621K011j281k768j513J379K431J050r51j859j38J471O45j154
6538A6j708LK167J672j98k245j468K89J667K36Lr03M75P68J96j173j185R7J069
6557b22J018Q40j185q56l07K84J096q74m48j25J305J300k82j534j914J53J778
6574B7J696m08j344o46M47O50j18r37j056J260J634P12j048k380n49J247J954
6591A141j83j129k13O87R98n63j519p92O19J829P70q33j287o95J045N24m05p51
6609g57k6J509O07R0j989j220M43J444Q73O9r55o13q7R78j68o08m07J36J567N56
6629A442o7j728r89N52M48J110j84o93N7M52K90q84n21n80J152J274L45j148j211
$$ plain form
6648 -883 -604 -62 645 -10 -774 -441 935 1531 544 -1484 -1669 -610 994 1443 263 -467 -774 209
6666 209 598 365 -1289 -1108 447 1584 1251 -236 -1218 -1154 17 640 398 -35 -193 322 799 -187 -874
6685 -874 -1295 -155 1052 1190 688 -673 -903 -738 428 369 -472 -316 614 1023 728 -325 -1675 -916
6703 -916 360 1377 1055 -299 -916 -449 983 424 -561 -1090 -373 1018 1741 184 -1305 -1663 -321
6720 -321 1019 872 39 -720 -218 853 597 -709 -1325 -283 809 1715 680 -958 -812 -243 458 168
6738 168 -573 -655 166 1245 813 -440 -1426 -1128 147 1331 749 -665 -410 -175 308 492 -289 -825 -692
6757 -692 760 1524 442 -599 -1248 -969 636 871 497 -492 -379 727 33 -59 -646 -709 393 983 807
6776 807 -179 -1143 -391 417 548 -299 -777 -22 555 872 130 -1356 -1379 109 1196 988 -158 -942 -843
$$ packed form
6648h83K79N42P07o55p64L33J376N96r87k028j85J059J604M49j180p30l07R83
6666B09L89k33j654J81J555J137l33j487r82O4J171O23k42m33j58N15M77r86o87
6685h74m21J140J207J38n02j361k30J65J166n9q41J56R30M09k95j053j350P59
6703i16J276J017l22j354o17M67J432n59r85n29P17J391P23j557j489l58J342
6720c21J340j47q33p59N02J071k56j306o16J042J092R06j035j638J46N69P01k90
6738A68p41q2Q21J079m32j253r86K98J275J184n82j414K55K35M83J84p81n36J33
6757f92J452P64j082j041o49K79J605K35l74r89J13J106o94r2n87o3J102N90j76
6776H07r86r64P52Q08J31q47m78P55N77L17p42j486k3J488J087k08j146p84R9
$$ plain form
6795 -843 462 718 -248 -733 -637 665 1328 544 -676 -1460 -503 118 750 178 -269 -224 179 496 -99 -265
6815 -265 -563 138 572 811 283 -683 -619 407 385 -80 -348 -164 513 787 173 -440 -1025 -213 686 892
6835 892 346 -813 -1102 -240 500 409 -310 -719 -143 704 1120 -12 -1033 -1001 93 778 803 -13 -606 -60
6855 -60 626 339 -359 -574 -16 689 906 443 -312 -787 -245 399 406 -211 -363 67 672 500 -441 -1256 -237
6876 -237 445 1119 245 -557 -548 -358 512 302 -157 -865 -366 660 993 153 -950 -1243 -476 561 759 94
6896 94 -705 -504 322 933 -226 -630 -455 -39 588 726 -329 -967 -502 553 422 -255 -664 -471 366
6915 366 740 190 -941 -511 343 887 665 -378 -998 -127 543 732 -70 -680 -705 326 1220 377 -791
6934 -791 -937 -181 394 969 269 -607 -276 453 760 130 -888 -643 308 692 605 -281 -613 -798 233 652
$$ packed form
6795h43J305K56r66m85R6J302O63p84j220p84R57O21O32n72m47M5M03L17n95j66
6815b65k98P01M34K39n28r66O4J026k2m65k68J84O77K74o14o13n85Q12Q99K06
6835H92n46j159k89Q62P40r1p19m09N76Q47M16j132j021L2J094O85K5q16n93N46
6855f0O86k87o98k15N58P05K17m63p55m75N42O44Po17j52M30O05j72r41q15J019
6876b37O82O74q74q02RJ90Q70k10m59p08M99J026L33q40j103k93P67J037J98o65
6896I4p99K01Q26O11j159m04J75M16O27J38j055o38M65J055j31o77m09J93Q37
6915C66L74n50j131M30Q54N44k22j043o20Q71O70J89q02o10k5J031Q94q43j168
6934g91j46P56N75N75p00q76L31P29L07o30j018K45R51L84q7q86l32j85J031M19
$$ plain form
6954 652 203 -521 -311 174 632 -43 -980 -882 -223 704 526 -379 -503 -615 359 840 62 -824 -565 353
6974 353 841 411 -376 -733 -52 426 656 -7 -242 -692 413 654 514 -437 -630 257 371 770 431 -416
6994 -416 -125 -75 493 365 -444 -442 96 594 68 -460 -793 -347 385 814 -2 -608 -499 -68 462 140 -485
7015 -485 -535 -88 602 725 125 -867 -547 102 638 327 -88 -644 -380 468 531 -78 -385 -535 141 704 178
7036 178 -286 -204 76 252 634 30 -597 -213 224 622 -182 -305 -318 136 736 240 -248 -757 -96 322 417
7057 417 -65 -498 -330 403 437 73 -407 -597 -36 636 325 -107 -859 -526 205 661 86 -431 -577 25
7077 25 353 170 -257 -269 -295 202 179 10 -500 -267 240 354 353 -630 -385 7 674 638 -301 -878 -121 167
7099 167 644 324 -474 -454 180 554 466 -320 -546 -215 492 528 48 -70 -821 46 376 523 -325 -625 -248
$$ packed form
6954F52m49p24K10M85M58o75r37R8O59R27j78r05j24j12R74M81p78q86K59R18
6974C53M88m30p87l57O81M78K30o63k35m50J105K41j40r51j93Q87J14L99l39q47
6994d16K91N0N68j28q09KN38M98n26n28l33M46P32M29q16o06J09M31N30l22o25
7015d85n0M47O90J23o00r92L20O49N36l11m15n56K64Q48O3o09l07j50O76N63n26
7036A78m64Q2K80J76L82o04o27L84M37L98q04j23j3M54O00m96m88n09O61M18R5
7057D17m82m33J68P33L4l64m80j90N61O72l11m32p52L33P31M56n75n17j46O02
7077B5L28j83m27j2k6M97k3j69n10K33N07J14jr83K45L92O67l6r39n77P57K88
7099A67M77l20p98K0O34L74q8p86k26L31P07L6m80j18p51Q67L30J47q48l00L77
$$ plain form
7120 -248 192 318 66 -441 -350 150 340 242 -170 -724 316 493 578 -356 -513 -140 358 318 -188 -524 -599
7141 -599 357 672 218 -226 -461 -121 552 232 112 -407 -295 305 811 62 -444 -388 24 747 503 -118
7161 -118 -725 -511 298 559 289 -293 -156 -6 576 161 -348 -561 -167 376 315 -43 -488 -302 383 378 -140
7182 -140 -428 -320 300 693 526 -553 -491 -239 358 450 323 -273 -403 341 545 40 -271 -635 -491 410
7202 410 437 -123 -490 -203 13 262 103 -322 -168 -27 233 68 -106 -658 -314 365 303 236 -243 -194 20
7223 20 447 266 -479 -805 154 436 105 -47 -293 -572 -146 574 196 -73 -590 -169 263 609 -246 -255 -84
7244 -84 460 686 274 -608 -524 -251 277 589 -111 -166 -54 511 281 -25 -280 -506 87 462 184 -396 -160
7265 -160 18 7 162 -308 -212 -155 272 483 76 -388 -705 394 436 395 41 -588 -331 464 652 50 -335
$$ packed form
7120b48M40J26k52n07R1N00J90r8m12n54J040J77Q5r34j57L73M98m0n06l36p5
7141e99R56L15m54m44k35L40O73l20j20n19J12O00N06p49n06N6M12P23k44o21
7161a18o07K14Q09K61k70n82J37J50N82m15n09k13L94N43o1l58m45J86O85nn18
7182a40k88J08O20L93j67j079O2K52N97R2j27n96j30P44K04n05l11l64J44R01
7202D10K7n60l67K87K16K49j59m25J54J41K60j65j74n52L44O79o2o7m79M9K14
7223B0M27j81p45l26R59K82l31j52k46k79M26P20l78k69n17M21M32L46q55rJ71
7244h4N44K26m12q82Q4K73N28L12p00n5J12N65k30l06k55k26N93L75k78n80K36
7265a60J78j1J55m70R6N7M27K11m07m64l17J099M2m1l54o29K57P95J88o02l85
$$ plain form
7286 -335 48 114 589 327 -42 -451 -278 462 602 -108 -249 -323 187 -26 -157 -112 -713 75 372 443 -477
7307 -477 -616 -378 437 397 -224 -146 183 279 637 308 -487 -442 -50 566 398 -118 -246 -298 178 147 -88 -457
7329 -457 -447 217 624 636 -314 -676 -549 139 437 343 -71 -214 -33 447 504 -58 -491 137 422 512 142 -662
7351 -662 -457 221 247 312 -215 -375 131 459 81 -543 -331 -409 456 467 -73 -252 -300 -29 574 272 -170 -470
7373 -470 -34 329 526 -107 -691 -47 276 207 279 -366 -306 52 525 -136 23 -424 248 286 406 -167 -455
7394 -455 -409 -78 159 214 -26 -221 416 547 262 -322 -471 -408 387 268 191 42 -441 -174 259 -103 -120 -530
7416 -530 -369 114 487 309 -490 -665 93 155 570 165 -487 73 473 261 -368 -393 -450 227 517 217 -86
7437 -86 -264 -195 191 -42 -329 -318 -121 486 613 -474 -468 -404 83 773 366 27 -297 -129 107 465 86 -608
$$ packed form
7286c35L83O6M75k62l69m09J73P40J40p10j41p4N10k13j31M5o01P88K97P1r20
7307d77j39K38Q15m0o21P8L29R6L58l29p95M5L92O16j68n16j28n2M76l1k35l69
7329d57J0O64M07J2r50l62J27O88K98r4m14j43J81M80N7n62m33O28K85R0l70q04
7351f62K05O78K6O5n27j60N06L28l78o24K12p8Q65J1n40j79m8K71O03l02m42l00
7373d70M36L63J97o33n84O44L23o9P2o45O0L58M73o61J59m47O72L8J20n73k88
7394d55M6L31K37N5k40j95O37J31k85n84j49O3P95j19p7j49m83K67M33l62j7m10
7416e30J61M83L73j78p99j75P58O2M15m05o52N60M00k12o29k5n7O77K90l00l03
7437h6j78O9L86k33k87J1J97O07J27j087OO4M87O90m07l39l24J68K36L58l79o94
$$ plain form
7459 -608 -111 128 484 238 -182 -602 -403 336 260 -55 -504 -87 134 30 -18 -343 -428 -39 209 349 35
7480 35 -660 -545 45 356 -155 73 -476 221 627 -53 -239 -587 -25 684 816 159 -524 -547 431 404 191
7501 191 -427 -400 89 660 472 -25 -916 -399 78 393 184 -348 -398 -191 229 -83 -340 -127 -6 734 943
7522 943 -110 -418 -512 -175 186 -6 -42 -398 257 534 235 -162 -822 -112 438 410 43 -275 -538 -1 381
7543 381 114 -113 186 9 552 498 73 -553 -523 -11 544 437 -68 -478 -274 497 460 -256 -706 138 525
7564 525 358 210 -402 -701 -70 312 381 117 -508 196 382 352 -442 -507 -90 430 627 249 -425 -328 34
7585 34 517 226 -173 -14 222 495 542 -241 -529 -662 -92 786 532 -117 -411 -181 302 -13 -40 -454 -20
7606 -20 212 249 407 -399 -617 -327 772 509 335 70 -90 154 391 -192 -498 -410 49 809 680 -78 -799
$$ packed form
7459f08M97K39L56k46m20m20J99P39p6l15m49M17K21j04m8l25q5L89K48J40l14
7480C5o95J15N90L11n11K28n49O97M06o80j86l48N62P09J32o57o83k3R78k7k13
7501A91o18K7M89N71j88m97q91N17M77L15k09n32n0K07M20l12k57K13J21P40K09
7522I43j053l08r4L37L61j92l6l56O55K77k99l97o60P10N50k8l67l18k63N37L82
7543C81k67k27K99j77N43n4m25o26L0N12N55j07n05m10K04P71l7p16m50Q44L87
7564E25j67j48o12k99O31L82O9k64o25P04J86l0p94o5M17N20J97l78o74R7L62
7585C4M83k91l99J59K36K73M7p83k88j33N70Q78k54o49k94K30M83l15k7m14M34
7606b0K32L7J58q06k18K90J099k63j74k65j60K44K37n83l06Q8M59P60j29p58p21
$$ plain form
7627 -799 -187 334 243 -202 -269 -150 348 601 321 -676 -836 316 335 898 -33 -385 -468 80 316 485 -717
7648 -717 -380 248 421 400 -151 -602 -299 30 451 216 -237 -32 172 147 144 -110 -248 286 449 431 161 -354
7670 -354 -346 -190 -57 287 -99 -245 119 559 319 -281 -857 -604 335 533 184 -523 -806 -321 151 296 -405
7691 -405 -305 34 601 456 -106 -684 -540 71 445 321 -179 -360 59 337 283 -375 -405 106 557 843 76
7712 76 -401 -471 -292 393 -204 -445 19 58 472 318 -367 -860 -301 367 803 744 -293 -324 -193 -112 272 -84
7734 -84 -355 13 199 557 175 -415 -833 -331 436 501 69 -250 -65 162 48 -123 -427 -256 368 713 56
7755 56 -630 -845 -580 394 184 -105 -62 -24 460 322 -193 -986 -644 241 710 416 -160 -399 -434 163 5
7776 5 -316 -384 26 334 436 132 -641 -454 -127 69 500 122 -256 -340 172 -7 231 -24 -293 190 678
$$ packed form
7627g99O12N21r1m45o7J19M98K53k80r97j60J152J9N63r31l52q3N48K36J69j202
7648g17L37O28J73k1n51m51L03L29M21k35m53K05K04k5lk54j38N34J63j8k70n15
7670c54QJ56J33L44l86j46L64M40k40o00n76K53R39J98l49p07k83M85M72J45p01
7691d05J00L39N67j45n62n78J44O11L74j24n00j81M19K78n4o58l0N11M51K86p67
7712G6m77p0J79O85n97k41M64L9M14j54o85m93N59O68M36n9j037l1J31Q1L84l56
7734h4k71L68J86L58l82n90m18N02P67O5m32l19J85K27j14j71l04J71O24L45o57
7755E6o86k15K65R74k10k89M3L8M84j38n15p93L42Q85M69k94n76k39l5N97j58
7776El21o8M10L08J02l04p73J87L27J96M31l78l78q4N12j79K38k55k69M83M88
$$ plain form
7797 678 606 88 -517 -427 95 276 227 -348 -219 309 60 -100 -297 -770 -445 567 728 277 -354 -360 -152
7818 -152 494 -21 -35 -203 284 678 52 -205 -1044 -279 296 612 307 -5 -407 61 245 -3 -569 96
7838 96 183 771 727 14 -930 -509 93 452 285 140 105 340 155 -137 -550 -582 -206 658 445 264 -190 -438
7860 -438 -154 95 347 -257 -54 -77 440 429 87 -810 -417 -157 596 730 -260 -546 -481 170 291 -307 -598
7881 -598 -271 479 897 253 -681 -958 -216 566 580 -36 -336 -67 416 -26 -471 -533 -340 500 1230 252 -444
7902 -444 -871 -539 -100 280 -101 -448 187 440 148 27 -567 -840 31 665 604 40 -194 -322 -209 52
7922 52 66 -783 -172 459 682 276 -210 -792 -324 329 843 641 -285 -276 218 199 -177 -637 -506 111 743 991
7944 991 -129 -642 -418 79 535 125 -96 -16 582 299 60 -534 -819 0 229 609 150 -629 -388 403
$$ packed form
7797F78p2n18o05R0N22J81m9n75J29N28k49j60j97m73L25J012J61m51o31oK08
7818a52O46n15j4j68M87L94o26k57q39P65N75L16l05l12m02M68J84k48n66O65
7838I6Q7N88m4p13r44M21O02L59j67j45l5K35j85k92m13l2L76Q64k13j81m54k48
7860d38K84K49K52o04K03k3N17j1l42q97L93K60P53J34r90k86O5O51J21n98k91
7881e98L27P50M18o44r34k77P42P82J4o16l00K69M83m42m45o2J93Q40P30r78o96
7902d44m27L32M39L80l81l47O35K53k92j21n94k73Q71O34o1n64k34j28J13K61
7922E2J4q49O11O31K23m06m86n82M68O53N14k02r26RM94j9l76m60J31O17O32K48
7944I91j120n13K24M97M56m10k21Q0N98k83k39n94k85Q19K29L80m59p79K41P91
$$ plain form
7964 403 45 -114 -484 -115 435 564 319 -243 -744 -370 202 190 453 -168 75 314 332 -423 -242 -270 46
7985 46 723 788 -48 -672 -566 -182 414 27 32 -194 -50 179 214 -322 -711 -563 94 973 720 19 -599 -635
8007 -635 182 158 -265 -271 16 536 793 63 -867 -770 117 823 712 -118 -215 116 119 145 -422 -975 20 693 1152
8030 1152 331 -444 -843 -65 403 85 -189 -108 187 267 225 -287 -712 -142 147 776 226 -6 -499 -643 -235
8051 -235 255 50 -38 108 267 377 188 -396 -708 -313 479 672 118 -245 -524 -22 214 256 -618 -319 594
8072 594 878 535 -363 -861 -820 613 809 109 -505 50 255 622 406 -777 -830 26 1059 597 -103 -619
8092 -619 -635 246 506 -11 -207 -154 463 661 98 -692 -1015 -483 306 473 312 37 126 73 188 -21 -296
8113 -296 -72 133 616 367 89 -669 -373 -69 516 414 -111 -174 -48 530 73 -287 -647 -3 716 1099
$$ packed form
7964D03l58j59l70L69N50J29k45n62n01L74N72j2K63o21K43K39J8p55J81k8L16
7985D6O77O5q36o24J06L84N96l87Nk26J44K29L5n36l89J48O57Q79k53p01o18l6
8007f35Q17k4m23oK87N20K57p30r30R7Q87P06j11q30r7L31LK6n67n53R95O73M59
8030A152q21p75l99P78M68l18k74Q1K95Q0m2n12m25N70K89O29n50k32m93j44M08
8051b35M90k05q8J46J59J10j89n84l12L95P92J93n54l63k79N02K36M2q74K99R13
8072E94K84l43q98m98M1J433J96p00o14N55K05L67k16j183n3Q56J033m62p00n16
8092f19j6Q81K60n17j96N3O17J98n63p90l23N32P89J67j61k75Q9n3J15k09k75
8113b96K24K05M83k49k78p58K96L04N85j02n25o3J26N78m57l60l60O44P19L83
$$ plain form
8133 1099 539 -423 -1098 -154 301 278 120 -174 69 637 88 -300 -836 -721 240 810 463 -293 -344 41
8153 41 149 171 -286 -384 64 1011 232 -173 -806 -828 -256 434 484 -26 200 171 144 262 -787 -854 -202 419
8175 419 957 384 -312 -561 -360 129 215 136 -87 -104 318 572 170 -666 -515 -663
$$ packed form
8133A099n60r62o75R44M55k3j58k94K43N68n49l88n36J15R61N70l47p56n1L85
8153D1J08K2m57r8M48R47p79m05o33k2N72O90N0n10K26k9k7J18j049o7O52O21
8175D19N38n73o96k49K01M89Q6p9k23j7M22K54m02q36J51j48
8191f63
$$ Imaginary data points
##PAGE= N=2
##DATA TABLE= (X++(I..I)), XYDATA
$$ plain form
0 0 0 0 0 8 -8 0 -8 8 -8 16 -20 24 -30 40 -43 51 -67 75 -87 108 -122 139 -165 189 -215 247 -282 319 -360
29 -360 409 -459 512 -578 642 -717 802 -886 985 -1093 1210 -1340 1485 -1643 1818 -2018
45 -2018 2240 -2487 2779 -3112 3498 -3965 4525 -5219 6117 -7305 8971 -11489 15712 -24121
$$ packed form
0@%%%Qj6QqJ6j6K4l6M4n4P0q3R4j18J42j62J95k30K61l04L54m04M62n29O01o79
29c60P69q68R71j090J220j359J519j688J871k078K303k550K825l128L461l836
45b018M258m727N266n891O610p463Q490r744J1336j3422J6276k0460K7201l9833
$$ [...]
8191D09
##END NTUPLES=NMR FID
##END=
