##TITLE=1H_CA-8611
 DMSO-d6, 8 sc, 
 25.6.2019
##JCAMPDX= 6.0         $$ Bruker NMR JCAMP-DX V2.0
##DATA TYPE= NMR FID
##DATA CLASS= NTUPLES
##ORIGIN= UXNMR, Bruker Analytische Messtechnik GmbH
##OWNER= root
$$ XWIN-NMR		Version 3.5
$$ Tue Jun 25 15:34:02 2019 Russian Standard Time (UT+4h)  she@DPX200
##.OBSERVE FREQUENCY= 200.13155
##.OBSERVE NUCLEUS= ^1H
##.DELAY= (6, 6)
##.ACQUISITION MODE= SIMULTANEOUS
##.ACQUISITION SCHEME= undefined
##.AVERAGES= 8
##.DIGITISER RES= 18
##SPECTROMETER/DATA SYSTEM= spect
##.PULSE SEQUENCE= zg30
##.SOLVENT NAME= DMSO
##.SHIFT REFERENCE= (INTERNAL, DMSO, 0, 15.7039)
##AUDIT TRAIL= $$ (NUMBER, WHEN, WHO, WHERE, WHAT)
$$ ##TITLE= Audit trail, XWIN-NMR		Version 3.5
$$ ##JCAMPDX= 5.01
$$ ##ORIGIN= Bruker BioSpin GmbH
$$ ##OWNER= she
$$ F:/spectra/data/she/nmr/H-F/1/audita.txt
$$ ##AUDIT TRAIL=  $$ (NUMBER, WHEN, WHO, WHERE, WHAT)
(   1,<2019-06-25 15:33:05.37 +0400>,<she>,<DPX200>,
      <created by zg, POWCHK disabled, PULCHK disabled
       configuration hash MD5:
       00 E9 B6 7A A2 85 ED C7 34 08 36 98 17 FE 4E 26
       data hash MD5: 16K
       BC 3D F8 8B 8D 26 9D 0F 20 C5 25 73 A1 EA 02 39>)
$$ ##END=
$$ 
$$ hash MD5
$$ A8 07 BE D6 51 25 7C CB BA 6B 15 3B CB A0 44 08
##$RELAX= 
##$RELAX= 
##$RELAX= 
##$RELAX= 
##$RELAX= 
##$RELAX= 
$$ Bruker specific parameters
$$ --------------------------
##$DU= <F:/spectra>
##$EXPNO= 1
##$NAME= <H-F>
##$PROCNO= 1
##$TYPE= <nmr>
##$USER= <she>
##$AMP= (0..31)
100 100 100 100 100 100 100 100 100 100 100 100 100 100 100 100 100 100 
100 100 100 100 100 100 100 100 100 100 100 100 100 100 
##$AQSEQ= 0
##$AQ_mod= 1
##$AUNM= <au_zg>
##$AUTOPOS= <>
##$BF1= 200.13
##$BF2= 200.13
##$BF3= 200.13
##$BF4= 200.13
##$BF5= 200.13
##$BF6= 200.13
##$BF7= 200.13
##$BF8= 200.13
##$BYTORDA= 1
##$CFDGTYP= 0
##$CFRGTYP= 5
##$CHEMSTR= <none>
##$CNST= (0..31)
1 1 145 1 1 1 1 1 1 1 1 1 1 1 1 1 1 1 1 1 1 1 1 1 1 1 1 1 1 1 1 1 
##$CPDPRG= <>
##$CPDPRG1= <>
##$CPDPRG2= <>
##$CPDPRG3= <>
##$CPDPRG4= <mlev>
##$CPDPRG5= <mlev>
##$CPDPRG6= <mlev>
##$CPDPRG7= <mlev>
##$CPDPRG8= <mlev>
##$CPDPRGB= <>
##$CPDPRGT= <>
##$D= (0..31)
0 1.2 0 0 0 0 0 0 0 0 0 0.03 0 0 0 0 0 0 0 0 0 0 0 0 0 0 0 0 0 0 0 0 
##$DATE= 1561462384
##$DBL= (0..7)
120 120 120 120 120 120 120 120 
##$DBP= (0..7)
150 150 150 150 150 150 150 150 
##$DBP07= 0
##$DBPNAM0= <>
##$DBPNAM1= <>
##$DBPNAM2= <>
##$DBPNAM3= <>
##$DBPNAM4= <>
##$DBPNAM5= <>
##$DBPNAM6= <>
##$DBPNAM7= <>
##$DBPOAL= (0..7)
0.5 0.5 0.5 0.5 0.5 0.5 0.5 0.5 
##$DBPOFFS= (0..7)
0 0 0 0 0 0 0 0 
##$DE= 6
##$DECBNUC= <off>
##$DECIM= 24
##$DECNUC= <off>
##$DECSTAT= 4
##$DIGMOD= 1
##$DIGTYP= 9
##$DL= (0..7)
0 120 120 120 120 120 120 120 
##$DP= (0..7)
150 150 150 150 150 150 150 150 
##$DP07= 0
##$DPNAME0= <>
##$DPNAME1= <>
##$DPNAME2= <>
##$DPNAME3= <>
##$DPNAME4= <>
##$DPNAME5= <>
##$DPNAME6= <>
##$DPNAME7= <>
##$DPOAL= (0..7)
0.5 0.5 0.5 0.5 0.5 0.5 0.5 0.5 
##$DPOFFS= (0..7)
0 0 0 0 0 0 0 0 
##$DQDMODE= 0
##$DR= 18
##$DS= 0
##$DSLIST= <SSSSSSSSSSSSSSS>
##$DSPFIRM= 0
$$ [...]
##$SUBNAM2= <"">
##$SUBNAM3= <"">
##$SUBNAM4= <"">
##$SUBNAM5= <"">
##$SUBNAM6= <"">
##$SUBNAM7= <"">
##$SUBNAM8= <"">
##$SUBNAM9= <"">
##$SW= 24.9336996594482
##$SWIBOX= (0..15)
0 0 2 0 0 0 0 0 0 0 0 0 0 0 0 0 
##$SW_h= 4990.01996007984
##$TD= 16384
##$TD0= 1
##$TE= 0
##$TE2= 300
##$TE3= 300
##$TEG= 300
##$TL= (0..7)
0 120 120 120 120 120 120 120 
##$TP= (0..7)
150 150 150 150 150 150 150 150 
##$TP07= 0
##$TPNAME0= <>
##$TPNAME1= <>
##$TPNAME2= <>
##$TPNAME3= <>
##$TPNAME4= <>
##$TPNAME5= <>
##$TPNAME6= <>
##$TPNAME7= <>
##$TPOAL= (0..7)
0.5 0.5 0.5 0.5 0.5 0.5 0.5 0.5 
##$TPOFFS= (0..7)
0 0 0 0 0 0 0 0 
##$TUNHIN= 0
##$TUNHOUT= 0
##$TUNXOUT= 0
##$USERA1= <user>
##$USERA2= <user>
##$USERA3= <user>
##$USERA4= <user>
##$USERA5= <user>
##$V9= 5
##$VALIST= <valist>
##$VCLIST= <CCCCCCCCCCCCCCC>
##$VD= 0
##$VDLIST= <DDDDDDDDDDDDDDD>
##$VPLIST= <PPPPPPPPPPPPPPP>
##$VTLIST= <TTTTTTTTTTTTTTT>
##$WBST= 1024
##$WBSW= 4
##$XGAIN= (0..3)
0 0 0 0 
##$XL= 0
##$YL= 0
##$YMAX_a= 661672
##$YMIN_a= -1108693
##$ZGOPTNS= <>
##$ZL1= 120
##$ZL2= 120
##$ZL3= 120
##$ZL4= 120
##$ABSF1= 10
##$ABSF2= 0
##$ABSG= 5
##$ABSL= 3
##$ALPHA= 0
##$AQORDER= 0
##$ASSFAC= 0
##$ASSFACI= 0
##$ASSFACX= 0
##$ASSWID= 0
##$AUNMP= <proc_1d>
##$AZFE= 0.1
##$AZFW= 0.1
##$BCFW= 1
##$BC_mod= 2
##$BYTORDP= 1
##$COROFFS= 0
##$CY= 11.3945322036743
##$DATMOD= 1
##$DC= 2
##$DFILT= <>
##$DTYPP= 0
##$F1P= 18.9103706918063
##$F2P= -1.10871071338519
##$FCOR= 0.5
##$FTSIZE= 0
##$FT_mod= 4
##$GAMMA= 1
##$GB= 0.15
##$INTBC= 1
##$INTSCL= 1
##$ISEN= 128
##$LB= 0.24
##$LEV0= 0
##$LPBIN= 0
##$MAXI= 10000
##$MC2= 0
##$MEAN= 0
##$ME_mod= 0
##$MI= 1.114404
##$NCOEF= 0
##$NC_proc= 0
##$NLEV= 6
##$NOISF1= 3.799351
##$NOISF2= 2.8
##$NSP= 1
##$NTH_PI= 0
##$NZP= 0
##$OFFSET= 15.70392
##$PC= 1
##$PHC0= -8501.381
##$PHC1= 13.60097
##$PH_mod= 1
##$PKNL= yes
##$PPARMOD= 0
##$PSCAL= 0
##$PSIGN= 0
##$REVERSE= no
##$SF= 200.130013532006
##$SI= 16384
##$SIGF1= 3
##$SIGF2= 2
##$SINO= 400
##$SIOLD= 16384
##$SREGLST= <1H.CDCl3>
##$SSB= 0
##$STSI= 0
##$STSR= 0
##$SW_p= 3612.71676300578
##$SYMM= 0
##$S_DEV= 0
##$TDeff= 0
##$TDoff= 0
##$TI= <>
##$TILT= no
##$TM1= 0
##$TM2= 0
##$TOPLEV= 0
##$USERP1= <user>
##$USERP2= <user>
##$USERP3= <user>
##$USERP4= <user>
##$USERP5= <user>
##$WDW= 1
##$XDIM= 8192
##$YMAX_p= 0
##$YMIN_p= 0
$$ End of Bruker specific parameters
$$ ---------------------------------
##NTUPLES= NMR FID
##VAR_NAME=  TIME,          FID/REAL,        FID/IMAG
##SYMBOL=    X,             R,               I
##VAR_TYPE=  INDEPENDENT,   DEPENDENT,       DEPENDENT
##VAR_FORM=  AFFN,          ASDF,            ASDF
##VAR_DIM=   8192,          8192,            8192
##UNITS=     SECONDS,       ARBITRARY UNITS, ARBITRARY UNITS
##FACTOR=    0.0002004,     1,               1
##FIRST=     0,             0,               0
##LAST=      1.6414764,     0,               0
##MIN=       0,             -1108693,        0
##MAX=       1.6414764,     661672,          0
$$ Real data points
##PAGE= N=1
##DATA TABLE= (X++(R..R)), XYDATA
0@%%%qK4k4J6l2N6o4Q0j10J34j68K08k48L04l60M22n08N98o92Q04r34J076j236
$$ 0 0 0 0 -8 16 -8 8 -24 32 -32 48 -62 72 -96 112 -136 168 -192 230 -278 320 -372 432 -502 574 -662
26f62J412j604J827k067K326k621K945l295L685m114M576n087N653o267O944p692
$$ -662 750 -854 973 -1094 1232 -1389 1556 -1739 1946 -2168 2408 -2679 2974 -3293 3651 -4041
42d041Q511r423J0440j1570J2844j4288J5931j7832K0056k2693K5890k9860L4936
$$ -4041 4470 -4953 5487 -6083 6761 -7527 8404 -9428 10628 -12065 13825 -16035 18901
55A8901m1705N1239o5771R0919j46418M74069l04999r92087N99681P96126P8758
$$ 18901 -22804 28435 -37336 53583 -92835 381234 76235 -915852 -316171 479955 558713
66E58713n56954j44064M4230r5156o6890M27167L01480l90594o46367R9122O32364
$$ 558713 1759 -142305 -98075 -193231 -260121 167046 468526 77932 -568435 -469313 163051
77A63051K45661m02333l12682R9989J83190L4625J32756J51432j99746m50512
$$ 163051 408712 6379 -306303 -206314 -23124 11501 144257 295689 95943 -354569
87c54569o975N65038L83931l66256o18575r8335M45274L93232J798k68567k89823
$$ -354569 -361544 203494 587425 221169 -397406 -495741 -50467 342765 344563 75996 -213827
98b13827j25437J74549L69176J85658k50017m35000j51401K69310L84235J26817
$$ -213827 -339264 -164715 204461 390119 140102 -294898 -446299 -176989 207246 334063
108C34063k29446l58364j31016K51672L84952R3729l07248l62875k2432L22247
$$ 334063 104617 -253747 -384763 -133091 251861 345590 38342 -324533 -346965 -24718
118b4718L13451j2489l10706k74662O6926L47262K40769j30862l38695j83353
$$ -24718 288733 276244 -34462 -309124 -242198 105064 345833 214971 -123724 -307077
128c07077J08934K48534J82424k0348k59284l02602K4557M33634L69664j79256
$$ -307077 -198143 50391 232815 212467 -46817 -349419 -324862 108772 478436 299180
138B99180n18930j96685L24358L74674J8597k12959j74912q9290K2690K37635
$$ 299180 -219750 -416435 -92077 282597 301194 88235 -86677 -175967 -153277 84358
148H4358K92551p1080m59626k68573L02149M44892j4804l79251k07766J10008
$$ 84358 376909 305829 -153797 -422370 -120221 324671 309867 -69384 -277150 -167142
158a67142J55495Q5571R8250m932k67514k59489J85435M77249J16692m33522l97981
$$ -167142 -11647 73924 172174 167242 -100272 -359761 -174326 302923 419615 -13907 -411888
169d11888J40605M24066J70862j64063k11295r4728R182J37726K28609O8199k62887
$$ -411888 -271283 152783 323645 159582 -51713 -146441 -137259 467 229076 297275 34388
180C4388l33031J4153L57186K61777j23994l26708j69328J20238K60865J57202
$$ 34388 -298643 -284490 72696 334473 210479 -116229 -285557 -165319 95546 252748
190B52748r5533k76270j89748J04284K95246J64997j39690k82610j23706J61678
$$ 252748 157215 -119055 -308803 -204519 90727 255724 116034 -166576 -290282 -128604
200a28604K86164J22591j76467k95585r3177K11482K71356L5348k10506k15780
$$ -128604 157560 280151 103684 -191901 -285078 -73596 197760 233108 22602 -193178
210a93178j7867J72310K06060O3899j56596k52455q3842K00807K73451K9208k47009
$$ -193178 -211045 -38735 167325 231224 74628 -177827 -261669 -60862 212589 241797 -5212
221e212k39646K0410K35559K08144o180k07461k16073n732K31947K28789m0275
$$ -5212 -244858 -224448 11111 219255 213075 5614 -210459 -216191 15756 244545 204270
232B04270k72024j94511Q8540K52051J50235p5804k11328j53726N4146K33669
$$ 204270 -67754 -262265 -173725 78326 228561 152757 -58571 -212297 -158151 75518
242G5518J75804r7137k81599j41185J58824K55609P1533j41601j77945o8300P9537
$$ 75518 251322 154185 -127414 -268599 -109775 145834 217367 75766 -102179 -170479 -90942
253i0942J84227J40879q2202k74173j59912J75912L14364O7069k45644k37829
$$ -90942 93285 234164 151962 -122211 -282123 -106211 208153 275222 29578 -208251
263b08251K8189K06071J48052j0993j28114j58998o6644J22431K22547O8243j95531
$$ -208251 -180062 26009 174061 163068 34954 -124044 -190688 -68257 154290 222533 27002
274B7002k41025M283K37549J89342n0395k05928j46531L2473J68472J54258j1257
$$ 27002 -214023 -209740 27809 217151 166756 -39172 -185703 -153230 15242 169500 158243
285A58243j85980j78303L2663K26468J75789p0563k36089j41491R8616K19467
$$ 158243 -27737 -206040 -173377 53091 228880 158317 -77772 -219263 -120647 98820
295I8820J02659j12686j97723q0328J03008J75501Q5873p6784j73563j10586P5082
$$ 98820 201479 88793 -108930 -189258 -86250 89251 175124 98340 -75223 -185809 -110727
306a10727K06608J20151j21385k43789q5208J73407K27119K9459j73504j71500
$$ -110727 95881 216032 94647 -149142 -234350 -60943 166176 195635 22131 -149369
316a49369q307J37532J51187L3411j26731j80069m5431J56227J92249J1617j74131
$$ -149369 -157676 -20144 131043 164454 37723 -142346 -187777 -31550 160699 172316 -1815
327a815j56521J8661J52640J32810k215j37848j58476j5403J68245J81152k2661
$$ -1815 -158336 -139675 12965 145775 143560 5712 -152764 -168167 78 181230 158569
338A58569k09474j48810Q1068K01115R7555q4436j61501r1879N1795J56611J18891
$$ 158569 -50905 -199715 -118647 82468 180023 95587 -65914 -157793 -105998 50613 169504
349A69504n4860j91117j16932R9363K02599P8523j14510j66930n8174Q3723J44624
$$ 169504 114644 -76473 -193405 -94042 108557 187080 72570 -94360 -152534 -68811 75813
360G5813Q1245o9495j75977j00090J07287K09085O6342j54329j86608q857J51896
$$ 75813 157058 87563 -88414 -188504 -81217 127868 194210 39881 -146727 -155584 -3688
371c688J31016j0601j17017j12410j6242J00400J37092L5683j21291j61050j6874
$$ -3688 127328 116727 -290 -112700 -128942 -28542 108550 144233 22942 -138108 -154982
382a54982J56347J57032j8929j70733j35152L9100J63209J17936l9090j49209
$$ -154982 1365 158397 139468 -31265 -166417 -127317 35892 153828 114738 -34471
392c4471j09593L6460J49570J14284m0876j60674j13225N6668J65977R4518p3012
$$ -34471 -144064 -107604 41966 156250 115374 -45300 -158525 -101857 64120 158638 85626
403H5626j52574o9770P3247J33912O6450o0964j36367q3263O2872J56764Q2584
$$ 85626 -66948 -136718 -63471 70441 136891 75927 -60440 -143703 -80831 75933 158517
414A58517r5159j73389n2765J27150J58345J8301j27468j30942j0268J07315J20631
$$ 158517 63358 -110031 -162796 -35646 122699 141000 13532 -117410 -127678 -20363 100268
425A00268K2050j01981j31084k3072J19051J40792J1406j28573j28919M647J25328
$$ 100268 122318 20337 -110747 -133819 -14768 126024 137430 8857 -120062 -115415 9913
436I913J17000p240j23090j17631R972J32818J18572k5310j44016j06640M2667
$$ 9913 126913 119673 -3417 -121048 -111076 21742 140314 115004 -29012 -135652 -92985
447i2985J39569Q3777n4655j31653p6703M8127J25296P9432m7230j31532q2072
$$ -92985 46584 130361 75706 -55947 -132650 -84523 40773 120205 72975 -58557 -140629
458a40629N8297J41476P4988p4439j42611n8373Q4104J35568M9633q1530j25066
$$ -140629 -82332 59144 134132 59693 -82918 -141291 -57187 78381 128014 46484 -78582
469g8582m2962Q3709J27487M1173r2378j31173l0506J03502J22756J2741j04908
$$ -78582 -121544 -37835 89652 130825 38447 -92726 -123232 -19730 103026 115767 10859
480A0859j09015o480R7378J04015J1392r7608j16586j2997J12794J22326n207
$$ 10859 -98156 -104636 -7258 96757 108149 10541 -106045 -119042 -6248 116078 110871
491A10871j29673j09090K8404J28077Q9905l3616j13552q1337K5805J08633Q5457
$$ 110871 -18802 -127892 -99488 28589 118494 84878 -28674 -110011 -84206 24427 109884
502A09884k6586j16920q5225L9686J23145P5264n0182j18951o3870N3658J15830
$$ 109884 83298 -33622 -118847 -79161 43984 119248 69066 -49885 -113755 -60097 55733
513E5733O0027n7608j19132n5620P0219J23695M5790p8150j17203l4598Q1406
$$ 55733 115760 58152 -60980 -116600 -46381 77314 123104 44954 -72249 -106847 -25441
524b5441J11517K9137q2528j12116k7832Q5291J10781J9472r0669j06421j5291
$$ -25441 86076 115213 32685 -79431 -107263 -21972 88809 108281 17612 -88809 -104100
535a04100Q8058J00617J1505r2507j03997q470R9524J02956m315j06188q9680
$$ -104100 -16042 84575 96080 3573 -100424 -108894 -9370 93586 89271 -16917 -106597
546a06597K0118J04997P9596k1333r7291p5205K3216J01371P8462k7704j06740
$$ -106597 -86479 18518 98114 76781 -20510 -95715 -72499 28872 107334 79630 -27110
557b7110p2968L9202J09432O4732m6282j08738o1564M6123J06184N7435n3876
$$ -27110 -100078 -60876 48556 113288 67006 -41732 -103296 -57173 49011 106446 52570
568E2570j12004n3531O1264J09218M1294o6496j02038l4631O4094R7348L4644
$$ 52570 -59434 -112965 -51701 57517 98811 32315 -69723 -104354 -40260 57088 91732
579I1732o3500r8977l1022P3836J02952K3380p9318r6333j2466Q2635R1448P710
$$ 91732 28232 -70745 -101767 -27931 75021 98401 19083 -77250 -89716 -7081 84367 92077
591I2077q3699r0194l189Q8830Q7998o126r3148q1931J3629R1034P3690j6691
$$ 92077 8378 -81816 -85005 3825 91823 85697 -7451 -89382 -75753 15281 88971 72280
603G2280q9429p2319J7292R0509P2245k0762r4484o9501K9030R7761O3600l6241
$$ 72280 -17149 -89468 -72176 18333 90578 69816 -24668 -94169 -65139 32622 96222 59981
615E9981r7973n8174M1537R7720N2248m8016r7823m5576N3692R4874L6716n6571
$$ 59981 -37992 -96166 -54629 43091 95339 47323 -50500 -96076 -42384 52490 89206 32635
627C2635r0230l2814N5697Q9123L2853n8066r0699k8185O6074R2041K1702p0071
$$ 32635 -57595 -90409 -34712 54411 87264 29198 -61501 -89686 -23612 68429 90131 20060
639B0060q6820j4292P2343Q4092J0162p5096q2813m326P9080P8169l634q1988
$$ 20060 -66760 -81052 -8709 75383 85545 10449 -72364 -76690 2390 80559 76925 -5063
651e063p4477Q370Q0027O7897j3323q0314o6833J4244Q2421O6242j9162q6150
$$ -5063 -79540 -71170 8857 76754 63431 -16883 -83716 -69472 12949 79191 60029 -26121
663b6121o2494K7810Q9019N6577l2502q6416m9942L8162Q6705M7836m1521q6492
$$ -26121 -88615 -60805 28214 84791 52289 -34127 -84069 -45907 40798 88634 47113 -39379
675c9379m0820M7367Q3661L4710m9749q1408l1668M9236Q0068K9333n3868q3302
$$ -39379 -80199 -32832 50829 85539 35790 -45618 -77286 -28050 52018 81351 27483 -55819
687e5819k5755N8707Q1820J8672o3989p9793j2690O6794P6430P091o7867p2608
$$ -55819 -81574 -22867 58953 77625 13636 -66157 -78847 -12053 64377 71468 3601 -69007
699f9007k621P0411P0358k114p1713o6622Q376P2543O2059j1156p2156n9608J2973
$$ -69007 -71628 -1217 69141 67027 -4686 -71308 -62932 9611 71670 60514 -11642 -71250 -58277
712e8277P3881N8822j7964p7449n6502K4259P9052N1047k9897p8440m5911L2918
$$ -58277 15604 74426 56462 -20987 -77489 -53230 25822 76869 46972 -31468 -77379 -44461
724d4461P8095M2812l6993p7943l7906M0357P6789L3613m3522p5178k9764M5608
$$ -44461 33634 76446 39453 -38490 -76396 -36039 40750 74363 30841 -44337 -74101 -28493
736b8493P4394K5930m8644p3824k2245N2119P2623J7996n6250p1363j1837N9880
$$ -28493 45901 71831 23187 -50637 -72882 -20763 51860 69856 13606 -57757 -69594 -9714
748i714O8551O387o0814o4861k634O2365O3802j033o4162o0841N972O6281N7546
$$ -9714 58837 65224 4410 -60451 -63085 -720 63082 62049 -2113 -62954 -56982 9299 66845
761F6845r544o6418n5398J2791O7907N3120j7708o9645m9849K1798O9802M6077
$$ 66845 57301 -9117 -64515 -51724 16183 69303 51595 -18050 -67899 -46101 23701 69778
773F9778k5224p1059m2862K9537P0678L8287l3638p0480l3430L7149O8329L0714
$$ 69778 44554 -26505 -69367 -39830 30848 69135 35497 -34983 -68413 -31264 37065 67779
785F7779l8966o7660k7411M2007O7555K3077m4451o6927j9390M7320O5703J5452
$$ 67779 28813 -38847 -66258 -24251 43304 66381 21930 -44997 -64387 -17067 48636 64088
797F4088n0388o3922j0828N2629O1202O538n4468o0065l210N7512N8097k786n9298
$$ 64088 13700 -50222 -61050 -8421 52781 59319 4851 -55214 -58424 -912 57185 54399 -4899
810d899n4149O690N9993N1016r768o0250m9706J2429O2612M7255j6938o3123m3730
$$ -4899 -59048 -52358 7635 58651 48883 -11367 -61073 -48644 13968 61223 44285 -18838 -62568
823f2568K0346O3092M0987k2826o3880l8331K6083O3997L5068k9678o3479l1320
$$ -62568 -42222 20870 61857 39031 -24849 -63180 -37097 26900 61968 32290 -31189 -62509
835f2509L2830O3767K7227l7501o1837k2328L9861N9441J8480m0888n8717j5128
$$ -62509 -29679 34088 61315 23814 -38023 -60351 -20490 38951 57431 16543 -42174 -57302
847e7302M3993N8123J1623m6631n6346p534M8186N4421M523m9735n3309k262N2770
$$ -57302 -13309 44814 56437 9806 -46540 -54074 -5888 48533 53056 3321 -49988 -52250 520
860E20N2371j458n4390n0482N730N5162M7988r373n6465m4978J3248N6295M1288
$$ 520 52891 51433 -2957 -53439 -47709 7453 55441 46068 -10397 -55375 -42127 14168 55456
873E5456j5928n5914l8742J8398N6398L6115k2224n6674l2920K5166N6457K9396
$$ 55456 39528 -16386 -55128 -36730 19668 55783 33559 -23115 -56035 -30869 25588 54984
885E4984k7255n5959k6985L0379N6827K3703l4127n6129k0140L6828N4859J6486
$$ 54984 27729 -28230 -55215 -24836 31991 55694 21567 -34562 -54702 -17874 36985 53471
897E3471l8207n3530j4183M0820N3091J0463m2982n1422p615M4070N0306M376
$$ 53471 15264 -38266 -52449 -11629 41462 51925 8943 -42479 -50094 -6024 44282 48658
909D8658m6096m8720n33M7338M6425k367m8556m4937N477M9974M2140q476n1143
$$ 48658 2562 -46158 -46691 647 47072 44705 -3851 -48788 -43311 6663 48803 40327 -10816
922a0816l9507J2905N0813L6633j4573n0836l4484J6736N1547L2878k0054n2205
$$ -10816 -50323 -37418 13395 50028 35455 -15381 -49865 -33129 18418 51296 31242 -20963
934b0963k9892K3316N2346K7251k6360n2140k3868K8951N1879K0374l2117n0791
$$ -20963 -50855 -27539 24807 52058 25698 -26442 -50310 -21359 30520 50894 18777 -32014
946c2014j7325L4327M9805J3747l6075m8719j0939L8165M6349P826l8815m5877
$$ -32014 -49339 -15012 34793 48540 12465 -36254 -47193 -9028 37321 45147 6332 -39545
958c9545o051L9949M5446M112m1587m4603q42M3625M2626k186m5213m0696N456
$$ -39545 -45596 -5647 39799 43911 2324 -42279 -43121 504 43130 40944 -4269 -44965 -39509
971c9509M6025L8456q724m7030l5034J2043M6713L2793j5075m7079k9994J7409
$$ -39509 6516 44972 36248 -10782 -45816 -33773 12940 45733 30658 -16421 -46415 -29006
983b9006M6426K7348j9497m6378k5222K1566M6815K3504k4233m6620k1871K6447
$$ -29006 17420 44768 25271 -21107 -46329 -24763 22052 45556 21323 -25297 -47168 -20721
995b0721M7395J8922k9206m6650j5705L1289M6273J3176l3168m4809j0310L4807
$$ -20721 26674 45596 16390 -30260 -45965 -14676 31597 44773 11605 -33204 -43514 -8707
1007h707M3342P591l6077m1812m300L7235M0245J946l8285l8389J075L9202L7058
$$ -8707 34635 42226 6149 -35663 -39963 -2728 37517 39463 1178 -37211 -36136 3066 40124
1020D0124l946m0455l5172O490M1516L3825r358m2239l1539J2285M2757K9376
$$ 40124 36178 -4277 -39449 -32959 8557 42382 33024 -9215 -40754 -28469 14288 43664
1032D3664j4587m3731k6920J6707M3672K4677j9043m2700k3346K1309M2948K0433
$$ 43664 29077 -14654 -41574 -24867 18805 43482 24439 -18261 -41607 -20298 22650 43083
1044D3083k3022m2996j8273K4783M2315J5723k6932m1674j3439K9468M0772J0007
$$ 43083 20061 -22935 -41208 -16425 25890 41613 14681 -26993 -40432 -10964 29808 39815
1056C9815l0559l9950q151L1885L8706N571l3730l7846k472L4755L5952M99l5700
$$ 39815 9256 -30694 -38845 -6960 31746 37317 3587 -34259 -36731 -1976 33976 34475 -1225
1069a225l5114J639L6315L3821m556l7592l2086O976L8301L0098q894l8948k8741
$$ -1225 -36339 -34700 1615 35436 30880 -6712 -38798 -31822 6479 36577 27683 -11265 -40006
1082d0006J1768L9458K5847j3379l9782k3991J5931L9735K2179j7554l9355k0355
$$ -40006 -28238 11220 37067 23688 -16094 -40085 -24154 15581 37760 20206 -19149 -39504
1094c9504J9673L9453J8138k1625l8622j6500K3404L8753J3696k4386l7729j2087
$$ -39504 -19831 19622 37760 16135 -22487 -38987 -15583 23170 36866 12480 -25249 -37336
1106c7336K6378L7798R443k8488l6000p244K9956L5160M938l0478l3917k328L1974
$$ -37336 -10958 26840 36283 7795 -28205 -35449 -5493 29667 34605 4127 -29790 -32118 -144
1119a44L2855K02l2418l1718K266L3541L0066m374l4113k8749O977L4685K6703
$$ -144 32711 32913 495 -31223 -28957 4584 34650 30276 -3837 -32586 -25609 9076 35779
1132C5779q219l5748k5531J0364L5864K3889j2983l6013k2066J4560L6247J9869
$$ 35779 27560 -8188 -33719 -23355 12509 36398 23415 -12598 -34664 -20104 16143 36012
1144C6012j6544l5976j7833J8209L5633J5954j9769l5683j4012K2081L4614J2101
$$ 36012 19468 -16508 -34341 -16132 19501 35455 15686 -19997 -34009 -11928 22686 34787
1156C4787k3208l4167j0103K4386L3149P615k5729l2469o951K7396L1859L775
$$ 34787 11579 -22588 -32691 -8305 24844 32459 6730 -25739 -32690 -5294 26565 30340
1168C0340k8530l1036j486K9211K9221n64l0457k8005K420L0421K7184m039l1253
$$ 30340 1810 -29226 -30712 -1501 27720 27156 -3301 -31306 -28886 1535 28719 24680 -6573
1181f573k5918O891L2050K3961q503l2204k2726J0663L2030K1246j1542l3226
$$ -6573 -32491 -25600 6450 30411 21908 -10296 -33022 -22359 9671 30917 19375 -13851
1193a3851j9104J3688L3094J7565j5816l2862j5367J7186L2801J3569j8748l2071
$$ -13851 -32955 -19267 13827 31392 15576 -17286 -32653 -15467 17334 30903 12155 -19916
1205a9916j1477K0222L1266J0553k1383l0611q777K2753L0503O833k4046k9595
$$ -19916 -31393 -11171 20095 30648 9265 -21346 -30123 -7370 23133 29966 5920 -23675
1217b3675m393K5375K8288K725k6007k7278q65K6806K6433q08k7890k5539L131
$$ -23675 -28068 -2693 25595 28320 2313 -24965 -25830 976 27409 26601 -1289 -26828 -23697
1230b3697K8341K4569n322k8633k2441O652K9066K1273p889k9269k0546R980K9527
$$ -23697 4644 29213 23891 -4742 -27183 -20531 8535 29808 21919 -7350 -27896 -17916 11611
1243A1611J8774j1000l0125j7259J3551K9121J5314j4736k9694j3889J5939K8929
$$ 11611 30385 19385 -10740 -27999 -14448 14673 29987 15251 -14443 -28332 -12393 16536
1255A6536J2132j7272k9205j0703J8731K8325Q780k0041k8055o632K0845K7322
$$ 16536 28668 11396 -17809 -28512 -9781 18544 27324 7283 -20772 -27404 -6559 20763
1267B0763N041k1599k6541l858K3293K5234K268k3876k5038k04K4447K3962j548
$$ 20763 25804 4205 -22336 -26194 -2901 22333 24601 725 -24313 -24517 -70 23892 22344
1280B2344k5794k2315L371K5689K1162m732k6055k0607O339K6525J9098p814k6898
$$ 22344 -3450 -25765 -22394 3295 24457 19725 -6330 -26937 -20598 5927 25025 17211 -9687
1293i687j7892R619K7008J6659j0680k6997j4999J2369K6865J3667j3892k6400
$$ -9687 -27579 -17960 9048 25707 15027 -11970 -26969 -14600 12265 25932 12040 -14360
1305a4360j2097J5346K6534R976j6015k6015q430J7556K4995P410j8146k5246
$$ -14360 -26457 -11111 15423 25399 9384 -16631 -25061 -7505 17490 24900 6754 -18492
1317a8492o079J9852K4345M601k0568k3854k346K1699K2761R29k1842k2266K89
$$ -18492 -24571 -4719 19626 24227 3659 -20195 -22541 -842 21919 22848 1006 -21260 -20971
1330b0971K2625K1356j927k3128k0402L715K3609J9003m874k3872j7864N801K3990
$$ -20971 1654 23010 21083 -2045 -22447 -18732 4877 23880 19006 -4866 -22730 -16929 7061
1343G061J6926p539k4033j5814Q836K4259J4765j0420k4679j2996J1403K4238
$$ 7061 23987 16448 -7585 -23399 -14563 9696 24461 14041 -10638 -23634 -12231 12007
1355A2007J1572j2768k3933j0549J4115K4125Q754j5320k3337p713J6115K2940
$$ 12007 23579 10811 -13122 -23671 -9556 14569 23323 8003 -15334 -23047 -6932 16008
1367A6008O183j7059k2535n066J8144K2403L396j9175k0852k290J9519K0561N29
$$ 16008 22191 5132 -17403 -22469 -4325 18078 21474 2299 -18553 -20843 -1324 19237 19766
1380A9766j9677k0197P47K1054J8542k258k1127j7581L246K1277J7040n004k1792
$$ 19766 89 -20108 -19361 1693 20235 17977 -3150 -20731 -17485 3792 20832 15828 -5964
1393e964j6148O347K1968J4888p330k2332j4092R420K2052J2819j0456k1951j1151
$$ -5964 -22112 -15765 6203 21091 13761 -8571 -22663 -13243 8809 21628 11172 -10779 -21930
1406b1930J1413K2029R835j1749k2089q922J3244K1667P562j3794k1150o387J5145
$$ -21930 -10517 11512 21347 9598 -12491 -21413 -8169 13498 21060 7266 -13884 -20271 -5126
1419e126K0572N017j5729k0157m104J7064J9843K077j7678j8801j334J7736J8682
$$ -5126 15446 20463 4734 -15423 -19527 -2463 17380 19457 1779 -17022 -18356 -620 18062
1432A8062k02j8727j7709J623J8743J6570k335j8995j6218L637J9190J5581n124
$$ 18062 17860 -867 -18576 -16953 1790 18360 16025 -2970 -19188 -15551 3639 19220 14096
1445A4096j9750j3601N650K0018J3118o840j9900j2214Q136K0370J1146r541k0265
$$ 14096 -5654 -19255 -13605 6413 19531 12691 -7209 -19423 -11287 9083 20229 10688 -9577
1458i577r782J0280K0074Q963j1531j9612p901J2331J9677O421j3192j9100n813
$$ -9577 -19359 -9079 10995 19958 8427 -11185 -19086 -6755 12922 19343 6151 -12949 -18762
1471a8762J3455J9019M459j4757j8590k980J5251J7582K078j5867j7362q17J6414
$$ -18762 -5307 13712 18171 3414 -15176 -18156 -2905 14677 16755 888 -16474 -17291 -877
1484h77J6638j75j6577j5552J218J6992J5153k148j7176j4750L746J8152J3590
$$ -877 15761 15586 -991 -16543 -15325 1667 16820 14672 -2504 -17254 -13508 4644 18234
1497A8234m750j8031j2589N191J8343J2420o988j8728j0663P651J8568R310q443
$$ 18234 13484 -4547 -17136 -11945 6398 18818 11830 -6898 -17561 -9910 8658 17968 9525
1510I525j8023r036R062J7695Q443j0508j8348p034J1238J7631N844j1600j7489
$$ 9525 -8498 -17534 -8472 9223 17666 7158 -11190 -18224 -6986 10645 16489 4889 -12600
1523a2600n191J2658J7373M025j3105j6859k747J4156J6075K409j4592j5512p12
$$ -12600 -17791 -5133 12240 16265 3160 -13699 -16446 -2290 13785 16194 1602 -13910 -14622
1536a4622J5207J4744m27j4968j4279R97J5410J3989k382j6299j3321L414J6050
$$ -14622 585 15329 14902 -66 -14345 -13348 2062 16051 13669 -2630 -15951 -12537 3513
1549C513J2396m783j6003j1769M947J6611J0550n969j7157r436P271J6794Q463
$$ 3513 15909 11126 -4877 -16646 -11699 4912 15462 9493 -7664 -17100 -9829 6965 15428
1562A5428q034j5975q151R022J6895O968r627j5944n919J0011J6209N472j1371
$$ 15428 7394 -8581 -16732 -7710 9185 16153 6526 -9418 -15337 -5326 10883 16355 4984
1575D984j5574m531J1947J5728L201j2594j4920k323J2490J4738J176j3723j3989
$$ 4984 -10590 -15121 -3174 12554 15755 3161 -11759 -14082 -1592 13146 14322 599 -13390
1588a3390J87J3738J3022q10j3851j3118J788J4167J2615k926j4722j1430L701
$$ -13390 -13203 535 13557 12747 -1104 -14222 -12434 1733 14348 11422 -3300 -14730 -11029
1601a1029J4944J0681m458j4829j0742N624J5259R460o307j5291p927O644J4936
$$ -11029 3915 14596 10138 -4691 -15433 -9809 5450 14910 8603 -6688 -14615 -7971 6965
1614F965P838p538j4913o751Q326J5224N804q787j4207n739R357J5063M331j0819
$$ 6965 14803 7265 -7648 -14399 -6073 9151 14955 6168 -8039 -13778 -4421 10642 14973 4154
1628D154j4025l593J0570J3507K797j1272j3720k282J1621J2977J105j2059j2844
$$ 4154 -9871 -13464 -2894 10613 13410 2138 -11582 -13864 -2243 10734 11839 -220 -13064
1641a3064N5J2329J1995j31j3048j1522J403J3682J1376k577j2995j0371L369
$$ -13064 -13009 -680 11315 11184 -1864 -13386 -11983 1699 13075 10498 -2497 -12868 -9499
1654i499J3595R992l792j3908r442N218J4134Q043n589j4198p773O269J3654O542
$$ -9499 4096 14088 10296 -3612 -13054 -7836 6298 14341 8752 -5446 -13219 -6950 6704 13246
1668A3246o907j3973o507P688J3635N336q257j3309m967R053J3688L883r613j2684
$$ 13246 6339 -7634 -14141 -6453 7182 12518 4261 -9048 -14015 -4962 8726 12609 2996 -9688
1682i688k627R489J2890K488j0519j1831k163J1268J1695J168j1438j1473J12
$$ -9688 -12315 -2826 10064 12552 2033 -9798 -11961 -693 11002 12170 732 -10741 -10629
1695a0629J1368J0608p92j1550j0682J574J2110J0315k538j2492r244K918J2654
$$ -10629 739 11347 10555 -995 -11677 -10103 2007 12322 9784 -2708 -11952 -9034 3620
1708C620Q958l713j2884p998M569J2219P594m954j2971o868N791J2333O285o355
$$ 3620 12578 8865 -4019 -12017 -7448 4771 12365 7411 -5560 -12428 -6637 5696 11981 5626
1722E626j2532n581O772J2586M540p591j2280l728Q196J1809L730q675j1457k719
$$ 5626 -6906 -12487 -5715 6871 11411 3820 -8460 -12188 -3992 7817 11547 2872 -8585 -11304
1736a1304R181J1360K023r492j0864j010R962J0493L88j0284j0090Q1J0396R857
$$ -11304 -2123 9237 11260 1768 -9096 -10106 -144 10349 10737 453 -9637 -9556 840 10697
1750A0697r68j0981r275J098J1115Q816k463j0952q552K747J1490P981l895j0918
$$ 10697 9729 -1252 -10527 -9429 1686 10502 8039 -2913 -11465 -8718 2772 10753 6858 -4060
1764d060p414L894J1813P166m992j1297o001M937J1891N724o300j0910n121O621
$$ -4060 -11474 -7580 4233 11399 6407 -4890 -10891 -5954 5937 11661 5361 -5549 -10670 -4049
1778d049J1132M153p025j1271l725P738J0517L103q093j0515k324Q072J0323J715
$$ -4049 7083 11236 4211 -7060 -10785 -3047 7470 10573 2480 -8035 -10359 -2287 8036 9751
1792I751q764r933j078R182R518P80r563r012L12R591R057p66j0102q921J769
$$ 9751 987 -8946 -10024 -842 8676 9456 -107 -9119 -8807 784 9841 9075 -1027 -9948 -8179
1807h179R894Q315k174j0217p705K526J0210P109k792j0642o667L777J0539O145
$$ -8179 1715 10030 7856 -2361 -10066 -7540 2670 9779 6987 -3655 -10322 -6545 3994 10139
1821A0139m501j0244n537M992J0321N038n628j0394m336N933J0420M199o768j0379
$$ 10139 5638 -4606 -10143 -5151 5170 10208 4580 -5814 -10150 -4217 6203 10402 3634 -6745
1835f745k914P155R607K671p535r613k119Q033R521J225q436q895o98Q270Q915
$$ -6745 -9659 -2504 7103 9774 2239 -7374 -9493 -1460 8061 9286 850 -8045 -8743 -473 8442
1850H442n3q394q454M06R080Q002j328q937p847J825R136P154j919r589o579K352
$$ 8442 8389 -5 -8459 -8053 1027 9029 7701 -1236 -9083 -7258 1878 9032 7113 -2476 -9055 -6703
1866f703R449O530l026r710n998L824R528N950m712r241n255M865R329M523n229
$$ -6703 2746 9276 6250 -3460 -9458 -5634 3894 9844 5132 -4109 -9364 -4499 4830 9353 4124
1881D124r147l793N276R589L218o007r345l089O702Q736K260o593r008j618P132
$$ 4124 -5023 -8816 -3540 6049 9267 3260 -6085 -9174 -2472 6264 8524 1931 -7077 -8695 -1563
1896a563Q173J425p680p831o65P762P745M99q176p621N85Q311O911j045q118o741
$$ -1563 6610 8035 355 -7476 -8141 -379 7366 7865 -311 -7932 -7347 964 7875 6830 -1288 -8029
1912h029J483Q628O386k222q263o220K544Q441N796l107q754n133L968Q526M368
$$ -8029 -6546 2082 8468 6246 -2017 -8237 -5693 2748 8544 5437 -3317 -8450 -4482 4044 8412
1927H412m099q404m237M047Q859L715m869q872l306N456Q381L198n881q065k579
$$ 8412 4313 -4091 -8328 -4281 4578 8293 3424 -5448 -8754 -3298 5083 8281 2400 -5665 -8244
1942h244O278Q090J314o088p869j269O512P774J006o975p158n31P239P213j46
$$ -8244 -1966 6124 7438 1350 -6519 -7788 -1276 6498 7504 529 -6629 -7160 79 7292 7146
1957G146p248o887Q39P591O422r52q123n768J402P238O255k300p822n515K446
$$ 7146 -102 -6989 -6150 1441 7863 6911 -1212 -6980 -5578 1660 7915 5615 -2207 -7722 -5276
1972e276P530N185k697q001n120L613Q346L804l709p799l935M134Q171L236m526
$$ -5276 2254 7439 4742 -3259 -8379 -4766 3580 7384 3675 -4124 -8059 -3925 4246 7482 2956
1987B956p726l019N113P555K568n228p249k026N624P471R68n312p046j390O317
$$ 2956 -4770 -7789 -2676 4879 7447 2219 -5030 -7056 -1432 6039 7007 1695 -5351 -6741 -424
2002d24P184J41o281o865k05O861O419q69o834o024P02P083N836j145p740n171
$$ -424 6760 6901 620 -6245 -6450 411 6830 5961 -873 -6897 -6195 888 6724 5579 -2161 -7332
2018g332J928O959N200k361o632m675K094P007M962l111p028m197L207P663L516
$$ -7332 -5404 1555 6755 4394 -2238 -6913 -4819 2188 7150 4039 -2989 -7186 -3979 3684 7200
2033G200l497p226l406M483O953K771m566o608k713M932O663J997n110o504j600
$$ 7200 3703 -3523 -6929 -2446 4507 7278 2712 -3896 -6609 -1677 4986 6983 1873 -4631 -6231
2048f231M978O186J240n544o350o88N322O124P83n898o374N12N934N431l94o105
$$ -6231 -1253 4933 6173 629 -5721 -6409 -1087 5037 5820 -78 -6452 -5940 -6 5425 5031 -1074
2064a074n247N69O551N416j208o288n142K034O393M899k547o297l947K020O711
$$ -1074 -6321 -5752 799 6215 5007 -1281 -6423 -4389 2004 6903 4356 -1941 -5888 -3868 2843
2079B843M021k939o554l497L041O357L401l278o788l134M352O076K637m340o308
$$ 2843 6864 3925 -2629 -6126 -3085 3272 6673 3395 -3393 -6527 -2175 3901 6538 2198 -4110
2094d110j932L926O100K041m339n912k021N014N969P61m977n668n24N016N863
$$ -4110 -6042 -2116 3984 6025 1686 -4226 -6247 -1233 4736 5497 520 -5148 -5672 -656 5207
2109E207K93n757n239M45N613N191n39n613m830Q22O068M457j462n568m261J285
$$ 5207 5500 -257 -5496 -5051 562 5753 5214 -399 -5229 -4407 1661 6118 4656 -912 -5173 -3888
2125c888N953M100j931o230l655K147N794L712k863o363k994L006N511L274l505
$$ -3888 2065 6165 4234 -1996 -5651 -3504 2290 6002 3139 -3224 -6218 -3212 2299 5573 2068
2140B068n953k364M042N396K110l767n400j663L766N712J410l866n572j106M482
$$ 2068 -3885 -6249 -2207 3189 5299 1532 -3868 -5531 -1765 3947 5357 1491 -4081 -5187 -705
2155g05N553P41m673n332l40M838M752l66m582m667L66M670M700r46n294m230
$$ -705 4848 5589 916 -4416 -4756 82 4834 4468 -114 -4781 -4415 255 4955 4009 -1285 -5515
2171e515J365N144M095j459n213l791J626N214L760k229n064l266K199N533L359
$$ -5515 -4150 994 5089 3630 -1583 -5374 -3748 1466 5226 2997 -2067 -5333 -3134 2399 5758
2186E758l194n273k540K863N381K456k883n636j638L296M899J825l696m792j467
$$ 5758 2564 -2709 -5249 -2386 2995 5451 2568 -3068 -4706 -1410 3489 5314 1618 -3174 -4641
2201d641L566N006J173l992n036m25L757N195N46m729m625M2M604M027j42m903
$$ -4641 -1075 3931 5104 1112 -3924 -4349 -592 4603 5149 420 -4205 -4163 441 4468 4326 -577
2217e77l807L57M918L642o70m964l671J539M267L557j609m464l323J206N444L080
$$ -577 -4384 -4027 891 4533 3863 -1101 -4772 -3233 1034 4591 2982 -1482 -4805 -3599 1845 4925
2233D925k011m908l000K392N048K812k918m875k157K929M616J980l182m309j772
$$ 4925 2914 -1994 -4994 -2602 2446 5258 2340 -2535 -4692 -1763 2853 4833 1651 -2658 -4430
2248d430L115M525J111l061m966j214L803M316P63l713m278j20K925M670M35l925
$$ -4430 -1315 3210 4321 1260 -3706 -4920 -1117 3199 3962 249 -4029 -4149 -1224 3446 3881 -44
2264d4m274R9M516L805n39m062l920O73M515L488p79m206l322P29M482L305j198
$$ -44 -4318 -4219 297 4102 3563 -499 -4419 -3746 769 4257 3478 -728 -4050 -3321 1161 4466 3268
2281C268m783l064J741M628K591j664m825k501K348M789J839k521m561j818K773
$$ 3268 -1515 -4579 -2838 1790 4381 2717 -2108 -4609 -2261 2528 4367 1846 -2715 -4533 -1760
2296a760M246K073l030m442j196L167M067J210l162m322j032L639L850O42l537
$$ -1760 2486 4559 1529 -2913 -4109 -942 3125 4335 1173 -3149 -4181 -542 3308 3950 413
2311D13m063l17L889M038k41m150l436P43L713L474q02l856l039Q03L751K792
$$ 413 -3650 -3967 -78 3960 3719 -431 -3867 -3124 589 4063 3261 -595 -3634 -2831 920 3712
2327C712p16m184k564J016L928L020j409m289k763J849M528K071k015m142k479
$$ 3712 2996 -1188 -3752 -2736 1192 4212 2803 -1486 -4249 -2400 2128 4199 2184 -1958 -4437
2342d437K486M218J568k327m059j285K477L680J300k685l741j399L414L465J258
$$ -4437 -1951 2267 3835 1508 -2551 -3836 -1359 2321 3621 936 -2805 -4204 -790 2675 3933
2357C933l028m207m25L255L561K13l402l269j82L680L365n33l375l059N73L130
$$ 3933 905 -3302 -3727 -472 3089 3302 -100 -3369 -3551 129 3494 2961 -414 -3473 -2900 230
2373B30K975k63l786k670Q66L224K881q50l581k953J322L936K789j909l769j996
$$ 230 3205 2942 -844 -3514 -2648 576 3457 2607 -974 -3927 -2605 1331 4120 2211 -1558 -3554
2389c554J420L827K106k282l601j486K404L542R50k015l666j130K387L426J106
$$ -3554 -2134 1693 3799 1517 -2084 -3570 -1166 2376 3326 1311 -2355 -3485 -1098 2328 3434
2404C434k280l930q77L029L642K56k576l675J14K997L184P2l283l259N82K907
$$ 3434 1154 -2776 -3653 -624 3018 3274 698 -2977 -2863 134 3318 3390 107 -3152 -2570 337
2420C37K801l68l142k586N51L212K476j024k938k859R91L599K634j200l792k293
$$ 337 3138 2770 -372 -2958 -2407 805 3281 2257 -681 -3540 -2549 1050 3684 2484 -1308 -3601
2436c601J063M177J706j377l760j637J643L628J243j814l326j195J965L259J447
$$ -3601 -2538 1639 3345 1968 -1792 -3429 -1786 1842 3085 1271 -2055 -3250 -1285 1974 3421
2451C421k409l248j095J990L486J044k246l415p85K358L532N08k922k859m1K502
$$ 3421 1012 -2236 -3331 -1341 2145 3189 943 -2472 -3257 -899 2633 3141 219 -2640 -2681 -179
2467a79L003j33l001k720N72K956K087l66k422k538J06K942K592p46k837k420
$$ -179 2824 2691 -310 -3030 -2458 498 2585 2219 -203 -2741 -2635 307 2899 2153 -684 -3104
2483c104P84L366K100j302l069k008J329L317J830j625l294j395J677L061J542
$$ -3104 -2320 1046 3146 1844 -1225 -3233 -1904 1413 3243 1618 -1676 -3071 -1394 1667 3209
2498C209j534l299j214J572L065J145j997l017p24K023K690J031k533k963l64
$$ 3209 1675 -1624 -2838 -1266 1799 2944 947 -2070 -2794 -771 1919 2950 417 -2546 -2910
2513b910K592K549O35k729k678j90K901K634m73k755k277Q07K280K157r13j872
$$ -2910 -318 2231 2866 137 -2541 -2731 170 2804 2331 -424 -2701 -1894 386 2543 1630 -242
2529b42k545P23K714K097m37k970k203J083L026J854j351l262j436J541K902J231
$$ -242 -2787 -2064 650 2747 2310 -660 -2863 -1780 1246 3100 1749 -1513 -2949 -1408 1494 2725
2545B725j653k518j285J704K342J103j480k608j071J934K396J296k182k607q20
$$ 2725 1072 -1446 -2731 -1027 1315 2418 938 -1670 -2741 -807 1589 2885 703 -1904 -2724
2560b724K061K704N19k173k546m10K320K841n23k116k337L2K471K130j26k135
$$ -2724 -663 2041 2560 387 -2159 -2569 -249 2592 2069 -47 -2384 -2352 119 2249 2123 -12
2576a2j891n0K277K408r41j943k367P22K493J616m34k683j877R26K595J900j393
$$ -12 -1903 -1953 324 2732 1791 -152 -2519 -1797 696 2312 1878 -805 -2682 -1756 839 2739 1346
2593A346k357j529J368K815O04j356k266j470J967K295Q46j665k479o59J812K438
$$ 1346 -1011 -2540 -1172 1643 2247 891 -1375 -2845 -878 1417 2263 598 -1881 -2540 -728 1710
2609A710O63j552k722o49K052K477L92k125k349M2K207J979q6k229j863M19J843
$$ 1710 2373 821 -1901 -2550 -498 1979 2371 246 -2103 -2061 146 2125 2039 -190 -2053 -1634 209
2626B09K033o78k001j603J13K304J797n44j944j806M54J940K223j138k415j311
$$ 209 2242 1564 -437 -2040 -1927 377 2174 1630 -314 -2120 -1666 274 2497 1359 -1056 -2367
2642b367R59K830J027j217k158j479J587K316R89j060k664o81J210K308P01j432
$$ -2367 -1408 1422 2449 1232 -926 -2405 -818 1498 2487 1427 -1237 -1918 -708 1600 2301 869
2658H69k354o98J477K580L28j659k619J24J777K397j02k330j805J12K274J562
$$ 869 -1485 -2183 -706 1874 2202 543 -2076 -1952 -175 2222 2120 -210 -2015 -1903 371 1933
2674A933k20j587j961J73J409K238m03j974j905N69K117J388r3k381j426N41K556
$$ 1933 1713 126 -1835 -1662 -253 1985 1582 -392 -2297 -1728 389 1777 1684 -697 -2123 -1582 974
2691I74J571j269k209r21Q28K171P77r94k175q55J454J867Q31j242k175n59J102
$$ 974 2545 1276 -933 -1854 -1026 1145 1922 928 -1247 -2102 -648 1219 2050 808 -1367 -1926 -824
2708h24K348L55j564j921m01J349K128M62j518k422K63J580J914K35k483j478
$$ -824 1524 1879 315 -1606 -2007 -658 1470 1932 414 -2008 -1745 -165 1749 1984 -499 -1977
2724a977RJ933J784n32j175j763N9J793J759n09j939j466N76K102J250n24j952
$$ -1977 -1968 -35 1749 1217 42 -1721 -1662 131 1890 1381 -558 -2024 -1448 654 1904 1380 -572
2741e72j568R90K104R66q51j872j127R28J884J196j419j592r84J185J921L58p63
$$ -572 -2140 -1150 954 1920 1069 -803 -1930 -1002 882 2078 659 -933 -1917 -732 1189 1547 784
2758G84j714o79Q79J950P95j430k344l09J584J727N73j838j418j55J534J741j93
$$ 784 -930 -1609 -730 1220 2015 585 -1759 -2068 -484 1243 1816 -22 -1440 -1595 -61 1680 1487
2775A487j381j577L70Q70J746k7j667j607J15K175J174k48j760j733P96J629J562
$$ 1487 106 -1471 -1101 -231 1515 1488 -179 -1786 -1671 504 1678 1430 -330 -2063 -1267 362 1924
2792A924q42j934j156J187J863M27m69k126o72J166J605J031j118j816q54J106
$$ 1924 1082 -852 -2008 -821 1042 1469 1000 -1126 -1798 -632 973 2004 886 -930 -1784 -678
2808f78J626N12r64j390p26R73J874O5r94j791J09J531J276p6j338j200j40J357
$$ -678 948 1460 496 -894 -1620 -647 1227 1292 298 -1493 -1384 147 1423 1347 9 -1191 -1331 26
2826B6J217J40j540j326R5J455J365n5j407j221L85J308J238n70j541j092K96
$$ 26 1243 1383 -157 -1483 -1388 67 1432 1377 -30 -1251 -866 442 1680 1110 -431 -1523 -1227
2843a227J882R39p94j431j161J122J309R27j031j452m93Q41J388O92p07j816l56
$$ -1227 655 1594 800 -631 -1792 -670 639 1566 535 -917 -1410 -569 819 1511 804 -1012 -1368
2860a368P46J469Q67j245j559l10J056J497L23j195j568j26J305J200R8j160j183
$$ -1368 -622 847 1714 469 -1090 -1400 -344 1153 1476 281 -1287 -1413 -108 1092 1190 30 -1153
2877a153r7J362R28J39j212j346M26J273J198l38j735q57L69J230J152l38j658
$$ -1153 -1250 112 1040 1179 -33 -1379 -953 320 1518 1180 -555 -1412 -1043 187 1339 1001 -657
2894f57p67N87J608M99m33j828k54Q14J031P92n50j627m62O37J182N61o26j265
$$ -657 -1424 -837 771 1270 837 -991 -1245 -431 600 1392 842 -785 -1247 -610 572 1133 507 -758
2912g58m30P67J548K11j087j410qJ210Q57K88j359j069O6J130J272k25j034p62
$$ -758 -1188 -421 1127 1338 251 -1159 -1167 43 900 1188 -171 -1240 -1174 -44 1228 1003 -31 -793
2930g93k77P87J505L8j256j013NJ210P66o7j253j094O26J162R01m62j254r34Q97
$$ -793 -1070 -283 1222 1260 4 -1009 -1004 206 972 905 -348 -1442 -816 346 1247 785 -469 -1403 -506
2949e06J085J155r36j427m47L30J744J26n78r73p44P20J376M29j010r73p55J119
$$ -506 579 1734 798 -629 -1076 -746 998 1124 546 -427 -1171 -451 925 1354 344 -629 -1384 -265
2967b65J148j96n90p91k85R14J252k34o42j550o9J316O63M29j500o24O1J060J005
$$ -265 883 687 97 -694 -979 -65 1187 953 311 -1239 -1308 8 671 1100 -400 -1024 -963 97 1102
2986A102j47r62j125K17J055R03m02j213p72N51J492M65m82j230p35N80J419M59
$$ 1102 955 -7 -1132 -915 140 1043 641 -572 -1344 -793 699 1164 682 -548 -1283 -703 716 1175
3004A175n90j153l20R21O31N23r12o40o09Q13Q19M06n95j111n42R27J498j13j089
$$ 1175 585 -568 -888 33 664 1187 275 -365 -974 -161 658 1064 469 -642 -1184 -257 1241 1128 39
3023C9j095P2J126N59J74r12r07J11Q16O36K78r97p06l38J645L03j81o51j158
$$ 39 -1056 -984 142 701 875 -37 -944 -833 -17 619 897 -100 -806 -1144 501 804 623 -28 -1186
3042a186K44J148O92m48q26q85O18J343R1l38o54q89O44J151K58m91r44n24N90
$$ -1186 -942 206 898 450 -376 -1261 -643 700 791 453 -201 -1090 -446 705 963 472 -472 -996 -406
3061d06J371M07j003q89n72J082O36J83n11j303N8J234O83J42j005r93L10Q82
$$ -406 965 1372 369 -520 -1092 -10 626 809 298 -1005 -947 287 970 1112 107 -886 -576 306
3079C06M46j04p99o65L03O18Q66l00j150n93J40J129N68m09n17n33l0J340M81
$$ 306 752 648 -151 -816 -513 105 971 671 -479 -1072 -932 197 765 356 -161 -694 -724 616 1097
3098A097o52j190n41P73J123O38q12r28m10Q18P72K72p98o95l81P49Q71N16j172
$$ 1097 445 -745 -1286 -513 610 1248 436 -492 -902 -84 688 960 162 -533 -914 -165 706 1222 50
3117E0j099k8J208N93L2o43r82j12P20R76J60r07r39L48J024K72K66r50q98L07
$$ 50 -1049 -1077 131 724 756 113 -869 -981 -261 715 875 -32 -971 -623 401 673 939 -11 -909 -602
3137f02O29R14k52p62r50N22P16O35l96k72j115O14Q14M83n13p93l77M39P60J67
$$ -602 27 941 689 -73 -1023 -501 215 850 454 182 -933 -319 495 978 465 -328 -705 -266 494 661
3157F61n8j046n64P16N86N49l56j290k86R82N80N3m90n48m24P49P55J26n61r40
$$ 661 603 -443 -1007 -291 295 844 488 -802 -1088 -106 474 527 37 -511 -935 -186 569 695 134 -806
3177h06nP49P44j53r57l09q8R22O51k27n78q19L22J014K18p2o18n82N8O50J114
$$ -806 -811 -62 682 529 -428 -737 -825 97 748 521 -57 -876 -554 460 678 606 -12 -594 -536 114 1228
3198A228o86q89m36N72P68K13n35p27k73K39J203M6m27r25r5P49O89Q8p51o32
$$ 1228 542 -347 -783 -211 557 770 235 -492 -765 -526 677 723 296 -629 -724 25 714 802 51 -581
3218e81j77Q31N94j81m88o47k88R19O79j70p08k76j9M12Q47m02m92n03L48J77
$$ -581 -758 73 667 486 -2 -649 -937 -18 661 491 -217 -493 -512 -100 747 345 -147 -650 -302 -125
3238a25R77l91o46m74N1Q49K61O6q20l43K14Q19K9Kj018k61N89O69Q7l45l79l69
$$ -125 852 461 -185 -659 -608 241 502 568 -252 -595 -381 438 467 469 -549 -810 -221 448 535 190 -189 -558
3260e58j1J152K14m98p38j93M21P67K19o40p01k56J056K20pm45n41j40O30O22
$$ -558 -569 583 797 299 -439 -632 -211 556 775 135 -566 -822 234 454 447 2 -539 -679 -49 573
3280E73j68n22o19N10N31N65O4j251l53L00M32O25j61o88l70L2J075J00j10j030
$$ 573 405 -117 -736 -226 305 870 934 -317 -670 -370 62 687 526 -162 -532 -500 575 675 565 -465
3300d65QM4R34L59m86q04k14O91M29P8k87o30m08P72K91N29q97m80l01P22O57
$$ -465 -457 -413 521 880 394 -410 -624 67 496 574 287 -343 -751 21 312 841 -56 -536 -837 -115 542
3321E42J66q66m04K73K14N60J5n23l59k33J031nJ39m75j113K70R28N14j64p33
$$ 542 708 -158 -562 -289 -75 485 500 -23 -382 -615 416 411 550 75 -1038 -768 160 674 510 -223
3341b23l94K59N12O00l70p05n01M45P62R7r0p89l32N70O41q5j43m85l92O68M48
$$ -223 -617 -358 154 754 384 -321 -822 -377 385 482 392 -397 -729 -159 482 397 254 -231 -623 45 493
3362D93K9l39o46J27J86P01j36o58k05j11L78J049m27n50m97L00K94M19r9l81
$$ 493 522 183 -463 -336 -150 551 415 -243 -448 -559 -181 868 441 -109 -606 -306 -12 407 308 -73
3382g3n85Q29j37L26k19k06n58M24M66M78l03n06m06Q5P82K7j90n71r2K16O17
$$ -73 -658 171 34 360 141 -65 -623 -199 267 745 442 -64 -470 -385 397 424 234 -337 -429 -213 404
3403D04p0m26j31m0J07N28M0m17m58k8N55M8N8J9n86l0N18L18l74J53n97j30O95
$$ 404 334 -92 -223 -263 -156 372 412 -5 -463 -491 64 112 170 189 -397 -427 91 409 35 188 -409 -539 156
3426A56J86q7r2l23l68P86R1k59j69m69L80L18M23m57m31l17L10M95K25k64n62
$$ 156 342 255 163 -160 -528 258 349 90 -79 -548 -168 150 573 116 -315 -632 -322 173 398 134 -428
3447d28pO63P8q1r3m08k47K86N17K17n49m50J29M01R2K71n04l10j89P22M16l42
$$ -428 -435 228 306 225 132 -276 -523 -237 280 497 -52 -502 -373 28 120 391 -113 -423 -612 110 526 184
3469A84j29l63P2Q97k63o4l73o36K83L24N61l68m39kj2N56J64l76m07L36K5K18
$$ 184 55 -308 -236 661 398 334 -39 -675 -392 -68 493 125 -314 -316 -328 228 392 16 -391 -55 -30 188
3491A88J73l06j58k59r0P74K67m17p40o9N07M58J47n39r2m25P06J90K1l9n72k86
$$ 188 361 55 -103 -362 -452 322 589 172 -568 -637 -130 328 475 -64 -156 -581 125 315 336 297 -275 -561
3513e61M19N54j58m35m08N16L49j51j4k83j53J82N64o9K2k68o78N86M23j82j07
$$ -561 -142 412 254 -181 -589 -73 276 125 111 -172 -325 -143 421 352 374 106 -572 14 437 255 148
3534A48l09k85J12Q77m18J70m32j41L55J95K55o54j12k04O0Q14l8l14l11k99P17
$$ 148 -161 -446 -334 543 125 295 -137 -278 77 272 527 -127 -239 -443 -383 431 393 79 -232 -531 186
3555A86R1L3n15l34J74L92M23L4m57k73l32O23K41n2l71m69K11M98Q3K07k97q02
$$ 186 277 310 -205 -539 -365 27 450 484 27 -246 -578 45 286 234 -137 -606 -395 103 186 393 96 -706
3577g06M08M59J69j24o00J07J58N26o8m28k66J7N36P9J71l00o54R0O02J39N7k36
$$ -706 -298 161 330 206 -394 -287 -129 397 329 -99 -365 -348 188 267 438 138 -516 -426 176 315 372 136
3599A36o38o5N66K18K32n06k59L8J25M51r0k49l47qM69K98j60%q48J35O52L9K83
$$ 136 -502 -567 -1 217 449 -57 -316 -278 -153 298 208 -41 -388 -396 73 371 211 211 -637 -502 150 189 472
3622D72n76n58M80L53K77j2n56l30j68R78j87Q6o82PK18N75N6l05j83l16J74N22
$$ 472 -104 -662 -182 171 448 436 -120 -450 -618 360 173 259 -423 -416 -198 377 433 128 -55 -371 -197 325
3644C25m6k60j61j56O58J92l22n97j01L33J61J87K96l15l63j17M21j1jl42j79
$$ 325 279 19 -142 -298 360 552 230 -367 -468 -135 26 213 509 194 -169 -286 135 124 123 -219 -398
3665c98M36J37J46j94n58MO05K5K30p5j73n05J40N02J5m02o8l98K69P25l12J84
$$ -398 38 175 321 127 -431 -427 178 203 433 358 185 -320 -180 322 337 -65 -133 -531 -262 463 151 335
3687C35n14J85k16O77J01n15k86j69K65N41j94l22m47K2O03N34l75o30J69q0N36
$$ 335 -179 6 -210 467 568 53 -233 -402 -137 404 210 -112 -559 -537 66 600 225 -405 -236 -316 220
3708B20l4P9l19l91M16J33L08j27o09J88J08L78jk74n12J36K97M19L38r56r9k78
$$ 220 186 265 -54 -445 -29 104 412 285 -324 -136 -28 350 349 75 -437 -301 -4 415 753 -203 -302 -580
3730e80N97K57K59n75j33j57L23L17k33j21o14N8M32M84K56q46K79n3L33MM78
$$ -580 17 274 533 -42 -175 -332 -9 308 75 -46 -660 -602 -170 314 570 -276 3 -50 283 287 765
3751G65j009n13O74L00q6R8l64q2J19L35K02j21l92m14J07K83M36m9n19l03L65
$$ 765 -244 -757 -83 217 131 229 -135 -217 -98 237 439 318 -74 -488 -381 -98 338 289 -230 -533 -168
3772a68M17N8k72r6k56J4M98J17j91p81K10O13MJ64l41m25Q1K92J40L54n55q4
$$ -168 249 307 35 -61 -317 -303 195 312 121 -660 -450 163 167 331 -10 -435 -354 -62 78 432 -123 -207
3794b07J11M1L74J24n85k22m5N48K58k56P7o18L28o6N87k39l04m4r7K57O44o23
$$ -207 -96 -55 319 443 -142 -364 -409 139 397 141 218 -400 -72 -138 449 210 -94 -138 -235 22 666 43
3816D3n19K69J03K94K4Q7l94l46M34N5K77k50k33k27K88L16K5k20r8k04M71J2
$$ 43 -476 -207 -104 190 214 301 -93 -439 -5 50 327 77 -156 -383 -95 221 246 26 -72 -276 195 207
3838B07K73k27o74K5M08O97l32m55k08j87P44L48m05k92m29L80P3P6K29l72l33
$$ 207 480 253 -421 -396 12 709 377 -78 -286 -473 271 619 214 -78 -507 -127 -54 22 251 -121 -454
3859d54l3P34l63K55m99P2q0R41j2n89j90L7J47O4M19k41m58r4Q3M26K01k04n03
$$ -454 -487 247 -116 139 -360 -288 -368 573 561 -28 -218 -181 -34 30 449 208 -250 -344 -261 165 366 162 -341
3882c41r7M82J79K40n74o8k43M00M75m36J59m03j86K00L81J14j44o00N3P17O1
$$ -341 -438 44 223 463 -111 -179 -422 -22 453 17 176 -227 -413 -213 168 282 138 -462 -409 308 369
3903C69q3n8m70j5O10l7K34m63n79O7K01L33K28n21nq4O25Pk69j23j81mP5P14
$$ 369 286 228 -242 -257 353 316 550 87 -492 -425 -224 109 337 -184 -189 -273 352 359 90 -33 -214 -218 -143 571
3927E71k30o24j81L88L72M7l60k61J38J23J68K25l80m84M82L7N21j64m94l54K10
$$ 571 341 -283 -464 -76 296 343 -17 -278 -140 -17 151 376 -4 -488 -6 31 552 388 -106 -460 -250
3948b50L42M70l93n6m50R0M53J85k23j21k57j32M08L16o6n54l40O79k04O69l57
$$ -250 92 562 169 113 -337 -247 206 391 168 47 -210 -342 66 382 316 -238 -578 101 -103 566 209
3969B09k92k96K19M47Q7m96m2j98L57n4N27j32m43N1j49M97J8n40j07j17NP24
$$ 209 -83 -379 -160 287 374 -122 -164 -362 -5 -59 468 336 -107 -56 -205 292 310 -230 -337 -454 -449 275
3991B75N7o3o82p6L83O10k35k79k26j25O64J37j57l38j55l28O35K91M0k30n56
$$ 275 332 269 -413 -489 -106 504 269 -10 -236 -361 303 440 283 -55 -210 -538 97 388 428 198 -358
4012c58j06L99Q15p14k92Q4o1N13j71Q3k63j51j13M33J82j1m15l51M35M78j10
$$ -358 -464 -65 750 36 -256 -172 -233 280 109 192 -71 -222 -335 98 280 269 -146 -497 -62 416 306
4033C06l85J22o30M69K14K07k6q30N23r3M48r5o9p51N07Q0L64j75k90l91J11J28
$$ 306 -79 43 -587 -118 96 303 277 -553 -30 -123 325 230 161 -590 -83 -3 361 186 -104 -495 -384 -256
4055b56Q22o60j7ok52O10J17n1n70k35L73N82l23J93o64l5M1M74J51J9n33l49
$$ -256 566 -94 -111 -117 -369 241 358 307 -263 -498 -125 457 134 327 -337 -372 -331 143 294 313 -220 -569
4077e69N08J54L88j39n36j58K07M58J67j02m13k35RN33J27m43j74k60K77O16m49
$$ -569 -61 93 481 342 -194 -352 -145 313 480 378 -35 -270 -261 272 399 -44 -218 -478 -201 415 -34
4098c4j04j1j72L45L03J05m81m1n0J55M04km51k75n9O22m5J55n41l94L20O34R3
$$ -34 -138 -149 -321 24 327 432 -49 -90 -140 15 419 417 -34 -309 -368 254 209 364 -177 -571 -251 383 476
4121D76k17m34l42L58K47J37j5m74N8J50J19K34j6m70j70N32k2L14k18n38k24
$$ 476 259 -175 -517 -159 88 225 210 -264 -206 -56 63 297 281 -189 -359 173 151 465 247 -291 -515
4142e15K92M61K49l27o02M7M51L14j69k62k70j31O05J62r1k86n54K83O75J6K07
$$ -515 -223 238 487 160 -442 -395 56 370 201 -61 -331 -462 143 305 214 -72 -626 -343 332 348 555
4163E55o06k97K63J76K81j96m48J66k69M72R9L6j82o08L92N19n5k56p6j25R2K40
$$ 555 -51 -348 -85 91 372 176 -272 -106 -375 97 196 232 50 -558 -166 353 298 42 -34 -159 -67 173
4185A73L81n43l73P7K09K56N17o08n79J9N74K78k42l26l07J09K81M22%po48N1
$$ 173 554 11 -362 -285 -76 180 697 89 -490 -471 103 381 139 -187 -494 -385 -104 318 318 311 -337 -286
4207b86K4O89j14l46n87J1M66K21J04k85k02R7J44L09m9m38O9JK50P3K64q06J86
$$ -286 -262 427 313 -33 -620 -609 -143 78 182 -103 -305 -208 -64 245 196 -242 -173 -172 78 151 415 -391 -205
4230b05j90O39L30m31m27J52k44M58M91q05kq2K26L68N4k32p12L36N21j4J58n03
$$ -205 -395 244 574 143 -284 -132 -376 82 573 -232 -234 -316 -90 278 332 100 -612 -276 245 231 389 -114
4252a14j0m6N9P15j8r10M2j47P15J05l22k02j56j40L55P08p57L4m10K40L87K95
$$ -114 -124 -170 -111 604 586 -324 -282 -429 286 391 69 -133 -289 -429 -74 634 -123 -89 -499 -259 128 423
4274D23j71l28l86J93L57J02j55j25o87N06N84N6ml51p81O28K51K69k67k96J0
$$ 423 252 -76 -462 -269 88 190 35 -90 -777 -271 313 369 365 14 -767 -139 112 381 114 -182 -172
4295a72j4M53k4n11m2l4j1P93L9o13N5q7k77M91J57m52K16k43M35R7O5l00n72
$$ -172 -186 267 243 -268 -310 -344 -355 438 477 -136 -81 -168 -445 46 203 -249 -33 -276 159 256 321 21 -551
4318e51O25J39K01j97n22M5j60N81M49l03o21l04N49L35K96k54m81o09N04L58
$$ -551 74 213 414 217 -305 -260 -420 161 610 307 -314 -618 -69 266 562 308 -173 -782 -278 80
4338H0N56m06m40k06N00o9K58O0o84PJ10Q91o18k50m0KK31K43L51n43l63R5O80
$$ 80 636 230 -210 -416 84 15 273 333 -351 -344 -234 657 39 -211 -251 -249 -18 225 576 33 -330 -235 445
4361D45J36j41k60m94k37P31L12k74p6k73j40N26L30k68n18k64J25K23P17k64
$$ 445 581 440 180 -314 -551 180 492 218 142 -131 -271 255 585 317 -201 -465 -340 -117 600 336
4381C36o59j30N35K40j76k42K1n84L82N66J00l06n34j25L56L34K66l08k87J09
$$ 336 -323 -453 82 322 146 -96 -75 -659 -277 289 389 83 -451 -576 -220 114 380 72 -215 -106
4401a06L1L55R3n16l99L18K18J49N5k44m50M31J15J70J67m88l3k06N58L52k87
$$ -106 -75 280 373 -143 -542 -224 -6 143 198 -46 -496 -65 50 220 387 -101 -134 -340 218 570 283
4422B83k53j32l74L53K39L16m20n81N32K92O6J42m65k10q6L56L04m08j47k23K28
$$ 283 30 -102 -476 -123 116 432 12 -569 -37 255 321 463 -2 -212 -298 58 362 -46 -193 -416 -188
4443a88N07K36l51o05p9K48L81j09R2m64k19N27K65Q7j96n88J33J91N42p3m94
$$ -188 319 555 204 -401 -480 -232 149 40 132 -332 -551 -24 241 328 132 -456 -323 -132 410 337 -157
4464a57L7j16L45L56l25J34q40N88K24K57j05m58l70K08L59K31j99l90j89N58
$$ -157 -120 -236 109 465 140 274 -566 22 246 503 398 -60 -430 -222 137 368 169 -221 -410 148
4484A48J52R0k30j78l41J8O51K42l11p18J62L95K90M8l16m59L6Q55j71J92m00
$$ 148 300 390 160 -18 -359 -341 310 552 241 -477 -315 80 370 418 102 -357 -321 534 363 555 155
4505A55l58l47O16K75j53l02J7m26N65N1K82m42k86%M76L24m31K1m44J05M52L81
$$ 155 -203 -550 66 341 188 -114 -97 -523 42 93 375 -67 -353 -353 123 447 16 37 -407 -302 150 531
4527E31l13m18j4q9N10j3P7k97l46L53J9M70l81k83j59K19K28K92l03m32j14J26
$$ 531 218 -200 -214 -303 207 194 271 -26 -372 -19 0 470 89 -194 -353 -134 94 386 83 -349 -463 -337
4549c37O13J82m60k38P9o8L40M81n23j48K4J73K35j27k42k66R6L8L69J74l38n38
$$ -337 276 458 -2 -240 -161 -229 111 592 69 -79 -55 118 353 226 -16 -282 -186 -148 221 395 57 -481
4571d81j5O61K55l72J84n74m5O49J97m0o28l4k0J73L20Kn17l24%N24J31J32k52
$$ -481 -496 165 420 48 232 -342 -387 262 459 419 -209 -243 -263 -90 230 232 -285 -609 -609 -85 46 178 -74
4594g4j03j43M55M37l52n18k00K51L10M16p13L3k43K26N41j26j47l30k21P49r1
$$ -74 -177 -320 135 572 220 -298 -498 -247 63 479 -234 -201 -444 -218 323 197 50 -280 -501 248 157
4615A57Q7k77m83J71K27J36K72k90k95k40P80J16j10l95k36K62K58J60K85n84
$$ 157 244 -33 -516 -345 -118 18 290 0 -295 -535 245 361 251 -144 -380 -118 140 300 585 1
4635AP5L8l44N64j83k33l58J35N81J96j61p09k26N57J24O51m61m69k0L3L05L61
$$ 1 76 114 -230 334 151 -82 -440 -305 276 472 311 -398 -624 -67 57 708 247 -222 -242 -209 96 457
4657D57jn97l37O01K08J83l02o02K39J54P8L63l86m40K01K59M54k16m20j57j46
$$ 457 456 -141 -478 123 331 514 212 -390 -151 3 81 444 58 -382 -181 78 532 316 -104 -261 -407
4678d07M89PJ15k84m56q4P36L42l12l66k51L01O0P97n30k08m52J76M82K78m58
$$ -407 82 89 204 -80 -536 -620 116 458 146 -220 -471 -170 -110 687 157 -51 -503 -327 155 433 -25
4699b5k83J29k48M87N87q9p23l8M5L58K10o20j43K94j27L52N2Rj33j80N3L67k9
$$ -25 -308 -179 -427 60 647 558 -165 -203 -158 200 410 -210 -353 -59 -186 166 218 227 94 -86 -33 334 305
4722C05k94k48N7M21L04k06n06k91K39K46J9L49m22j12O2J80J48k5m20J99q5K12
$$ 305 11 -237 -180 241 545 339 -167 -458 -219 27 46 395 -27 -139 -77 103 251 226 -194 5 -80 132
4744A32L43k22m84k2K22K15J02j28l03k88K2P43K22n81l41k79L09M76K02j18q13
$$ 132 475 253 -231 -253 -31 184 286 158 -145 -433 -411 332 554 -27 -368 -647 -338 138 340 222 -591
4765e91K67K95K64J63k32n43j8N66K41k02k13m47J77K37K09J78n81q9J36K75P
$$ -591 -324 -29 235 398 166 -377 -395 171 412 210 -3 -450 -273 -36 173 351 -230 -319 -183 92 99
4786I9J89J27p19J87K31M1j9j21l61m5O24J06l46j86m2K36J98J88m09r3r7p7M05
$$ 99 288 415 -304 -117 114 155 136 15 -346 -391 233 339 -7 -193 -235 1 199 387 -22 -115 -212 -289 116
4809A16J16l45j49o6J70N37K0m36J04m00K47J11L15m00o35P80j73L35J42m27k89
$$ 116 232 -113 -262 -328 -158 379 399 -37 67 -333 -86 25 340 -60 -695 85 -88 247 389 -38 -327
4830c27K12R1M20r8k10l52J94r6M20j36J25m91N3M96L3k88j74k02K76L95j64Q9
$$ -327 -115 -24 396 298 88 -264 -70 -166 254 118 243 -248 -195 301 334 46 -128 -330 -54 341 177 266
4852B66n22j44J38M44M1j33l03M0n4O92k15k32j62m39L74L32M24o08J14k43M01
$$ 266 -256 -400 -262 182 223 90 -213 -173 -227 465 250 18 -144 -583 -209 123 547 -61 53 -190 211
4873B11j15L18o71k1k1L64n1K58j79l23p4J35L65m6k13n05M72M01J78n17j78j44
$$ 211 96 414 -257 -278 -299 65 14 272 93 -230 -304 -169 196 150 -63 -568 -96 305 483 -34 -212 -356
4895c56M9N75J6j50k40l90K69N82j18J26p84j21K88N52K30m40l83l5m9N54O2n95
$$ -356 -307 268 284 134 -106 -496 -227 355 237 363 -421 -542 -254 298 528 88 -295 -330 -379 175 237 -358
4917c58RK93l8L61J36l08m32j04L17O29n2l78k29k00N13k89K71k39o9j21m7P72
$$ -358 -349 -56 -94 267 403 95 -337 -441 -124 505 453 75 -154 -354 159 -130 141 -98 -167 -288 -335 437
4939D37k00j52n6l07M04L44k09m03k52L75l4O40m66k29k5l15N30J43O8l14n26
$$ 437 237 85 29 -278 126 470 261 -142 -394 -19 -53 587 121 -108 -133 -448 82 225 293 -21 -547
4960e47L47J02M25j59l35JJ81L1L92k97l92R0R3L23j2m1n21M8L0N34j12k25Q0
$$ -547 -200 -98 327 168 -167 -166 15 46 438 141 -251 -161 -68 255 243 202 -319 -271 -241 293 181 -44 36
4983C6l34L22K22M0n14k82K60O09K95m72m50L4J33L2M46n37J84l25j5M64M29o57
$$ 36 -298 24 246 286 -228 -510 -250 359 654 182 -268 -234 -101 -69 377 -160 24 -301 -316 148 577 -80
5005h0j39oN6J92L04j95l32O6p4j8L68o6l25K4M51r9J13k45k95K46j6N41J17o79
$$ -80 -219 -225 -169 23 327 132 -200 -134 -208 -226 142 76 -249 -225 226 127 240 -5 -300 -54 -70 471 588 -91
5029i1l09j57L36K58M13m56m22J31M1N71j21j56m34M02K10J28K3k88k30l26J39
$$ -91 -400 -557 -221 37 450 -6 -428 -297 -256 315 194 38 -396 6 216 344 367 79 -151 -477 -338
5050c38M28J91Qo80K09J59L77l09l42J00M5K74K52r6k75m7j06J52J29J42n99O8
$$ -338 90 281 289 -391 -182 -23 354 45 -297 -197 -152 122 374 278 3 -44 -150 2 131 273 -326 -258
5072b58Q1L88J91j27n60J60j30M09m6k94J16m65P52l5K98l36m68r8L90J64L56
$$ -258 -177 211 402 275 -285 -125 -255 154 108 -186 -70 -535 217 182 480 144 -324 -422 -32 132 488
5093D88p78J74j15L21M1K8m25J50k4M27j10J82n35k86Q2N76K74k85o50l4L66j3
$$ 488 -290 -116 -231 90 131 159 -266 -116 -140 287 177 359 -176 -462 -380 196 470 185 -465 -499 -133 -146
5115a46K26qj16l39k1K69L15K9m11k26L98J23L47n07J1p2J23L04k0M8p88RL61
$$ -146 80 72 -44 -383 -404 -135 180 209 -202 -428 -30 93 440 -67 -56 -128 -5 299 279 327 -461 -452 -91
5138i1L70l06Q0l73M4L74K41j60m14n8j14O47K80k31m25j99K33L25l08L51k23
$$ -91 279 -27 53 -320 -276 98 339 179 -235 -293 -407 240 520 289 -136 -335 -102 223 -85 266 43
5159D3o6k23J95N12k84m42j22R1P18m19K83n35k36M94M62m06Q8j85k23M73k06
$$ 43 -23 -246 -51 461 177 -265 -387 -296 422 3 286 -249 -485 9 471 65 153 -32 -255 218 12
5180A2K10q7o80J24N40kL02n0o90K33L6J69K03l54l96k31P69J90k35n9k15J05
$$ 12 222 135 -545 -421 119 117 419 369 -321 -88 -52 117 320 -34 -430 -661 108 298 63 4 -211 -106
5202a06r4N98n4k22l39J34N8Q7J22j14k10Q0J03M8Q7l47m06N62j67N30J16m39
$$ -106 -200 398 344 122 -217 -83 -25 62 184 70 -140 -60 43 91 178 -169 -575 -13 -180 350 466 27
5224B7n15L25K79J51k33J96k25l58M85K89l91j15k96J73K45K7j24j44O7J78L43
$$ 27 -488 -163 116 267 34 230 5 -353 132 421 30 -85 -381 -208 37 64 -60 -204 -137 41 384
5245C84N6n67oj26Q4M58j26k9n01J26N44j46K76o54l4K05N9M18n45J41k82QN44
$$ 384 440 -127 -133 -259 -175 283 157 128 -373 -247 297 151 427 -227 -261 -56 3 421 -124 17 -265 -257 287
5268B87l33j18k0n06N51M10j40K48o21k95N63pn6O6k19J64J7J68R2O1o36J56L05
$$ 287 -46 -164 -184 -690 -139 271 131 379 -242 -537 26 19 -37 29 -190 -26 -9 159 251 312 -324 -168 137
5291A37J75l63K13m09l12O58J78N2m17j27J64q1M39l06J28r03N37J72m8L1J05
$$ 137 312 -51 162 -247 -559 99 277 329 -88 -215 -51 -132 307 1 129 -774 -237 -65 -113 -82 23
5312B3R4l58M40M98n49k71q0k89M96L26l70m2o8m0L14J61l2m22p6J68O25k32l22
$$ 23 117 -241 199 697 148 -123 -203 -492 4 330 -40 -82 -150 -190 124 285 253 -169 -245 -77 548 316 -6
5335fp6j64L07K08k4l38j37QK50N07o1m07l23P0J76M69l35j60J07k73j98N19J41
$$ -6 -82 -246 61 269 245 -93 -230 -222 28 535 474 67 -256 -186 -10 459 124 -36 71 -202 -400 119 260
5358B60k62k0k56M12jJ3k20l16O2J83N57n0o62j90O20k3O8K4k58l88M22K59J34
$$ 260 -2 -22 -278 134 133 146 -74 -390 -328 -145 412 362 -300 -490 130 107 175 199 -59 -447 -25 234 368
5381C68l72k19K7j67L29J90L3m36nP8L50Q4pl98P4l05Q01O1n21J50m63K81M52
$$ 368 -4 -223 -196 -363 -34 156 189 -247 -252 -174 176 260 253 -145 -71 -376 425 486 -35 115 -348 -67 385
5404C85p4l70k07R8M01j86L6j28lk93J77O78Oj85o81J23L93M17n13k45j29J11
$$ 385 311 -59 -266 -168 233 47 83 -45 -48 -341 -164 514 520 335 -346 -223 170 587 74 -171 -300 -189
5426a89L6K80Q6l83k51K09N04k09J93n22On2M58K16On28J12m2jN62n93j20J21
$$ -189 -153 127 213 -170 -421 -212 292 83 276 -246 -240 -292 166 382 388 -140 -28 -70 -71 491 -102 -222 -101
5449a01r1L91J92l07m62o5M35N17m04j64N2n06O97J35j56k16n39O24NL38k81k59
$$ -101 -192 199 391 84 -378 -443 -8 509 105 -59 -7 -513 184 319 163 -53 -592 32 37 375 94 -165
5471a65n40P73J6K21K8p40K40k82N62J48j67o7n60M37J95j22K47m15m1L28O0j9
$$ -165 -705 68 84 305 333 -407 -167 -449 113 261 94 27 -533 -96 99 -23 224 -191 -232 96 156 137
5493A37K48q45L56q5Q1N17m93j38j18M87J28j4m23K23L7P5J11j06r9k66j27K59
$$ 137 385 -460 -104 -189 -108 409 -84 -222 -340 147 275 261 -162 61 98 173 284 178 79 -187 -314 -55
5515e5o7L24j44j08k80K19N88k22m72J00J55O0J09K1j65k70j42L00J92l5k04k96
$$ -55 -122 202 58 -50 -330 -111 477 255 -217 -117 38 98 207 228 63 -207 -349 -49 143 108 -96 -392
5537c92J94K92K50k85m57M51j54L89k00lj31j49J0M42M5k89l41K8L08J54r0k03
$$ -392 -198 94 344 59 -398 53 -101 288 88 85 -46 -195 -185 257 302 13 -328 -300 8 162 72 -131
5559a31J37n41P45k38J04K14n34M1P6M31m53j42k67O19N5J84j00m3n29K13L23
$$ -131 6 -535 210 -28 76 290 -244 -203 -127 304 -149 -291 -558 61 116 300 200 157 -372 -159 164
5580A64j53M5k04p9k6L88K53k49m9j93k6M65L45m31n82p3K77L87K49k53o08K72
$$ 164 11 56 -148 -227 -253 135 388 139 90 -103 -129 336 681 250 -332 -405 -128 259 508 255 -353 -81
5602h1j05L06J80l13j02j56K02O41K1o43l64L51J69n2K97l70O0k34mL16J94k47
$$ -81 -186 120 300 -13 -115 -271 -69 572 593 -50 -414 -63 106 54 351 -19 41 -193 -197 119 313 66
5624F6m76L32L83k70L09m47l27Q9M43L74m02j20k7KR1K76j67r7l08q4M96p5L7
$$ 66 -410 -78 305 35 344 -103 -430 -341 102 476 74 -46 -73 -71 20 296 129 32 -276 -360 136 61 98
5647I8j69m06L31N62r1j86m03M3J87K94l9k93J36m62K70M7M58l62k26j82L72M62
$$ 98 -71 -477 -146 416 325 139 -264 -221 -34 260 221 -72 64 -398 -128 -81 377 15 -211 -393 -21 441
5669D41j99k43l80J89K72N8n3j51n21O11j09J96L05o70J23l8j27N97k46o30L26
$$ 441 242 -1 -381 -192 80 138 85 -66 -587 24 -85 111 416 -254 -131 -169 -296 301 55 -575 -249
5690b49o1K96J80l68rR5j4J83K13j93j90j82J08K62K05l98l1l28N07K30j42J25
$$ -249 -310 -14 166 -202 -211 -116 -130 53 266 73 -117 -299 -191 71 276 -122 -153 -481 26 256 114 239
5712B39m30j14K80J77J95k69k03l40N94J99k34J22k24j25K71j19K09j34j36n9
$$ 239 -191 -305 -25 152 347 78 -125 -465 129 328 94 216 -8 -133 138 19 228 94 -42 -101
5732a01r8L80j72k78K34l5L94j26j36j74j04j9K49K18l8k65R3j47O14m38j13l44
$$ -101 -199 181 9 -269 -35 -70 324 198 62 -112 -216 -235 14 232 194 -71 22 -125 489 51 -62 -406
5754d06J32M77j53L1n0j78J2k8K11L8j8j77j80L87J76J13n98N7n4K63M49l59k7
$$ -406 -274 203 50 81 31 -147 -135 -163 48 86 68 -109 -289 98 274 387 -211 -154 -208 55 504 145 118
5777A18j67l20L89J69j07oj52k8L18L7j96k62L6o5J13J62l62M68l57l3K11L70
$$ 118 -49 -369 20 189 82 76 -76 -104 214 251 55 -207 -171 -236 -123 39 -323 145 -212 -245 -34 336
5799C36N5p98q7M39M2J72j25K02o44L79J08J54m6k68J85q0r3L26k13k73Q1K06
$$ 336 391 -407 -494 -55 -13 159 34 236 -408 -29 79 233 187 -81 104 24 -69 257 44 -229 -148 58
5821E8J93j74n4k18O6K12j74R7k7p8M3N9M23k57r7l31j71N04Q8k30J7k91J9M27
$$ 58 251 77 23 -195 -129 83 -91 6 -21 -99 -56 3 426 169 72 -259 -430 74 162 -68 -51 -342 -323 104
5845A04J52K08o60o3J76J96K39P1n17o5L58l20K35M6l16K88m1k4K71j27j45n11
$$ 104 256 464 -196 -259 -83 113 352 423 -94 -159 199 -121 114 160 -156 132 91 67 338 211 66 -445
5867d45M58J89j14j46j62L97l62J31K32l12J16l29M93J5R8j17l68m6K15J86l2
$$ -445 13 202 88 -58 -220 177 -185 -54 178 -134 -18 -347 146 161 259 142 -226 -272 -57 129 97
5888I7Q1k19j93N98j27N6j61o30O45q7M3n4n48Q7N15J82l07J70j22p7j38M68n
$$ 97 178 -41 -234 364 237 293 132 -498 147 60 103 49 -499 -412 103 285 -22 148 26 -51 -189 279 274
5911B74j16k71J43l19M17L45o42j42K90r1M85j96k95K8j84J93J62J5L95n77j03
$$ 274 158 -113 30 -289 128 473 -169 -311 -21 -112 373 177 -118 -90 -274 -81 81 96 491 -86 -189
5932a89r5M89k7l57l87K14M55q3K78j41k8j49j04P3J81l82p2J4L70j0K38k97L2
$$ -189 -284 205 178 -179 -566 -352 103 20 298 157 129 -20 -124 -51 130 -252 -324 -310 60 50 288 -9 23
5955B3J9JL11j84m8P1k25k19M32j0N0m21J08L36k4j3j60l47K24P9l7J28j48r8
$$ 23 42 43 354 170 122 193 -32 -251 181 171 221 -200 -92 244 220 207 47 -300 -76 3 -34 94 -54 -152
5979a52K44N1K38k37N4k29K25o4k9k07j43j53J35N43l55L94n56r6M09J69J4k87
$$ -152 92 143 381 144 198 -31 194 130 101 -106 -249 -402 -267 276 -79 315 -241 -337 72 241 255 -32
6001c2O5OJ65J13k37o3J05j66K38K0Ro41M57j67L60l17K66k10l81N85j01K05l04
$$ -32 33 39 204 317 80 17 122 -44 194 214 223 -418 39 -128 232 -85 181 -29 -410 175 74 279 -25
6024b5Q5l19J81J95J39k6p93N74J32j17J34k41Q5j76P0K9K62N0k06O0r9j76J72
$$ -25 60 -259 -78 117 256 230 -563 11 143 26 160 -81 4 -172 -102 -73 189 239 33 93 -6 -182 -10
6047a0J7j28J06n9K77k25l7p0m3L39J13Q9l83o7R5J66P3n6l69q9L77j4K66k41
$$ -10 7 -121 -15 -74 203 -22 -59 -129 -172 167 280 369 -14 -81 14 180 253 197 -172 -261 116 102 368 127
6071A27k99k66L40pO30n35J02j89J79k05J95K37m46m7L72K62l91j10m09L16P3
$$ 127 -172 -438 -98 -105 525 -10 92 -97 82 -123 72 309 -137 -184 188 450 59 -51 -460 -144 -71
6092g1J82J67n58K71q7KO04m46q7j04j91K18p8K10j60n4k48N85l19q8O9nJ48l5
$$ -71 111 278 -280 -9 -96 -94 510 64 -23 -127 -318 -100 -178 32 -128 -182 -430 155 -164 -252 -183 -188 -40 -75
6116g5K95p0k32J17j38J41J22l14J21l66L40J58l4j39k8m80N80J89LJl08l28L02
$$ -75 220 150 -82 35 -103 38 160 -154 -33 -399 -59 99 65 -74 -102 -582 -2 187 190 191 -117 -445 -143
6139a43J35M01k04m06O2K01K65r8Nj58k36NK30J16m05j57M11J26K18q5k2j63k19
$$ -143 -8 393 189 -217 -155 46 311 213 218 60 -176 -171 59 175 -230 -387 24 150 368 283 261 98 -121
6162a21K2l8L32k18j57J52j8k6J20j97p6J36K29j80l3M8k9K07O6P7k10k62M1M7
$$ -121 -99 -137 195 -23 -180 -28 -46 -72 48 -149 -225 -89 140 -40 -73 -25 -54 153 219 296 86 -176 -135 -88
6186h8K13M0j53K2n03O05kQ9j70j33k26l5N91k83K24n32M00j94M1M1l33j54L27
$$ -88 125 165 12 34 -469 136 134 223 53 -80 -306 -341 250 -33 191 -341 59 -135 -94 -53 -386 -540 -213
6209b13L27J13n5K2l92P6K06K14k19n02j0K82J78j07O8j2j15m13P64k7Qn97M20
$$ -213 114 227 172 194 -198 -122 84 298 79 -423 -433 -151 27 -80 -12 -24 -139 -552 212 185 193 -404 16
6232A6J83K3o6j76O6l08K92L98j78ll16J71J09J28K0k00k66J29K66n6l82J42J55
$$ 16 199 222 156 -20 46 -262 30 428 250 247 -69 102 211 339 359 159 -107 22 288 232 -150 -8 147
6255A47l67k4M96m6q1m87K06K57Q1k9n56L81k62K38L6j01R0j38r1J95M5L6k38
$$ 147 -220 -244 252 206 125 -362 -156 101 182 153 -403 -22 -284 -46 -10 -111 -21 -159 -250 -55 -10 26 -212
6278b12J58j41J91L8Km84J14M06r8J17N5j09k28L2J93J61n1o31L90j08N09Om20
$$ -212 -54 -195 -4 34 36 -448 -334 72 -26 91 146 37 -191 -159 34 195 144 -487 -97 -205 304 310 -110
6301a10J1k39M36J64K42n20R1J21m38O07q2lp03N57j17J36j72n2n9P7P7J78Q6
$$ -110 -99 -338 98 262 504 -16 75 196 -242 365 283 280 -423 134 17 153 -19 -71 -130 -53 24 202 288
6324B88l11q4j51J98L72k25r7lJ85j12O2J85k87j40K64j87j6J80J20j95q2K52
$$ 288 -23 -107 -258 -60 312 87 -10 -13 172 60 122 307 20 -120 144 -43 -59 121 241 46 -36 216
6346B16j10j07l20K28K70P0l20j60K41o7k32L89Q0rk78J24p8j66j2M02k31k4k
$$ 216 106 -1 -321 -93 177 247 -73 -233 8 -59 -291 98 178 169 -109 15 -63 -229 -241 161 -70 -94 -96
6369i6J32M1J15l44l23O21k45J95J46m31J03N8J84j2m01J98J73O3Kk53K2m9J81
$$ -96 36 77 192 -152 -475 146 -99 96 242 -189 -86 -28 156 144 -257 -59 114 177 179 -74 -52 -101 80
6392H0k06J31m3j68J33j0L07l29J14l7k24L57R4j76N9Q8k46k85N20Q5j53j84J00
$$ 80 -126 5 -38 -206 -73 -83 224 -105 9 -28 -252 105 199 23 82 170 -76 -361 159 244 91 -93 7
6415GQ0j09J34l4p7j46n2K87k0N8k83j29K22J15J81k23l66N68O8Jk06J43m61J13
$$ 7 87 -22 112 78 1 -145 -197 90 70 128 -155 -284 -62 53 234 11 -355 213 281 282 76 219 -242 -129
6439a29L25k78j10L24j27l5K41j17q3k95j08K38O57n51Q2k58j80L07K64n7j95
$$ -129 196 -82 -192 132 5 -30 211 94 11 -284 -392 -154 503 -48 34 -224 -404 -97 167 110 -85
6460h5NJ0J12K42j98k59J82J82r4l1k45K08q7n7p8L81K9n71J03L50K41p5m8k90
$$ -85 -80 -70 42 284 86 -173 9 191 97 66 -179 29 -58 -115 -193 188 217 -354 -251 99 340 265 217 -73
6484g3K97j99k4o5j71K80k68j49L05M3J02l67M23k86J52K91m02L62j84l52N28
$$ -73 224 25 1 -64 -235 45 -223 -372 -67 -24 78 -289 134 -152 0 291 -111 251 67 -285 243
6505B43j33o2M9j60k13M39J35n43J46j37K75J45l06Q6K44L4k39K8K00K8j97k61
$$ 243 110 48 97 -63 -276 163 298 -245 -99 -236 39 184 -122 -36 208 242 3 31 231 259 62 -199
6527a99M10J48m75l6L3j49J17R9J57l5l36M42j72L11k17j14j88j70L77N5l79K95
$$ -199 211 359 -116 -152 -119 -268 -151 -52 105 70 -266 176 4 315 98 -16 -204 -374 3 58 -321 -26
6549b6p4K5N11j92K1m97M02k59K30q0O0l15K38j35L84k62j21M1l2M8OJ76l7l47
$$ -26 -100 -75 436 244 265 -232 170 -89 141 61 121 -194 44 -91 293 31 -90 -49 -81 -33 -27 149 112 -235
6573b35K51m7J20j10j83J06J45P7Q5j52l50M9K36K70j01O4l64J82M6k49L71r2
$$ -235 16 -31 89 -21 -204 -98 47 124 209 57 -293 -244 -8 262 161 225 -139 43 89 -160 211 119
6595A19l48q5L49m1J54l71J94k6J40O7l06J97n1k9J15J80Rm64J73k29L51L2l08
$$ 119 -229 -314 35 -6 148 -223 -29 -55 85 152 -154 43 -8 -37 78 258 267 -197 -24 -253 98 130 -178
6618a78P2K19j20l4J12j12k10J1k25O37o4k3L7k89j56M32j45n1P4J38J40j40o7
$$ -178 -106 113 -7 -41 71 -41 -251 -240 -465 172 108 85 122 -167 -323 109 -36 -87 -13 125 265 125 58
6641E8J2M4n35L44J73J10j40j06J61q0L4L08p2l51k11N70n40K86n9k05j88M81
$$ 58 70 114 -421 -77 96 206 66 -40 121 41 75 383 311 -40 -251 319 -221 65 6 -199 -387 94
6663I4o2j20K0j57J31J78k19K16n1l22L00N0K08l26j95L92p8NJ99k77k79K06J28
$$ 94 32 -88 -68 -225 -94 84 -135 81 30 -292 8 58 266 -60 -255 137 59 64 263 -14 -293 -87 41
6686D1l8Q8M6j34P5m0Jm2J8m1l17L16j31J97R8l84J89J10j15j36N83l49r7J53
$$ 41 3 91 137 3 78 38 39 -3 15 -26 -343 -27 -158 39 137 -247 -58 52 -63 -199 384 35 -62 91
6710I1k6N3j18k27P0J29N78o02J5J03l25M53l93J83j75J38j34L27k10j26L46l85
$$ 91 65 118 0 -227 -157 -28 550 -52 -37 66 -259 194 -199 -16 -191 -53 -187 140 -70 -196 150 -235
6732b35K98L1J09o0j11R0j51j88L41k49q6L47l71K77j51k48K29M05l78K60l6k14
$$ -235 63 94 203 143 32 122 -29 -217 124 -125 -211 136 -235 42 -109 -357 -128 277 -101 159 123 -91
6754i1K59j30j35N15j03l21L1R6N4n0j12K41k87l07K93Q1M2k40j36J59o2K73j84
$$ -91 168 38 -97 418 315 -6 25 121 175 125 13 254 -33 -340 -47 34 76 -164 -300 -141 -203 70 -114
6777a14j58M47j53j29J62n8j46j3J24K04m03J23R2j59N3Q4L86k15p6l24Q8R6K06
$$ -114 -272 175 22 -107 55 -3 -149 -162 -38 166 -237 -114 -22 -181 -128 -44 342 127 51 -273 -185 -89 117
6800A17j02J32l25K53O6m0l4j37NK43k21pj35Q3O1l1L80k41K2L6l58R7J83L55
$$ 117 15 147 -178 75 141 101 67 -70 -65 178 -43 -50 -185 -102 -41 -72 308 67 89 125 -233 -136 47 402
6824D02k85q6K25p6k36J27k95j02N56n30n8J64m5L50Q2K49m66L33n12K72K1j1
$$ 402 117 31 256 180 -56 71 -224 -326 230 -300 -358 -194 -239 111 193 442 -24 309 -203 69 90 79
6846G9j98K91o7j76J83q9J63K32n96K97j09j06K79j50j64K2K16l4J15k98L4M2
$$ 79 -119 172 105 -71 112 23 186 418 -178 119 10 -96 183 33 -131 -109 107 73 188 -110 -76 -34
6868c4R4P2j03l53M25p5O0j19K90l18N1J49j11K04l62M35k56O3j4N8k56K76j15
$$ -34 60 132 29 -324 101 26 86 -33 257 -61 -10 139 28 232 -130 305 49 112 98 156 -100 176 61
6891F1j78n3L93M8l10lJ82k51J77J86m2k69n5K36o3j8k15k41N61l22J42k12O7
$$ 61 -117 -170 223 271 -39 -42 140 -111 66 252 210 -59 -114 122 59 41 -174 -415 146 -176 -34 -246 -179
6914a79K80j65r4J0K70L7k49J88k9J92k02l5k19p9J90jR3o8j90J01K26o5L4j36
$$ -179 101 -64 -158 -148 122 159 -90 98 69 261 59 24 -195 -274 -84 -85 8 -60 -250 -149 77 12 46 -90
6938i0j0L20k19m9m3J68k77K08j05J90k60L21l54J08L98m07K34j77L8p7K46l36
$$ -90 -100 220 1 -48 -91 77 -200 8 -97 93 -167 154 -200 -92 306 -101 133 -44 -6 -83 163 -173
6960a73K19j01j12M16m19Q2Q4n9J15n7r4k12L76r4O1K37m22J13k9j04M25m9J72
$$ -173 46 -55 -167 249 -170 -88 -4 -63 52 -5 -99 -311 65 -29 32 269 -153 -40 -69 -173 252 203 375
6983C75n22K75m35L75J52j29j66j42L10j48k3K8R2K54k70Q1J7l26q8M21q9K21
$$ 375 -147 128 -307 68 220 91 -75 -217 93 -55 -78 -50 42 296 26 107 124 -202 -290 131 42 263
7005B63m53J52j8J06o5K13J51j84q4l4K21l67M17m48L9j40L45q5J86m83J92K28
$$ 263 -190 -38 -56 50 -15 198 349 165 81 47 268 -99 318 -130 -91 -231 114 29 215 -268 -76 152
7027A52j10K09k20k77K35J92j89o3J06L00k40J11j10j77M11j64l93L87l79J74
$$ 152 42 251 31 -246 -11 181 -8 -71 35 335 95 206 96 -81 330 166 -227 160 -219 -45
7047d5J75m24J74P0L84n15K01J09L7l33L57j54k83R3J31P8o1M1L11m48k22K43
$$ -45 130 -294 -120 -50 334 -181 20 129 166 -167 190 36 -247 -154 -23 55 -6 35 346 -102 -324 -81
7069h1J36k6n1R8m66O57L3l49l52O47l84J87r4L2J07j25k0K16l7M6J70l72l62
$$ -81 55 29 -22 76 -390 267 300 -49 -401 246 -138 49 -45 -13 94 -31 -51 165 128 174 344 -28 -390
7092c90K13M2j33M23n5k16J37r9Q1P3j31p6J89j70p0K48J77r2j4j93J76N4k82
$$ -390 -177 -135 -268 155 100 -116 21 -78 3 76 -55 -131 58 -112 -182 66 243 151 137 -56 120 174 -108
7115a08L38k03K99m63m9j25K34J15p0K51k99R1k55O2M22j48Q5k58K75J74j66j86
$$ -108 230 27 326 -137 -186 -311 -77 38 -32 219 -80 11 -244 -182 240 92 177 -81 194 368 202 16
7137A6l23N51j63P0j67k69K47j14K3L41l36J81k58j79J58Q2L12p6o3j08J50o8
$$ 16 -307 244 81 151 -16 -285 -38 -152 -129 212 -124 57 -201 -380 -222 -140 172 96 33 -75 75 7
7159GK98m42j60J44K72o9J17m48M21j69q0J77j73R2k41O81l46K14l30P5l1k67
$$ 7 305 -137 -297 -153 119 50 167 -281 140 -29 -109 68 -105 -13 -254 427 81 295 -35 40 9 -258
7181b58M07k20K33j39m16M21q1LK4Q3J25j07K63j38n57M22K49m62j17K47l49O03
$$ -258 149 -71 162 23 -393 28 -53 -50 -26 57 182 75 338 200 -357 65 314 -148 -265 -18 -367 236
7203B36l61Q1M91o66Q7K5l5K40L00j27p54J47K21L41m91P4K70l45L62j23o8O5
$$ 236 -125 -44 447 -219 -132 -107 -142 98 398 271 -483 -336 -115 226 -265 -191 79 -266 96 -27 -95 -30
7225c0j90M98k59k46J01K15j88J22P7R4l2n2J01j18l76Q3J99l0m0l1J79J08l90
$$ -30 -220 278 19 -227 -126 89 -99 23 100 194 162 110 211 93 -283 -200 -1 -31 -71 -102 77 185 -205
7248b05J96K0L6k60M43k4j57%k34L16q5o8l59M81K84n39L90o3o8j93J42k98J29
$$ -205 -9 11 47 -213 230 206 49 49 -185 131 46 -22 -381 100 384 -155 235 172 104 -89 53 -245 -116
7271a16J15J57l58L72k46L6K09jl78Q7J2J02k83L04m4M8Nn2K05k67K8k30M01K
$$ -116 -1 156 -202 170 -76 -40 169 168 -210 -123 -111 -9 -292 12 -32 16 21 -31 174 -93 -65 -295 106 108
7295A08l9J0k16P4K92j46q7K2o6K00qj5q9o5p1J29Rm8k55L36k65J96j10J43l42
$$ 108 69 79 -137 -63 229 83 -4 18 -48 152 144 129 40 -25 -96 33 42 -6 -261 75 -190 6 -104 39 -303
7320c03M09l98N92k99Q1l63K1K89r5o9nl3K16k60L87j27j24J68k85o4K19Q3l40
$$ -303 106 -292 300 1 82 -281 -260 29 -66 -135 -140 -173 43 -217 170 43 -81 87 -198 -262 -43 40 -300
7343c00P3L7R1R9j2J43j15j27K11k06q8J16q8R8P9p0J85l9j84K02J3k35lJ28k24
$$ -300 -227 -190 -99 0 -12 131 16 -111 100 -106 -194 -78 -166 -68 11 -59 126 87 -97 105 118 -117 -120 8 -216
7368b16M41j70j21J61j4O0n91J84J72J06j0rK27k83l3n1J52o0J31m3J59j90j6
$$ -216 225 55 -66 95 81 141 -450 -266 -94 12 2 -7 220 -63 -96 -147 5 -55 76 33 192 2 -14
7391a4j5L30j13l26L49j38j67K00k41J35oo3OJ06R9l62K95j7j3K03o27M90l4l01
$$ -14 -29 301 188 -138 211 73 -94 106 -135 0 -6 -69 -63 43 142 -220 75 58 45 248 -379 111 77 -224
7415b24J77L87l86N7J33n21L68l7K65j32j32j14L32j82o1k18M60k54L6J00J97
$$ -224 -47 340 -46 11 144 -377 -9 -46 219 87 -45 -159 173 -9 -70 -288 172 -82 -46 54 251
7436B51j49k29K41j34K45j68J5k71j42N62k15qj51j7P8J61M3j14j24M7K23j02
$$ 251 102 -127 114 -20 225 57 72 -199 -341 221 6 -2 -153 -170 -92 69 112 -2 -126 -79 144 42
7458D2k7O4j69j16L42j5j08K84k60P9J27j68j93J10q7J1K32r8M9N6j46J68j20
$$ 42 15 79 -90 -206 136 121 13 297 37 116 243 75 -118 -8 -95 -84 148 50 99 155 9 177 57
7481E7j35N1j26J43J21p3R9k11j7k08L48M3j45P5k37L20n1J45m9R5j95m76L57
$$ 57 -78 -27 -153 -10 111 38 137 -74 -91 -299 49 92 -53 22 -215 105 54 199 150 245 50 -426 -69
7504f9K46l22Q4J11l62M57j10r1J61p4R1k48J12k08N43k73l32J48K65k2M5m6j40
$$ -69 177 -145 -61 50 -312 145 35 -56 105 31 122 -126 -14 -222 321 48 -284 -136 129 107 152 106 -34
7527c4K63j02m8j9l53L2N47n06k4M05l82K08n3l0L13j75p3n3n8m7K40k38K42j61
$$ -34 229 127 79 60 -293 -261 286 -220 -244 161 -221 -13 -66 -96 217 42 -31 -84 -142 -189 51 -187 55 -106
7551a06M03j89j05O9k68p6M84j19m9j40O6j83M50Q6m16L86l72P8j15J25j84K97
$$ -106 297 108 3 72 -196 -272 212 93 44 -96 -30 -213 237 323 -93 293 -79 -1 -116 9 -175 122
7573A22O6m38L18j71J33J39o1q3J64J27m01L21k56K30k75K95k84k41L61j45K08
$$ 122 188 -250 68 -103 30 169 108 25 189 316 -85 236 -20 210 -65 230 -54 -295 66 -79 129
7594A29j8j88j36J31J40j29K46J28m78M47j23Q3R4l19j7j34J27R0J31m87J41J90
$$ 129 111 -77 -213 -82 58 -71 175 303 -175 272 149 232 326 7 -10 -144 -17 73 204 -283 -142 48
7616D8k92n6K53j75N17n34J69P7M1j09k0K07k03K25r7k65L93k74L33o7j91J02
$$ 48 -244 -300 -47 -222 295 -239 -70 7 48 -61 -81 126 -77 148 51 -214 179 -95 238 171 -20 82
7638H2j39j64K32j43j3L39k09M0L6j60q7N3j2k51M17j84l3o3J47J21j41K57m62
$$ 82 -57 -221 11 -132 -145 194 -15 25 61 -99 -186 -133 -145 -396 21 -163 -196 -259 -112 9 -132 125 -337
7661c37M40k70K11j66J07K80k38J32k52L51l06K31r4P5j62p0j1N2l01K94j8J95
$$ -337 103 -167 44 -122 -15 265 27 159 -93 258 -48 183 89 164 2 -68 -79 -27 -328 -34 -52 143
7683A43n9j68j75K73O4J35j08k7J87m43K74j85K81O9n56L58Jl1j20L17k80J95
$$ 143 84 -84 -259 14 78 213 105 78 265 -178 96 -89 192 261 -295 63 64 33 -87 230 -50 145
7705A45j16j14K06j76M3J48Rk63J04oq4J93n3m4J27r1O8L08m56O4j75R6n9J80
$$ 145 29 -85 121 -55 -12 136 145 -118 -14 -20 -104 89 36 -8 119 28 96 404 -52 12 -163 -67 -126 54
7729E4n5J95l0k38K22j52J25l27J07O9oq6J21j31Q9n4J26J95l92K92k58J91q6
$$ 54 -1 194 164 -74 148 -4 121 -206 -99 -30 -36 -122 -1 -132 -43 -97 29 224 -168 124 -134 57 -29
7752b9m7M78n05j19J45j60K79m23L05j58L41k9k62L65k41j4J97k15J59J29m94
$$ -29 -76 402 -103 -222 -77 -237 42 -381 -76 -234 107 78 -184 181 -60 -74 123 -92 67 196 -298
7773b98J89M6p1J56j18J90k71j09k1J95J02o7r7J89P3n4R1j88j00K23L4Q0k34
$$ -298 -109 -63 -134 22 -96 94 -177 -286 -307 -112 -10 -77 -174 15 88 34 125 -63 -163 60 94 174 -60
7796f0n6J85J22q1K14m80Q2J89k84L17j35q7J55O3K00k11L6j97L90j73j69J38
$$ -60 -116 69 191 110 324 -156 -74 115 -169 148 13 -74 81 144 344 133 169 -28 362 189 20 158
7818A58k67n5J60K04j60J41k64k31J86Q8L0L14j84l80J33j11M81m35J12J29k52
$$ 158 -109 -164 -4 200 40 181 -83 -314 -128 -40 -10 304 120 -260 -127 -238 243 -192 -80 49 -203
7839b03L11j74o2J19j03P7j5K14R3k56J72l75M4L60m28pK45j81L04j40K53k70
$$ -203 108 -66 -128 -9 -112 -35 -50 164 257 1 173 -202 -158 202 -226 -233 12 -169 135 -5 248 -22
7861b2K33k90K13j05k11mN4M2K14L2k56pM73m16K09J92l21k26J45l66M46k15K53
$$ -22 211 -79 134 29 -182 -186 -132 -90 124 156 -100 -107 366 -50 159 351 30 -196 -51 -417 29 -186 67
7884F7j49N4K19k18M31n33k25M78l9j14j8o8M20k59j19j58L80m16K21j9j9q0K33
$$ 67 -82 -28 191 -27 404 -129 -354 124 85 -29 -47 -115 305 46 -73 -231 149 -267 -46 -65 -84 -164 69
7907F9j97K0q9L64o72K73M35m94K86j86M42m06J92l0n8J4l1lJ9j12K85k34J69
$$ 69 -128 -108 -197 167 -505 -232 203 -291 -5 -191 251 -155 37 7 -51 -37 -68 -71 -52 -164 121 -113 56
7930E6k08K87k05r8J5J04m9J02j37K25l0p1L4M3ln8J65j26k84M34k62l3K10N8
$$ 56 -152 135 -70 -168 -153 -49 -98 4 -133 92 62 -9 25 68 65 7 172 46 -238 196 -66 -99 111 169
7954A69n8j46J57J25k40j30j7J61R3k85N63l94Q0k58L57l71N83k74m27L88k75
$$ 169 111 -35 122 247 7 -123 -140 21 114 -171 392 -2 78 -180 177 -194 389 115 -312 76 -199
7975a99K53j01j92J06Q5P0j12J33M44q36M19L07j57j5J52k86lj44J60m2K0l31
$$ -199 54 -47 -239 -133 -48 22 -90 43 487 -349 70 377 220 205 357 71 68 -76 84 42 62 -269
7997b69K36L68k11n28L4L72j40J79J62j76q4P5J82r3k76L92l53J08J12j81J28
$$ -269 -33 335 124 -404 -370 2 -138 41 203 27 -57 18 200 107 -169 223 -130 -22 90 -91 37
8018C7j45J3K72m65K14j46K16N1j17j78J61J59J1k17L93m0j53N9o1k67k2L32k43
$$ 37 -108 -95 177 -288 -74 -220 -4 47 -70 -248 -87 72 83 -134 259 219 66 125 64 -203 -225 107 -136
8041a36J22K20l29J5J60M2J15j05m67J92L23q6K1j95Q2p7J25J21j20l11K86p2
$$ -136 -14 206 -123 -108 52 94 209 104 -363 -171 152 66 87 -108 -26 -103 22 143 23 -288 -2 -74
8063g4j57K91Q5k47J75j26M59j76j61J28j85k33J98P5P5l21M2j1Q4K41l01r9l1
$$ -74 -231 60 145 -102 73 -53 406 230 69 197 12 -221 -23 52 127 -194 -152 -163 -79 162 -139 -238 -269
8086b69J80K94N3j55J06m09M3L13j31K6J02k32L04l50L04l2k06J88j34R5K20k52
$$ -269 -89 205 258 103 209 -200 -157 156 25 51 153 -79 225 -125 179 147 -59 129 -5 90 310 58
8108E8L1j79J73j14j52N2r6O82m69m4J42M1j08j78J65K76j94K68r4k76L29k81
$$ 58 89 -90 83 -31 -183 -131 -227 455 -14 -58 84 125 17 -161 4 280 86 354 260 -16 313 32
8130C2j49J1k46J82J93k47RJ30L7L33l17k36L05P2j4l6k07J48q3K19j62J5Jj61
$$ 32 -117 -106 -352 -170 23 -224 -215 -85 -48 285 -32 -268 37 109 95 59 -148 0 -83 136 -26 -11 -10 -171
8154a71L39k35P4m4K04K8p9r6n7J35J37k36j50K78j07OO1j75K13M0j46k17P2J73
$$ -171 168 -67 7 -37 167 195 116 20 -37 98 235 -1 -151 127 20 26 87 -88 125 165 19 -198 -126 47
8178D7r3l5m29M40K53k34k74L83J70k22k97L07m7
$$ 47 -46 -81 -510 -70 183 -51 -325 58 228 6 -291 16 -31
8191c1
$$ Imaginary data points
##PAGE= N=2
##DATA TABLE= (X++(I..I)), XYDATA
0@%%%Qj6QqK4l2M0n6O4p7R7j16J44j73J98k36K84l26L78m42N09n86O72p64Q70
$$ 0 0 0 0 8 -8 0 -8 16 -16 24 -32 32 -45 52 -64 80 -93 105 -131 153 -173 205 -237 272 -314 358 -406 464
28D64r87J110j252J410j575J763j974K195k439K713l008L331l691M084m520N008
$$ 464 -523 587 -665 745 -830 933 -1041 1154 -1285 1428 -1580 1751 -1940 2144 -2376 2632
44B632n546O153o844P623q519R566j0797J2280j4106J6408j9426K3569k9628L9375
$$ 2632 -2914 3239 -3605 4018 -4501 5065 -5732 6548 -7558 8850 -10576 12993 -16635 22740
58B2740n7598J03016m16844p60007Q76099Q94266j60861p35123j37116K57935
$$ 22740 -34858 68158 -348686 -1108693 -232594 661672 500811 -234312 -371428 -113493
68a13493P7491j7476K95063J39739m54962n15250K67380O67238R4681n45023l05777
$$ -113493 -36002 -53478 241585 381324 -73638 -588888 -321508 345730 440411 -104612 -410389
79d10389K43073K87841O270j0983K7090j97782l05079J35037N42397J94052n11863
$$ -410389 -167316 120525 126795 115812 142902 -54880 -359959 -224922 317475 511527 -336
90c36n41125J39727N84672K87328k33095l88244j92489P6701K81020K86400k898
$$ -336 -541461 -401734 182938 470266 237171 -151073 -343562 -266861 14159 300559 297661
101B97661l56994l46530O3420M08782L16253p1910l50462k82268N2424L44447
$$ 297661 -59333 -405863 -342443 66339 382592 310682 -39780 -322048 -269624 74823
111G4823K86000r5653l94202k60197J57193L87040J96884j80585l46263j43339
$$ 74823 360823 265170 -129032 -389229 -232036 155004 351888 171303 -174960 -318299
121c18299K17133L52918J02082k64651l27457l4422K56137K59092M9801j64781
$$ -318299 -101166 251752 353834 89183 -238274 -272696 -16559 242533 292334 127553
131A27553k62255j51022J74041M06423J72397l52561m96248j9809M55740L25608
$$ 127553 -134702 -285724 -111683 294740 467137 114576 -381672 -401481 54259 379867
141C79867j48648l28595j32676O2617J36444K00494J34517j92940m14375j01346
$$ 379867 231219 -97376 -230052 -167435 -30991 169503 304020 111080 -303295 -404641
151d04641M12307L85992j63343m45531j21454K55571K18649J6192l6641p9458
$$ -404641 7666 393658 230315 -215216 -336670 -81099 137550 153742 117101 37643
161C7643k07989j16281K62375L91892m8546m92047k75747L08845M53025L4817
$$ 37643 -170346 -286627 -24252 367640 319094 -172953 -448700 -139855 313170 347987
171C47987l16959k32288J3977J26894J47497J17815o1803k85733k15976J62515
$$ 347987 31028 -201260 -187283 -60389 87108 204923 143120 -142613 -358589 -196074
181a96074L83934J39151k62848l29949l2882K49435K49772K5173k06689k50576
$$ -196074 187860 327011 64163 -265786 -298668 -49233 200539 225712 19023 -231553
191b31553n1018K21756K78743L7165k43112k51302R878K53391K33461k3559k64334
$$ -231553 -282571 -60815 217928 255093 11981 -239321 -229443 23948 257409 233850 -30484
202c0484k36813M7236K86517K09123r2943k70161j46115J07198K25846J32553
$$ -30484 -267297 -220061 66456 275579 182636 -87525 -233640 -126442 99404 231957
212B31957o7056k16898j81815M5310K57107J98714r8051k90747j51464J50083
$$ 231957 164901 -51997 -233812 -188502 68605 267319 169268 -121479 -272943 -122860
222a22860K72232J11615j37791k41973j22255J16785K54871J30383j55034k80190
$$ -122860 149372 260987 123196 -118777 -241032 -124247 130624 261007 105973 -174217
232a74217q5737K02748K55637M0765j85692k11024m7911J53757K20093O4470j89300
$$ -174217 -259954 -57206 198431 239196 53504 -157520 -205431 -51674 168419 232889 43589
243D3589k55638k2218K46570K26558m0912k23397j50220L6077J52784J48127K6559
$$ 43589 -212049 -234267 12303 238861 197949 -25448 -175668 -139591 13193 161320 187879
254A87879j61818k32052l5270K53277K61344n9766l08290j73549J43871K47914
$$ 187879 26061 -205991 -241261 12016 273360 213594 -94696 -268245 -124374 123540
264A23540P7178j19935j67822r2613M0613J68507J62689l6086k34641j68748J13608
$$ 123540 200718 80783 -87039 -179652 -139039 29468 192157 156071 -78570 -247318 -133710
275a33710K66263J06201j59580k25822o1283J34202J85227P2152j04537j94743
$$ -133710 132553 238754 79174 -146648 -207931 -73729 111498 183650 79113 -115630
285a15630r0652J27853K28870P8518j68942k33038m2484J87007K04560N237j86725
$$ -115630 -206282 -78429 150441 228959 60017 -173021 -215505 -28498 176062 181299 -5426
296e426j71946J5836J72601J50456p623j48118j52042j7314J44752J79011K0496
$$ -5426 -177372 -161536 11065 161521 153898 5780 -146262 -163576 -18824 160187 180683
307A80683j86921k01654K3374K34576J76759p6936k24808j19081Q8799J77670
$$ 180683 -6238 -207892 -184518 50058 226817 149881 -74927 -194008 -105209 72461
317G2461R5010o1069j63209j21207M9968J92885J33843q0668k05779r7697J05835
$$ 72461 167471 106402 -56807 -178014 -128046 64839 198682 118014 -87765 -185462 -79627
328g9627J76716O7881r0226j58546q8974P4139J87267J08752j08893k17073o9911
$$ -79627 97089 164970 74744 -83802 -172776 -98637 88630 197382 88489 -128584 -198495
339a98495J61033J96340J3068j61136j51616p967J24518J45939L6768j23196j74920
$$ -198495 -37462 158878 171946 10810 -140806 -148773 -24255 121684 158452 35256 -139664
350a39664l1772J64593J79204j1000j79006j43103K7426J44098J20039j791j26199
$$ -139664 -171436 -6843 172361 161361 -17645 -160748 -133322 10776 130815 129024 2825
361B825j46271j2441J62118J71874k4692k03097j42188P7106J88526Q3452q7261
$$ 2825 -143446 -155887 6231 178105 153413 -49684 -191872 -114766 73760 157212 69951
372F9951j42827o2044N9006J26958Q9110m0967j48814j09417O2336J78161R5892
$$ 69951 -72876 -134920 -75914 51044 140154 99187 -49627 -159044 -96708 81453 177345
383A77345r8734j84320o5839J18778J70667M7505j14716j53696m2280J05945J48964
$$ 177345 78611 -105709 -171548 -52770 117897 165402 50686 -103010 -145290 -39345 109619
394A09619M3263j10519j57323m0460J23396J58354K2539j33944j41109j193J26879
$$ 109619 152882 42363 -114960 -155420 -32024 126330 148869 14925 -126184 -127377 -498
405d98J18046l108j14015j18392j0922J15682J36181R130j42275j41980K4667
$$ -498 117548 114440 425 -117967 -128889 -13207 122974 132104 -10171 -152151 -127484
416a27484J68068J19375n9482j61537q7040O4641J37899P8418m8597j28739q7017
$$ -127484 40584 159959 100477 -61060 -148100 -83459 54440 132858 84261 -44478 -131495
427a31495M7571J44162R2051o2390j53524q1264P4049J44288O4963p5917j38279
$$ -131495 -83924 60238 152289 89899 -63625 -144889 -70840 73448 138411 62494 -75785
438g5785o3219P6207J42085O0300r0542j49388m7435J04136J39447K3968j08989
$$ -75785 -139004 -62797 79288 139588 49046 -100342 -147777 -43641 95806 119774 10785
449A0785j22907j3498J04068J17613J8653r8363j19890j8596J09335J27630R385
$$ 10785 -112122 -125620 -21552 96061 114714 16351 -103539 -122135 -12800 114830 124215
460A24215j22399j22565R451J29137J11596j8316j23614j00269K0787J18796R7068
$$ 124215 1816 -120749 -111298 17839 129435 111119 -12495 -112764 -91977 26819 123887
471A23887k5367j26317r8766L5088J32589Q6666n0304j29727p0561N5335J17771
$$ 123887 98520 -27797 -126563 -91475 41114 127780 77476 -52251 -122812 -67477 50294
482E0294O3845m9678j17134p2148N0373J30885P6089o7040j41175n8369Q8612
$$ 50294 114139 64461 -52673 -124821 -74448 56437 132526 65486 -75689 -134058 -45446
493d5446J35149L6691r1113j17388k9424P9941J10074L4431p7895j15252l2613
$$ -45446 89703 126394 35281 -82107 -111531 -31590 78484 112915 35020 -80232 -112845
504a12845Q9376J18440K0266r8175j10840q848R8414J03136L684r9273j01779
$$ -112845 -23469 94971 115237 17062 -93778 -102626 -4212 98924 102608 3335 -98444
515i8444K056J07904J01263j3949j15608r3647K3558J12739Q3046l0292j12146
$$ -98444 -96388 11516 112779 98830 -16778 -110425 -86867 25872 108918 78626 -33520
526c3520q1485L0992J12791P8847l8101j14966p2939M3136J11848O6862m4008
$$ -33520 -115005 -84013 28778 107625 69524 -45442 -118381 -75245 36603 103465 59457
537E9457j09720o4814M8680J17403O3823n8081j16681m7827P1062J11447L5500
$$ 59457 -50263 -115077 -66397 51006 114829 56748 -59933 -107760 -36698 74749 110249
548A10249p1871j01594l1077O8794J01065L0585p4401j06704k6375Q2418J03045
$$ 110249 38378 -63216 -94293 -25499 75566 106151 31750 -74954 -101329 -18911 84134
559H4134J3574r0395j00003r322Q7788R6095N947r1249r6243Q52R8778R3089r622
$$ 84134 97708 7313 -92690 -102012 -14224 81871 87818 -3431 -99674 -98822 -44 93045 83423
572H3423r9048q2203J8578R6252P6787j6115r1705p5952J9886R8857P6411k8837
$$ 83423 -15625 -97828 -79250 17002 93789 77674 -14031 -89983 -70097 28760 105171 76334
584G6334j03834o8676L7378J01212N9280m3299j00748n5867M5505J01849N1270
$$ 76334 -27500 -96176 -58798 42414 101694 58395 -42353 -98220 -52715 49134 100404
595A00404n4129j03269m3621O0105R8321L5094o1567r3428l1675O1648R3444L1287
$$ 100404 46275 -56994 -100615 -40510 57811 92905 31338 -62090 -93765 -32117 61327 92614
607I2614o3678r5130k7593P0708R5383J9185p6404r2269j2531P9444Q8416O425
$$ 92614 28936 -66194 -93787 -23079 72304 91489 15085 -77184 -89715 -10271 78145 84570
619H4570q2397q5606J009Q6489Q0489r015q6172p2828J3326Q4441P0521j3060
$$ 84570 2173 -83433 -82424 4065 84554 75539 -10633 -83461 -70135 14306 84827 71767
631G1767q4427p0060J7870Q9302O8486k5765r2370o2512L1155R0776N6167l6146
$$ 71767 -12660 -82720 -64850 24452 92938 67173 -25197 -87709 -56554 34222 90389 54243
643E4243r1752n3762M0234R1421M6721m6861r1359m1130N1284Q7830L4741n2696
$$ 54243 -37509 -91271 -51037 40384 87105 40244 -51115 -92245 -40961 46869 81610 28914
655B8914q4536l0788N5427Q6102K9608n7916q5826k3808O5483Q6806J6201o8571
$$ 28914 -55622 -86410 -30983 55119 84727 26811 -59015 -82823 -17340 69466 85667 17096
667A7096q1369j0332P0697P8138N142p3053p7620l51P5361P1513p897p7171o6728
$$ 17096 -64273 -74605 -3908 74230 79372 6319 -71301 -71652 3709 75222 67325 -9846 -76574
680g6574R600P5070O3778j1941p7019o3898J6192Q1149O1265k2759q2628n5743
$$ -76574 -66974 8096 71874 59933 -17086 -80984 -64792 16357 77622 54863 -27765 -83508
692h3508K9729Q3763N1028l3092q2333m5674L7919Q1351M1748m0972q1493l6930
$$ -83508 -53779 29984 81012 47920 -34413 -80087 -42168 39183 80931 39959 -41534 -78464
704g8464M5214P9463L1330m7874p7282k7840M8775P5984K6121n2404p7774k2230
$$ -78464 -33250 46213 77543 29669 -47613 -75453 -26678 49306 75427 23023 -54751 -76981
716g6981N8245P7424J5024o1846p3681r695O3353P1569N853o5735o9208m76O7732
$$ -76981 -18736 58688 73712 11866 -61815 -71510 -8157 63412 69265 3530 -65678 -66154 1578
729A578O5512m204o8246o2228P211O9303N9805j1425p0012n7636J5638P1911N4768
$$ 1578 67090 62886 -5360 -67588 -60377 8926 68731 57306 -12706 -70342 -54704 17207 71975
742G1975j9834p3079n0836K5151P4731M6020k9563p3907m0941L3169P2610L7777
$$ 71975 52141 -20938 -71774 -46623 28108 74128 44565 -29342 -70283 -37114 35496 73273
754G3273l5714p3390l3862L9767P1881K9351m2792p1523k6291M4805P0303K3319
$$ 73273 37559 -35831 -69693 -29926 41955 71306 28514 -43009 -69300 -24495 45808 69127
766F9127m9027p0620j8144N2099O8242J3800n4455o6423r781N7153O4877N508
$$ 69127 20100 -50520 -68664 -16565 51677 65477 11022 -55401 -65182 -8029 56848 62356
778F2356o0082o1571n5O1076N8691l827o1206n6579O473O3129N3910j0694o4173
$$ 62356 2274 -59297 -59352 1724 60415 56588 -4618 -61197 -54724 8405 62315 51621 -12552
791a2552n1310J4444O4861M8374j8109o6389m5167K2124O6119M1614k6216o5951
$$ -12552 -63862 -49418 15443 63817 45708 -20681 -65848 -43724 22395 64009 37793 -28158
803b8158l8171K9574O6946L4688l3737o7020k9479L7534O5318K5507m0039o3259
$$ -28158 -66329 -36755 30191 64879 31142 -35878 -65357 -27823 37495 63002 22963 -40296
815d0296k2618M1604O3982K0098m5842o2626j5435M7612O1121J1797m9093n9987
$$ -40296 -62914 -21310 42672 62770 16928 -45698 -61133 -13521 47600 59397 10304 -49683
827d9683q528N1342N8131N407n3166n6421p36N4861N4199l223n7573n0689Q023
$$ -49683 -58211 -6869 51262 56669 3503 -52918 -53654 1207 55406 52183 -5390 -56079 -48056
840d8056N8160M7145j2246n7233m4015J4849N8401M1872j8451n9840l8860K2186
$$ -48056 10104 57249 45003 -12230 -56245 -41396 17005 58877 40426 -19414 -58274 -36088
852c6088O0040L5151k5124n9581l3383K7939O0712L0863l1255o1647k7424L4679
$$ -36088 23952 59103 33979 -25602 -58985 -31046 29666 60529 29274 -32373 -59797 -25118
864b5118O0106K3769l7096n9451k0363L9946N7856J6681m1470n6284j3178M2560
$$ -25118 34988 58757 21661 -37790 -58153 -18207 39649 56330 14860 -41424 -54602 -12042
876a2042N4764J0029m4908n3012o030M6561N1172K904m7985m9070J15M9690M8208
$$ -12042 42722 52751 7843 -45169 -51199 -4638 46534 49438 1453 -47617 -47502 2188 50396
889E0396m238n1913m5877Q282N2921M2515j1190n3166m0238J3818N4026L7716
$$ 50396 46158 -5755 -51632 -43350 9571 52086 40896 -12270 -52508 -38690 15336 53052
901E3052j6718n4987l5516K0337N4337L2996k2390n5277k9832K5761N4890K7155
$$ 53052 36334 -18653 -54169 -33832 20505 53501 31111 -24166 -53998 -28237 26653 53808
913E3808k8979n4264k3912L1222N3387K1553l3763n2937j7484L6463N1741J3460
$$ 53808 24829 -29435 -53347 -22125 31262 52815 19052 -33885 -51369 -14906 36835 50295
925E0295l7211n0428j1097L8791M8921Q989m0716m8283n922M3200M6924K019m4861
$$ 50295 13084 -37344 -48441 -9650 39271 48260 7544 -40739 -46661 -3461 43463 45482 621
938F21m5679J263M6241M3187m964m8040m0491Q382M8485L8199j1212m9260l5835
$$ 621 -45058 -43795 2446 45633 40669 -7371 -47862 -39480 9005 47204 35992 -13268 -49103
951d9103J4477M8990L3236j6916m8966l0751J8339M9659K9785k1009m9285k7384
$$ -49103 -34626 14364 47600 30684 -18282 -49033 -30694 18965 48750 27741 -21544 -48928
963d8928K2768N0154K4972k6030m9748k2176K8444M9500J8837l1132m8469j5195
$$ -48928 -26160 23994 48966 22936 -26812 -48988 -20544 28956 47793 16661 -31808 -47003
975d7003L3429M6846J1839l5031m5763q776L6944M3972N844l7823m2340l042L9113
$$ -47003 -13574 33272 45111 10080 -35683 -44459 -7515 36457 42301 4478 -37862 -40904 -1791
988a791M1427N62m0179m0774J999M2403L9029m355m3349l7052P014M4526L5612
$$ -1791 39636 40198 19 -40755 -38756 3647 42676 38321 -5028 -42080 -35066 9460 45072
1001D5072j0057m5329l3322J2928M5329L0684j5565m5153k8157J8078M5464K5443
$$ 45072 35015 -10314 -43636 -30708 14621 45305 29740 -15413 -43570 -25492 19972 45415
1013D5415k0308m5195k2964K2414M4385K0250k4688m3917j8241K7075M3599J5708
$$ 45415 25107 -20088 -43052 -20638 23747 43997 19309 -24608 -42849 -15774 27825 43533
1025D3533k9117m3831j2664L1139M2485R839l3235m1886o775L4568M0084M297
$$ 43533 14416 -29415 -42079 -10940 31545 41384 8149 -33737 -40512 -5944 34140 38437
1037C8437l5456l9030j959L6546L7437o83l7506l6464K770L8783L4471m998l9888
$$ 38437 2981 -36049 -38008 -1462 35975 35292 -2214 -38678 -35908 2875 37346 32348 -7540
1050g540l2586P752M0441L0406j0127m0937k9274J3131M1176K6743j5252m1185
$$ -7540 -40126 -32374 8067 38473 28346 -12591 -41865 -28734 12442 39185 23933 -17252
1062a7252k4284J7364M1318K2664k0080m0750k0042K1045M0502J8697k3462l9869
$$ -17252 -41536 -24172 17146 39810 19730 -21020 -41062 -20017 20485 39182 15720 -24149
1074b4149j6261K5452M0340J3485k6979l9572j0889K9004L8467Q775l0471l7460
$$ -24149 -40410 -14958 25382 38867 11888 -27684 -38573 -9569 28898 37673 7202 -30258
1086c0258n668L1427L6813L786l2810l4829j528L3751L3957q03l4848l2919L405
$$ -30258 -35926 -4499 32314 36100 3290 -31539 -33067 684 34641 33838 -1010 -33929 -30524
1099c0524L5333L1481m726l6092l0322P474L6999K8200r716l7241k6648J2510
$$ -30524 4809 36290 31564 -4528 -34850 -27376 9623 37823 28107 -9134 -35782 -23272
1111b3272L7675K4108j3884l8055k1943J6259L7334J9685j7723l7309j8305J9731
$$ -23272 14403 38511 24627 -13428 -35371 -19112 18222 37907 20184 -17125 -35430 -15699
1123a5699L6903J5954k1891l6853j3757K2944L6342J1246k4539l6068j0228K6238
$$ -15699 21204 37158 15267 -21586 -35343 -12399 23943 35189 10650 -25418 -35646 -9408
1135i408L5390P608k7649l4698n084K9272L3214K528k9735l2046o42L0668L0522
$$ -9408 25982 33590 5941 -28757 -33841 -4569 28645 31173 1438 -30608 -31250 -582 29940
1148B9940j153l1524k9332K881L2827K7738n670l2926k6826P698L3393K4373r471
$$ 29940 28787 -2737 -32069 -29188 3639 31377 25707 -7219 -34045 -26347 7046 31419 21948
1161B1948l4005k3276J1484L4022K1776j3096l4615j9989J6050L4306J7488j6855
$$ 21948 -12057 -35333 -23849 10173 31949 18853 -15762 -35751 -19701 14605 32093 15238
1173A5238l3970j5532J8778L3983J4118j9998l3160j1944K1636L2925J0095k2935
$$ 15238 -18732 -34264 -15486 18497 32615 12617 -20543 -32487 -10851 22074 32169 9234
1185I234l2186q270K4612L1763N943k5538l0587m036K6648L0029J955k7872k8699
$$ 9234 -22952 -31222 -6610 25153 31096 5558 -25029 -29065 -2417 27612 29567 1695 -27004
1198b7004L05K8357K7947j871k9331k6328M057K9855K4835n509l0329k3521P135
$$ -27004 -26699 1658 29605 27734 -1597 -27925 -23868 5987 30822 25313 -5016 -28537 -21402
1211b1402L0592K2127r027l0812k0834J0651L1328J9007j3111l1334j7223J4690
$$ -21402 9190 31317 22290 -8522 -29356 -18705 12623 31630 18519 -12815 -30038 -15348
1223a5348L0739J5610j5843l0962j4340J7548L1287J2025j9286k9983j0260J9803
$$ -15348 15391 31001 15158 -15804 -30144 -12596 18691 30716 11430 -18553 -28813 -9010
1235i010K9420Q669k1230k8973p193K2292K8543M924k3372k8258l322K4047K6834
$$ -9010 20410 29079 7849 -21124 -28317 -6025 22518 27442 4070 -24188 -27510 -3463 23371
1248B3371J439k5354k5590N7K5748K4662j806k6501k3820M282K7075K2224n715
$$ 23371 24810 -544 -26134 -26077 -329 24333 22527 -3974 -27794 -23512 3563 25787 20072
1261B0072k7459k0661P260K7863J9953q727k8045j8684J0462K8797J6582j2032
$$ 20072 -7387 -28048 -20788 7075 27028 18301 -9744 -28428 -17966 10831 27413 15381
1273A5381k8556j5279J3822K8114J3645j5518k7886j1572J6423K7509J0500j7145
$$ 15381 -13175 -28454 -14632 13482 27127 11609 -16277 -27849 -11426 16083 26583 9438
1285I438k7483q837J8461K7170P173j9246k6228n552K0591K5722M210k1771k4758
$$ 9438 -18045 -26882 -8421 18749 25922 6676 -19552 -25104 -4513 21209 25419 3648 -21110
1298b1110k215K2596K4166M77k3504k2843R50K4139K1977k982k4586k0380M345
$$ -21110 -23325 -729 23437 23914 410 -22433 -21483 2656 24633 21651 -2935 -23315 -18970
1311a8970K4596J9131n551k4786j8336O685K5255J7793q500k5635j6461J0415
$$ -18970 5626 24757 19206 -5580 -23916 -17231 8024 25817 17317 -8318 -24779 -14364
1323a4364K5703J4592j1857k5354j3325J1929K6074J2138j3962k5694j0696J5432
$$ -14364 11339 25931 14074 -11280 -24605 -12676 13398 25536 11574 -14120 -24816 -9384
1335i384K4854R057j6389k4518p634J7256K3681O133j8003k3377n047J8777K2959
$$ -9384 15470 24527 8138 -16380 -24014 -6758 16923 23056 5053 -18324 -23371 -4594 18365
1348A8365L687k0200k2042j811K0523K1670j24k1638j9944J173K2043J9363k531
$$ 18365 22052 1852 -20190 -22001 -1478 20192 20068 -1570 -21514 -20341 1702 21065 18534
1361A8534k2593j8428M671K2091J7546n430k2971j6627P035K3291J5697q330k3492
$$ 18534 -4059 -22487 -17816 4275 21821 16391 -6580 -23207 -16172 7119 22816 14486 -9006
1374i006j4093R716K3264J2815j0601k3289j2018J1906K3393J0319j3260k2558
$$ -9006 -23099 -13383 9881 22696 12095 -11194 -23212 -11306 12087 22406 9146 -13412
1386a3412q706J3757K2338P405j4914k1881o136J5889K1553N189j6859k1084l427
$$ -13412 -22118 -8361 13977 21382 6468 -15413 -21549 -5660 15893 21082 4223 -16861 -20288
$$ [...]
8191a5
##END NTUPLES=NMR FID
##END=
