##TITLE=1H_CA-8610
 CDCl3, 8 sc, 
 25.6.2019
##JCAMPDX= 6.0         $$ Bruker NMR JCAMP-DX V2.0
##DATA TYPE= NMR FID
##DATA CLASS= NTUPLES
##ORIGIN= UXNMR, Bruker Analytische Messtechnik GmbH
##OWNER= root
$$ XWIN-NMR		Version 3.5
$$ Tue Jun 25 14:14:22 2019 Russian Standard Time (UT+4h)  she@DPX200
##.OBSERVE FREQUENCY= 200.13155
##.OBSERVE NUCLEUS= ^1H
##.DELAY= (6, 6)
##.ACQUISITION MODE= SIMULTANEOUS
##.ACQUISITION SCHEME= undefined
##.AVERAGES= 8
##.DIGITISER RES= 18
##SPECTROMETER/DATA SYSTEM= spect
##.PULSE SEQUENCE= zg30
##.SOLVENT NAME= D2O
##.SHIFT REFERENCE= (INTERNAL, D2O, 0, 15.7039)
##AUDIT TRAIL= $$ (NUMBER, WHEN, WHO, WHERE, WHAT)
$$ ##TITLE= Audit trail, XWIN-NMR		Version 3.5
$$ ##JCAMPDX= 5.01
$$ ##ORIGIN= Bruker BioSpin GmbH
$$ ##OWNER= she
$$ F:/spectra/data/she/nmr/H-F/1/audita.txt
$$ ##AUDIT TRAIL=  $$ (NUMBER, WHEN, WHO, WHERE, WHAT)
(   1,<2019-06-25 14:13:15.51 +0400>,<she>,<DPX200>,
      <created by zg, POWCHK disabled, PULCHK disabled
       configuration hash MD5:
       00 E9 B6 7A A2 85 ED C7 34 08 36 98 17 FE 4E 26
       data hash MD5: 16K
       5F 49 AA DC 98 32 F6 C0 81 04 CC 0A A8 6E BB CF>)
$$ ##END=
$$ 
$$ hash MD5
$$ 1E E5 C2 BA 58 FB 4E 20 F4 B9 7E C2 3B 05 E5 93
##$RELAX= 
##$RELAX= 
##$RELAX= 
##$RELAX= 
##$RELAX= 
##$RELAX= 
$$ Bruker specific parameters
$$ --------------------------
##$DU= <F:/spectra>
##$EXPNO= 1
##$NAME= <H-F>
##$PROCNO= 1
##$TYPE= <nmr>
##$USER= <she>
##$AMP= (0..31)
100 100 100 100 100 100 100 100 100 100 100 100 100 100 100 100 100 100 
100 100 100 100 100 100 100 100 100 100 100 100 100 100 
##$AQSEQ= 0
##$AQ_mod= 1
##$AUNM= <au_zg>
##$AUTOPOS= <>
##$BF1= 200.13
##$BF2= 200.13
##$BF3= 200.13
##$BF4= 200.13
##$BF5= 200.13
##$BF6= 200.13
##$BF7= 200.13
##$BF8= 200.13
##$BYTORDA= 1
##$CFDGTYP= 0
##$CFRGTYP= 5
##$CHEMSTR= <none>
##$CNST= (0..31)
1 1 145 1 1 1 1 1 1 1 1 1 1 1 1 1 1 1 1 1 1 1 1 1 1 1 1 1 1 1 1 1 
##$CPDPRG= <>
##$CPDPRG1= <>
##$CPDPRG2= <>
##$CPDPRG3= <>
##$CPDPRG4= <mlev>
##$CPDPRG5= <mlev>
##$CPDPRG6= <mlev>
##$CPDPRG7= <mlev>
##$CPDPRG8= <mlev>
##$CPDPRGB= <>
##$CPDPRGT= <>
##$D= (0..31)
0 1.2 0 0 0 0 0 0 0 0 0 0.03 0 0 0 0 0 0 0 0 0 0 0 0 0 0 0 0 0 0 0 0 
##$DATE= 1561457594
##$DBL= (0..7)
120 120 120 120 120 120 120 120 
##$DBP= (0..7)
150 150 150 150 150 150 150 150 
##$DBP07= 0
##$DBPNAM0= <>
##$DBPNAM1= <>
##$DBPNAM2= <>
##$DBPNAM3= <>
##$DBPNAM4= <>
##$DBPNAM5= <>
##$DBPNAM6= <>
##$DBPNAM7= <>
##$DBPOAL= (0..7)
0.5 0.5 0.5 0.5 0.5 0.5 0.5 0.5 
##$DBPOFFS= (0..7)
0 0 0 0 0 0 0 0 
##$DE= 6
##$DECBNUC= <off>
##$DECIM= 24
##$DECNUC= <off>
##$DECSTAT= 4
##$DIGMOD= 1
##$DIGTYP= 9
##$DL= (0..7)
0 120 120 120 120 120 120 120 
##$DP= (0..7)
150 150 150 150 150 150 150 150 
##$DP07= 0
##$DPNAME0= <>
##$DPNAME1= <>
##$DPNAME2= <>
##$DPNAME3= <>
##$DPNAME4= <>
##$DPNAME5= <>
##$DPNAME6= <>
##$DPNAME7= <>
##$DPOAL= (0..7)
0.5 0.5 0.5 0.5 0.5 0.5 0.5 0.5 
##$DPOFFS= (0..7)
0 0 0 0 0 0 0 0 
##$DQDMODE= 0
##$DR= 18
##$DS= 0
##$DSLIST= <SSSSSSSSSSSSSSS>
##$DSPFIRM= 0
$$ [...]
##$SUBNAM2= <"">
##$SUBNAM3= <"">
##$SUBNAM4= <"">
##$SUBNAM5= <"">
##$SUBNAM6= <"">
##$SUBNAM7= <"">
##$SUBNAM8= <"">
##$SUBNAM9= <"">
##$SW= 24.9336996594482
##$SWIBOX= (0..15)
0 0 2 0 0 0 0 0 0 0 0 0 0 0 0 0 
##$SW_h= 4990.01996007984
##$TD= 16384
##$TD0= 1
##$TE= 0
##$TE2= 300
##$TE3= 300
##$TEG= 300
##$TL= (0..7)
0 120 120 120 120 120 120 120 
##$TP= (0..7)
150 150 150 150 150 150 150 150 
##$TP07= 0
##$TPNAME0= <>
##$TPNAME1= <>
##$TPNAME2= <>
##$TPNAME3= <>
##$TPNAME4= <>
##$TPNAME5= <>
##$TPNAME6= <>
##$TPNAME7= <>
##$TPOAL= (0..7)
0.5 0.5 0.5 0.5 0.5 0.5 0.5 0.5 
##$TPOFFS= (0..7)
0 0 0 0 0 0 0 0 
##$TUNHIN= 0
##$TUNHOUT= 0
##$TUNXOUT= 0
##$USERA1= <user>
##$USERA2= <user>
##$USERA3= <user>
##$USERA4= <user>
##$USERA5= <user>
##$V9= 5
##$VALIST= <valist>
##$VCLIST= <CCCCCCCCCCCCCCC>
##$VD= 0
##$VDLIST= <DDDDDDDDDDDDDDD>
##$VPLIST= <PPPPPPPPPPPPPPP>
##$VTLIST= <TTTTTTTTTTTTTTT>
##$WBST= 1024
##$WBSW= 4
##$XGAIN= (0..3)
0 0 0 0 
##$XL= 0
##$YL= 0
##$YMAX_a= 301289
##$YMIN_a= -429077
##$ZGOPTNS= <>
##$ZL1= 120
##$ZL2= 120
##$ZL3= 120
##$ZL4= 120
##$ABSF1= 10
##$ABSF2= 0
##$ABSG= 5
##$ABSL= 3
##$ALPHA= 0
##$AQORDER= 0
##$ASSFAC= 0
##$ASSFACI= 0
##$ASSFACX= 0
##$ASSWID= 0
##$AUNMP= <proc_1d>
##$AZFE= 0.1
##$AZFW= 0.1
##$BCFW= 1
##$BC_mod= 2
##$BYTORDP= 1
##$COROFFS= 0
##$CY= 11.3945322036743
##$DATMOD= 1
##$DC= 2
##$DFILT= <>
##$DTYPP= 0
##$F1P= 18.9103706918063
##$F2P= -1.10871071338519
##$FCOR= 0.5
##$FTSIZE= 0
##$FT_mod= 4
##$GAMMA= 1
##$GB= 0.15
##$INTBC= 1
##$INTSCL= 1
##$ISEN= 128
##$LB= 0.24
##$LEV0= 0
##$LPBIN= 0
##$MAXI= 10000
##$MC2= 0
##$MEAN= 0
##$ME_mod= 0
##$MI= 1.114404
##$NCOEF= 0
##$NC_proc= 0
##$NLEV= 6
##$NOISF1= 3.799351
##$NOISF2= 2.8
##$NSP= 1
##$NTH_PI= 0
##$NZP= 0
##$OFFSET= 15.70392
##$PC= 1
##$PHC0= -8497.11
##$PHC1= 13.40097
##$PH_mod= 1
##$PKNL= yes
##$PPARMOD= 0
##$PSCAL= 0
##$PSIGN= 0
##$REVERSE= no
##$SF= 200.130013532006
##$SI= 16384
##$SIGF1= 3
##$SIGF2= 2
##$SINO= 400
##$SIOLD= 16384
##$SREGLST= <1H.CDCl3>
##$SSB= 0
##$STSI= 0
##$STSR= 0
##$SW_p= 3612.71676300578
##$SYMM= 0
##$S_DEV= 0
##$TDeff= 0
##$TDoff= 0
##$TI= <>
##$TILT= no
##$TM1= 0
##$TM2= 0
##$TOPLEV= 0
##$USERP1= <user>
##$USERP2= <user>
##$USERP3= <user>
##$USERP4= <user>
##$USERP5= <user>
##$WDW= 1
##$XDIM= 8192
##$YMAX_p= 0
##$YMIN_p= 0
$$ End of Bruker specific parameters
$$ ---------------------------------
##NTUPLES= NMR FID
##VAR_NAME=  TIME,          FID/REAL,        FID/IMAG
##SYMBOL=    X,             R,               I
##VAR_TYPE=  INDEPENDENT,   DEPENDENT,       DEPENDENT
##VAR_FORM=  AFFN,          ASDF,            ASDF
##VAR_DIM=   8192,          8192,            8192
##UNITS=     SECONDS,       ARBITRARY UNITS, ARBITRARY UNITS
##FACTOR=    0.0002004,     1,               1
##FIRST=     0,             0,               0
##LAST=      1.6414764,     0,               0
##MIN=       0,             -429077,         0
##MAX=       1.6414764,     301289,          0
$$ Real data points
##PAGE= N=1
##DATA TABLE= (X++(R..R)), XYDATA
$$ [...]
$$ plain form
2364 2398 -60 -908 1766 571 -989 522 322 -723 140 186 -1143 -652 57 -1377 -654 746 -1308
2381 -1308 -1681 1165 -235 -2219 327 1682 -1274 -658 1390 186 -734 1036 245 -75 855 -180
2397 -180 -475 1385 771 -1539 930 1351 -1850 -950 1759 -14 -1620 506 654 -1486 -320 483 -721
2414 -721 -300 419 -1094 -813 610 -744 -84 1652 -611 -1891 1417 1164 -1451 204 1791 -510
2430 -510 -818 1141 413 -229 952 811 -333 519 -36 -163 1711 904 -1855 79 2093 -668 -1196
2447 -1196 1344 290 -1716 333 240 -1100 35 780 -531 -1151 -499 -1135 -6 988 -1465 -1446 1034
2464 1034 -179 -1922 850 1228 -1333 -189 1470 -771 -1329 1418 1296 -444 -91 -201 187 1270
2480 1270 365 -930 1114 1672 -1244 -220 2012 -334 -1041 1758 698 -1588 372 1735 -172 5
$$ packed form
2364B398k458q48K674j195j560J511k00j045Q63M6j329M91P09j434P23J400k054
2381a308l73K846j400j984K546J355k956O16K048j204r20J770p91l20R30j035
2397a80k95J860o14k310K469M21l201R00K709j773j606K126J48k140J166Q03j204
2414g21M21P19j513K81J423j354O60J736k263j280L308k53k615J655J587k301
2430e10l08J959p28o42J181j41j144Q52n55j27J874q07k759J934K014k761n28
2447a196K540j054k006K049r3j340J135P45j311o20O52o36J129R94k453J9K480
2464A034j213j743K772L78k561J144J659k241n58K747j22j740L53j10L88J083
2480A270r05j295K044N58k916J024K232k346p07K799j060k286J960J363j907J77
$$ plain form
2496 5 430 -445 -25 869 -160 12 1044 -769 -1537 1157 455 -1795 485 1387 -1782 -1540 810 -435
2514 -435 -1453 432 -115 -1073 -665 -413 -1133 650 237 -1819 58 837 -1273 -599 1721 -424 -1374
2531 -1374 1127 572 -1586 421 1528 -40 -394 1017 583 593 1208 -142 215 1885 424 -956 1582
2548 1582 1365 -709 750 1873 -1185 -779 1856 920 -1182 -502 105 -870 26 -373 -1443 -235 -213
2565 -213 -1898 -1334 243 -1587 -1387 918 -782 -2782 93 1202 -1494 -914 731 -70 -405 716
2581 716 -184 74 1338 341 61 1457 360 -846 1890 1934 -1193 240 2736 385 -774 1143 859
2598 859 -526 631 799 -716 567 463 -907 -164 60 -1456 -492 1319 -1014 -1976 662 -258 -2044
2615 -2044 -157 1210 -1527 -918 1099 -425 -958 191 -77 66 727 -368 -805 1276 1002 -927 842
$$ packed form
2496EM25q75M20Q94j029J72J032j813p68K694p02k250K280R02l169K42K350j245
2514d35j018J885n47r58M08K52p20J783m13k056J877P79k110O74K320k145r50
2531a374K501n55k158K007J107j568l54J411m34J0O15j350L57J670j461j380K538
2548A582k17k074J459J123l058M06K635r36k102O80O07r75Q96l99j070J208K2
2565b13j685N64J577j830K00K305j700k000K875J109k696N80J645q01l35J121
2581G16r00K58J264r97k80J396j097j206K736M4l127J433K496k351j159J917k84
2598H59j385J157J68j515J283j04j370P43K24j516R64J811k333r62K638r20j786
2615b044J887J367k737O09K017j524n33J149k68J43O61j095m37K081k74j929J769
$$ plain form
2632 842 1555 -1374 -729 1986 365 -1084 1051 660 -662 154 99 -714 435 422 -988 40 900 -507
2650 -507 45 1560 -542 -1452 1278 1102 -1371 -176 1361 -292 -432 1112 43 -339 1244 339 -673
2667 -673 733 -23 -874 1479 728 -1663 -230 1658 -885 -1291 875 -117 -1188 143 263 -1413 -84
2684 -84 593 -850 -296 -7 -1258 -251 712 -1221 -1288 881 -300 -1550 297 764 -1446 -96 1525
2701 1525 -688 -827 913 817 210 1038 298 -131 1739 888 -266 1377 1705 -613 299 1881 -300
2718 -300 -470 1335 771 -1537 133 617 -1161 -317 24 -1345 -1080 -165 -1339 -806 122 -1134 -1613 638
2736 638 -270 -2025 -148 1041 -1394 -963 518 -592 -619 1108 111 -510 751 584 -363 811 1067
2753 1067 -647 649 1347 -567 -423 1934 631 -838 684 474 -898 621 1221 -377 87 823
$$ packed form
2632H42P13k929O45K715j621j449K135l91j322Q16n5q13J149j3j410J028Q60j407
2650e07N52J515k102r10K730j76k473J195J537j653j40J544j069l82J583r05j012
2667f73J406p56q51K353p51k391J433J888k543m06K166r92j071J331J20j676J329
2684h4O77j443N54K89j251J007R63j933o7K169j181j250J847M67k210J350J621
2701A525k213j39J740r6o07Q28p40m29J870q51j154J643L28k318R12J582k181
2718c00j70J805n64k308J670M84j778Q44L41j369K65R15j174N33R28j256m79K251
2736F38r08j755J877J189k435M31J481j110k7J727r97o21J261j67r47J174K56
2753A067j714J296O98j914J44K357j303j469J522k10j372J519O00j598M64P36
$$ plain form
2769 823 -485 238 1347 -103 -375 1293 -192 -1033 664 871 -1359 -228 1047 -1427 -1085 546
2785 546 -419 -912 334 -376 -1679 -267 -80 -1071 336 121 -1645 -572 1156 -608 -750 1208 352
2802 352 -1365 523 979 -662 486 1213 -569 -410 1017 -260 406 1315 109 -504 1095 231 -1060
2819 -1060 1208 1320 -706 -189 1377 -277 -623 1655 519 -643 441 290 -808 789 748 -568
2835 -568 -40 453 -1245 -583 942 -767 -905 292 -786 -2155 75 622 -1334 -537 472 -1078 -1014
2852 -1014 440 -449 -522 943 -126 -1374 656 942 -754 427 1390 -900 -413 1051 174 -22 1255
2869 1255 261 -1041 881 939 -565 522 1098 -882 -232 1282 -101 -486 1516 -294 -1089 754 268
2886 268 -1124 972 983 -1199 -619 697 -723 -464 1020 -442 -1244 527 0 -1197 143 270 -1258
$$ packed form
2769H23j308P23J109j450k72J668j485q41J697K07k230J131J275k474L42J631
2785E46r65m93J246p10j303J412J87r91J407k15j766J073J728j764j42J958q56
2802C52j717J888M56j641J148P27j782J59J427j277O66R09j206o13J599q64j291
2819a060K268J12k026N17J566j654l46K278j136j162J084j51j098J597m1j316
2835e68N28M93j698O62J525j709j38J197j078j369K230N47j956P97J009j550O4
2852a014J454q89p3J465j069j248K030K86j696J181R63k290M87J464q77j96J277
2869A255r94j302J922N8j504J087N76j980O50J514j383l85K002j810p95J843m86
2886B68j392K096J1k182N80J316j420K59J484j462q02J771n27j197J340J27j528
$$ plain form
2903 -1258 -930 -34 -1213 -756 1391 -398 -1418 21 88 -622 484 512 -1281 -77 1172 -938 -510
2920 -510 1092 388 -307 1072 138 -1245 1280 1419 -475 133 834 -306 188 1279 -469 -520 1635
2937 1635 774 -1135 540 1000 -154 598 484 -1178 -391 1126 -219 -892 551 -8 -877 503 -3
2954 -3 -1715 49 841 -1337 -875 368 -510 -689 606 -653 -1381 -13 400 -1175 -32 607 -831
2971 -831 -109 634 -761 -779 1257 51 -710 809 402 -774 850 1245 -121 31 689 -530 -158 1661
2989 1661 70 -557 964 456 -709 863 1035 -551 449 1034 -1227 -701 1250 333 -668 476
3005 476 -116 -1238 420 491 -1090 4 243 -999 -489 621 -870 -709 942 -532 -1892 79 1000
3022 1000 -584 -235 220 -1137 -551 957 -299 -583 880 -139 -696 892 -40 -472 1156 1264 -863
$$ packed form
2903a258L28Q96j179M57K147j789j020J439O7p10J106K8j793J204J249k110M28
2920e10J602p04o95J379r34j383K525J39j894O08P01j140M94J091j748n1K155
2937A635q61j909J675M60j154P52j14j662P87J517j345o73J443n59q69J380n06
2954cj712J764P92k178M62J243q78j79J295j259p28J368M13j575J143O39j438
2971h31P22P43j395j8K036j206p61J519m07j176J624L95j366J52O58j219L72J819
2989A661j591o27J521n08j165J572J72j586J000N85k261N26J951r17j001J144
3005D76n92j122J658P1j581J094K39j242N10J110j491J61J651j474j360J971R21
3022A000j584L49M55j357N86J508j256k84J463j019n57J588r32m32J628J08k127
$$ plain form
3039 -863 -779 1189 381 23 1537 -52 -754 1138 834 -485 386 866 -333 20 223 -884 137 1421
3057 1421 -641 -1476 614 40 -1218 687 522 -1396 -518 706 -768 -809 495 -94 -712 -22 -489
3074 -489 -994 1062 502 -1334 -209 681 -969 -520 1271 -154 -903 414 242 -1048 513 753 -644
3091 -644 420 877 -722 337 1183 -627 215 1123 -274 -1251 1097 1216 -586 270 1111 -932 -526
3108 -526 1224 268 -505 467 -38 -527 247 362 -706 758 624 -1727 -379 938 -808 -809 873 -501
3126 -501 -1279 326 123 -722 -351 411 -787 -790 -29 -719 -37 823 -1166 -1196 1128 196 -938 505 826
3145 826 -1194 -127 1259 -624 -480 1015 671 -222 364 213 -65 1050 558 -859 507 744 -630
3162 -630 209 1763 -257 -886 1030 288 -877 1 1048 -673 -32 186 -785 -432 257 -683 -860 60
$$ packed form
3039h63Q4J968q08l58J514j589p02J892l04j319Q71M80j199L53K03j107J021J284
3057A421k062q35K090n74j258J905j65j918Q78J224j474m1J304n89o18O90m67
3074d89n05K056n60j836J125Q90j650M49J791j425p49J317j72j290J561K40j397
3091f44J064M57j599J059Q46j810Q42R08j397r77K348J19j802Q56Q41k043M06
3108e26J750r56p73R72n05m89P74J15j068J464j34k351J348J317j746jJ682j374
3126e01p78J605k03q45L71P62j198lP61o90O82Q60j989l0K324r32j134J443L21
3145H26k020J067J386j883J44J495l44q93N86j51k78J115m92j417J366K37j374
3162f30Q39J554k020o29J916p42j165Q78J047j721O41K18r71L53O89r40j77R20
$$ plain form
3180 60 -771 -1128 840 262 -1301 165 734 -1679 -882 881 -248 -668 406 -77 -791 437 487 -355
3198 -355 551 518 -1074 363 1170 -568 -38 1128 -540 -943 1098 1190 -695 201 1032 -567 -323 745
3216 745 325 219 464 -100 -274 1093 -315 -825 1099 427 -1455 -107 1368 -710 -530 1091 -42
3233 -42 -1296 192 52 -587 -20 -102 -810 -186 43 -1126 -53 970 -755 -948 848 -394 -1309 537
3251 537 826 -1185 -350 708 -10 -460 484 163 -51 760 -233 -513 1261 164 -458 688 596 -949
3269 -949 26 1533 232 -759 897 454 -989 180 482 -315 -40 359 -734 510 262 -585 145 959
3287 959 -945 -861 1339 383 -1403 15 410 -1058 -765 428 -367 -726 365 -489 -529 94 -468 -713
3305 -713 1127 17 -1341 111 966 -922 -396 997 -36 -910 923 669 -727 598 784 -221
$$ packed form
3180F0q31l57J968n78j563J466N69k413P97J763j129m20J074m83p14J228N0q42
3198c55R06l3j592J437Q07j738N30J166j668m03K041R2j885Q96Q31j599K44J068
3216G45m20j06K45n64j74J367j408n10J924o72j882J348J475k078J80J621j133
3233d2j254J488j40o39N67q2p08O24K29j169J073J023j725j93J796j242r15J846
3251E37K89k011Q35J058p18m50R44l21k14Q11r93k80J774j097o22J146r2j545
3269i49R75J507j301r91J656m43j443J169L02p97K75L99j093J244k48q47P30Q14
3287I59j904Q4K200r56j786J418L95j468K93J193p95l59J091q54m0O23n62k45
3305g13J840j110j358J452Q55j888N26J393j033q74J833k54j396J325J86j005
$$ plain form
3321 -221 -64 229 -442 542 747 -1011 -482 1249 -350 -822 1030 679 -845 -114 662 -453 -295 860
3339 860 185 -400 130 -32 -273 792 185 -625 729 448 -901 225 855 -1012 -764 1055 -12 -1272
3357 -1272 111 261 -357 -157 -5 -732 -127 367 -821 -456 485 -1013 -641 1278 -16 -1077 899
3374 899 939 -1006 -332 894 -283 -18 960 -44 -599 770 463 92 366 129 -640 932 884 -898
3392 -898 10 1696 -86 -835 882 484 -620 519 1146 -389 -53 488 -124 -47 284 -762 -411 658
3410 658 -743 -1173 545 -14 -1732 -306 287 -1406 -994 599 -644 -1183 227 -9 -653 166 -2
3427 -2 -391 224 597 -747 302 1356 -410 -198 1369 408 -572 1374 940 -483 621 962 -205 575
3445 575 776 70 450 820 -421 -54 1068 230 -613 877 375 -1151 274 1155 -692 -781 627 -81
$$ packed form
3321b21J57K93o71R84K05j758N29J731j599m72J852l51j524P31P76j115J58J155
3339H60o75n85N30j62k41J065o07q10J354k81j349J126O30j867K48J819j067j260
3357a272J383J50o18K00J52p27O05M94j188L65R41j498L72J919j294j061J976
3374H99M0j945O74J226j177K65R78j004n55J369l07l71K74k37p69J572m8j782
3392h98R08J686j782p49J717l98j104J139O27j535L36N41o12P7L31j046L51J069
3410F58j401m30J718n59j718J426N93j693M12J593j243n39J410k36o44Q19j68
3427bl89O15L73j344J049J054j766K12J567r61r80J946m34j423J104L41j167P80
3445E75K01p06L80L70j241L67J122q38q43J490n02j526J425Q81j847q9J408p08
$$ plain form
3463 -81 -945 95 128 -839 -227 -600 -1055 39 341 -1061 -546 209 -1014 -752 769 -261 -1175 523
3481 523 463 -835 -13 809 171 -26 779 170 312 954 437 -42 1203 666 -444 916 1082 -512 469
3500 469 1435 -258 -512 927 523 -380 133 323 -202 166 321 -715 129 297 -1095 -646 61 -779 -902
3519 -902 789 -290 -1570 -210 501 -1066 -534 108 -390 -602 102 -493 -658 853 -12 -424 732 593
3537 593 -745 449 1086 -713 -194 1281 -88 -253 890 578 -588 393 379 -291 401 619 -216 57
3555 57 795 -415 -458 776 -154 -742 614 498 -1091 -56 938 -630 -239 190 -327 -306 375 -149 -660
3574 -660 471 1 -885 456 76 -874 -471 443 -663 -708 850 -190 -899 363 224 -770 143 396
3592 396 -340 387 442 -444 -48 625 -130 -479 810 166 -1015 609 967 -710 398 825 -298 -120
$$ packed form
3463h1q64J040L3r67O12l73m55J094L02j402N15P55j223K62J521j030r14J698
3481E23o0j298Q22Q22o38j97Q05o09J42O42n17m79J245n37j110J360J66j594R81
3500D69R66j693k54J439m04r03N13J90n25L68J55j036Q44J68j392M49P07q40j23
3519i02J691j079j280J360P11j567N32O42m98k12P04n95j65J511q65m12J156j39
3537E93j338J194O37j799N19J475j369j65J143l12j166R81j4o70O92K18q35K73
3555E7P38j210m3J234r30n88J356j16j589J035R94j568L91M29n17K1O81n24n11
3574f60J131m70q86J341l80r50M03R14j106m5J558j040p09J262j39r94R13K53
3592C96p36P27N5q86L96O73p55l49J289o44j181J624L58j677J108M27j123J78
$$ plain form
3610 -120 788 -26 42 710 88 -496 593 360 -728 530 350 -437 105 1089 -327 -661 339 34 -521
3629 -521 -147 83 -917 -137 143 -752 -134 12 -773 -805 591 -590 -959 95 -194 -615 202 222 -482
3648 -482 -450 730 -341 -212 841 407 -206 743 421 -456 294 683 -460 145 621 -305 62 1074 28
3667 28 -698 648 245 -874 139 465 -487 -179 436 -408 -467 647 -519 -643 513 -346 -580 460
3685 460 251 -680 305 659 -520 -419 89 -326 -804 385 -412 -709 249 330 -726 274 365 -575 -500 583
3705 583 -391 -333 917 134 -789 347 246 -522 270 703 -677 -130 589 -300 56 768 326 -688 415
3724 415 208 -437 550 769 -326 -146 731 -308 -59 668 -17 -619 652 207 -861 304 532 -876
3742 -876 -161 381 -613 -179 457 -264 -576 595 -314 -957 -171 -62 -350 -233 235 -770 -440 798 -253
$$ packed form
3610a20R08q14O8O68o22n84J089k33j088J258j80p87N42R84j416l34J000l05n55
3629e21L74K30j000P80K80q95O18J46p85l2J396j181l69J054k89m21Q17K0p04
3648d82L2J180j071J29J053m34o13R49l22q77P50L89j143O05M76r26L67J012j046
3667B8p26J346m03j119J013L26r52L08O15q44n9J114j166j24J156q59k34J040
3685D60k09r31R85L54j179J01N08m15m78J189p97k97R58Q1j056J000R1r40P5J083
3705E83r74N8J250p83r23J136j01p68P92M33j380N47P19q89L56P12m42j014J103
3724D15k07o45R87K19j095J80Q77j039K49P27o85o02J271m45j068J165K28j408
3742h76P15N42r94M34O36p21l12J171r09o43P86J09k88J17M68j005L30J238j051
$$ plain form
3761 -253 -439 737 32 -951 417 400 -385 59 864 -155 -397 882 -144 36 579 55 -489 747
3779 747 902 -380 480 495 -70 121 726 -132 -260 606 -34 -579 80 255 -687 316 105 -876 -343 400
3799 400 -806 -667 67 -642 -870 138 -347 -608 -101 121 -887 -157 348 -265 -146 636 -380 -209 707
3818 707 59 -267 263 834 -162 -120 660 -438 -92 777 65 -285 274 -10 -731 157 275 -445 -28 578
3838 578 -619 -36 965 -2 -468 627 249 -517 258 269 -509 -31 459 -864 -222 331 -423 -334 692
3857 692 -373 -637 531 412 -1147 169 334 -765 -437 633 -224 -559 473 57 -169 184 186 -272
3875 -272 342 -73 -555 298 488 -487 -134 764 -3 -670 521 441 -631 -190 616 -441 -186 284 -319
3894 -319 -60 478 161 -126 546 322 -303 649 317 -678 185 917 -468 -183 652 178 -788 243 -452
$$ packed form
3761b53j86J176p05r83J368j7p85M44Q05j019k42J279j026J80N43n24n44J236
3779G47J55j282Q60J5n65J91O05q58j28Q66o40n45O59J75r42J003k11r81N33P43
3799D00j206J39P34p09k28J008m85k61N07K22j008P30N05o13J19P82j016J71R16
3818G07o48l26N30N71r96M2P80j098L46Q69p12l50N59k84p21Q88J18p20M17O06
3838E78j197N83J001r67m66J095l78p66P75J1p78M78M90j323O42N53p54Q9J026
3857F92j065k64J168j19j559J316J65j099L28J070q57l35J032m16k26L53Km58
3875b72O14m15m82Q53J90r75L53Q98p67o67J191q0j072M41Q06j057K55M70o03
3894c19K59N38l17k87O72k24o25R52l32r95Q63P32j385K85Q35m74r66J031o95
$$ plain form
3913 -452 -648 58 -133 -822 -18 108 -905 -230 379 -604 -769 531 237 -1014 212 190 -512 27 149
3932 149 -437 247 640 -409 -192 427 76 -110 815 34 -447 449 539 -914 -319 1296 -118 -288 422
3951 422 107 -456 292 547 -373 513 197 -153 71 617 -185 -237 849 -605 -624 672 136 -787 60 261
3971 261 -607 -451 370 -287 -446 59 -355 -553 -107 -633 -505 608 4 -884 141 246 -800 -394 890
3990 890 -38 -652 848 544 -400 256 175 -153 436 605 -39 689 873 -318 7 752 -190 -1003 973
4009 973 649 -758 -250 884 -261 -417 551 37 -428 83 -276 -196 48 -10 -508 145 99 -707 -97 823
4029 823 -494 -562 444 -386 -957 419 446 -694 -60 159 -234 233 264 -289 51 368 -671 -758 735
4048 735 -132 -345 509 426 -851 1 1105 -584 -214 354 200 -81 215 516 285 734 -160 -645 572
$$ packed form
3913d52j96P06j91o89Q04J26j013O75O09r83j65J300k94j251J226k2p02N39J22
3932A49n86O84L93j049K17O19l51j86R25p81m81Q96R0j453N95J615j414j70P10
3951D22l15n63P48K55r20Q86l16l50K24N46q02n2J086j454j9J296n36r23Q47K01
3971B61q68J56Q21o57j59N05m14j98M46n26J28J113o04q88J025J05j046M06J284
3990H90r28o14J500l04r44O56q1l28N89J69o44P28J84j191L25P45r42q13J976
4009I73l24j407N08J134j145j56R68n14m65N11l59Q0K44n8m98O53m6q06O10R20
4029H23j317o8J006q30n71J376K7j140O34K19l93M67L1n53L40L17j039q7J493
4048G35q67k13Q54q3j277Q52J104j689L70N68j54k81K96L01k31M49q94m85J217
$$ plain form
4067 572 1015 -383 253 703 -321 -555 743 273 -513 39 306 -467 -304 311 -235 -42 286 -662 -369
4086 -369 197 -7 -773 467 -198 -1292 124 517 -307 -324 808 -97 -440 238 -19 -120 -22 -108 -521 249
4106 249 281 -231 376 504 -359 -290 1022 125 -178 596 555 -152 361 702 -172 230 699 -63 -35 498 -95
4127 -95 -183 645 -329 -490 515 -80 -931 -323 601 -445 -759 -42 -548 -832 131 -227 -584 119 -472 -599
4147 -599 30 167 -595 -81 674 -541 -416 751 161 -627 479 474 -257 161 578 187 339 217 -257 -17
4167 -17 443 -55 -254 693 107 -779 569 642 -425 -87 1069 -26 -487 740 253 -206 318 138 -418
4186 -418 191 114 -224 583 616 -562 -150 610 -279 -349 470 176 -632 -177 101 -577 -112 378 -337 -425 281
4207 281 -160 -176 173 -173 -463 423 204 -735 313 919 -633 -188 885 -288 -454 775 446 -604
$$ packed form
4067E72M43j398O36M50j024k34J298m70p86N52K67p73J63O15n46J93L28r48K93
4086c69N66k04p66J240o65j094J416L93q24j7J132r05l43O78k57j01R8q6m13P70
4106B49L2n12O07J28q63O9J312q97l03P74m1p07N13L41q74M02M69p62K8N33n93
4127i5q8Q28r74j61J005n95q51O08R24j046l14P17n06k84R63l58l57P03n91j27
4147e99O29J37p62N14P55j215J25J167n90p88J106np31M18M17l91J52j22m74K40
4167a7M60m98j99R47n86q86J348P3j067L38J156j095m61J227m87m59N24j80n56
4186d18O09p7l38Q07L3j178M12P60q89p0Q19k94q08M55K78o78M65M90p15q8P06
4207B81m41j6L49l46k90Q86k19r39J048O06j552M45J073j173j66J229l29j050
$$ plain form
4225 -604 80 256 -12 290 438 -126 335 806 -898 -215 1203 88 -187 490 285 -822 173 657 -134
4244 -134 -242 457 -12 -364 182 -224 -198 316 -190 -916 -37 -71 -766 -102 608 -753 -848 665 105 -761
4264 -761 123 201 -390 190 28 -240 -32 274 -267 -95 493 -311 -214 729 98 -177 173 461 -240 263 672
4285 672 -38 -158 611 -234 -255 445 -34 -258 -109 -116 -546 55 635 -602 -156 319 -192 -763 450 -104
4305 -104 -982 4 238 -604 -391 311 -430 -187 279 -612 -368 513 24 -697 364 48 -1108 335 623
4324 623 -582 -237 509 258 -432 156 284 78 256 150 -318 403 342 -496 369 754 -218 169 868 153
4344 153 -438 608 494 -558 447 636 -377 47 542 -188 -287 16 -171 -161 534 -170 -701 359 300
4363 300 -570 -63 555 -258 -664 302 44 -735 235 -55 -382 195 -73 -320 133 367 -640 -261 485 -119
$$ packed form
4225f04O84J76k68L02J48n64M61M71j704O83J418j115k75O77k05j107R95M84p91
4244a34j08O99m69l52N46m06K6N14n06p26Q79l4o95O64P10j361r5J513n60q66
4264g61Q84P8n91N80j62k68K08L06n41J72N88q04R7R43o31k75L50K88p01N03M09
4285F72p10j20P69q45k1P00m79k24J49pm30O01N80j237M46M75n11n71J213n54
4305a04q78R86K34q42K13P02p41K43M66q91K44Q81m89p21J061l16j156J443K88
4324F23j205L45P46k51o90N88J28k06J78j06m68P21o1q38Q65L85r72L87O99p15
4344A53n91J046j14j052J005J89j013M24M95p30r9L03j87J0O95p04n31J060n9
4363C00q70N07O18q13m06R66k58p79R70k90l27N77k68k47M53K34j007L79P46o04
$$ plain form
4383 -119 -259 528 -220 -574 428 283 -237 77 577 -13 -46 517 -271 28 685 56 -408 731 395 -462
4403 -462 262 652 -134 116 713 -246 -231 578 -164 -326 190 240 -629 286 119 -532 -423 336 -586 -382 348
4424 348 -352 -490 75 136 -439 174 367 -547 -154 413 -351 54 222 40 -55 583 -217 -539 248 272 -201
4445 -201 317 690 -169 -522 945 27 -532 438 122 -304 462 150 -437 133 246 -395 104 483 -305 24
4465 24 707 99 -802 217 34 -688 44 246 -427 -59 177 -200 -368 378 -224 -638 214 134 -570 408
4485 408 362 -858 -403 18 -484 -198 778 -63 -344 158 -64 -227 160 330 -390 426 874 -768 -38 515
4505 515 95 -209 729 105 -630 339 396 -73 71 403 -121 17 537 83 -188 295 3 -510 184 136 -542
4526 -542 222 379 -651 -193 401 -290 -244 290 -524 -425 454 -36 -417 41 320 -440 -218 751 -341 -443
$$ packed form
4383a19j40P87p48l54J002j45n20L14N00n90l3N63p88K99O57o29m64J139l36q57
4403d62P24L90p86K50N97r59J5Q09p42j62N16N0q69R15j67o51J09P59r22K04P30
4424C48p00j38N65O1n75O13J93r14L93N67p64M05J68j82r5O38q00l22P87K4m73
4445b01N18L73q59l53J467r18n59R70l16m26P66l12n87N70J13o41M99L79p88L29
4465B4O83o08r01J019j83p22P32K02o73L68K36l77j68P46o02m14Q52q0p04R78
4485D08m6j220M55M21n02K86R76q41k81N02k22j63L87J70p20Q16M48j642P30N53
4505E15m20l04R38o24p35R69N7m69J44L32n24J38N20m54k71M83k92n13O94m8o78
4526e42P64J57j030M58N94o91M6N34q14R9Q79m90l81M58K79p60K22R69j092j02
$$ plain form
4546 -443 296 -110 -435 272 -22 -405 288 476 -457 145 277 -316 -50 577 -232 -536 201 210 -531 448 87
4567 87 -326 134 420 -167 -48 617 -32 -37 430 102 -335 530 644 -401 21 374 -449 -266 417 -191 -358
4588 -358 357 159 -387 202 41 -373 -225 423 -314 -332 376 -182 -443 233 -94 -437 262 163 -671 112 464
4609 464 -354 89 269 -153 -311 543 -26 -383 510 738 -727 572 326 -292 59 570 159 274 774
4628 774 -63 -425 576 50 -352 183 288 -254 -252 191 -534 -306 504 -250 -418 559 -234 -684 91 301
4648 301 -741 197 353 -251 -327 301 -334 -148 435 -266 -149 29 -25 -804 69 357 -436 -207 549 -255
4668 -255 -414 378 248 -292 219 62 -40 64 373 233 148 430 -407 -84 409 211 -337 233 599 -423
4688 -423 79 356 -317 -247 368 -4 -113 99 -73 -222 355 -254 -486 9 48 -607 48 114 -915 -54 347
$$ packed form
4546d43P39m06l25P07k94l83O93J88r33O02J32n93K66O27q09l04P37Rp41R79l61
4567H7m13M60K86n87J19O65o49nM67l28m37Q65J14j045M22L53q23J83O83o08j67
4588c58P15j98n46N89j61m14J48O48p37j8P08n58k61O76l27l43O99r9q34P83L52
4609D64q18M43J80m22j58Q54n69l57Q93K28j465J299k46o18L51N11m11J15N00
4628G74q37l62J001n26m02N35J05n42KM43p25K28Q10p54j68R77p93m50P75K10
4648C01j042R38J56o04p6O28o35J86N83p01J17J78n4p79Q73K88p93K29P56q04
4668b55j59P92j30n40N11j57j02J04L09j40q5K82q37L23M93j98n48N70L66j022
4688d23N02K77o73P0O15l72j09K12j72j49N77o09k32M95L9o55O55O6j029Q61M01
$$ plain form
4709 347 -483 -546 256 295 -511 98 98 -603 -75 289 -250 -54 132 -585 -204 277 120 -76 596 491 -322
4730 -322 -18 469 -24 -123 502 -63 -222 531 366 150 526 57 -382 429 559 -420 298 578 -245 -566
4750 -566 529 87 -495 208 98 -324 -30 373 -119 -150 214 -396 -365 157 -439 -447 513 140 -523 46 294
4771 294 -506 -144 336 -28 -153 296 110 -157 428 196 -266 212 187 -102 121 590 -545 -69 679 -64
4791 -64 -370 630 310 -455 154 186 -269 -84 328 -45 215 -143 -304 27 478 137 -573 209 8 -471
4811 -471 13 486 -277 -479 300 -118 -519 151 -167 -269 196 97 -451 -212 -100 -444 102 284 -306 -241 428
4832 428 -49 -412 439 325 -396 -92 440 279 -76 176 8 -96 277 -163 -39 591 -83 -412 476 416
4852 416 -400 186 493 -267 -114 186 -25 -614 -105 380 -96 -37 158 -221 -25 298 -605 -73 463 -345
$$ packed form
4709C47q30o3Q02L9q06O09%p01N28L64n39J96J86p17L81M81j57j96O72j05q13
4730c22L04M87m93r9O25n65j59P53j65k16L76m69m39Q11J30r79P18K80q23l21
4750e66J095m42n82P03j10m22K94M03m92l1L64o10L1N22n96qR60l73o63N69K48
4771B94q00L62M80l64j25M49j86k67N85k32m62M78k5k89K23M69j135M76P48p43
4791f4l06J000l20p65O09L2m55J85M12l73K60l58j61L31M51l41p10P82k01m79
4811d71M84M73p63k02P79m18m01O70l18j02M65r9n48K39J12l44N46J82n90O5O69
4832D28m77l63Q51j14p21L04N32j61l55K52j68j04L73m40J24O30o74l29Q88o0
4852D16q16N86L07p60J53L00k11n89N09M85m76N9J95l79J96L23r03N32N36q08
$$ plain form
4872 -345 -407 482 35 -549 14 103 -317 -277 136 -278 -77 -116 -243 -79 265 -135 -91 348 82 -624 428
4893 428 498 -208 178 475 -431 -400 409 315 100 146 246 22 212 275 -242 76 493 -304 -79 407 -51 -281
4915 -281 372 134 -620 69 333 -447 83 358 -302 -348 -85 -49 -112 127 -185 -414 170 -73 -541 163 311
4936 311 -228 -539 389 -103 -435 285 361 -582 -45 349 -482 139 165 -398 142 271 -196 -254 597 189 -197
4957 -197 801 266 -257 313 775 -35 -261 548 -39 96 412 -22 10 207 220 -369 578 412 -359 -31 447
4978 447 -254 -419 333 112 -351 130 159 -60 -269 194 -99 -159 353 -618 -31 322 -445 -259 311 -166 -631
4999 -631 75 386 -437 -135 356 -105 -284 241 320 -61 173 154 -180 590 -62 -425 496 448 -389 -53 909
5020 909 136 41 433 328 -227 47 273 -54 -12 -13 -24 -393 47 -372 -147 459 -345 -545 77 363 -615 -150
$$ packed form
4872c45o2Q89m47n84N63Q9m20M0M13m14K01l9j27J64L44m00M4M39k66p06J052
4893D28P0p06L86K97r06L1Q09r4k15M6J00k24J90O3n17L18M17p97K25M86m58k30
4915b81O53k38p54O89K64p80N30K75o60m6K63L6o3K39l12k29N84k43m68P04J48
4936C11n39l11R28m92l32P20P6r43N37L94q31O21K6n63N40J29m67n8Q51m08l86
4957a97R98n35n23N70M62q10k26Q09n87J35L16m34L2J97J3n89R47j66p71L28M78
4978D47p01j65P52k21m63M81K9k19k09M63k93o0N12r71N87L53p67J86N70m77m65
4999f31P06L11q23L02M91m61j79N25P9l81K34j9l34P70o52l63R21m8q37L36R62
5020I09p73r5L92j05n55K74K26l27M2jj1l69M40m19K25O06q04k00O22K86r78M65
$$ plain form
5042 -150 322 -448 -392 144 -35 -314 140 -206 -425 317 -107 -289 32 77 -219 163 324 -155 -74 407 305
5063 305 -111 481 247 -265 205 308 -8 5 337 244 44 293 -7 101 447 77 -438 578 119 -310
5083 -310 81 419 -92 -158 584 -47 -208 -51 -43 -34 46 65 -393 66 -228 -241 -247 415 -376 -319 435 -12 -524 138
5107 138 275 -280 -177 210 -107 5 282 -238 157 384 -185 -277 418 -121 -189 325 276 -265 -239 376 125
5128 125 66 70 71 39 222 327 -460 324 -57 -475 48 204 -297 -108 82 -102 -135 257 246 -330 93 31 -291
5151 -291 19 499 -72 -356 156 -146 -390 -115 -273 -418 331 317 -111 -122 266 -326 159 338 -73 -460 126
5172 126 -7 -338 171 264 81 151 12 -317 179 644 -13 -24 318 109 -332 474 502 -296 397 467 -32 -363
5194 -363 45 -79 -245 381 -358 -7 251 -30 -197 52 115 -503 -119 -208 -88 -416 -10 -110 -143 -48 -124 -735
$$ packed form
5042a50M72p70N6N36j79k79M54l46k19P42m24j82L21M5k96L82J61m79Q1M81j02
5063C05m16N92k34n12M70J03l16J3L32r3k00K49l00J08L46l70n15J016m59m29
5083c10L91L38n11o6P42o31j61J57QRQ0J9m58M59k94j3oO62p91N7P54m47n12O62
5107A38J37n55J03L87l17J12K77n20L95K27n69r2O95n39o8N14m9n41K6O15k51
5128A25n9MJl2J83J05p87P84l81m18N23J56n01J89J90j84l3L92j1n76M23o2l22
5151b91L10M80n71k84N12l02k44K75j58j45P49j4m28j1L88n92M85J79m11l87N86
5172A26j33l31N09R3j83P0j39l29M96M65o57j1L42k09m41Q06K8p98O93P0m99l31
5194c63M08j24j66O26p39L51K58k81j67K49O3o18L84q9J20l28M06j00l3R5p6o11
$$ plain form
5216 -735 174 -104 -399 113 -63 -207 -492 458 -499 -119 358 208 -395 85 394 -69 156 179 269 28 402
5237 402 160 -496 33 -90 -289 153 468 -20 149 195 -177 97 214 -259 -206 124 -8 -208 16 284 -301
5258 -301 0 -40 -365 -143 -23 -113 -116 -77 -166 -458 20 -4 -261 -35 195 -254 -128 221 -165 -127 332 -149 -206
5281 -206 163 -277 -287 306 117 97 411 622 -50 -152 359 280 268 605 403 -375 164 224 -251 -192 443 -231
5303 -231 186 370 -11 -283 283 135 -309 -16 310 -396 -201 19 -244 -231 263 48 -289 160 90 -306 -319
5324 -319 58 -346 -126 -16 -110 64 -121 -107 -215 227 109 -225 236 83 -373 266 16 -214 -155 433 -298
5345 -298 -374 161 -12 -171 361 55 42 252 174 -126 -131 207 -268 -82 293 272 -132 326 340 -372 124 -122
5367 -122 -83 9 512 -4 -347 86 -198 -63 -43 106 -241 -28 250 -521 -200 540 -118 -273 -87 -321 -184
$$ packed form
5216g35R09k78k95N12j76j44k85R50r57L80M77j50o03M80L09m63K25K3R0k41L74
5237D02k42o56N29j23j99M42L15m88J69M6l72K74J17m73N3L30j32k00K24K68n85
5258c01L01m0l25K22J20r0lL9q9k92M78k4k57K26K30m49J26L49l86L8M59m81n7
5281b06L69m40j0N93j89k0L14K11o72j02N11p9j2L37k02p78N39O0m75N9O35o74
5303b31M17J84l81k72N66j48m44K93L26p06J95K20k63J3M94k15l37M49p0l96j3
5324c19L77m04K20J10r4J74j85J4j08M42j18l34M61j53m56O39k50k30N9N88p31
5345b98p6N35j73j59N32l06j3K10p8l00nL38m75J86L75k1m04M58J4p12M96k46
5367a22L9R2N03n16l43M33k84J35K0J49l47K13K78p71L21P40o58j55J86k34J37
$$ plain form
5388 -184 163 -29 -207 54 37 -257 185 460 -182 -351 450 -132 -42 321 -30 -20 122 -275 -136 214 221 -146
5410 -146 5 254 190 156 269 39 -321 278 107 45 273 229 -1 20 205 -147 -171 230 -10 -566 80 192
5432 192 -358 133 -4 -475 81 180 -258 -456 149 -360 -246 255 -4 -302 -180 199 -482 -143 490 24
5452 24 -265 84 86 -203 11 275 -179 219 38 -202 415 315 -97 11 39 -162 -176 346 318 39 136 287
5474 287 -155 396 407 -19 -56 469 31 -361 163 -284 -266 52 -103 -436 -70 201 188 -376 247 -143 -323
5495 -323 -63 -29 242 -136 105 -143 -207 -85 -380 305 245 -334 -285 378 -68 -148 -51 331 -261 -148 122 -185
5517 -185 379 212 -224 -91 188 -100 -34 334 23 -278 192 272 -494 -49 386 -72 -135 161 71 -274 33
5538 33 -132 -408 49 -216 -136 -36 284 -190 45 244 -428 -290 102 36 -334 -177 183 58 68 135 -280 -372
$$ packed form
5388a84L47j92j78K61j7k94M42K75o42j69Q01n82R0L63l51J0J42l97J39L50Pl67
5410a46J51K49o4l4J13k30l60N99j71o2K28m4k30K1J85l52k4M01k40n56O46J12
5432A92n50M91j37m71N56R9m38j98O05n09J14N01k59k98J22L79o81L39O33m66
5452B4k89L49Kk89K14K64m54L98j81k40O17j00m12J08K8k01j4N22k8k79R7J51
5474B87m42N51J1m26l7N25m38l92N24m47J8L18j55l33L66K71j3n64O23l90j80
5495c23K60L4K71l78K41k48o4J22k95O85o0n79M9O63m46q0R7L82n92J13K70l07
5517a85N64j67m36J33K79k88O6L68l11l01M70Q0p66M45M35m58o3K96r0l45L07
5538C3j65k76M57k65Q0J00L20m74K35J99o72J38L92o6l70J57L60j25J0O7m15r2
$$ plain form
5560 -372 156 0 95 212 -285 64 480 20 -128 56 333 -458 -140 451 -19 -70 123 282 25 136 78
5581 78 24 122 350 132 161 206 123 28 169 -360 -50 337 30 -449 -65 253 -491 167 135 -239 -441 180 -63
5604 -63 -227 278 -125 -118 171 130 -238 12 91 -412 -449 354 220 -44 45 279 -186 -102 150 -330 137 573 -68
5627 -68 58 174 -107 -57 429 -30 -54 200 -93 -342 25 510 -152 -38 263 13 -169 -75 5 -320 -135 -70
5649 -70 -266 37 214 -314 -165 479 -184 57 215 -17 -71 -203 -42 -43 -162 -49 82 -15 77 -139 -88 324
5671 324 -458 -133 256 204 -18 -204 334 -364 -222 18 -45 -76 49 175 -37 23 309 -69 311 101 -26
5692 -26 120 126 125 -23 562 -119 -341 346 -125 -244 204 130 -285 -194 -47 -46 -93 182 88 93 385 95 -90 253
5716 253 337 -281 -122 78 -82 -249 309 143 -168 -79 153 -58 311 -412 -151 403 32 -151 -9 197 -327
$$ packed form
5560c72N28j56R5J17m97L49M16m60j48J84K77p91L18N91m70n1J93J59k57J11n8
5581G8n4R8K28k18K9M5q3r5J41n29L10L87l07m79L84L18p44O58l2l74k02O21k43
5604f3j64N05m03PK89m1l68K50P9n03l7Q03j34k64Q9K34m65Q4K52m80M67M36o41
5627f8J26J16k81N0M86m59k4K54k93k49L67M85o62J14L01k50j82R4Q0l25J85O5
5649g0j96L03J77n28J49O44o63K41J58k32n4j32J61jj19J13J31r7R2k16N1M12
5671C24p82L25L89n2k22j86N38o98J42K40o3l1J25J26k12O0K86l78L80k10j27
5692b6J46Ojj48N85o81k22O87m71j19M48p4m15R1J47Jm7K75r4NK92k90j85L43
5716B53Q4o18J59K00j60j67N58j66l11Q9K32k11L69p23K61N54l71j83J42K06n24
$$ plain form
5737 -327 -261 303 39 79 224 134 -80 59 260 103 177 -60 -62 52 352 -69 -331 154 230 -163 114 311
5759 311 -5 87 258 -60 -296 398 208 -464 -224 -128 5 -135 20 -351 105 -88 -336 -142 -26 -24 -301
5780 -301 347 -72 -436 116 235 -448 48 274 -118 97 190 121 88 26 -146 116 250 287 -157 227 566 -6
5802 -6 -107 382 115 -68 300 87 61 -28 -81 132 237 -67 86 -94 285 243 -197 279 64 -309 49 190
5824 190 -524 59 -14 -612 -224 195 -114 -72 54 -52 -130 22 72 -16 149 -81 -471 161 92 33 -148 151
5846 151 -72 -58 49 -93 -14 257 317 -157 218 166 -34 90 85 -136 -262 162 95 -120 324 150 -161 388
5868 388 231 222 -25 -44 55 318 131 -296 33 -8 33 -188 -54 -171 -561 -313 45 -285 -317 -221 113 30 10
5891 10 21 -238 -263 -32 -96 -240 137 -358 109 136 -125 -189 190 96 -265 140 71 -57 151 52 -25 -185 262
$$ packed form
5737c27O6N64k64M0J45r0k14J39K01j57P4k37kJ14L00m21k62M85P6l93K77J97
5759C11l16R2J71l18k36O94j90o72K40R6J33j40J55l71M56j93k48J94J16Kk77
5780c01O48m19l64N52J19o83M96K26l92K15R3o9l3o2j72K62J34L7m44L84L39n72
5802fj01M89k67j83L68k13k6q9n3K13J05l04J53j80L79m2m40M76k15l73L58J41
5824A90p14N83p3n98L88M19l09M2J26j06p8J52N0q8J65k30l90O32o9n9j81K99
5846A51k23J4J07j42P9K71O0m74L75n2k00J24nk21j26M24o7k15M44j74l11N49
5868C88j57rk47j9R9K63j87m27L29m1M1k21J34j17l90K48L58l30l2R6L34q3k0
5891A0J1k59k5K31o4j44L77m95M67K7k61o4L79r4l61M05o9j28K08r9p7j60M47
$$ plain form
5914 262 -240 -160 173 102 52 85 -159 -245 102 12 -130 -98 216 57 16 137 7 -445 162 -11 -233 -26 126
5937 126 -210 -177 52 -77 -122 599 -240 -97 354 -230 -238 -60 -94 -154 -332 232 -216 -241 -235 -119 -67 82 -1 -214
5961 -214 230 -16 -308 -105 318 -251 127 138 105 -304 252 71 -51 -269 254 124 72 302 -407 231 425
5982 425 -160 -453 277 74 83 85 58 -168 3 233 -16 -77 301 -245 -141 93 -167 -13 314 128 -102 63
6004 63 257 -374 -247 -133 36 103 126 91 -378 46 -54 53 77 30 -298 108 309 -228 20 322 327 -102 339
6027 339 84 115 255 150 -127 23 226 -67 -169 101 -254 -219 207 92 -192 40 -1 -110 103 221 -129
6048 -129 134 -75 -51 -97 122 67 -245 202 339 -314 -183 -4 -348 -310 -118 162 -443 385 -53 147 98 -67
6070 -67 -299 5 44 -59 -104 68 -51 93 91 80 -44 262 -131 60 -310 273 285 81 368 -286 9 158
$$ packed form
5914B62n02Q0L33p1n0L3k44q6L47r0j42L2L14j59m1J21j30m52O07j73k22K07J52
5937A26l36L3K29j29m5P21q39J43M51n84qJ78l4o0j78N64m48k5OJ16N2J49q3k13
5961b14M44k46k92K03M23n69L78J1l3m09N56j81j22k18N23j30n2K30p09O38J94
5982D25n85k93P30k03RKk7k26J71K30k49o1L78n46J04K34k60J54L27j86k30J65
6004F3J94o31J27J14J69O7K3l5m69M24j00J07K4m7l28M06K01n37K48L02Nm29M41
6027C39k55L1J40j05k77J50K03k93j02K70l55L5M26j15k84K32m1j09K13J18l50
6048a29K63k09K4m6K19n5l12M47J37o53J31J79l44L8J92K80o05Q28m38K00m9j65
6070f7k32L04L9j03m5J72j19J44kj1j24L06l93J91l70N83J2k04K87o54K95J49
$$ plain form
6092 158 123 -114 188 310 -237 -146 93 -133 69 -5 -172 -274 510 70 -408 204 227 -237 -267 -73 -296 -20
6114 -20 48 116 30 435 -209 139 432 69 -105 45 -21 -169 -296 -87 -232 28 247 20 -301 -150 55 49
6136 49 83 524 202 -190 64 150 198 233 -38 -269 142 229 -198 124 33 5 -10 -118 -30 52 348 -195 -194 32
6160 32 75 -223 -97 32 -116 -5 56 20 -79 230 143 -188 -15 -161 -91 30 150 -7 101 -123 -238 -286 19
6183 19 -319 23 417 287 -80 -54 -6 -153 157 407 -57 61 52 -16 -36 35 265 -272 275 270 43 27 223 -138
6207 -138 -192 144 -31 -20 333 126 127 214 256 -264 86 -264 48 26 182 234 -148 128 -140 217 14 93 190
6230 190 -29 98 -201 -20 95 -45 -183 -147 -199 16 151 124 -44 233 247 -36 188 -91 -215 -228 517 123
6252 123 144 153 -118 -182 -123 -365 278 122 -40 -110 34 77 -12 74 40 -329 -279 139 -265 -240 234 463 -9 7
$$ packed form
6092A58l5k37L02J22n47R1K39k26K02p4j67j02P84m40m78O12K3m64l0J94k23K76
6114b0O8O8q6M05o44L48K93l63j74J50o6j48j27K09j45K60K19k27l21J51K05o
6136D9L4M41l22l92K54Q6M8L5k71k31M11Q7m27L22r1k8j5j08Q8Q2K96n43JK26
6160C2M3k98J26J29j48J11O1l6r9L09q7l31J73j46P0J21J20j57J08k24j15m8L05
6183A9l38L42L94j30l67K6M8j47L10K50m64J18ro8k0P1K30n37N47nk27j6J96l61
6207a38n4L36j75J1L53k07JQ7M2n20L50l50L12k2J56N2l82K76k68L57k03P9R7
6230A90k19J27k99J81J15j40j38L6n2K15J35k7j68K77J4k83K24k79j24j3P45l94
6252A23K1Rk71o4N9k42O43j56j62p0J44M3q9Q6l4l69N0M18m04K5M74K29m72J6
$$ plain form
6276 7 294 206 -384 6 -63 34 316 -215 58 -165 239 -292 -31 209 -83 -46 -282 -330 -323 160 -114 -303 115
6299 115 88 119 241 -22 -163 59 154 -227 -84 222 -466 -269 390 -180 -279 226 237 -7 -300 93 -40 465
6321 465 205 -8 94 -58 274 37 47 312 62 -230 307 -157 294 -34 265 -132 79 -44 -219 -155 76
6342 76 113 -209 -89 -10 92 167 -585 -305 184 -237 -64 -206 -77 -250 -83 171 57 -172 126 -211 -148 402
6364 402 -57 28 65 -51 -208 -13 304 -232 37 263 -91 -211 300 -43 -394 -125 -28 -202 -252 -41 -192
6385 -192 158 -69 -60 27 181 115 -17 -16 204 58 121 159 106 -235 134 -258 -287 111 -132 -318 -25 -176 108
6408 108 225 303 63 217 27 -223 -214 186 79 39 173 93 147 -107 347 -1 -235 273 124 65 130 -87 -101
6431 -101 101 121 -75 141 294 -8 -137 104 -59 47 -210 119 34 -40 4 -13 -1 -187 20 71 140 -303 -163
$$ packed form
6276GK87q8n90L90o9R7K82n31K73k23M04n31K61K40k92L7k36m8PM83k74j89M18
6299A15k7L1J22k63j41K22R5l81J43L06o88J97O59n70r9N05J1k44k93L93j33N05
6321D65k60k13J02j52L32k37J0K65k50k92N37m64M51l28K99l97K11j23j75O4K31
6342G6L7l22J20P9J02P5p52K80M89m21J73j42J29j73J67K54j14k29K98l37O3N50
6364D02m59Q5L7j16j57J95L17n36K69K26l54j20N11l43l51K69R7j74n0K11j51
6385a92L50k27RQ7J54o6j32JK20j46O3L8n3l41L69l92k9L98k43j86K93j51K84
6408A08J17P8k40J54j90k50RM00j07m0J34q0N4k54M54l48k34N08j49n9O5k17j4
6431a01K02K0j96K16J53l02j29K41j63J06k57L29q5p4M4j7J2j86K07N1O9m43J40
$$ plain form
6454 -163 -63 107 -57 -172 128 -250 212 240 -166 -3 89 -130 -104 27 217 -56 -104 -101 -130 185 -37 -425
6476 -425 155 -14 -177 -89 316 -147 -111 150 -10 -11 -75 349 -124 202 75 -127 160 81 277 135 -33 53
6498 53 -352 182 68 -201 246 147 -187 -60 46 198 166 55 -172 -86 -110 -159 -47 155 -34 -120 -170 195 171
6521 171 -14 57 -157 -50 169 95 -204 214 146 168 108 -145 -124 22 -7 182 106 204 193 -243 -157 191 -233 6
6545 6 -19 33 181 252 18 -186 -214 68 -159 442 -331 -230 167 140 69 -195 120 52 52 -165 264 -208 -47 36
6569 36 221 -277 140 -394 -91 -8 77 -291 176 216 -43 210 305 -143 113 119 87 -318 353 36 -293 150 -197
6592 -197 -152 232 31 -171 -105 134 -130 303 -200 -78 85 -119 10 154 -254 265 -74 138 30 -87 -14
6613 -14 -62 76 -28 175 80 -25 113 16 -40 39 70 -320 -196 50 -45 384 196 -194 -303 199 -297 168 419
$$ packed form
6454a63J00J70j64j15L00l78M62K8m06J63R2k19K6J31J90k73m8Lk9L15k22l88
6476d25N80j69j63Q8M05m63L6K61j60jo4M24m73L26j27k02K87p9J96j42j68Q6
6498E3m05N34j14k69M47r9l34J27J06J52l2j11k27Q6k4m9J12K02j89q6n0L65k4
6521A71j85P1k14J07K19p4k99M18o8K2o0k53K1J46k9J89p6R8j1m36Q6L48m24K39
6545Fk5N2J48P1k34k04k8K82k27O01p73J01L97k7p1k64L15o8%k17M29m72J61Q3
6569C6J85m98M17n34L03Q3Q5l68M67M0k59K53R5m48K56Ol2m05O71l17l29M43l47
6592a97M5L84k01k02O6K39k64M33n03J22J63k04J29J44m08N19l39K12j08j17P3
6613a4m8J38j04K03r5j05J38r7n6P9L1l90J24K46r5M29j88l90j09N02m96M65K51
$$ plain form
6636 419 21 -83 115 -18 99 -280 136 -204 38 273 110 74 -167 54 -199 149 64 -160 -74 427 67
6657 67 -164 343 -171 169 191 278 -229 104 91 -212 14 163 215 -164 153 220 -237 84 26 -49 320 -350 4
6680 4 93 -291 94 -130 432 -121 -300 33 -189 -277 -74 -251 22 -247 -45 -61 32 72 -43 -230 121 -26
6702 -26 225 35 -31 -92 310 -54 125 290 105 -124 -116 220 356 85 -246 292 179 -185 182 -48 56 4
6724 4 -106 -112 125 84 -125 132 -56 98 -234 -224 -169 -330 86 -206 -225 270 4 89 228 -77 -452 -190 25
6747 25 -146 49 319 -154 37 35 89 104 -11 -35 54 19 -76 -162 -49 -131 -132 54 171 38 -97 224 216 55 84
6772 84 62 -63 40 153 54 -205 300 106 -210 -204 -168 6 -82 24 -54 -103 180 -363 -112 287 -72 -77 83 -116
6796 -116 -49 111 175 -268 -176 104 -338 -157 -164 -114 377 168 -62 147 256 165 -197 64 154 175 -106 35 -28
$$ packed form
6636D19l98j04J98j33J17l79M16l40K42K35j63l6k41K21k53L48q5k24Q6N01l60
6657F7k31N07n14L40K2Q7n07L33j3l03K26J49N2l79L17O7m57L21n8p5L69o70L54
6680DQ9l84L85k24N62n53j79L33k22q8K03j77K73k69K02j6R3M0j15j87L51j47
6702b6K51j90o6o1M02l64J79J65j85k29QL36J36k71l31N38j13l64L67k30J04n2
6724Dj10oK37m1k09K57j88J54l32J0N5j61M16k92j9M95k66Q5J39l05l75K62K15
6747B5j71J95K70m73J91kN4J5j15k4Q9l5r5q6J13q2jJ86J17j33j35L21qj61K9
6772H4k2j25J03J13r9k59N05j94l16OL6J74q8J06p8m9K83n43K51L99l59nJ60j99
6796a16O7J60O4m43R2K80m42J81pN0M91k09k30K09J09r1l62K61R0K1k81J41o3
$$ plain form
6819 -28 172 148 -91 270 264 9 144 88 -63 79 201 100 -138 39 137 230 117 123 53 -92 71 -137 -316
6842 -316 118 60 310 41 -23 -7 -24 -186 17 -176 269 -17 -10 -160 82 583 -90 331 -17 198 -116 -178
6864 -178 -204 427 28 90 147 -86 -185 113 302 16 187 87 57 -55 136 133 32 -149 16 -175 -47 180
6886 180 56 -78 -15 38 183 -99 349 -138 -54 222 -259 10 -82 -85 -62 161 149 87 -205 -154 -241 157 -5 -24
6910 -24 -340 3 -5 133 165 -72 17 114 -170 -397 309 -154 -279 129 128 -192 -194 -83 -58 -110 -36 -175 -341 100
6934 100 -78 131 400 95 -168 -82 96 -104 -1 41 364 -51 -37 305 6 314 143 -13 103 50 181
6955 181 -245 147 -44 177 99 208 18 75 -342 -227 -33 -88 -121 -213 -21 91 86 -103 88 -367 -15 0 -133
6978 -133 156 112 65 -139 -117 -159 57 63 -10 -90 64 -151 100 -53 121 41 199 196 243 116 -121 9 -202 361
$$ packed form
6819b8K00k4k39L61ok55J35n6j51J42J22j01k38J77R8R3j13Op0j45J63k08j79
6842c16M34n8K50k69o4J6j7j62K03j93M45k86Pj50K42N01o73M21l48K15l14o2
6864a78k6O31l99O2N7k33r9K98J89k86J71j00l0j12J91lj01j81J65j91J28K27
6886A80j24j34O3N3J45k82M48m87Q4K76m81K69r2lK3K23j2o2k92N1q7L98j62j9
6910b4l16L43qJ38L2k37Q9R7k84k27P06m63j25M08jl20kJ11K5n2P4j39j66M41
6934A00j78K09K69l05k63Q6J78k00J03M2L23m15J4L42k99L08j71j56J16n3J31
6955A81m26L92j91K21p8J09j90N7m17J15J94n5l3r2J92J12nj89J91m55L52J5j33
6978a33K89m4m7k04K2m2K16Op3q0J54k15K51j53J74q0J58lM7j27k37J30k11N63
$$ plain form
7002 361 222 -256 15 63 93 -334 -10 -171 112 -36 -246 -121 -140 -44 87 -5 5 21 -262 -171 -153 4 -13
7025 -13 -207 6 99 51 209 154 -118 -68 -40 -91 -30 10 160 -5 -172 355 46 -409 260 217 56 85 59 161
7049 161 203 382 -67 -255 261 -74 78 176 74 -5 85 -172 -260 -101 -5 -4 -275 190 -308 211 32 20 -282
7072 -282 -339 38 -166 238 484 -173 56 -118 -97 231 326 127 252 283 -170 15 -154 159 -185 -56 113
7093 113 -206 -41 -108 -64 143 -298 -101 123 290 -204 -340 185 242 -186 -377 104 111 -57 123 -4 -189 -168
7115 -168 -220 -166 -161 173 -104 -86 407 93 -357 325 -128 -75 327 -20 -331 -173 209 -114 -241 51 143 91 -65
7138 -65 -196 -258 12 -311 -194 -145 213 310 3 532 93 87 -76 84 -105 226 204 -191 -37 423 209 -39
7160 -39 245 26 -50 -214 -30 -15 -53 355 -32 196 230 -232 -22 -189 -239 -125 253 -133 -121 -259 -205 75 0
$$ packed form
7002C61j39m78K71M8L0m27L24j61K83j48k10J25j9R6J31r2J0J6k83R1J8J57j7
7025a3j94K13R3m8J58n5k72N0K8n1O1M0J50j65j67N27l09m55O69m3j61K9k6J02
7049A61M2J79m49j88N16l35J52R8j02p9R0k57q8J59R6Jk71M65m98N19j79j2l02
7072b82n7L77k04M04K46o57K29j74K1L28R5j99J25L1m53J85j69L13l44J29J69
7093A13l19J65o7M4K07m41J97K24J67m94j36N25N7m28j91M81Pj68J80j27j85K1
7115a68n2N4NL34k77J8M93l14m50O82m53N3M02l47l11J58L82l23j27K92R2n2j56
7138f5j31o2K70l23J17M9L58R7l07N29m39oj63J60j89L31k2l95J54M60k14k48
7160c9K84k19p6j64J84J5l8M08l87K28L4m62K10j67n0J14L78l86J2j38N4K80p5
$$ plain form
7183 0 -291 -14 39 -9 -112 -101 177 67 50 36 76 -101 -313 275 -10 -11 197 0 -180 -22 105 55 268 134
7207 134 7 160 144 96 288 216 -190 141 -79 204 -133 -90 46 -371 -146 39 145 -370 8 -108 166
7228 166 -43 -149 -114 11 -135 -263 125 384 -150 -26 -60 14 48 -25 -54 -115 488 -356 -65 -30 52 8 -138
7251 -138 -4 -17 -76 255 -189 -36 56 110 92 94 197 -62 -43 -128 -100 37 90 44 176 -208 -1 133 41 312
7275 312 90 176 111 -85 97 -85 130 68 119 22 70 -81 8 79 -146 174 -153 -54 -96 -182 -62 -157 -54 -52 -61
7300 -61 108 157 -32 32 -19 75 151 180 136 -302 19 18 193 -202 -26 109 -26 -247 -67 -17 -192 1 298 146
7324 146 126 118 -178 -210 -81 63 85 -53 113 -13 -19 220 -191 53 -155 -240 157 155 17 -169 172 8 -11 11
7348 11 311 86 -120 -165 -31 -78 -158 -138 55 150 145 -200 35 -2 17 337 115 80 53 -128 -79 -25 -10 197 51
$$ packed form
7183@k91K77N3m8j03J1K78j10j7j4M0j77k12N88k85jK08j97j80J58J27n0K13j34
7207A34j27J53j6m8J92p2m06L31k20K83l37M3J36m17K25J85J06n15L78j16K74
7228A66k09j06L5J25j46j28L88K59n34J24l4P4L4p3k9o1O03q44K91L5Q2m4j46
7251a38J34j3n9L31m44J53R2N4j8KJ03k59J9q5K8J37N3m6J32l84K07J34r2K71
7275C12k22Q6o5j96J82j82K15o2N1r7M8j51Q9P1k25L20l27R9m2q6J20r5J03Kr
7300f1J69M9j89O4n1R4P6K9m4m38L21jJ75l95J76J35j35k21J80N0j75J93K97j52
7324A46k0qk96l2J29J44K2j38J66j26oK39m11K44k08q5L97kj38j86L41j64j9K2
7348A1L00k25k06m5J34m7q0K0J93R5nl45K35l7J9L20k22l5k7j81M9N4J5K07j46
$$ plain form
7373 51 -44 32 -171 -16 52 92 122 180 113 -292 -329 -38 181 -17 73 43 -130 -21 -110 126 513 -40 -208 219
7397 219 62 -187 -97 258 220 135 -149 26 236 32 -37 9 133 236 -183 228 0 -270 -480 -216 115 456
7419 456 102 -169 -132 -169 10 -82 17 -154 -107 569 -76 -167 -15 199 194 3 123 -133 141 167 289 292 -275 -20
7443 -20 10 -42 2 96 -138 311 -94 -135 135 164 19 -118 -154 -334 -19 75 -90 84 8 -38 -91 -205 38 -11
7467 -11 -172 276 -201 -180 24 32 32 133 -93 -28 109 41 -173 -15 69 35 -95 252 9 69 -61 -1 -1 -247 133
7492 133 27 22 -16 -210 -366 -267 46 -146 331 200 -63 92 117 63 5 80 122 -203 33 -173 126 -277 110
7515 110 119 -203 -18 -161 -233 -35 161 -144 32 -41 115 94 82 -106 -89 -23 10 -177 -53 -8 -109 27 48 -106
7539 -106 -15 90 -91 -32 103 -16 118 -83 335 26 -40 227 266 67 -154 -96 79 61 -27 -100 14 -57 -146
$$ packed form
7373E1r5P6k03J55O8M0L0N8o7m05l7K91K19j98R0l0j73J09q9K36L87n53j68M27
7397B19j57k49R0L55l8q5k84J75K10k04o9M6J24J03m19M11k28k70k10K64L31L41
7419D56l54k71L7l7J79r2R9j71M7O76o45r1J52K14nj91J20k56K74K6J22Ln67K55
7443b0L0n2M4R4k34M49m05m1K70K9j45j37l6j80L15R4j65J74p6m6n3j14K43m9
7467a1j61M48m77K1K04Q%J01k26O5J37o8k14J58Q4l4j30L47k43O0j30O0%k46L80
7492A33j06nl8j94j56R9L13j92M77j31k63J55K5n4n8P5M2l25K36k06K99m03L87
7515A10Rl22J85j43p2J98J96l05J76p3J56k1j2j88J7O6L3j87J24M5j01J36K1j54
7539a06R1J05j81N9J35j19J34k01M18l09o6K67L9j99k21N8J75j8q8p3J14p1q9
$$ plain form
7562 -146 -125 -150 304 243 -109 11 45 374 195 120 117 39 180 132 296 -27 -147 157 373 -99 36 149 -82
7585 -82 -258 -379 68 137 -164 30 57 -138 -78 -189 112 119 -73 75 322 184 165 -49 -179 -64 465 169
7607 169 -4 112 -101 78 -71 -121 -78 94 -51 -139 103 -167 184 -44 36 109 -141 54 144 63 87 -22 -239
7630 -239 9 376 -332 -29 92 -129 -78 -87 -321 58 -99 -226 132 -92 -53 83 27 -204 -352 58 81 -251
7652 -251 87 6 98 140 -177 106 -188 102 10 -187 28 54 -81 -297 -133 -168 -137 129 216 36 -136 204 286
7675 286 -33 -84 125 -5 52 -348 -89 -121 191 -167 -106 305 -167 185 -24 101 175 170 -245 -41 -214 210
7697 210 -22 -151 216 -80 -191 100 -10 179 29 -66 -227 218 272 -233 -50 213 461 107 -60 -232 -160
7718 -160 159 -220 221 162 -110 132 161 -169 78 82 -315 -169 60 -62 -131 -135 13 -66 -137 -13 -214 0 -35
$$ packed form
7562a46K1k5M54o1l52J20L4L29j79p5lp8J41m8J64l23j20L04K16m72J35J13k31
7585h2j76j21M47O9l01J94K7j95O0j11L01Pj92J48K47j38j9k14j30J15N29k96
7607A69j73J16k13J79j49n0M3J72j45q8K42k70L51k28Q0P3k50J95R0q1K4j09k17
7630b39K48L67p08L03J21k21N1rk34L79j57j27L58k24L9J36n6k31j48M10K3l32
7652b51L38q1R2M2l17K83k94K90r2j97K15K6j35k16J64l5L1K66Q7j80j72L40Q2
7675B86l19n1K09j30N7m00K59l2L12l58O1M11m72L52k09J25P4nm15K04j73M24
7697B10k32j29L67k96j11K91j10J89j50r5j61M45N4n05J83K63K48l54j67j72P2
7718a60L19l79M41n9k72K42K9l30K47Ml97J46K29j22o9mJ48p9p1J24k01K14l5
$$ plain form
7741 -35 131 -209 -142 -160 55 367 125 355 336 -27 71 -128 90 -207 -109 38 228 74 172 -257 36 118 -144
7764 -144 118 -224 92 -42 -16 -344 197 206 12 45 -290 -107 63 319 440 133 -209 210 -58 44 222
7785 222 -26 -18 -84 243 62 -82 -275 -40 175 54 -138 -58 -98 -286 -90 106 37 77 -189 116 -7 -33 -1
7808 -1 -204 280 -20 -11 14 198 -100 -272 104 102 -104 -91 175 155 -195 146 -12 -49 -63 36 44 4 15 177 136 191
7834 191 -154 -74 -134 168 53 79 172 -61 -9 -85 321 -280 115 -282 151 133 138 -35 50 134 -143 -162 246 186
7858 186 -170 -408 -141 125 -37 -214 -188 -252 32 -431 29 136 97 -77 132 114 106 32 -112 115 175 -28 -295
7881 -295 44 171 -24 -66 -202 25 -84 115 -509 -21 138 47 -116 92 -1 45 -51 -118 -207 87 -109 266
7903 266 218 31 21 130 138 295 -77 123 134 79 -134 -65 150 131 -293 -128 -133 110 -3 46 67 92 31 -81 -46
$$ packed form
7741c5J66l40O7j8K15L12k42K30j9l63R8j99K18k97R8J47J90j54R8m29K93Q2k62
7764a44K62l42L16j34K6l28N41Rj94L3l35J83J70K56J21l07l42M19k68J02J78
7785B22k48Qo6L27j81j44j93K35K15j21j92Q0m0j88J96J96o9M0k66L05j23k6L2
7808ak03M84l00RK5J84k98j72L76kk06J3K66k0l50L41j58l7j4R9Qm0J1J62m1N5
7834A91l45Q0o0L02j15K6R3k33N2p6M06o01L95l97M33j8Nj73Q5Q4k77j9M08o0
7858A86l56k38K67K66j62j77K6o4K84m63M60J07l9j74K09j8qp4j44K27O0k03k67
7881b95L39J27j95m2j36K27j09J99o24M88J59r1j63K08r3M6r6o7q9K94j96L75
7903B66m8j87j0J09QJ57l72K00J1n5k13O9K15j9m24J65nK43j13M9K1K5o1j12L5
$$ plain form
7928 -46 -41 82 -93 162 199 -163 -248 73 -19 12 154 -100 -80 128 150 -132 3 15 13 -250 -119 228 -137 184
7952 184 182 -45 -50 -66 -143 108 -49 -260 -92 386 -187 293 -475 -148 137 -94 283 83 298 -195 -59 -1
7974 -1 -280 -18 128 -225 172 -18 104 85 -75 -101 -147 95 -235 5 16 57 289 123 44 133 -259 -209 17
7997 17 -152 -66 241 -153 -316 126 75 313 -183 210 17 -55 144 -64 184 -210 -180 -53 -251 129 195 141
8019 141 -75 66 -77 152 144 260 78 -255 -269 112 -270 58 95 143 49 -29 236 149 -98 -208 59 -1 -8 42
8043 42 -52 -333 -99 120 28 -123 189 -258 151 -30 66 52 88 -211 35 -50 66 -348 -8 -161 18 117 -210
8066 -210 -7 -40 267 337 67 -155 -15 -238 249 266 55 189 -388 -174 256 -32 -46 219 144 -305 54 -96
8088 -96 -276 -284 68 -78 -240 -124 8 -143 141 58 -74 125 79 255 -196 195 64 132 -144 -36 -143 -151 27
$$ packed form
7928d6NJ23j75K55L7l62q5L21r2L1J42k54K0K08K2k82J35J2kk63J31L47l65L21
7952A84kk27nj6p7K51j57k11J68M78n73M80p68L27K85k31L77k00K15m93J36N8
7974ak79K62J46l53L97j90J22j9j60k6m6K42l30K40J1M1K32j66p9Q9l92N0K26
7997A7j69Q6L07l94j63M42n1K38m96L93j93p2J99k08K48l94L0J27j98L80O6n4
8019A41k16J41j43K29qJ16j82l33j4L81l82L28L7M8r4p8K65q7k47j10K67o0pN0
8043D2r4k81K34K19r2j51L12m47M09j81R6j4L6k99K46q5J16m14L40j53J79R9l27
8066b10K03l3L07P0k70k22J40k23M87J7k11J34n77K14M30k88j4K65p5m49L59j50
8088i6j80qL52j46j62J16J32j51K84q3j32J99m6J76m51L91j31O8k76J08j07qJ78
$$ plain form
8111 27 -79 182 126 -116 -85 112 164 -130 -319 240 68 26 -140 -10 -160 -190 54 11 -53 233 325 70 -200
8134 -200 32 25 97 131 4 330 -58 201 -91 121 -169 256 142 -244 0 17 -227 -20 -164 79 -241 -83
8156 -83 252 -26 -130 253 -118 -54 -133 -114 88 39 164 7 217 -290 177 41 -51 42 58 74 80 194 -191 -9
8180 -9 -82 -47 164 63 276 -118 -105 -67 340 167 177
$$ packed form
8111B7j06K61n6k42L1J97N2k94j89N59j72m2j66J30j50l0K44m3o4K86R2k55k70
8134b00K32pP2L4j27L26l88K59k92K12k90M25j14l86K44J7k44K07j44K43l20J58
8156h3L35k78j04L83l71O4p9J9K02m9J25j57K10n07M67j36r2R3J6J6OJ14l85J82
8180ip3L5K11j01K13l94J3L8M07j73J0
8191A77
$$ Imaginary data points
##PAGE= N=2
##DATA TABLE= (X++(I..I)), XYDATA
$$ plain form
0 0 0 0 0 0 0 0 0 8 -8 8 -8 16 -16 16 -24 32 -32 40 -48 56 -66 77 -88 104 -118 134 -154 174 -197 221 -249
31 -249 280 -312 350 -389 434 -481 534 -593 657 -727 803 -889 987 -1095 1214 -1351 1506
48 1506 -1687 1901 -2154 2464 -2848 3341 -4002 4934 -6342 8719 -13463 26526 -133664 -429077
62 -429077 5159 301289 23065 -287335 -103647 145526 25584 -208266 -107848 116813
72 116813 64008 -124861 -66313 67412 -19870 -109976 58331 177748 296 -170021 -39060
83 -39060 159035 120986 -49111 -62400 62211 78121 -27046 -31345 56177 50798 -3208 16600
95 16600 6967 -69246 -32055 110057 100691 -74906 -136815 12856 126949 22745 -106785
106 -106785 -23986 104354 9650 -129322 -28277 118783 29301 -106574 -36629 66790 -8219
$$ packed form
0@%%%%%%%Qj6J6j6K4l2L2m0N6o4P2q8J04j22J43j65J92k22K52k88L28l71M18m70
31b49N29n92O62p39Q23r15J015j127J250j384J530j692J876k082K309k565K857
48A506l193L588m055M618n312O189p343Q936j1276J5061k2182L9989j60190k95413
62d29077M34236K96130k78224l10400J83688K49173j19942k33850J00418K24661
72A16813n2805j88869N8548J33725q7282r0106J68307J19417j77452j70317J30961
83c9060J98095l8049j70097j3289J24611J5910j05167m299Q7522n379n4006J9808
95A6600r633p6213L7191J42112r366j75597o1909J49671J14093j04204j29530
106a06785Q2799J28340r4704j38972J01045J47060q9482j35875O9945J03419p5009
$$ plain form
117 -8219 -105405 -18218 112878 32401 -152738 -110892 103849 109162 -89023 -111066 58454
128 58454 83010 -51374 -71932 39801 78431 7522 -33186 7302 32376 -451 6067 68109
140 68109 42106 -57701 -38507 69602 55288 -41383 -33272 34660 21881 -32438 -33689 2017
152 2017 14904 -5665 -16352 -4842 -20083 -43049 6055 61781 1304 -73295 -16059 61774
164 61774 22317 -38927 -12269 40255 35421 -11387 -34218 86 38564 22503 -5557 -10108
176 -10108 -21853 -20579 23804 29723 -31756 -43131 15007 19534 -35085 -40449 11385 37518 -214
189 -214 -46960 -27405 29909 23366 -17857 5503 36920 -11416 -42218 21574 62402 9664 -33932
202 -33932 -797 39648 14752 -36732 -15118 60173 45155 -54507 -61618 30966 49634 -14608
$$ packed form
117h219r7186Q7187J31096q0477j85139M1846K14741N313j98185k2043J69520
128E8454K4556j34384k0558J11733L8630p0909m0708M0488K5074l2827O518O2042
140F8109k6003r9807J9194J08109j4314r6671Q111O7932j2779n4319j251L5706
152B017J2887k0569j0687J1510j5241k2966M9104N5726o0477p4599N7236P7833
164F1774l9457o1244K6658N2524m834m6808k2831L4304L8478j6061k8060m551
176a0108j1745J274M4383N919o1479j1375N8138M527n4619n364N1834K6133l7732
189b14m6746J9555N7314o543m1223K3360L1417m8336l0802O3792M0828n2738m3596
202c3932L3135M0445k4896n1484K1614P5291j5018r9662p111R2584J8668o4242
$$ plain form
214 -14608 -28328 5131 3239 -18392 -15835 5680 17193 950 -18404 -9946 -3953 -15188 6431
227 6431 37516 32 -46208 -9292 30462 -1213 -18510 19209 23945 -22977 -37848 6590
239 6590 43189 12484 -34873 -8542 38668 -2499 -53264 10059 75203 8497 -67278 -20306
251 -20306 48962 26900 -26573 -17707 29023 23650 -35725 -38550 31860 45592 -19574 -36049 6988
264 6988 7431 -18462 -901 21527 2968 -21562 -18442 1242 13551 2263 -6171 8622 5385
277 5385 -23220 -10828 28798 16595 -13884 3098 15061 -13886 -17973 21494 36153 838
289 838 -32594 -15076 29951 21604 -30581 -18514 40754 19456 -51725 -33114 37598 30967 -23766
302 -23766 -29009 5479 12184 -15481 -21402 17591 29256 -22610 -40767 14323 31685 -16407 -20776
$$ packed form
214a4608j3720L3459j892k1631K557K1515J1513j6243j9354Q458N993j1235K1619
227F431L1085l7484m6240L6916L9754l1675j7297L7719M736m6922j4871M4438
239F590L6599l0705m7357K6331M7210m1167n0765O3323O5144o6706p5775M6972
251b0306O9268k2062n3473Q866M6730n373n9375k825P0410J3732o5166j6475M3037
264F988M43k5893J7561K2428j8559k4530L120J9684J2309j1288q434J4793l237
277E385k8605J2392L9626j2203l0479J6982J1963k8947m087L9467J4659l5315
289H38l3432J7518M5027q347n2185J2067N9268k1298p1181J8611P0712o631n4733
302b3766n243L4488O705k7665n921L8993J1665n1866j8157N5090J7362m8092m369
$$ plain form
315 -20776 22897 17640 -22454 -19895 13309 23915 5766 -11077 -3814 7555 -3864 -3484 24383
328 24383 16279 -24369 -13275 26620 9021 -24634 1242 31375 5105 -28820 -16612 18142
340 18142 23469 -8854 -20957 8862 12949 -23314 -16022 30246 17453 -30411 -20523 17929 9772
353 9772 -15928 -9229 13680 13318 -15001 -28019 4630 27818 -2074 -21045 3947 6480 -17217
366 -17217 -3655 22091 4668 -17770 -5876 10382 3738 -8241 -3148 17461 14610 -20445 -21871
379 -21871 22701 26108 -15897 -11681 22906 6756 -24548 -3584 29129 16130 -17863 -19109 14006
392 14006 23272 -13039 -23022 21947 28876 -25650 -32625 19648 26214 -14667 -17512 8912 6076
405 6076 -16241 -14310 11719 17973 -15615 -30155 7039 22138 -18908 -25366 21218 20544 -27112
$$ packed form
315b0776M3673n257m0094K559L3204J0606j8149j6843P263J1369j1419L80K7867
328B4383q104m0648J1094L9895j7599l3655K5876L0133k6270l3925J2208L4754
340A8142N327l2323j2103K9819M087l6263P292M6268j2793m7864R888L8452q157
353I772k5700O699K2909l62k8319j3018L2649K3188k9892j8971K4992K533k3697
366a7217J3562K5746j7423k2438J1894J6258o644j1979N093K0609k851l5055j426
379b1871M4572L407m2005M216L4587j6150l1304K0964L2713j2999l3993j246L3115
392A4006R266l6311r983M4969O929n4526o975N2273O566m0881k845K6424k836
405F076k2317J931K6029O254l3588j4540L7194J5099m1046o458M6584o74m7656
$$ plain form
418 -27112 -25619 17568 20779 -8454 -12930 9009 14583 -9283 -15478 21289 33094 -14162 -27806
431 -27806 23266 33389 -17101 -21535 27218 29492 -17665 -30978 8198 32940 1572 -32900
443 -32900 -7768 25779 -4796 -35920 2084 30173 -10453 -35403 -618 19768 -4956 -19243
455 -19243 1515 19858 724 -25793 -5404 32892 14611 -24255 -4695 28295 4118 -19959
467 -19959 7469 26342 1818 -17652 -4525 14020 8833 -12373 -8433 15023 3763 -27401
479 -27401 -10900 23598 4834 -24493 -6625 12410 -4990 -16924 -344 15111 4886 -18185
491 -18185 -15704 15239 18281 -14648 -13915 18890 13125 -19434 -10783 16784 13644 -3475 -7560 -787
505 -787 6852 3800 -2206 7243 12276 -6875 -10686 14165 15130 -7942 -3365 15775 7051 -9585
$$ packed form
418b7112J493M3187L211k9233m476K1939N574k3866o195L6767J1805m7256j3644
431b7806N1072J0123n0490m434M8753K274m7157j3313L9176K4742l1368l4472
443c2900K5132L3547l0575l1124L8004K8089m0626k4950L4785K0386k4724j4287
455a9243K0758J8343j9134k6517K0389L8296j8281l8866J9560L2990k4177k4077
467a9959K7428J8873k4524j9470J3127J8545n187k1206L940K3456j1260l1164
479b7401J6501L4498j8764k9327J7868J9035j7400j1934J6580J5455j0225k3071
491a8185K481L0943L042l2929P33L2805n765l2559Q651K7567l140j7119m085O773
505g87P639l052o006R449N033j9151l811K4851R65k3072M577J9140q724j6636
$$ plain form
519 -9585 -6405 5876 12468 3684 -13924 -11965 4645 862 -10533 -3076 -1320 -15178 -12126 -131
533 -131 -7912 -13690 -1289 1872 -8147 -11579 -7194 3668 13522 2931 -10509 2161 15689 5821
547 5821 3286 14344 11078 4089 9151 8004 2896 10844 13780 2629 -1978 -675 -2055 3663 6268
562 6268 -6907 -10522 -1298 -5167 -12612 -2516 848 -9102 -8235 -3987 -9746 -5689 4966 745 -5066
577 -5066 -2031 -3176 -1872 7111 4764 -3239 3906 6149 -6029 -3817 9474 7387 -573 -1463 -4267
592 -4267 -2673 6419 3124 -5206 1679 3994 -6862 -4439 5994 3172 551 4687 -811 -6234 1973
607 1973 7266 4586 4402 -1515 -7061 3097 8349 -4110 -4382 7536 643 -11522 -4617 2501 77
622 77 1036 -269 -7185 -5176 107 337 4524 5082 -6661 -5089 8463 3689 -5863 6217 12673 -1997
$$ packed form
519i585L180J2281O592q784j7608J959J6610l783j1395P457J756j3858L052J1995
533a31p781n778J2401L161j0019l432M385J0862R854j0591j3440J2670J3528r868
547E821k535J1058l266o989N062j147n108P948K936j1151m607J303j380N718K605
562F268j3175l615R224l869p445J0096L364r950Q67M248n759M057J0655m221n811
577e066L035j145J304Q983k347q003P145K243j2178K212J3291k087p960q90k804
592d267J594R092l295q330O885K315j0856K423J0433k822k621M136n498n423Q207
607A973N293k680j84n917n546J0158N252j2459k72J1918o893j2165O905P118k424
622G7R59j305o916K009N283K30M187N58j1743J572J3552m774r552J2080O456j4670
$$ plain form
638 -1997 -6983 1637 4058 3535 3096 -2658 -3679 -1815 -6764 -5057 5903 367 -13228 -6726 1691
653 1691 -7360 -6936 4100 1987 -5434 -4138 -2200 559 8236 6096 -358 4575 5982 -1517 4248
668 4248 14143 7846 1404 3767 1148 407 7842 5999 -1917 1304 673 -8019 -4696 4599 -613 -5270
684 -5270 -2545 -6660 -9885 -1684 1336 -2411 -1486 -4482 -9326 -1717 4161 -2354 -675 5235 -3741
699 -3741 -8663 2794 6157 -1342 1854 4362 -4187 -5496 1249 4630 6107 2369 -7016 -3435 6612
714 6612 673 -4006 8511 8314 -6587 -5237 5994 4843 1898 5949 2947 -2137 -1250 -377 3578
729 3578 9414 1825 -7993 -878 3366 -4264 -1455 6843 -973 -7211 -2999 -3293 -5009 3734 3949 -5881
745 -5881 -6437 -2554 -2744 791 3884 -2009 -2598 1351 -5001 -5368 6748 6452 -3000 -1985 -91 -5305
$$ packed form
638a997m986Q620K421n23m39n754j021J864m949J707J0960n536j3595O502Q417
653A691r051M24J1036k113p421J296J938K759P677k140o454M933J407p499N765
668D248R895o297o442K363k619p41P435j843p916L221o31q692L323R295n212m657
684e270K725m115l225Q201L020l747R25k996m844P609N878o515J679N910q976
699c741m922J1457L363p499L196K508q549j309O745L381J477l738r385L581J0047
714F612n939m679J2517j97j4901J350J1231j151k945M051l002n084Q87Q73L955
729C578N836p589r818P115M244p630K809Q298p816o238M212k94j716Q743K15r830
745e881n56L883j90L535L093n893n89L949o352l67J2116k96r452J015J894n214
$$ plain form
761 -5305 147 7921 1861 -3492 -336 -1709 -2750 3770 3521 -40 2858 629 -5809 -509 6625
776 6625 3899 2570 2977 -5336 -3190 10001 7213 -3911 889 6472 -1360 -4298 1168 3972 4549
791 4549 1781 -6427 -5816 2318 1055 -1591 2805 -2576 -11187 -2745 5483 -3992 -6701 2622 1065
806 1065 -6622 -5366 -2025 836 5241 342 -7576 -3410 2061 773 4325 4314 -5142 -3025 7540
821 7540 1953 -5436 4340 9406 -42 -3246 -70 1253 5254 7025 -654 -2869 1364 47 721
836 721 6952 1678 -5422 1641 3729 -4578 -2170 5514 1118 -2737 -507 -3828 -4326 4205 4318 -3883
852 -3883 -4184 -1988 -3051 1053 1890 -3631 -1750 2036 -4443 -5702 4287 2462 -4348 1077 2172 -6704
868 -6704 -3873 5482 3534 -989 -1604 -3641 -904 4789 1429 -1657 2898 802 -4395 2015 4491
$$ packed form
761e305N452P774o060n353L156j373j041O520k49l561K898k229o438N300P134
776F625k726j329M07q313K146J3191k788j1124M800N583p832k938N466K804N77
791D549k768q208O11Q134j263k646M396n381q611Q442Q228r475k709R323j557
806A065p687J256L341K861M405m899p918M166N471j288L552j1r456K117J0565
821G540n587p389R776N066r448l204L176J323M001J771p679k215M233j317O74
836G21O231n274p100P063K088q307K408P684m396l855K230l321m98Q531J13q201
852c883l01K196j063M104Q37n521J881L786o479j259R989j825o810N425J095q876
868f704K831R355j948m523o15k037K737N693l360l086M555k096n197O410K476
$$ plain form
883 4491 -2404 426 7478 -602 -7253 1730 6306 2573 1489 -582 -3411 1157 3959 270 1653
898 1653 2466 -3362 -1135 4152 -2177 -4675 5656 5181 -6779 -5705 1670 1156 950 1164 -4396 -4789
914 -4789 400 -235 -1745 814 -1238 -3943 1127 -305 -6681 130 7364 -1530 -6349 -94 -169 -803
930 -803 4316 2459 -4505 -1715 2248 -382 1280 2911 -376 1049 3101 -2760 -2006 6566 4260 -1807
946 -1807 1576 1133 -3839 2259 8371 514 -3700 1533 1785 -475 1711 1376 517 2729 -1114 -5212
962 -5212 1448 4081 -2122 -928 2167 -5456 -6380 3386 2713 -4809 -2148 -314 -4700 -2727 218 -1697
978 -1697 61 232 -5423 -4036 1661 -553 -1370 4275 -641 -7486 610 6638 -606 -902 4679 1842
994 1842 -1666 1696 2513 3294 6039 1356 -2693 1851 4048 911 4567 5450 -3345 -2635 5054 1344
$$ packed form
883D491o895K830P052q080o651Q983M576l733j084k071k829M568K802l689J383
898A653Q13n828K227N287o329k498J0331m75j1960J074P375n14k06K14n560l93
914d789N189o35j510K559k052k705N070j432o376O811P234q894m819O255p5o34
930h03N119j857o964K790L963k630J662J631l287J425K052n861P54Q572k306o067
946a807L383m43m972O098O112p857m214N233K52k260K186l35q59K212l843m098
962e212O660K633o203J194L095p623r24R766o73p522K661J834m386J973K945j915
978a697J758J71n655J387N697k214q17N645m916o845Q096O028p244k96N581k837
994A842l508L362Q17P81K745m683m049M544K197l137L656Q83q795P10P689l710
$$ plain form
1010 1344 -2104 3256 2680 -3651 -2432 -784 -2796 793 2909 -3890 -5960 -2191 -2427 -1024 2316
1025 2316 -3557 -6648 -153 129 -6394 -1703 4606 -1654 -4581 -860 -2101 -1398 5099 3309 -2752
1040 -2752 -1072 704 761 5148 4430 -1179 1378 4954 -998 -795 7506 4789 -1086 2647 2106 -3038
1056 -3038 1772 6797 1539 -1951 -1302 -1953 89 2918 -1287 -3142 1362 -2232 -7493 -429 3006
1071 3006 -3506 -2741 415 -5308 -5910 1741 1468 -2477 -978 -2590 -4252 499 2332 -1239 1222 1715
1087 1715 -3557 -1256 5011 1440 -418 5339 2279 -4003 435 5561 2434 2416 2835 -1996 -1452 3190
1103 3190 1443 775 3234 -724 -4306 1133 1585 -2791 1526 3115 -3756 -4453 655 -1186 -1264 3202
1119 3202 -52 -6126 -2426 450 -978 961 1035 -3649 -1946 998 -2913 -1355 4746 430 -4168
$$ packed form
1010A344l448N360n76o331J219J648k012L589K116o799k070L769k36J403L340
1025B316n873l091O495K82o523M691O309o260k927L721j241P03O497j790o061
1040b752J680J776N7M387p18n609K557L576n952K03Q301k717n875L733n41n144
1056c038M810N025n258l490O49o51K042K829m205j855M504l594n261P064L435
1071C006o512P65L156n723o02P651k73l945J499j612j662M751J833l571K461M93
1087A715n272K301O267l571j858N757l060o282M438N126l127j8M19m831N44M642
1103C190j747o68K459l958l582N439M52m376M317J589o871o97N108j841p8M466
1119C202l254o074L700K876j428J939P4m684J703K944l911J558O101m316m598
$$ plain form
1134 -4168 532 554 -2905 2266 6032 -358 -2463 1269 721 1771 5471 1753 -846 3036 1144 -1955
1150 -1955 3227 4510 -869 587 2063 -3884 -2772 4762 2416 -3820 -1917 -1974 -3965 -338 482 -3608
1166 -3608 -1697 -837 -5107 -3892 1388 -1419 -2035 2157 -1708 -6262 687 4723 533 587 1962 -1535
1182 -1535 167 4171 1524 1278 5241 1974 -2348 1980 3332 871 4062 3844 -2389 -1196 3274
1197 3274 372 -751 3938 482 -4376 -745 374 -2238 735 1980 -3636 -4015 -841 -3316 -1941
1212 -1941 1768 -2067 -5808 -1145 -1990 -6249 -420 3252 -2371 -3897 -1730 -3113 -436 4600 994
1227 994 -2647 1720 1741 -631 3118 4921 2421 4486 4080 -2518 732 9091 6847 1017 1963 564
1243 564 -701 4346 4445 -1156 93 2351 -2904 -3959 -171 -1726 -1424 1565 -5095 -10742 -3020 2911
$$ packed form
1134d168M700K2l459N171L766o390k105L732n48J050L700l718k599L882j892l099
1150a955N182J283n379J456J476n947J112P534k346o236J903n7j991L627Q20m090
1166c608J911Q60m270J215N280k807o16M192l865m554O949M036m190N4J375l497
1182a535J702M004k647k46L963l267m322M328J352k461L191k18o233J193M470
1197C274k902j123M689l456m858L631J119k612K973J245n616l79L174k475J375
1212a941L709l835l741M663q45m259N829L672n623j526K167j383K677N036l606
1227I94l641M367K1k372L749J803k500K065m06o598L250Q359k244n830R46j399
1243E64j265N047R9n601J249K258n255j055L788j555L02K989o660n647P722N931
$$ plain form
1259 2911 -1349 -3545 -4124 -6693 -2492 1278 -3159 -3745 2985 329 -5485 -2340 1061 1447 4729 2867
1275 2867 -4894 -2921 4447 3624 2801 4251 -21 -2300 3305 3857 -13 4051 6360 226 -1506 1132
1291 1132 960 3904 7362 226 -4680 177 2082 -32 2622 2525 -3474 -3346 -618 -3334 -1317 2981
1307 2981 -1296 -5930 -3061 -3209 -4202 972 1487 -4575 -4301 -2126 -4588 -2074 4084 635 -4033 -1830
1323 -1830 -1553 -917 3737 3247 -1159 1352 2778 -2151 -221 6192 4031 1207 2706 -705 -2380 4190
1339 4190 6882 1734 -63 122 -1398 2641 4516 -1154 -1594 3990 511 -5255 -975 2108 780
1354 780 1241 -1009 -6825 -3455 3311 253 -2963 -1023 -2742 -3362 56 -1275 -4268 637 2227 -3813
1370 -3813 -4123 -700 -771 1396 4055 -2470 -5685 1477 4108 -483 643 2218 -58 940 1952 -1484
$$ packed form
1259B911m260k196n79k569M201L770m437n86O730k656n814L145L401L86L282j862
1275B867p761J973P368q23q23J450m272k279N605N52l870M064K309o134j732K638
1291A132j72K944L458p136m906M857J905k114K654r7n999J28K728k716K017M298
1307B981m277m634K869j48r93N174N15o062K74K175k462K514O158l449m668K203
1323a830K77O36M654m90m406K511J426m929J930O413k161k824J499l411j675O570
1339D190K692n148j797J85j520M039J875n670m40N584l479n766M280L083j328
1354G80M61k250n816L370O766l058l216J940j719o20L418j331k993M905J590o040
1370c813l10L423p1K167K659o525l215P162K631m591J126J575k276R98J012l436
$$ plain form
1386 -1484 899 5568 1998 -1336 605 -212 -957 4851 3971 -3324 -1506 2678 -444 -1255 2677 1064
1402 1064 -1342 579 -1400 -2788 1640 2324 -1223 -8 -615 -5047 -904 4895 -11 -3223 909
1417 909 -569 -3562 608 1880 -931 11 601 -3279 -2004 2013 -149 -52 2409 -2171 -4575 845
1433 845 2179 -1054 1163 789 -4347 -1758 3511 110 -1525 2681 694 -2497 -163 1138 590 3821
1449 3821 2552 -3101 -913 2552 260 1521 4840 -556 -3218 2426 2683 -1543 1749 3742 -1064
1464 -1064 -1541 82 -1763 278 3148 -516 -3333 -697 -1946 -2298 2743 616 -5045 -2376 1319
1479 1319 -3152 -3306 2236 154 -2783 -1256 -1674 -2607 1706 1819 -1431 -126 310 -2455 1149 4466
1495 4466 -82 -825 3148 778 -2341 2673 4126 -295 1030 2610 -1459 -916 2739 1731 441
$$ packed form
1386a484K383M669l570l334J941q17p45N808q80p295J818M184l122q11L932j613
1402A064k406J921j979j388M428O84l547J215o07m432M143N799m906l212M132
1417I09j478k993M170J272k811R42N90l880J275M017k162R7K461m580k404N420
1433H45J334l233K217l74n136K589N269l401j635M206j987l191K334J301n48L231
1449C821j269n653K188L465k292J261L319n396k662N644K57m226L292J993m806
1464a064m77J623j845K041K870l664k817K636j249l52N041k127n661K669L695
1479A319m471j54N542k082k937J527m18r33M313J13l250J305M36k765L604L317
1495D466m548p43L973k370l119N014J453m421J325J580m069N43L655j008j290
$$ plain form
1510 441 999 -1845 -2403 2465 626 -2495 1130 1617 -3908 -1924 2377 -1306 -1505 2078 -859 -3949
1526 -3949 131 1559 -416 801 937 -1780 106 1447 -1294 642 3610 -1417 -3207 1941 484
1541 484 -3453 824 2560 -2928 -3034 314 -810 -1212 553 -1519 -2063 638 -1018 -2175 2272 1445
1557 1445 -2533 831 1920 -1860 423 5177 918 -2154 2430 2356 -264 2303 2654 237 1129 1356
1573 1356 -1083 1103 2943 -1394 -712 2657 -1490 -3781 2497 2544 -3283 -1711 1045 -2096 -1727 995
1589 995 -1068 -2377 405 -1428 -2783 -204 -845 -1964 1002 -968 -5256 -820 3005 -2136 -3101 1685
1605 1685 -340 -2344 1175 1644 -1203 1233 2833 729 948 2348 1822 3630 4727 109 -166 5327
1621 5327 3708 -878 2415 2452 -1431 15 2625 -2014 -3095 821 -513 -3719 -2801 -2994 -2795 267
$$ packed form
1510D41N58k844n58M868j839l121L625M87n525J984M301l683j99L583k937l090
1526c949M080J428j975J217J36k717J886J341k741J936K968n027j790N148j457
1541D84l937M277J736n488j06L348j124m02J765k072n44K701j656j157M447q27
1557A445l978L364J089l780K283M754m259l072M584p4k620K567L51k417Q92K27
1573A356k439K186J840m337O82L369m147k291O278M7n827J572K756l141L69K722
1589I95k063j309K782j833j355K579o41j119K966j970m288M436L825n141r65M786
1605A685k025k004L519M69k847K436J600k104K19J400n26J808J097m618k75N493
1621E327j619m586L293L7l883J446K610m639j081L916j334l206R18j93J99L062
$$ plain form
1637 267 -2415 -5545 -1627 187 -3541 -2004 1766 -1697 -2372 2957 1571 -1962 1629 4085 944
1652 944 997 2161 680 2712 3421 -106 186 2782 -148 -1531 2585 800 -4198 -82 2162 -3049
1668 -3049 -3104 1169 -812 -1827 78 -794 -1792 714 521 -602 1374 527 -1882 1818 3552 -1814
1684 -1814 -1521 3743 838 -1940 1702 1288 -2224 492 2559 -1561 -1827 872 465 510 321 -2538 -555
1701 -555 3804 623 -2882 1097 2425 -1085 624 2107 -2065 -1069 3119 278 -3588 -1347 336
1716 336 -739 -367 -2716 -4117 56 941 -3653 -3006 275 -1976 -1076 2111 -1360 -3339 3178 4460
1732 4460 -1128 -732 3250 3580 3016 2610 490 1999 4882 2373 -65 2114 989 -839 2525 1249
1748 1249 -4224 -2030 2630 -1676 -5157 -1502 -838 -2037 -1242 -2687 -3779 -678 346 -2509 -1042
$$ packed form
1637B67k682l130L918J814l728J537L770l463o75N329j386l533L591K456l141
1652I44N3J164j481K032P09l527K92K596k930j383M116j785m998M116K244n211
1668c049n5M273j981j015J905q72r98K506j93j123J976q47k409L700J734n366
1684a814K93N264k905k778L642m14l512K716K067m120k66K699m07M5j89k859J983
1701e55M359l181l505L979J328l510J709J483m172R96M188k841l866K241J683
1716C36j075L72k349j401M173Q85m594O47L281k251R00L187l471j979O517J282
1732D460n588L96L982L30n64m06k120J509K883k509k438K179j125j828L364j276
1748A249n473K194M660m306l481L655O64j199P95j445j092L101J024k855J467
$$ plain form
1763 -1042 259 -1863 667 3087 -1120 -1634 3902 2585 -2110 462 3251 -110 74 1787 -175
1778 -175 -581 998 -358 -336 1643 -1100 -2204 1979 854 -2762 705 2763 -1814 -1231 2835 712
1794 712 -1182 1916 1794 -575 773 943 -520 1525 2013 -1471 -846 776 -1674 -681 1943 -2214
1810 -2214 -3763 1705 910 -4017 -1888 2244 -347 -1561 -532 -1228 212 2141 -235 -1763 1364
1825 1364 749 -929 2079 1261 -2330 650 2695 -1365 -2398 2004 1138 -1617 76 -379 -1932 679
1841 679 1871 -1021 -619 580 -616 859 1480 -1788 -845 4079 884 -3054 1278 3819 183 -172
1857 -172 1373 -473 26 2248 25 -954 817 -170 -1365 1139 -439 -2273 912 1282 -2997 -1609
1873 -1609 1545 -900 -2104 963 -407 -2759 438 1411 -1348 -658 708 -645 -164 278 -1615 -72
$$ packed form
1763a042J301k122K530K420m207n14N536j317m695K572K789l361J84J713j962
1778a75m06J579j356K2J979k743j104M183j125l616L467K058m577N83M066k123
1794G12j894L098j22k369J348J70j463K045M88l484O25J622k450R93K624m157
1810b214j549N468p95m927K129M132k591j214J029o96J440J929k376j528L127
1825A364o15j678L008q18l591K980K045m060j033M402q66k755J693m55j553K611
1841F79J192k892M02J199j196J475O21l268R43M924l195l938M332K541l636l55
1857a72J545j846M99K222k223r79J771r87j195K504j578j834L185L70m279J388
1873a609L154k445j204L067j370k352L197R73k759O90J366j353M81M42j893J543
$$ plain form
1889 -72 2360 -807 -2560 2050 1238 -2304 244 1760 -1241 -933 1915 -376 -492 1330 491 -1221
1905 -1221 1387 741 -1085 1801 1174 -1604 793 2470 -807 -533 2931 266 -1514 1728 1466 -1858
1921 -1858 251 1479 -894 -582 438 -1088 -145 1127 -1780 -1402 1514 -943 -3068 358 597 -2857
1937 -2857 -1117 1044 -2252 -2052 821 -876 -1608 549 -177 -1242 401 223 -1076 1247 1938 -1297
1953 -1297 421 2854 44 182 3331 1669 -1112 1644 2436 -233 1028 2486 -44 359 1267 -821
1969 -821 -216 1971 -659 -1627 774 -465 -2919 -7 714 -2624 -1558 744 -2114 -1990 913 -440
1985 -440 -2221 -28 -217 -1784 168 1117 -1307 -58 1088 -1359 -543 2663 200 -1265 1843 565
2001 565 -1824 694 2358 -487 294 1108 -1035 -410 1913 -84 -540 1313 -137 -1801 802 1043
$$ packed form
1889g2K432l167j753M610q12l542K548J516l001L08K848k291j16J822q39j712
1905a221K608o46j826K886o27k778K397J677l277K74L464k665j780L242k62l324
1921a858K109J228k373L12J020j526R43J272k907L78K916k457k125L426K39l454
1937b857J740K161l296K00K873j697p32K157p26j065J643j78j299K323O91l235
1953a297J718K433k810J38L149j662k781K756P92k669J261J458k530M03R08k088
1969h21O05K187k630r68K401j239k454K912P21l338J066K302k858J24K903j353
1985d40j781K193j89j567J952R49k424J249J146k447Q16L206k463j465L108j278
2001E65k389K518J664k845P81Q14k143O25K323j997m56J853j450j664K603K41
$$ plain form
2017 1043 -1686 359 1551 -1770 -1734 1586 168 -913 1340 -41 -1681 1231 1053 -346 856 1219
2033 1219 -1175 -3 2062 -526 -365 2138 79 -1903 766 994 -1169 629 900 -1943 -1112 1083
2049 1083 -873 -1631 817 -991 -2123 42 -297 -2379 252 641 -2221 -833 760 -908 -952 1397
2065 1397 -394 -1455 1102 950 -858 1423 1937 -599 1236 2006 -347 265 3014 966 -410 2023
2081 2023 1227 -513 1851 1975 -1012 401 1358 -878 -527 1461 -646 -1610 532 -681 -2574 -197
2097 -197 -309 -2804 -1387 -165 -2433 -1695 194 -1705 -1877 554 -570 -1785 795 414 -1548 751
2113 751 2066 -455 386 2415 867 295 2422 1299 -317 2262 1796 -375 1049 1704 -896 -68
2129 -68 1536 -1216 -1590 1133 -910 -2055 159 -217 -2434 82 208 -1975 -494 1228 -1180 -829
$$ packed form
2017A043k729K045J192l321L6L320j418j081K253j381j640K912j78j399J202L63
2033A219k394J172K065k588J61K503k059j982K669K28k163J798K71k843Q31K195
2049A083j956p58K448j808j132K165l39k082K631L89k862J388J593j668m4K349
2065A397j791j061K557j52j808K281N14k536J835P70k353O12K749k048j376K433
2081B023p96j740K364J24k987J413R57k236L51J988k107r64K142j213j893K377
2097a97j12k495J417J222k268P38J889j899j72K431j124j215K580l81j962K299
2113G51J315k521Q41K029j548n72K127j123j616K579m66k171J424O55k600Q28
2129f8J604k752l74K723k043j145K214l76k217K516J26k183J481J722k408L51
$$ plain form
2145 -829 1647 99 -335 1617 966 -633 1330 1372 -591 781 1968 -895 -473 1499 -155 -1923
2161 -1923 752 -188 -2121 -401 -252 -2431 -791 135 -1790 -1141 286 -1750 -1626 1323 85 -1823
2177 -1823 1047 1240 -692 576 1387 -224 521 2081 185 -339 1879 884 -12 1848 635 -981
2193 -981 1661 1621 -652 114 2803 363 -548 1637 869 -423 1517 839 -927 191 821 -875 -203
2210 -203 102 -1853 -1414 836 -1820 -3453 -512 -1519 -3771 -2032 -1137 -3053 -1841 -180 -2126 -2050
2226 -2050 173 -773 -904 807 240 207 2505 2188 308 2311 4260 1506 1761 3736 2118 1267 3463
2243 3463 2356 -170 1500 1798 -147 258 542 -1013 -348 -174 -2767 -2362 210 -1296 -3201 -437
2259 -437 -779 -3160 -1163 517 -2009 -1864 817 -831 -1244 -96 -6 -609 755 -587 -1433 953 681
$$ packed form
2145h29K476j548m34J952o51j599J963M2j963J372J187k863M22J972j654j768
2161a923K675r40j933J720J49k179J640R26j925O49J427k036J24K949j238j908
2177a823K870J93j932J268Q11j611P45J560j896n24K218r95q96J860j213j616
2193i81K642m0k273P66K689k440r11K185p68j292J940o78j766J118O30j696O72
2210b03L05j955M39K250k656j633K941j007k252J739Q95j916J212J661j946P6
2226b050K223r46j31J711n67l3K298l17j880K003J949k754K55J975j618q51K196
2243C463j107k526J670K98j945M05K84j555O65J74k593M05K572j506j905K764
2259d37l42k381J997J680k526J45K681j648m13J148R0o03J364j342q46K386k72
$$ plain form
2276 681 -1487 50 1835 -675 -877 1380 241 -930 1675 1420 -885 603 1230 363 1046 1934 286
2293 286 894 2452 227 227 2536 1257 -1024 890 1180 -1355 -75 1317 -1121 -1900 170 -399 -1833
2310 -1833 -861 -1123 -1895 -108 -1260 -2361 34 383 -2412 -1100 1110 -848 -1468 1640 820 -1479
2326 -1479 747 1629 -440 164 893 137 118 835 -831 -66 1760 -199 -1310 1346 335 -1870 688
2343 688 1702 -1254 -793 1804 88 -954 847 1011 241 747 199 -550 1223 870 -901 767 1445
2360 1445 -1457 -574 2013 -318 -2184 660 748 -2079 -604 449 -999 -924 0 -1136 -849 512 -836
2377 -836 -899 1940 -249 -1253 1481 1118 -1456 1025 2272 -561 -1022 1542 665 -887 838 820 -61
2394 -61 368 -34 -821 594 534 -1564 105 1146 -1345 -1703 1805 175 -2232 472 716 -1028 -357
$$ packed form
2276F81k168J537J785k510k02K257j139j171K605k55k305J488O27q67O83Q88j648
2293B86O08J558k225%K309j279k281J914K90k535J280J392k438p79K070n69j434
2310a833R72k62p72J787j152j101K395L49k795J312K210j958o20L108q20k299
2326a479K226Q82k069O04P29p56j9P17j666P65J826j959j111K656j011k205K558
2343F88J014k956M61K597j716j042J801J64p70N06n48p49J773l53j771J668O78
2360A445k902Q83K587k331j866K844Q8k827J475J053j448P5R24j136K87J361j348
2377h36o3K839k189j004K734l63k574K481J247k833m61K564q77j552J725j8q81
2394f1M29m02p87J415o0k098J669J041k491l58L508j630k407K704K44j744O71
$$ plain form
2411 -357 1227 -314 -109 511 -435 -208 917 101 -278 1428 35 -1893 1086 1900 -1206 -364 1596
2428 1596 -285 -1201 1311 669 -648 511 489 -738 -72 -75 -599 780 561 -2302 -640 1640 -939
2445 -939 -1708 865 422 -2380 -450 623 -834 -434 649 -605 -1261 184 -351 124 1034 -520 -1106
2462 -1106 1243 904 -1367 890 1622 -660 -302 1784 -270 -1170 1726 1455 -430 -488 -141 95 1217
2479 1217 753 -1193 122 1502 -1181 -956 1768 -85 -1445 751 484 -1922 -98 1776 -484 -1189
2495 -1189 294 -435 -622 608 -305 -832 284 -938 -1584 639 403 -1765 231 1304 -1417 -1553 1540
2512 1540 486 -1331 352 885 -655 -9 702 -129 869 707 -1124 139 1762 -271 -631 2230 474
2529 474 -1397 997 1651 -1093 289 2189 -185 -1193 902 747 40 498 -184 -585 1084 343 -1565
$$ packed form
2411c57J584j541K05O20r46K27J125q16l79J706j393j928K979Q14l106Q42J960
2428A596j881r16K512o42j317J159k2j227O66ln24J379k19k863J662K280k579
2445i39p69K573m43k802J930J073j457M00J083j254o56J445n35M75R10j554n86
2462a106K349l39k271K257P32k282L58K086k054r00K896k71j885n8L47K36J122
2479A217m64j946J315J380k683K25K724j853j360K196k67k406J824J874k260p05
2495a189J483p29j87J230r13n27J116j222o46K223k36k168J996J073k721j36L093
2512A540j054j817J683N33j540O46P11q31R98j62j831J263J623k033l60K861j756
2529D74j871K394O54k744J382J900k374j008K095j55p07M58o82m01J669p41j908
$$ plain form
2546 -1565 478 983 -1740 -697 898 -1505 -2040 1218 489 -2486 -1144 163 -755 -464 -483 -1420 -218
2563 -218 543 -1272 -755 1293 -221 -818 1530 349 -1580 1133 2957 -89 -370 1543 1167 217 1413
2580 1413 544 124 1627 725 -353 1227 775 -782 1092 1272 -1586 -1292 1803 -283 -1857 258
2596 258 321 -1859 -615 26 -1246 -515 -217 -1282 -724 81 -995 -637 1295 -222 -1879 620 840
2613 840 -1352 -195 1560 -626 -679 1423 328 -501 952 651 -182 895 518 -419 1135 1415 -1142
2630 -1142 318 1575 -1051 -907 1862 653 -1572 388 1163 -823 -467 371 -209 -19 985 -656
2646 -656 -305 1512 -74 -556 1134 -45 -1240 1208 1543 -1415 -647 1645 -577 -1176 692 246 -648
2663 -648 661 296 -1166 57 1 -977 588 645 -1827 -822 1216 -710 -1830 778 704 -1400 -88
$$ packed form
2546a565K043N05k723J043J595k403n35L258p29k975J342J307r18K91j9r37J202
2563b18P61j815N17K048j514n97K348j181j929K713J824l046k81J913l76r50J196
2580A413q69m20J503r02j078J580m52j557J874J80k858K94L095k086j574K115
2596B58O3k180J244O41j272P31K98j065N58Q05j076L58J932j517j657K499K20
2613H40k192J157J755k186n3K102j095q29J453l01q33J077l77r37J554K80k557
2630a142J460J257k626J44K769j209k225J960P75j986L56Q38n80J90J004j641
2646f56L51J817j586m82J690j179j195K448L35k958P68K292k222n99J868m46q94
2663f48J309l65j462J223n6r78J565N7k472J005K038j926j120K608p4k104J312
$$ plain form
2680 -88 619 -897 29 1103 -554 -535 664 -365 -237 1320 -165 -754 1278 979 -1069 1031 1778
2697 1778 -533 140 2175 -75 -747 1381 1278 -214 377 568 -512 828 747 -936 20 873 -1273
2714 -1273 -1122 578 -675 -2096 216 -6 -2404 -938 671 -1089 -1034 -99 -1271 -1347 406 -401 -950
2731 -950 581 41 -915 844 1004 -1062 603 2085 -533 -464 1656 1065 -38 1269 1165 -444 814
2748 814 894 -419 739 981 -581 -126 1227 -352 -856 1786 395 -1661 401 836 -1106 53 1041
2765 1041 -482 -510 741 -464 -759 655 -68 -1061 310 -362 -2000 -13 838 -1450 -861 833 -1075
2782 -1075 -1348 888 178 -1017 247 548 -656 288 942 -349 213 961 -534 -484 1458 180 -460
2799 -460 1647 1105 -1033 679 1254 -451 268 1704 -234 -460 1073 -185 -113 1239 106 -1216 798
$$ packed form
2680h8P07j516R26J074j657J9J199j029J28J557j485n89K032k99k048K100P47
2697A778k311O73K035k250o72K128j03j492N91J91j080J340q1j683R56Q53k146
2714a273J51J700j253j421K312k22k398J466J609j760N5R35j172p6J753q07n49
2731i50J531n40r56J759J60k066J665J482k618O9K120n91j103J307j04j609J258
2748H14Q0j313J158K42j562M55J353j579n04K642j391k056K062M35j942J159R88
2765A041j523k8J251j205k95J414p23r93J371o72j638J987Q51k288N89J694j908
2782a075k73K236p10j195J264L01j204R44O54j291N62P48j495N0J942j278o40
2799d60K107n42k138J712N75j705P19J436j938k26J533j258P2J352j133j322K014
$$ plain form
2816 798 731 -1038 346 1221 -1077 -1004 836 -252 -1188 1226 335 -1534 -283 -5 -1179 -114 628
2833 628 -1146 -703 399 -1153 -1041 868 -17 -1070 283 291 -1691 240 1117 -371 -138 887 -378
2850 -378 -420 1323 537 -574 962 826 -847 748 1558 -44 456 1150 -364 -536 1517 477 -397
2867 -397 968 100 -1253 -8 871 -790 -76 508 -962 -932 936 -188 -1190 565 291 -1894 -99
2884 -99 422 -862 -179 793 -1392 -1332 816 23 -880 864 -220 -1333 330 501 -964 104 1159
2901 1159 -926 -655 684 -349 -268 1940 416 -1588 393 743 -169 574 871 -782 175 1323 22
2918 22 -524 1403 814 -398 842 87 -956 720 1286 -929 -463 720 -278 -320 1121 -380 -1296 722
2936 722 203 -1432 53 496 -943 -657 349 -1307 -853 1008 -134 -1331 -139 161 -968 330
$$ packed form
2816G98o7j769J384Q75k298P3J840j088r36K414q91j869J251K78j174J065P42
2833F28j774M43J102j552J12J909q85j053J353Qj982J931Q77j488K33J025j265
2850c78m2J743p86j111J536j36j673J595Q10j602N00O94j514j72K053j040q74
2867c97J365q68j353J245Q79j661P14N84j470L0J868j124j002J755k74k185J795
2884i9N21j284O83R72k185O0K148p93r03J744j084j113J663J71j465J068J055
2901A159k085K71J339j033Q1K208j524k004J981L50r12P43K97j653R57J148j301
2918B2n46J927n89j212J240p55j043J676N66k215M66J183r98m2J441j501r16K018
2936G22n19j635J485M43j439K86J006j656M54J861j142j197J192L00j129J298
$$ plain form
2952 330 424 -1028 90 977 -1169 -914 1032 207 -644 803 -3 -836 385 1014 -627 -300 900 -377
2970 -377 -334 1386 -388 -140 1383 352 -575 644 672 -782 481 1321 -445 -695 669 -240 -448 1084
2988 1084 160 -1201 -14 162 -1187 115 700 -1208 -556 773 -828 -1340 1031 -43 -1257 -328
3004 -328 -2 -1222 -113 972 -1100 -697 330 -446 -622 770 -14 -643 1172 248 -1073 425 1749
3021 1749 -203 -244 699 -263 63 1606 423 -536 668 749 -428 533 799 -460 1224 1392 -1062 -816
3039 -816 1421 684 -667 741 -227 -1541 360 747 -537 -383 546 -606 -725 477 -668 -507 1132
3056 1132 -599 -2113 45 572 -868 -60 1004 -1198 -849 794 -431 -972 573 93 -802 -59 278
3073 278 -411 483 815 -664 -158 1199 -115 -253 1591 134 -1186 647 807 -294 508 1107 -43
$$ packed form
2952C30R4j452J118Q87k146K55J946q25q51J447q06q33J221O29j641L27J200j277
2970c77M3J720j774K48J523j031r27J219K8j454J263Q40j766k50J364r09k08J532
2988A084r24j361J187J76j349J302N85j908O52J329j601n12K371j074j214R29
3004c28L26j220J109J085k072M03J027p76j76J392p84o29J815r24j321J498J324
3021A749j952m1R43r62L26J543j183r59J204Q1j177R61K66j259J684J68k454K46
3039h16K237p37j351J408r68j314J901L87j284J54R29j152j19J202j145J61J639
3056A132j731j514K158N27j440Q08J064k202L49J643j225n41J545m80q95P43L37
3073B78o89Q94L32j479N06J357j314j38J844j457j320J833J60j101Q02N99j150
$$ plain form
3090 -43 -367 537 -357 33 1169 -13 -549 695 -68 -924 1242 924 -1284 -868 885 -750 -781 1066
3108 1066 22 -1140 -204 244 -740 -78 118 -742 73 -14 -1403 -760 1229 -503 -1340 500 -88 -1294
3126 -1294 378 896 -657 -416 886 -240 -704 411 33 3 1012 -279 -619 1275 794 -569 592
3143 592 1228 -781 -26 1553 314 -752 1031 623 -835 113 450 -239 482 509 -957 215 629 -888
3161 -888 -735 797 -517 -1327 564 361 -1588 -100 916 -1003 -1074 237 -335 -229 458 -327 -667 60
3179 60 -802 -940 667 703 -1064 22 1178 -562 -670 1450 382 -1004 745 408 -309 371 808 -261
3197 -261 609 603 -591 309 1370 -312 -400 902 118 -1315 566 1099 -1112 -362 707 -664 -727 622
3215 622 154 -765 149 -717 -678 514 -128 -825 351 747 -1452 -466 829 -551 -847 579 112 -1590
$$ packed form
3090d3l24R04q94L90J136j182n36J244p63q56K166l18k208M16J753j635l1J847
3108A066j044j162R36M48r84O62J96q60Q15q7j389O43J989j732q37J840n88j206
3126a294J672N18j553K41J302j126m64J115l78l0J009j291l40J894m81j363J161
3143E92O36k009P55J579j239j066J783m08j458R48L37o89P21K7j466J172M14j517
3161h88J53J532j314q10J891k03j949J488J016j919p1J311n72J06O87p85l40P27
3179F0q62j38J607L6j767J086J156j740j08K120j068j386J749l37p17O80M37j069
3197b61Q70oj194R00J061j682q8J302p84j433J881N33k211P50J069j371o3J349
3215F22m68r19R14q66L9J192o42o97J176L96k199R86J295j380k96J426m67j702
$$ plain form
3233 -1590 85 557 -410 -268 124 -430 -140 563 -293 204 1070 -289 -873 1217 661 -1077 773 1498
3251 1498 -585 -514 1325 104 -377 868 408 -484 669 173 -686 750 681 -1091 225 879 -840
3268 -840 -316 1549 -249 -1201 506 307 -1037 23 986 -454 -680 281 -698 -231 492 -459 -365 670
3286 670 -735 -1432 858 762 -1441 -178 1054 -509 -966 689 59 -621 382 161 -548 577 390
3303 390 -125 903 868 -836 251 1302 -639 -703 1778 421 -1009 345 735 -440 -237 674 -350
3320 -350 -612 219 -589 -73 570 -495 -570 845 -38 -977 436 738 -1353 -348 1211 -224 -569 830
3338 830 330 -618 84 460 -115 325 -80 -998 239 494 -951 -613 828 -667 -1009 566 258 -1494
3356 -1494 304 780 -627 -349 586 -528 -193 492 -142 -80 821 -72 -90 1088 433 -506 526 1357 -600
$$ packed form
3233a590J675M72r67J42L92n54K90P03q56M97Q66j359n84K090n56j738J850P25
3251A498k083P1J839j221m81J245m60q92J153m96q59J436o9j772J316O54j719
3268h40N24J865j798r52J707j99j344J060R63j440k26R61r79M67P23r51R4J035
3286F70j405o97K290r6k203J263J232j563m57J655o30o80J003k21p09J125j87
3303C90n15J028l5j704J087J051j941o4K481j357j430J354L90j175K03R11j024
3320c50k62Q31q08N16O43j065p5J415q83r39J413L02k091J005J559j435l45J399
3338H30n00r48P02L76n75M40m05r18J237K55j445L38J441j495l42J575l08j752
3356a494J798M76j407K78R35j114L35O85o34O2R01q93j8J178o55r39J032Q31j957
$$ plain form
3375 -600 -733 1386 13 -581 615 258 -590 328 246 -529 166 374 -577 186 841 -715 -560 1064 -127
3394 -127 -1373 703 430 -840 106 569 -807 -711 121 -301 -491 -368 -673 -651 708 -320 -1408 506
3412 506 320 -1318 -349 962 -430 -292 1036 433 -902 280 1116 178 440 854 -26 804 985 -111
3430 -111 485 1113 48 -350 1056 371 -895 943 714 -1032 -234 875 -335 -578 324 -342 -792 28
3448 28 -474 -899 673 -311 -1485 -43 392 -1363 -866 841 -755 -1365 445 35 -907 285 205 -700
3466 -700 -176 260 59 -35 677 -363 -293 865 -300 -314 1368 807 -790 554 1160 -585 90 1499
3484 1499 593 -267 814 238 233 832 226 -204 386 406 -1054 -91 805 -586 -644 634 -606 -1224 475
3503 475 138 -1103 -582 -356 -802 -361 81 -826 -452 215 -1122 -861 551 -363 -798 451 431 -1094 -45
$$ packed form
3375f00j33K119j373n94J196l57q48R18q2p75O95K08r51P63O55j556J55J624j191
3394a27j246K076k73j270R46M63j376R6Q32m22j90J23l05K2J359j028j088J914
3412E06j86j638R69J311j392J38J328o03j335J182Q36r38K62M14q80Q30J81j096
3430a11N96O28j065l98J406o85j266J838k29j746P98J109j210k43R02o66m50Q20
3448B8n02m25J572r84j174J442M35j755M97J707j596o10J810m10r42J192q0r05
3466g00N24M36k01r4P12j040P0J158j165j4J682n61j597J344O06j745O75J409
3484A499r06q60J081n76nN99o06m30N90K0j460R63Q96j391n8J278j240o18J699
3503D75l37j241N21K26m46M41M42r07L74O67j337K61J412r14m35J249k0j525J049
$$ plain form
3522 -45 940 -314 -253 651 236 -319 462 464 -287 750 577 -358 575 813 -138 358 1027 -306 -366 1057
3542 1057 383 -740 464 645 -787 64 219 -892 -120 577 -652 -466 336 -583 -585 521 -118 -1126
3560 -1126 23 372 -1015 -521 950 -275 -523 634 -127 -810 405 354 -451 269 -45 -607 566 833
3578 833 -546 -481 905 -173 -746 987 561 -624 322 945 -281 212 818 -286 250 698 -496 -77
3596 -77 749 37 -654 703 194 -608 2 769 -500 -208 796 -332 -977 554 135 -349 490 -53 -668
3615 -668 -70 495 -509 42 624 -758 -814 664 -127 -913 339 307 -958 -234 345 -962 -284 570 -303
3634 -303 -452 393 -318 -70 721 306 -641 793 615 -528 366 1359 75 -246 881 -114 -331 823
3652 823 241 -159 300 629 -505 434 540 -469 -254 564 -520 -748 525 106 -962 364 248 -894
$$ packed form
3522d5R85j254O1R04m15n55P81Kp51J037j73r35R33K38r51M96O69j333o0J423
3542A057o74j123J204J81j432Q51J55j111P72O97j229J86Q02r19kJ106o39j008
3560a126J149L49j387M94J471j225k48J157p61o83J215n1q05P20l14n62J173K67
3578H33j379O5J386j078n73J733m26j185R46O23j226M93O06j104N36M48j194M19
3596g7Q26p12o91J357n09q02O10P67j269K92J004j128o45J531m19m84Q39n43o15
3615f68N98N65j004N51N82j382n6J478p91p86J252l2j265P24N79j307O78Q54q73
3634c03j49Q45p11K48P91m15r47J434j78j143Q94R93j284l21J127r95k17J154
3652H23n82m00M59L29j134R39J06j009K15Q18j084k28J273m19j068J326j16j142
$$ plain form
3670 -894 -378 517 -503 -453 158 -581 -279 611 19 -470 615 -74 -798 272 646 -592 -50 635 -172
3689 -172 -563 465 -24 -824 230 352 -524 149 762 -436 80 535 -130 -368 898 -57 -454 659
3707 659 17 -620 365 632 -559 21 700 -261 -268 796 16 -225 788 311 -939 192 485 -745 155
3726 155 766 -437 -263 346 -381 -656 224 153 -524 -71 46 -968 42 361 -618 -426 340 -441 -711
3745 -711 295 -238 -939 -120 184 -489 -43 677 -162 -73 775 -102 -300 805 67 -288 783 812 -373
3764 -373 349 945 9 383 762 -198 32 731 413 -408 198 171 -506 445 733 -859 -210 704 -487 -972
3784 -972 366 -169 -833 42 -358 -893 -72 73 -867 -87 227 -829 -592 650 -296 -439 624 87 -655
3803 -655 526 738 -311 197 1277 42 -330 622 177 -28 693 335 -555 590 527 -748 304 642
$$ packed form
3670h94N16Q95j020N0O11p39L02Q90n92m89J085o89p24J070L74j238N42O85q07
3689a72l91J028m89q00J054J22q76O73O13j198N16M55o65k38J266r55l97J113
3707F59o42o37R85K67j191N80O79r61pJ064p80k41J013m77j250J131K93j230R00
3726A55O11j203J74O09p27k75Q80p1o77M53J17j014J010L19r79J92P66p81k70
3745g11J006n33p01Q19L04o73M46P20q39Q9Q48q77j98J105p38l55J071K9j185
3764c73P22N96r36L74L79r60K30O99l18q21O06k7o77R51K88j592O49R14j191m85
3784i72J338n35o64Q75m00n35Q21J45r40P80L14j056K37J242r46j43J063n37p42
3803f55J181K12j049N08J080j235l72R52m45k05P21l58q90J145o3j275J052L38
$$ plain form
3821 642 -532 -477 492 -285 -602 464 228 -488 99 119 -463 361 319 -240 -76 254 -623 -400 953 -173
3841 -173 -587 543 245 -966 74 276 -532 -390 466 -445 -423 276 -472 -843 169 8 -268 223 194
3860 194 -613 108 562 -563 -208 870 26 -635 466 359 -183 388 696 -14 141 641 -347 142 737
3879 737 -329 -279 834 104 -371 163 636 -562 -109 517 -315 -325 722 238 -232 610 -210 -457 613
3898 613 301 -441 266 331 -686 -408 799 -517 -690 395 -509 -941 -254 -35 -834 -92 140 -283 -180
3917 -180 639 -312 174 1049 -210 -375 830 517 -624 126 1054 -508 -173 1124 297 -276 538 394
3935 394 -453 207 235 -183 494 311 -717 388 630 -602 -122 877 166 -607 202 504 -635 145 635
3954 635 -557 -383 220 -303 -262 360 -479 -466 791 -231 -1048 77 298 -748 121 360 -715 -371 708
$$ packed form
3821F42j174N5R69p77l17J066k36p16N87K0n82Q24m2n59J64L30q77K23J353j126
3841a73m14J130k98j211J040K02q08J42Q56r11K2O99p48l71J012j61k76M91k9
3860A94q07P21M54j125L55J078q44o61J101j07n42N71L08p10J55N00r88M89N95
3879G37j066N0J113p30m75N34M73j198M53O26q32j0J047m84m70Q42q20k47J070
3898F13l12p42P07O5j017K78J207j316j73J085r04m32O87K19p99P42K32m23J03
3917a80Q19r51M86Q75j259j65J205l13j141P50R28j562L35J297q27n73Q14j44
3935C94q47O60K8m18O77j83j028J105K42j232M80R99p11p73Q09L02j139P80M90
3954F35j192J74O03n23M1O22q39J3J257j022q17J125K21j046Q69K39j075L44J079
$$ plain form
3973 708 -174 -480 464 344 -545 95 328 -85 636 485 -483 396 843 94 -249 951 129 -453 406 900
3993 900 -370 341 508 -496 90 657 -65 -83 69 -146 -558 714 175 -810 393 341 -813 -310 580
4012 580 -500 -610 175 -249 -633 -240 151 -406 -78 30 -880 460 218 -843 -196 662 -17 -763 593
4031 593 84 -789 226 677 -372 -153 530 -359 18 506 106 -143 574 -132 -162 952 642 -830 129
4050 129 608 -400 -258 984 79 -127 307 442 -362 212 178 -88 187 -190 -371 15 567 -638 -296
4069 -296 575 -427 -978 410 380 -720 -464 214 -752 -706 471 126 -368 228 -228 -263 636 -44 -317 556
4089 556 131 -856 121 932 -320 -174 775 258 -413 460 426 -261 359 349 -164 -120 540 -212 86 699 -147
4110 -147 -520 910 218 -631 681 923 -825 -245 432 -82 -90 404 -329 -121 132 -318 -516 322 -489 -796
$$ packed form
3973G08q82l06R44j20q89O40K33m13P21j51r68Q79M47p49l43J200q22n82Q59M94
3993I00j270P11J67j004N86N67p22j8J52k15m12J272n39r85J203n2j154N03Q90
4012E80j080j10P85m24l84L93L91n57L28J08r10J340k42j061O47Q58o79p46J356
4031E93n09q73J015M51j049K19O83q89L77M88m00k49P17p06l0J114l10j472R59
4050A29M79j008J42J242r05k06M34J35q04N74l4k66K75l77j81L86N52j205L42
4069b96Q71j002n51J388l0j100K56O78r66M6J177l45m94N96m56l5Q99o80k73Q73
4089E56m25r87R77Q11j252J46R49n17o71Q73l4o87O20j0n13M4O60p52K98O13q46
4110a47l73J430o92q49J312K42j748N80O77n14qM94p33K08K53m50j98Q38q11l07
$$ plain form
4130 -796 -107 304 -818 -438 643 -107 -516 132 53 -552 159 242 -208 212 192 -57 309 594 -15 209
4150 209 942 -184 -252 998 445 -649 208 687 -504 -405 644 -122 -501 65 -50 -228 451 89 -436
4169 -436 546 400 -449 65 729 -537 -37 555 -71 -1031 285 310 -493 -10 271 -52 -299 262 -798
4188 -798 -136 182 -752 -462 514 -187 -942 340 370 -775 -121 760 -390 -222 651 109 -486 330 -47
4207 -47 -55 491 7 -103 500 69 -665 40 903 -162 -619 920 87 -617 358 414 -393 35 315 -264 -171
4228 -171 237 74 77 551 -491 -139 678 71 -639 102 254 -688 -167 485 -539 -551 104 -327 -875 147
4248 147 -265 -537 89 -252 -820 35 455 -676 -13 391 -173 -686 561 557 -472 428 1045 -559 123
4267 123 811 110 411 566 -285 -232 548 -72 -190 699 186 -842 320 412 -620 -89 333 -58 -706 396
$$ packed form
4130g96O89M11j122L80J081p50m09O48p9o05P11Q3m50M20k0k49L66K85o09K24
4150B09P33j126o8J250n53j094Q57M79j191R9J049p66l79N66j15j78O79l62n25
4169d36R82j46q49N14O64j266N00N92o26r60J316K5q03M83K81l23k47N61j060
4188g98O62L18r34K90R76p01p55J282L0j145O54Q81j150J68Q73n42n95Q16l77
4207d7qN46m84j10O03m31p34P05Q63j065m57J539q33p04R75N6q07M28K80n79R3
4228a71M08j63LM74j042L52Q17o07p10P41J52r42N21O52j024j2O55m31n48J022
4248A47m12k72O26l41n68Q55M20j131O63M04n64n13J247mj029R00O17j604O82
4267A23O88p01L01J55q51N3P80o20j18Q89n13j028J162R2j032N31M22l91o48J102
$$ plain form
4287 396 -224 -379 33 14 -671 16 138 -507 -50 496 -614 -558 399 -327 -736 320 393 -823 -128 353
4307 353 -350 -411 162 -182 -104 373 -468 -328 542 322 -509 130 395 -540 297 552 -123 -331 794 124
4327 124 -166 195 352 -356 147 174 -415 337 633 -282 -201 448 -66 -423 458 357 -919 255 268 -632
4347 -632 -218 135 -167 -234 292 -560 -348 848 -388 -443 332 -360 -946 272 433 -451 -94 741 -170 -310
4367 -310 510 120 -693 272 -11 -590 338 593 -262 295 430 -274 -128 636 -194 -282 506 577 -375 276 681
4388 681 -145 369 850 68 -229 565 0 -115 22 -321 -114 276 336 -829 -152 440 -635 -384 421 -570
4408 -570 -910 154 -284 -817 -170 -120 -547 -64 511 -233 -214 311 -230 -356 599 -192 -575 322 553 -411
4428 -411 231 595 -101 -131 406 106 -44 610 84 -58 65 149 -340 95 656 -678 214 668 -290 -354 719
$$ packed form
4287C96o20j55M12j9o85O87J22o45M57N46j110N6R57p26m09J056P3j216O95M81
4307C53p03o1N73l44P8M77q41J40Q70k20q31O39K65r35Q37K55o75k08J125o70
4327A24k90L61J57p08N03K7n89P52K96r15Q1O49n14l57Q81j01j276J174J3r00
4347f32M14L53l02o7N26q52K12J196j236n5P75o92n86J218J61q84L57Q35r11j40
4367c10Q20l90q13R65k83n79R28K55q55N57J35p04J46P64q30q8P88P1r52O51M05
4388F81q26N14M81p82k97P94n65j15J37l43K07L90O0j165O77N92j075K51Q05r91
4408e70l40J064m38n33O47N0m27M83N75p44J9N25n41j26R55p91l83Q97K31r64
4428d11O42L64o96l0N37l00j50O54n26j42J23Q4m89M35N61j334Q92M54r58o4J073
$$ plain form
4449 719 341 -405 373 211 -385 251 183 -356 188 354 -582 -449 379 -401 -443 150 50 -597 -108 185 -635
4470 -635 -134 321 -423 -71 182 -234 -424 690 153 -731 594 361 -630 305 671 -95 -366 579 -117
4489 -117 -38 638 392 -194 453 466 -455 168 769 -420 -11 693 -498 -299 383 177 -239 353 321 -18
4509 -18 430 780 -414 -331 519 -386 -322 439 -101 -715 405 107 -662 332 642 -402 -73 499 -518 -351
4529 -351 436 -509 -394 343 -54 -268 62 204 -583 122 687 -349 -408 398 -153 -543 526 159 -481 337
4549 337 554 -369 152 561 -113 154 714 42 -596 325 -129 -633 102 175 -321 194 546 -390 -116 384
4569 384 -166 -427 681 -19 -524 195 197 -452 -202 178 -664 -609 138 -454 -519 162 -151 -367 -34 386 -417
4590 -417 -118 67 -505 46 226 -184 -410 581 -147 -327 332 55 -446 105 679 -299 -105 550 304 54
$$ packed form
4449G19l78p46P78j62n96O36o8n39N44J66r36J33Q28p80m2N93j00o47M89K93q20
4470f35N01M55p44L52K53m16j90J114n37q84J325k33r91R35L66p66k71R45o96
4489a17P9O76k46n86O47J3r21O23O01j189M09P04j191J99O82k06m16N92l2l39
4509a8M48L50j194Q3Q50r05O4P61n40o14J120k98p69R94L10j044L29N72j017J67
4529c51P87r45J15P37l97k14L30J42p87P05N65j036n9Q06n51l90J069l67o40Q18
4549C37K17r23N21M09o74K67N60o72o38R21m54n04P35P3m96N15L52r36K74N00
4569C84n50k61J108p00n05P19Ko49K50L80q42N5P47n92o5O81l13k16L33M20q03
4590d17K99J85n72N51J80m10k26R91p28j80O59k77n01N51N74r78J94O55k46k50
$$ plain form
4610 54 580 135 -428 679 76 -648 226 167 -461 19 178 -193 14 488 -16 -128 85 -143 -569 -79
4630 -79 96 -442 35 162 -671 -461 481 -288 -367 149 -39 -467 349 39 -468 -17 263 -203 -391 536 22
4651 22 -463 487 242 -326 167 172 -331 282 288 -373 -127 781 -300 27 731 -53 -501 401 365 -88 157 536
4673 536 -302 28 448 -86 128 286 -224 -294 172 -148 -352 104 144 -766 -76 338 48 -285 342 -197 -457
4694 -457 57 -127 -763 180 195 -424 -150 260 -279 14 444 -361 -285 183 1 -461 332 304 -220 232 683
4715 683 -439 -235 309 -255 91 270 -259 -51 342 57 -340 410 600 -67 -246 454 -79 -234 259 -258
4735 -258 -402 -268 51 131 -78 31 -427 -74 345 -426 -260 251 -165 -387 191 -67 -371 -9 71 -179 -512
4756 -512 22 -10 -246 259 -133 -280 179 -76 -113 466 291 -355 94 488 -116 -47 208 199 -151 124 363 -178
$$ packed form
4610E4N26m45n63J107o03p24Q74n9o28M80J59l71K07M74n04j12K13k28m26M90
4630g9J75n38M77J27q33K10R42p69p9N16j88m28Q16l10n07M51K80m66j88R27n14
4651B2m85R50k45n68M93Nn03O13Oo61K46R08j081L27P04p84m48R02l6m53K45L79
4673E36q38L30M20n34K14J58n10p0M66l20k04M56M0r10O90M14k90l33O27n39k60
4694d57N14j84o36R43J5o19K74M10n39K93M30q05P6M68j82m62P93k8n24M52M51
4715F83j122K04N44n64L46J79n29K08L93k85l97P50J90o67j79P00n33j55M93n17
4735b58j44J34L19Q0k09J09m58L53M19p71J66N11m16k22N78k58l04L62Q0k50l33
4756e12N34l2k36N05l92j47M59k55l7N79j75o46M49L94o04O9K55rl50K75K39n41
$$ plain form
4778 -178 291 344 -182 208 66 -73 89 456 -200 -491 657 149 -501 367 210 -412 -72 123 -68 -128
4798 -128 -89 -190 -352 51 -116 -302 496 -104 -526 -41 238 -538 -190 378 -211 -364 338 -347 -697 113
4818 113 -52 -108 -215 25 37 -52 229 -391 -240 607 -263 -125 573 378 -495 162 444 -392 91 582 69
4839 69 -215 293 -96 -261 152 229 -91 782 310 -551 346 60 11 -276 286 -224 -489 80 150 -212 -122 165
4861 165 -476 -118 24 -646 29 95 -376 -106 62 -298 -169 393 46 -720 379 602 -321 -277 499 278
4881 278 -129 347 295 -75 133 374 -527 409 24 -168 314 480 -365 -275 504 295 33 611 389 -425 -112
4902 -112 351 -207 29 54 -255 143 273 -224 -312 321 -124 -546 460 208 -482 -206 148 -53 -386 59
$$ packed form
4778a78M69N3n26L90j42j39J62L67o56k91J148n08o50Q68j57o22L40J95j91o0
4798a28L9j01j62M03j67j86P98o00m22M85K79p76L48N68n89j53P02o85l50Q10
4818A13j65n6j07K40J2q9K81o20J51Q47q70J38O98j95q73O57K82q36M83M91n13
4839F9k84N08l89j65M13P7l20Q73m72q61Q97k86m9k87N62n10k65N69P0l62R0K87
4861A65o41L58J42o70O75O6m71K70J68l60J29N62l47p66J099K23r23M4P76k21
4881B78m07M76n2l70K08K41r01R36l85j92M82J66q45R0P79k09k62N78k22q14L13
4902a12M63n58K36K5l09L98J30m97q8O33m45m22J006k52o90K76L54k01l33M45
$$ [...]
8191D2
##END NTUPLES=NMR FID
##END=
