##TITLE=1H_CA-8603-3
 DMSO, 8 sc, 
 3.6.2019
##JCAMPDX= 6.0         $$ Bruker NMR JCAMP-DX V2.0
##DATA TYPE= NMR FID
##DATA CLASS= NTUPLES
##ORIGIN= UXNMR, Bruker Analytische Messtechnik GmbH
##OWNER= root
$$ XWIN-NMR		Version 3.5
$$ Mon Jun  3 16:35:05 2019 Russian Standard Time (UT+4h)  she@DPX200
##.OBSERVE FREQUENCY= 200.13155
##.OBSERVE NUCLEUS= ^1H
##.DELAY= (6, 6)
##.ACQUISITION MODE= SIMULTANEOUS
##.ACQUISITION SCHEME= undefined
##.AVERAGES= 8
##.DIGITISER RES= 18
##SPECTROMETER/DATA SYSTEM= spect
##.PULSE SEQUENCE= zg30
##.SOLVENT NAME= DMSO
##.SHIFT REFERENCE= (INTERNAL, DMSO, 0, 15.7039)
##AUDIT TRAIL= $$ (NUMBER, WHEN, WHO, WHERE, WHAT)
$$ ##TITLE= Audit trail, XWIN-NMR		Version 3.5
$$ ##JCAMPDX= 5.01
$$ ##ORIGIN= Bruker BioSpin GmbH
$$ ##OWNER= she
$$ F:/spectra/data/she/nmr/H-F/1/audita.txt
$$ ##AUDIT TRAIL=  $$ (NUMBER, WHEN, WHO, WHERE, WHAT)
(   1,<2019-06-03 16:33:55.68 +0400>,<she>,<DPX200>,
      <created by zg, POWCHK disabled, PULCHK disabled
       configuration hash MD5:
       00 E9 B6 7A A2 85 ED C7 34 08 36 98 17 FE 4E 26
       data hash MD5: 16K
       3F C8 BC B7 EE 7D 2D 39 59 BB 78 56 F8 A9 E3 50>)
$$ ##END=
$$ 
$$ hash MD5
$$ 22 EA 2C 43 23 95 3A DD FD 8E A3 26 77 D9 1D A1
##$RELAX= 
##$RELAX= 
##$RELAX= 
##$RELAX= 
##$RELAX= 
##$RELAX= 
$$ Bruker specific parameters
$$ --------------------------
##$DU= <F:/spectra>
##$EXPNO= 1
##$NAME= <H-F>
##$PROCNO= 1
##$TYPE= <nmr>
##$USER= <she>
##$AMP= (0..31)
100 100 100 100 100 100 100 100 100 100 100 100 100 100 100 100 100 100 
100 100 100 100 100 100 100 100 100 100 100 100 100 100 
##$AQSEQ= 0
##$AQ_mod= 1
##$AUNM= <au_zg>
##$AUTOPOS= <>
##$BF1= 200.13
##$BF2= 200.13
##$BF3= 200.13
##$BF4= 200.13
##$BF5= 200.13
##$BF6= 200.13
##$BF7= 200.13
##$BF8= 200.13
##$BYTORDA= 1
##$CFDGTYP= 0
##$CFRGTYP= 5
##$CHEMSTR= <none>
##$CNST= (0..31)
1 1 145 1 1 1 1 1 1 1 1 1 1 1 1 1 1 1 1 1 1 1 1 1 1 1 1 1 1 1 1 1 
##$CPDPRG= <>
##$CPDPRG1= <>
##$CPDPRG2= <>
##$CPDPRG3= <>
##$CPDPRG4= <mlev>
##$CPDPRG5= <mlev>
##$CPDPRG6= <mlev>
##$CPDPRG7= <mlev>
##$CPDPRG8= <mlev>
##$CPDPRGB= <>
##$CPDPRGT= <>
##$D= (0..31)
0 1.2 0 0 0 0 0 0 0 0 0 0.03 0 0 0 0 0 0 0 0 0 0 0 0 0 0 0 0 0 0 0 0 
##$DATE= 1559565235
##$DBL= (0..7)
120 120 120 120 120 120 120 120 
##$DBP= (0..7)
150 150 150 150 150 150 150 150 
##$DBP07= 0
##$DBPNAM0= <>
##$DBPNAM1= <>
##$DBPNAM2= <>
##$DBPNAM3= <>
##$DBPNAM4= <>
##$DBPNAM5= <>
##$DBPNAM6= <>
##$DBPNAM7= <>
##$DBPOAL= (0..7)
0.5 0.5 0.5 0.5 0.5 0.5 0.5 0.5 
##$DBPOFFS= (0..7)
0 0 0 0 0 0 0 0 
##$DE= 6
##$DECBNUC= <off>
##$DECIM= 24
##$DECNUC= <off>
##$DECSTAT= 4
##$DIGMOD= 1
##$DIGTYP= 9
##$DL= (0..7)
0 120 120 120 120 120 120 120 
##$DP= (0..7)
150 150 150 150 150 150 150 150 
##$DP07= 0
##$DPNAME0= <>
##$DPNAME1= <>
##$DPNAME2= <>
##$DPNAME3= <>
##$DPNAME4= <>
##$DPNAME5= <>
##$DPNAME6= <>
##$DPNAME7= <>
##$DPOAL= (0..7)
0.5 0.5 0.5 0.5 0.5 0.5 0.5 0.5 
##$DPOFFS= (0..7)
0 0 0 0 0 0 0 0 
##$DQDMODE= 0
##$DR= 18
##$DS= 0
##$DSLIST= <SSSSSSSSSSSSSSS>
##$DSPFIRM= 0
$$ [...]
##$SUBNAM2= <"">
##$SUBNAM3= <"">
##$SUBNAM4= <"">
##$SUBNAM5= <"">
##$SUBNAM6= <"">
##$SUBNAM7= <"">
##$SUBNAM8= <"">
##$SUBNAM9= <"">
##$SW= 24.9336996594482
##$SWIBOX= (0..15)
0 0 2 0 0 0 0 0 0 0 0 0 0 0 0 0 
##$SW_h= 4990.01996007984
##$TD= 16384
##$TD0= 1
##$TE= 0
##$TE2= 300
##$TE3= 300
##$TEG= 300
##$TL= (0..7)
0 120 120 120 120 120 120 120 
##$TP= (0..7)
150 150 150 150 150 150 150 150 
##$TP07= 0
##$TPNAME0= <>
##$TPNAME1= <>
##$TPNAME2= <>
##$TPNAME3= <>
##$TPNAME4= <>
##$TPNAME5= <>
##$TPNAME6= <>
##$TPNAME7= <>
##$TPOAL= (0..7)
0.5 0.5 0.5 0.5 0.5 0.5 0.5 0.5 
##$TPOFFS= (0..7)
0 0 0 0 0 0 0 0 
##$TUNHIN= 0
##$TUNHOUT= 0
##$TUNXOUT= 0
##$USERA1= <user>
##$USERA2= <user>
##$USERA3= <user>
##$USERA4= <user>
##$USERA5= <user>
##$V9= 5
##$VALIST= <valist>
##$VCLIST= <CCCCCCCCCCCCCCC>
##$VD= 0
##$VDLIST= <DDDDDDDDDDDDDDD>
##$VPLIST= <PPPPPPPPPPPPPPP>
##$VTLIST= <TTTTTTTTTTTTTTT>
##$WBST= 1024
##$WBSW= 4
##$XGAIN= (0..3)
0 0 0 0 
##$XL= 0
##$YL= 0
##$YMAX_a= 53979
##$YMIN_a= -55030
##$ZGOPTNS= <>
##$ZL1= 120
##$ZL2= 120
##$ZL3= 120
##$ZL4= 120
##$ABSF1= 10
##$ABSF2= 0
##$ABSG= 5
##$ABSL= 3
##$ALPHA= 0
##$AQORDER= 0
##$ASSFAC= 0
##$ASSFACI= 0
##$ASSFACX= 0
##$ASSWID= 0
##$AUNMP= <proc_1d>
##$AZFE= 0.1
##$AZFW= 0.1
##$BCFW= 1
##$BC_mod= 2
##$BYTORDP= 1
##$COROFFS= 0
##$CY= 11.3945322036743
##$DATMOD= 1
##$DC= 2
##$DFILT= <>
##$DTYPP= 0
##$F1P= 18.9103706918063
##$F2P= -1.10871071338519
##$FCOR= 0.5
##$FTSIZE= 0
##$FT_mod= 4
##$GAMMA= 1
##$GB= 0.15
##$INTBC= 1
##$INTSCL= 1
##$ISEN= 128
##$LB= 0.24
##$LEV0= 0
##$LPBIN= 0
##$MAXI= 10000
##$MC2= 0
##$MEAN= 0
##$ME_mod= 0
##$MI= 1.114404
##$NCOEF= 0
##$NC_proc= 0
##$NLEV= 6
##$NOISF1= 3.799351
##$NOISF2= 2.8
##$NSP= 1
##$NTH_PI= 0
##$NZP= 0
##$OFFSET= 15.70392
##$PC= 1
##$PHC0= -8663.623
##$PHC1= 20.20022
##$PH_mod= 1
##$PKNL= yes
##$PPARMOD= 0
##$PSCAL= 0
##$PSIGN= 0
##$REVERSE= no
##$SF= 200.130013532006
##$SI= 16384
##$SIGF1= 3
##$SIGF2= 2
##$SINO= 400
##$SIOLD= 16384
##$SREGLST= <1H.CDCl3>
##$SSB= 0
##$STSI= 0
##$STSR= 0
##$SW_p= 3612.71676300578
##$SYMM= 0
##$S_DEV= 0
##$TDeff= 0
##$TDoff= 0
##$TI= <>
##$TILT= no
##$TM1= 0
##$TM2= 0
##$TOPLEV= 0
##$USERP1= <user>
##$USERP2= <user>
##$USERP3= <user>
##$USERP4= <user>
##$USERP5= <user>
##$WDW= 1
##$XDIM= 8192
##$YMAX_p= 0
##$YMIN_p= 0
$$ End of Bruker specific parameters
$$ ---------------------------------
##NTUPLES= NMR FID
##VAR_NAME=  TIME,          FID/REAL,        FID/IMAG
##SYMBOL=    X,             R,               I
##VAR_TYPE=  INDEPENDENT,   DEPENDENT,       DEPENDENT
##VAR_FORM=  AFFN,          ASDF,            ASDF
##VAR_DIM=   8192,          8192,            8192
##UNITS=     SECONDS,       ARBITRARY UNITS, ARBITRARY UNITS
##FACTOR=    0.0002004,     1,               1
##FIRST=     0,             0,               0
##LAST=      1.6414764,     0,               0
##MIN=       0,             -55030,          0
##MAX=       1.6414764,     53979,           0
$$ Real data points
##PAGE= N=1
##DATA TABLE= (X++(R..R)), XYDATA
0 0 0 0 0 0 0 0 0 0 0 0 0 8 -8 8 -8 8 -8 16 -16 16 -24 24 -32 32 -40 48 -52 56 -65 76 -87 96 -108 120
34 120 -136 151 -167 184 -205 228 -252 279 -308 341 -380 420 -468 520 -581 652 -736 835 -961
53 -961 1115 -1317 1597 -2003 2652 -3873 6951 -31761 -39991 33988 41699 146 -55030 -51953
67 -51953 -6219 37117 27238 -13803 -44406 -31160 5652 32330 21625 -10405 -33503 -22758
79 -22758 10172 35407 24862 -10412 -33331 -16452 21496 40371 18961 -18154 -30382 -4613
91 -4613 28557 33878 8087 -19793 -23009 -365 23655 26092 5305 -19093 -25102 -5536 21915
104 21915 27863 2379 -29890 -33617 -2296 30934 26835 -13081 -44049 -30339 12844 36076 12709
117 12709 -30669 -44727 -14397 24420 28544 -3555 -35195 -33242 -1636 25035 19766 -9590 -31350
130 -31350 -24029 4556 25297 16815 -11873 -29966 -17718 12101 27864 12368 -17401 -27687
142 -27687 -7544 19780 24615 3876 -19040 -19804 697 19260 17656 345 -14792 -14309 375
155 375 15480 16729 2585 -14222 -17352 -1416 18989 20837 -294 -22186 -19762 5792 26548
168 26548 18133 -11236 -28099 -13040 16524 27353 7943 -19844 -25112 -2943 21442 21645 -850
181 -850 -21576 -19334 2998 21733 16921 -5843 -22429 -15508 7934 22818 12529 -12059 -23562
194 -23562 -9376 14633 21563 4245 -17696 -19439 -401 17085 14423 -3107 -15982 -11799 3368
207 3368 13072 8986 -2917 -11085 -9222 1137 10998 10684 -241 -11623 -11660 1703 15326 13467
221 13467 -3241 -16326 -10492 8330 19615 10185 -9570 -17348 -4416 14251 18406 4191 -12859
234 -12859 -14504 725 16191 15624 54 -14375 -12565 3984 17958 13441 -4981 -17305 -9854
247 -9854 9395 19195 7964 -11880 -17532 -3134 14427 15372 -525 -14851 -12051 3530 13591
260 13591 8243 -4697 -11528 -6379 4186 9491 5344 -3204 -8369 -5870 2477 9176 7083 -2385
274 -2385 -9644 -6689 4449 12035 7148 -5209 -11206 -4094 8344 12660 4321 -7719 -10338 -818
288 -818 10230 11454 1839 -8696 -9449 882 11613 11090 -589 -11413 -9441 4120 14381 9290
302 9290 -5966 -14154 -5926 9452 14528 3275 -11277 -12411 419 12134 9775 -2932 -11638
315 -11638 -7120 4202 9764 4630 -4547 -8485 -4014 3757 7313 3502 -3636 -7146 -3865 3470 7499
330 7499 3725 -4243 -7679 -2885 5134 7893 2404 -5405 -6960 -918 6150 7069 1335 -5469 -6272 -297
346 -297 6572 7235 987 -6411 -7025 682 8783 8004 -1428 -9448 -6724 4368 11383 5634 -6346 -10710
362 -10710 -2681 8617 10194 437 -9306 -8065 2029 9310 6088 -3187 -8357 -4502 3709 7285
376 7285 3083 -3949 -6711 -2880 3690 6092 1927 -4339 -6274 -1879 4225 5580 670 -5052 -5387
391 -5387 -350 4485 4327 -395 -4596 -4014 324 3910 3675 22 -3858 -4119 -113 4430 4830 129
407 129 -5151 -5096 1188 6925 5293 -2155 -7358 -3887 4560 8357 2947 -5541 -7170 -442 6970 6852
423 6852 -541 -6614 -4799 2461 6897 4164 -2505 -6032 -2809 3499 6007 2319 -3579 -5414 -1473
438 -1473 4097 5168 677 -4393 -4558 118 4322 3699 -1016 -4384 -2962 1140 3499 2065 -1341 -3200
454 -3200 -2080 686 2463 2016 -404 -2877 -2835 234 3391 3140 -625 -4142 -3173 1668 5151 2998
470 2998 -2562 -5097 -1710 4096 5659 1230 -4203 -4357 669 5304 4575 -681 -4458 -2907 2367 5456
486 5456 3221 -1789 -4430 -1604 3541 5333 1729 -3097 -4019 15 4456 4250 -197 -3871 -2745 1586
502 1586 4071 2312 -1582 -3277 -1233 1787 2595 942 -1354 -2125 -1070 789 1747 1096 -782 -2342
518 -2342 -1868 589 2503 1704 -1175 -3150 -1757 1635 3447 1312 -2332 -3346 -636 2987 3530 395
534 395 -2915 -2730 803 3847 3188 -482 -3282 -1993 2119 4431 2468 -1688 -3355 -735 3430 4374
550 4374 955 -2881 -2861 921 4026 3112 -821 -3081 -1391 2067 3213 1362 -1513 -2283 -324 1743
566 1743 1948 434 -1282 -1607 -476 947 1468 480 -1048 -1753 -875 920 1746 615 -1350 -2093 -769
583 -769 1431 2050 429 -1754 -2079 -225 2036 2205 51 -2192 -2010 517 2691 2229 -692 -2685 -1574
600 -1574 1709 3303 1449 -1754 -2943 -490 2773 3110 55 -2726 -2199 896 2961 1749 -1277 -2630
616 -2630 -980 1600 2240 463 -1710 -2052 -273 1453 1316 -72 -1442 -1355 -142 1072 1042 -109 -1231
633 -1231 -1201 -233 939 1054 -9 -1098 -1110 -83 1080 1223 124 -1158 -1153 -5 1395 1462 -7 -1567
651 -1567 -1376 499 2033 1415 -732 -2198 -1225 1433 2358 681 -1909 -2324 -266 2071 1876 -602 -2541
668 -2541 -1744 721 2031 741 -1583 -2340 -853 1187 1501 -87 -1757 -1866 -205 1128 859 -560
684 -560 -1626 -1320 83 1004 508 -724 -1251 -877 157 802 431 -464 -882 -556 124 722 618 -188 -839
703 -839 -857 51 921 879 -242 -1320 -946 393 1436 799 -869 -1773 -703 1117 1562 204 -1641 -1753
721 -1753 32 1641 1217 -663 -2001 -1151 648 1602 631 -1294 -1871 -560 1055 1264 -166 -1508 -1347
738 -1347 35 1162 734 -645 -1372 -811 399 945 260 -778 -1065 -471 377 486 -34 -645 -771 -403
756 -403 89 271 44 -419 -809 -601 -123 414 319 -512 -1126 -833 229 851 327 -874 -1369 -602 691 1060
776 1060 -53 -1271 -1309 30 1206 949 -526 -1443 -770 698 1403 570 -896 -1279 -132 1183 1260 76
794 76 -1108 -863 454 1317 823 -352 -947 -344 748 1072 282 -602 -689 -55 578 476 3 -489 -478 -25
814 -25 200 275 -59 -345 -520 -350 -27 215 -24 -502 -799 -583 33 411 23 -751 -1058 -547 413 616 -134
835 -134 -971 -1012 -105 806 620 -381 -1110 -674 532 1091 477 -701 -925 -20 1018 1070 25 -828 -558
854 -558 552 1203 791 -273 -645 -130 821 930 335 -346 -413 184 728 597 37 -313 -271 244 446 279
874 279 -62 -288 -238 -79 160 238 49 -283 -372 -274 171 350 67 -521 -663 -279 375 407 -68 -666 -662 35 583
897 583 511 -274 -780 -451 432 750 286 -615 -784 -75 698 810 -58 -733 -480 385 896 561 -308 -653 -94
918 -94 668 714 153 -408 -324 143 647 455 -6 -335 -137 263 393 255 -99 -154 15 138 250 159 10 -96
940 -96 -149 -50 220 199 9 -228 -347 -77 229 298 51 -453 -396 24 443 361 -139 -604 -356 308 539 210 -445
963 -445 -621 -71 526 419 -55 -575 -424 220 594 276 -296 -587 -82 395 582 84 -393 -337 126 430 286
984 286 -54 -360 -115 264 324 123 -102 -134 88 181 198 92 -95 -53 7 39 128 117 50 -103 -178 -12 175 223
1008 223 -32 -200 -275 98 327 226 -184 -434 -161 240 410 23 -374 -459 -48 362 315 -163 -512 -384 217
1029 217 447 174 -352 -463 -145 342 388 -70 -367 -258 160 300 202 -134 -264 -56 186 261 35 -134 -206
1050 -206 64 234 130 -85 -94 -43 62 130 79 -9 32 47 -16 -4 165 143 4 -133 -144 64 265 147 -147 -243
1074 -243 -102 104 264 79 -311 -295 -9 286 207 -56 -379 -223 180 329 84 -263 -314 -60 354 223 23
1095 23 -308 -128 90 306 181 -226 -315 -68 249 225 14 -184 -129 4 103 117 -47 -79 -51 35 119 91 -37 -41
1119 -41 -4 36 59 73 113 10 -59 -60 82 140 77 -55 -145 -28 137 223 122 -155 -143 43 221 192 -69 -209 -147
1144 -147 168 339 99 -190 -266 -23 233 225 -82 -297 -150 140 275 33 -112 -256 -16 172 157 -68 -225
1165 -225 -27 96 224 102 -65 -94 29 63 97 25 -48 -17 22 57 50 -82 36 7 -22 2 -7 106 109 13 -156 -7
1191 -7 93 99 75 -129 -44 32 134 201 -25 -160 -88 157 239 41 -201 -187 7 194 201 -2 -164 -38 120 216 55
1216 55 -144 -150 -50 174 90 -48 -156 -116 81 154 55 -108 -68 7 90 50 -9 -47 5 82 73 53 46 15 -48 36 -19 -33
1244 -33 56 37 -15 -33 -10 17 36 -1 -109 -72 15 183 115 -2 -79 -47 86 186 46 -124 -126 -9 154 127 -69 -155
1270 -155 -104 89 161 100 -151 -108 58 115 83 -13 -100 -40 14 59 36 -76 -78 -26 91 44 48 -77 -100 27 -31 -18 -16 -38
1298 -38 6 34 10 -11 69 -23 -34 25 46 11 15 68 -56 -45 44 102 19 -1 -38 -82 82 110 35 -97 -86 -20 120 91 -71
1327 -71 -57 -33 40 175 -29 -79 -22 16 87 63 -60 -109 -58 49 73 44 -48 -107 -2 109 33 -42 -40 -23 52 69 42 -53
1355 -53 -52 -50 -55 -70 24 11 20 29 -6 -13 -47 42 -5 -33 -69 -18 12 74 -81 -59 -82 12 14 -31 -72 -39 -10 21 77 -30 -73 -55 11
1388 11 2 31 -97 -92 6 89 51 -45 -60 -88 30 5 0 -108 -76 -12 4 48 -67 -135 -22 47 51 -8 -69 -43 37 5 -69 11
1418 11 -64 -19 -7 4 -72 23 -2 -11 18 0 7 24 41 -29 -30 -11 43 -13 28 -63 -75 12 82 9 -17 -101 3 47 110 54 -28
1449 -28 -98 35 71 44 10 -125 17 42 100 72 -29 -35 -1 32 10 -54 1 -58 47 33 -4 -58 -36 67 45 8 4 -64
1477 -64 -42 -23 -8 -13 36 81 -29 -11 58 25 -38 14 2 11 -41 28 31 45 -36 -36 61 17 0 -76 -53 -16 30 40 51 -5 -50 -3
1509 -3 30 50 -19 -48 -14 54 57 -18 -47 -42 0 74 23 -95 -14 -43 16 -18 -10 -54 21 15 18 17 8 -10 -5 32 5 23 -10 14 47 -20
1543 -20 -1 24 48 33 9 18 2 16 37 72 -46 -18 86 -24 57 -38 -2 -6 21 50 -10 23 -31 -24 -11 107 -23 -43 -25
1572 -25 -51 26 -15 -57 -39 -37 -16 -54 -61 -50 -11 63 9 6 -28 -92 2 2 28 45 -53 -50 27 0 27 -3 -21 13 -2 -37 54 -17 18
1605 18 31 -43 22 1 -27 23 -32 -20 17 44 -7 26 4 -21 23 -43 50 30 36 -62 -24 -29 9 -21 3 -25 36 48 50 9 -1 -8
1637 -8 7 -63 -24 -6 -36 66 17 49 40 46 -47 22 -53 64 79 -12 92 13 -21 -26 -42 -4 15 -14 21 -34 -16 -31 -11 -51 -6
1668 -6 10 -29 -39 -63 -56 54 7 20 21 -22 21 -15 -48 83 8 41 71 7 29 52 -15 -89 77 40 -19 16 33 2 43 8
1698 8 19 17 36 -24 46 -14 -45 -31 -11 3 -24 32 -55 -6 38 -27 48 -62 -66 9 -79 7 -7 3 9 15 -30 -1 -17 -6 27 74
1730 74 41 39 30 14 23 5 -5 -2 -64 33 -10 15 27 34 -32 -22 14 -24 -4 -2 15 0 14 0 5 -62 32 53 45 53 -36 76 23 53
1764 53 -1 34 -20 10 25 9 40 42 -38 1 76 59 59 -21 -15 -25 -2 -49 5 50 1 33 -54 -58 -17 52 -8 -28 1 -32 -16 -19 8
1797 8 -3 -6 26 6 68 64 -16 -6 17 49 32 -20 16 1 25 5 -1 30 -2 24 -20 1 27 26 1 20 20 11 20 -23 98 -4 -56
1830 -56 -18 -63 13 -9 -7 0 81 14 -17 -15 40 17 65 32 24 21 11 -55 78 -11 -36 51 -32 -19 -30 -28 -18 -43 -41 7 35 -43 -28
1863 -28 -13 97 -72 20 -13 -48 71 -8 34 50 25 -36 -15 31 -53 0 47 16 63 -3 30 -11 21 72 -41 7 -20 17
1891 17 75 30 -65 -60 17 40 -7 -6 -42 -23 -39 -34 6 -12 28 -7 10 40 -11 10 -9 37 -21 2 9 83 21 16 -51 10 22 16 -1
1924 -1 2 -7 -38 -25 -6 -51 -31 20 36 19 75 -43 65 7 5 -20 -34 -23 -24 -3 8 54 -16 37 42 45 10 64 -46 18 32 5
1956 5 21 -15 84 1 9 21 19 -5 5 14 72 10 -47 7 -13 -6 63 3 -20 -13 16 -24 -19 -5 36 2 8 13 -58 4 57 -8 -30 63 23
1991 23 -29 40 -2 13 -14 36 -15 4 33 6 -1 36 42 38 17 -17 8 44 20 -28 51 -2 -31 23 -54 39 12 -1 27 -17 -55 53
2023 53 31 -3 -31 -87 44 -73 -4 47 -8 10 -1 -72 -22 9 -11 13 47 -33 -3 -40 -32 -27 12 20 -4 53 24 18 73 -42 2
2054 2 28 -26 -28 17 68 -4 -39 33 -20 44 10 15 -37 -80 52 -23 -1 -3 -14 -6 -17 26 -53 4 -38 9 56 -28 -34 -22 22 -12 -8
2087 -8 -8 -9 -11 63 -80 -40 13 -42 44 -34 -14 23 4 -11 -23 -65 -17 36 -23 17 48 -32 7 58 20 -38 46 50 -14 54 19 -8
2119 -8 41 -10 -93 55 -2 44 16 49 -12 10 -40 -31 32 -35 26 32 -16 31 -26 16 95 40 62 29 -14 18 -5 13 33 4 -10
2150 -10 4 -4 66 0 32 13 -32 -35 -50 -27 68 8 -8 33 -40 -45 -29 -14 -18 -51 18 40 -53 -31 17 -61 -7 -18 23 9 -4 -4 0
2183 0 -23 5 -50 42 19 -70 -20 65 78 43 -29 43 -30 -18 -8 -13 2 5 5 -9 18 4 19 -33 20 35 -76 15 9 -42 47 1
2215 1 14 50 5 19 16 48 -17 4 40 -21 -45 -27 34 20 -13 -25 30 11 6 -88 -66 -8 -13 6 -12 -6 10 -40 -21 70 -7 25 28
2248 28 18 -15 47 12 -18 -44 -24 33 27 -7 20 9 -33 -1 -22 -19 43 13 24 26 -17 15 46 -20 -19 -6 13 51 37 -5 -5 40 14
2281 14 -57 -8 19 -19 -4 32 4 5 2 19 -5 -2 -36 -45 73 46 7 10 24 -35 -36 77 30 -19 -11 -20 -31 -21 -73 -61 -3 -22 -22 12
2315 12 -43 52 -40 -22 -14 -5 34 65 -15 -4 29 -42 17 65 24 2 -10 25 50 14 -24 2 12 -7 7 31 -76 -13 35 6 -12
2346 -12 2 82 26 46 34 -13 38 -30 -32 33 10 -61 -14 78 30 -11 -38 13 -24 -36 19 -20 -31 12 21 42 13 -23 9 17 -26 -20
2378 -20 -110 -3 43 -29 -19 34 -24 0 25 1 36 -8 33 38 40 24 -57 46 17 -1 11 -18 -42 -48 21 49 -70 31 1 -21
2408 -21 41 -13 -29 -39 -24 35 -33 -1 -14 50 4 14 16 -18 33 27 4 -44 -16 4 -36 -18 12 37 9 80 -74 -26 15 4 40
2439 40 -40 19 19 62 16 27 18 42 -9 -24 -25 49 10 -39 -2 47 -35 -4 -15 -5 -20 6 56 6 13 7 -48 -59 50 -16 53 -37
2471 -37 -7 24 -57 -13 9 -13 2 -60 -46 16 -15 -11 -48 -29 -27 -70 53 38 1 43 0 10 14 35 24 -3 16 31 -93 5 -23
2502 -23 1 25 126 -29 51 11 -8 64 -31 -82 -34 47 -17 3 33 40 41 27 12 -41 6 -1 43 5 19 43 -5 45 0 -63 17
2533 17 17 -1 31 -10 9 -11 21 29 44 13 -9 -44 0 -25 -37 -23 -20 73 -31 34 -34 -39 53 -57 -8 -41 27 62 5 73 11
2564 11 -42 -46 36 48 16 -5 23 19 -9 -2 53 -40 -46 -3 -23 21 5 50 -6 30 -15 -20 47 29 20 -15 -26 2 22 -17 -32 17 19 23
2598 23 56 8 -33 3 9 -28 46 -25 -28 35 4 29 22 -16 -43 -16 3 -26 -38 31 -29 -10 47 4 -34 -36 -22 -36 5 24 -61 -9
2630 -9 40 -23 33 -22 33 37 2 -60 -38 -20 44 7 11 58 -21 6 29 18 -20 41 18 45 23 5 16 -15 2 26 -29 -58 -50 35
2662 35 2 -23 -15 34 32 29 10 26 33 -13 -12 12 9 39 -2 -10 26 -15 -33 -58 39 72 -4 4 -22 10 0 -41 12 22 34 4 8 16 -48
2697 -48 0 31 63 -57 27 -34 41 65 -24 -12 -12 37 53 30 -10 -40 50 -6 10 -64 -13 -12 27 -13 -29 -38 -32 12 -13 -39 50 -25
2729 -25 -32 -15 -47 -26 36 19 78 -15 -46 30 72 -17 -8 15 6 23 64 -6 11 -57 -33 17 -34 10 -58 -15 15 -18 55 23 -25 -61
2761 -61 -28 13 16 -30 -4 45 34 -5 31 -47 7 51 98 17 13 82 -4 -9 73 22 2 40 15 1 -26 1 -38 -53 -12 5 13 -42
2793 -42 8 -14 -19 -28 -14 21 -27 8 -54 19 -21 27 40 -15 -20 -18 64 14 -90 31 8 45 -25 -27 35 -44 -20 -7 -48 -42 -69 -4
2825 -4 -28 5 23 -40 -16 3 50 57 -19 27 7 69 -56 18 -15 38 58 -2 15 16 57 -63 -47 -8 35 -16 -33 21 -42 14 12
2856 12 -56 45 18 27 21 -32 -53 35 -14 -13 -36 -13 8 -5 -32 -44 33 69 58 46 -84 19 -3 50 66 1 -6 -5 34 -51 -24
2887 -24 -6 48 87 51 -40 -52 22 25 11 -16 12 7 -48 44 -5 50 58 23 -32 -13 39 23 60 42 -24 -9 17 32 31 -16 -10 24 20
2920 20 -57 -34 16 23 -7 -12 43 -31 -13 -36 10 -26 39 49 12 -16 -1 -5 -58 -6 75 -19 -26 -37 26 4 -20 21 10 -97 -1 -50
2952 -50 5 73 -25 -2 -15 32 13 21 55 1 14 65 45 71 30 -18 -75 34 -37 21 11 -28 -8 42 -9 -12 16 -32 12 34 3
2983 3 33 -19 12 38 -14 18 62 91 -43 41 -17 31 36 7 -1 9 -32 -28 25 9 -71 -37 9 -2 39 4 -28 3 -15 -60 4 18
3015 18 1 34 -32 -9 -20 -17 20 -7 22 -12 -5 -4 20 -7 31 5 -52 33 -20 -6 -32 23 -39 22 32 -25 41 12 10 -13 -10 -10 -81
3048 -81 -28 -57 -14 27 21 37 2 3 -13 60 -26 67 -26 25 -10 22 -15 -5 -21 -4 -54 -80 -45 -38 29 -16 -7 18 -6 -51 -3 -3 22
3081 22 -78 26 -46 26 0 28 8 -68 -7 3 16 -45 7 61 -62 4 17 -21 14 -25 15 -21 23 8 -32 -4 17 6 77
3110 77 -45 20 18 12 24 3 -4 14 17 -21 -1 -14 -32 -2 -3 -8 -51 19 -31 -42 -51 20 -43 -34 -5 -14 9 -3 -31 19 10 -40 12 20 -15
3145 -15 -52 -24 0 14 -34 -47 5 15 -10 7 -10 60 10 -22 -16 12 74 66 -16 -21 22 -112 18 52 -43 -11 19 31 -26 11 15
3176 15 2 11 -94 10 -28 -62 27 -9 -1 23 30 -41 -35 16 -16 -33 43 -48 47 23 5 -33 -11 -5 40 -16 -67 21 8 -30 -39 -61
3208 -61 22 58 13 -4 3 -42 -32 -1 23 -44 -27 20 -73 -54 -57 -7 15 44 74 2 24 -7 52 20 -44 -31 13 15 -39 -10 21 -27
3240 -27 -21 36 -5 52 -21 -56 2 -9 -8 60 3 -31 -22 -7 -58 -52 -32 2 54 -24 32 -12 -13 6 -17 56 -20 -13 -2 1 14 27 20 4
3274 4 -19 29 13 -41 -31 21 -65 -30 62 -10 -2 16 16 -40 6 -66 46 -11 15 25 11 -20 -3 5 -20 -27 21 -32 -88 35 29 -3
3306 -3 58 20 -41 10 -13 -30 -21 -15 -5 16 -30 -26 11 8 -15 -16 -40 -61 25 -11 26 -32 12 -27 61 -47 14 21 15 11 -44 46 24 -41
3340 -41 -44 3 1 33 -75 -3 11 -52 12 7 -8 -16 -38 -19 -85 -62 -38 6 -43 -29 29 -23 -78 -46 63 -40 7 27 60 -28 23
3371 23 -10 -3 -12 -35 -59 -2 -22 -23 -41 32 -26 -14 37 29 -28 11 -23 -21 6 -38 16 -13 -25 -28 12 -50 -35 46 -17 -37 -54 -25 -24 7
3405 7 30 -39 36 -7 -23 -15 22 17 33 9 -1 8 30 16 39 -23 -15 34 24 35 -13 -12 -26 -10 -75 -35 -58 19 -25 2 -9 16 23 -27
3439 -27 5 -43 -49 -39 32 20 -34 9 -13 10 32 -46 -7 -40 -24 -9 9 44 48 -72 8 0 82 40 -4 0 21 -2 -7 47 -6 56
3471 56 16 -15 -10 58 -14 -21 18 -53 12 2 -37 -47 55 28 -19 1 63 12 0 41 -54 -40 -63 14 8 12 -41 -31 -20 -13 -27 5
3503 5 -60 22 -68 -13 4 -1 -80 36 -8 8 38 -19 6 -78 17 -36 -22 -37 -39 -3 29 -31 -10 50 -31 -51 22 7 -45 53 -1
3534 -1 -39 -55 21 58 35 43 10 -9 0 8 29 -59 -26 -26 -75 14 28 41 -33 -8 2 -77 -12 21 -20 33 17 7 -8 11 -23 -20 -32
3567 -32 -47 -17 -44 16 4 54 -26 -42 -13 -21 -2 60 9 -43 27 33 3 -24 9 -19 46 7 -71 -77 51 -58 36 0 -50 109
3597 109 -40 -15 -38 -56 -54 -9 -4 67 -9 25 11 35 -13 -4 -7 41 37 -87 -1 25 4 8 -58 -36 -1 -34 27 -12 33 -20 41 -58
3629 -58 8 -40 -2 -36 -22 33 1 46 -11 8 22 58 4 60 -12 2 11 23 -28 -8 21 -74 12 2 34 47 -14 -28 52 -15 -28
3660 -28 -31 -3 6 -40 -6 14 -49 -38 10 -16 -52 -43 -22 50 -26 -14 -36 -46 2 -4 18 21 68 13 -46 -38 -29 -25 -28 28 4 -23 8 -20 -12
3695 -12 -36 13 -29 22 -9 -14 3 -3 -43 -8 18 -2 -21 3 -28 40 12 -20 24 -17 -24 8 -2 28 -1 -13 -33 -5 15 41 -6 -48
3727 -48 24 -60 -21 2 1 -7 22 -7 -55 21 -28 16 -13 28 10 -57 -16 -130 -7 -19 45 -30 -8 -69 58 -64 -17 17 0
3756 0 -3 44 -14 6 18 -30 58 -32 -40 -58 -18 -39 42 2 -52 -16 0 3 -8 -35 13 13 -40 33 -37 7 14 38 -94 -5 -23 65 -6
3789 -6 -30 -89 41 2 -1 6 25 36 15 -6 28 48 -23 22 9 -29 15 -69 -55 -23 67 -20 6 33 13 54 -2 8 -7 51 -15
3820 -15 19 33 -28 2 -27 -41 12 2 3 -79 -21 42 57 -48 -30 1 6 18 -48 -45 56 -45 -13 5 -55 -1 -10 -2 19 -18 -80
3851 -80 16 20 7 15 30 4 -1 -95 -27 -16 -63 -59 5 -21 6 15 -29 -33 36 7 1 11 72 33 -63 13 27 28 14 -14 25 -51 53 25
3885 25 20 -2 80 -8 46 -11 20 -11 -11 43 -14 -12 20 -59 -22 -38 -10 12 9 5 -1 -16 18 35 -32 -4 -1 -50 -16 -12 -9 -23 5 28 10
3920 10 66 -6 22 -23 10 41 -67 5 11 9 -32 -12 -16 -9 32 22 40 18 -9 0 43 31 -30 39 -36 35 13 -43 -53 28 -4 24
3952 24 25 -21 18 91 -10 10 -58 91 3 -69 -15 50 -5 22 -42 -6 -38 19 -32 56 28 -31 23 15 -14 3 39 7 48 -5
3982 -5 4 -16 5 2 63 49 31 11 66 -17 -9 -6 56 -65 0 -36 15 26 23 -9 -29 0 20 -22 1 -4 -47 -20 1 41 -39 -39 -65 -64
4016 -64 -21 -41 -26 -7 2 -8 -27 24 5 -6 -35 -32 65 -38 21 54 -6 29 48 -48 -36 -26 31 47 -39 -59 58 -31 -27 23 23
4047 23 -21 -16 11 -16 -46 21 -28 -9 8 19 10 -8 -12 -16 2 -6 -51 -9 13 -3 -33 25 57 -45 -40 -19 -25 -5 -38 -25 24 -30 47
4080 47 21 -6 13 27 21 -30 -36 -19 -59 6 -9 8 19 -61 -36 -1 -65 32 -27 -14 -55 -76 15 -23 -8 -17 -40 5 42 -8 62 -38
4112 -38 41 17 5 28 16 24 25 6 39 -35 9 24 -35 -11 -19 1 29 73 -40 37 -21 -10 54 26 55 -40 -46 -24 62 51 25 4
4144 4 24 -20 40 44 -33 1 7 24 -14 20 -20 -21 -7 65 -91 -5 58 -9 -63 21 -18 4 13 6 10 -32 21 -47 17 -16 -45 6 -25
4177 -25 7 0 13 6 -48 2 41 -5 23 -48 13 -68 -41 -43 19 6 -57 21 -25 -39 16 -9 -21 0 -19 43 -65 87 -15 -27
4207 -27 24 -27 31 26 -42 58 7 -9 28 -4 -69 -28 7 9 6 -26 -8 -6 34 13 -69 -44 7 -50 20 51 -21 20 -5 -51 -60 -27
4239 -27 28 -44 39 40 9 0 -5 -24 17 23 15 14 18 44 54 -25 -18 -10 -28 15 -2 3 -30 -17 -63 -77 14 3 -77 10 31 7 -23 23 2
4274 2 -78 8 4 18 20 -66 -24 -55 41 25 9 -30 47 24 -11 -14 -30 -69 1 -37 12 -4 -49 -18 -29 31 -24 26 37 19 6 1 -46
4307 -46 -5 -16 -75 -16 16 24 5 -45 6 -11 31 -13 11 42 -69 -44 -53 -12 -75 60 -38 -4 59 7 24 39 -24 60 70 48
4337 48 -43 64 -20 -13 48 -44 -11 26 -10 21 32 -41 -56 0 -33 -31 6 -19 -68 -34 -9 -1 19 -33 -30 -34 73 -61 -13 -29 7
4368 7 16 -13 -50 5 -23 46 7 -52 11 -8 5 -25 -56 23 -5 18 -16 0 -6 20 28 40 10 2 19 20 12 -19 -21 -21 6 4 67 0 32
4403 32 14 -40 2 57 13 -42 -1 -33 0 -8 39 20 28 3 29 27 -30 -36 -13 22 24 3 8 41 21 34 -15 -9 30 34 -17 7 -31 -33 -19
4438 -19 24 45 41 5 -12 12 -13 -1 0 28 14 -32 -21 32 83 -22 -35 -28 -46 6 40 -50 -64 -12 11 31 -3 -9 35 61 23 -24
4470 -24 -27 7 -6 45 -33 42 21 -39 -54 4 -3 -37 45 22 -1 -71 -10 -93 5 -29 -34 -29 -22 -9 35 -35 -45 35 26 48 -15 -73 -2
4503 -2 -31 16 1 -46 29 13 52 42 15 -8 8 34 -1 3 -33 -56 -6 1 12 -17 -36 7 -52 -70 13 -36 31 -36 -28 31 -17 -50
4535 -50 88 -22 3 68 39 9 11 19 26 -10 -65 13 -28 -9 29 16 -15 -26 -20 30 -2 -19 -15 -15 -25 -41 18 38 42 16 11 -11 6
4568 6 35 -5 -45 29 11 -28 24 -14 32 12 1 -7 -19 20 -6 29 -22 -22 -16 25 -9 -21 24 -41 23 -64 7 -5 3 6 96 61 1
4601 1 -46 -50 -42 20 -4 16 17 8 -66 40 6 -25 53 -3 -16 -20 36 5 9 10 -7 9 -42 -36 3 31 -22 -11 -36 18 -12 -39 -7 -57
4635 -57 -10 4 -2 -10 9 11 -53 5 6 1 -45 32 94 -2 9 -16 48 -38 -29 11 -13 -1 -29 12 -47 34 -29 14 -55 -24 -62 -4 -73
4668 -73 7 -7 -26 1 48 9 -12 -15 -11 -10 45 31 -25 18 -24 -60 6 -50 -6 -45 -11 19 50 -11 0 -41 2 -58 58 21 -3
4699 -3 5 -90 37 7 -2 -2 -20 1 27 -65 70 -14 0 6 22 16 -24 15 -9 14 -5 37 12 -1 -1 -2 68 -38 -30 -51 28 -3 25
4732 25 -17 24 -4 -37 -2 1 52 26 5 -32 -15 -64 -101 -18 -1 -45 51 -38 -39 15 -26 9 -14 -4 21 -3 -42 -52 -15 26 -46
4763 -46 8 -34 -14 0 -3 -19 -34 -24 2 -55 -65 31 -41 1 25 -49 -5 -22 -14 14 58 68 41 -14 37 -30 -16 9 51 6 -3 3
4795 3 -12 -7 -14 -65 14 11 -53 50 -25 33 -49 24 -24 29 20 -45 -55 17 25 13 -50 -15 -19 -14 19 -23 -60 66 -17 -4 -3 10 -59 41
4829 41 -35 71 21 -15 -13 19 -57 -32 -48 37 -1 -18 -53 0 9 -21 2 -5 -11 -15 -52 -34 10 13 67 1 23 13 -5 -5 -8 25 16 24 15
4864 15 47 51 -53 -9 -53 -16 -19 -13 -7 27 61 20 -15 -27 72 -4 37 10 2 53 7 -25 18 43 44 14 30 18 -56 -54 8 14 -66 -14
4898 -14 -1 -32 60 3 31 -12 -49 14 -63 25 11 -42 65 -31 -2 -2 -62 27 -15 -14 6 -3 1 18 -7 -74 -11 -60 -21 -23 -36 13
4930 13 -21 17 -7 1 -33 -69 12 -12 61 56 17 32 -15 23 -7 75 1 4 -25 1 11 -16 -26 -7 18 -22 31 -11 -11 -22 -55 -5
4962 -5 37 -75 -40 -14 -31 -14 -12 -8 -26 26 -43 15 -21 -40 25 -51 -18 -26 10 -64 -15 -41 -19 -10 52 -20 -40 39 -33 51 2 22
4994 22 45 -55 23 0 -71 19 38 68 41 78 19 18 44 -4 -50 -38 -32 30 13 -2 16 -16 -37 63 -77 -25 33 -2 -33 -14
5024 -14 -41 -45 -10 -4 40 -12 3 23 -37 -6 -52 -24 -10 -7 -26 7 33 8 -65 19 -1 -81 74 40 42 28 -24 22 -36 20 -18 -44
5056 -44 56 53 17 -22 -7 36 -73 -4 -53 -10 29 -44 34 -4 -10 52 -13 31 -57 1 -8 -41 27 -98 59 -50 16 -3 -37
5085 -37 5 58 10 57 72 34 -29 31 -16 6 -39 -66 54 60 -29 -14 43 17 53 47 9 10 2 14 23 -34 -1 33 -7 -71 16 3
5117 3 8 3 -39 3 21 27 -4 13 39 23 27 35 26 34 -1 42 -4 27 38 -9 18 -6 -23 38 -34 20 54 -18 16 32 -17 33 12 -8
5151 -8 -50 -26 35 -50 -19 -37 -60 6 -4 -69 28 -1 -3 -89 30 28 38 80 5 -17 23 29 -40 -27 4 0 -41 14 -14 4 6 19 18
5184 18 -6 39 -2 74 -57 -42 20 -7 41 -57 -2 25 -15 26 -15 4 -19 20 14 15 -17 8 -11 -50 -46 16 17 -44 -29 52 -24 -17
5216 -17 27 55 51 17 -7 -20 -4 54 68 12 9 -49 24 -12 55 -63 -20 -5 -16 48 0 -12 2 -33 1 47 -2 -25 -21 70 -11
5247 -11 -14 1 -2 39 -37 -65 -9 37 36 8 -63 56 -7 -13 -46 7 28 -16 36 -30 19 -37 28 -15 -25 -32 -31 -46 19 -4 -11 -27 18
5280 18 5 4 -65 -14 39 65 -72 9 -9 -5 34 12 -70 28 30 36 28 18 17 47 10 70 41 20 5 -3 14 0 -39 -40 -5 -18 16 26
5314 26 20 -1 22 -43 5 11 -48 -14 37 -25 63 -5 -59 16 1 27 17 -5 34 -1 7 -23 -67 -11 30 15 26 -2 61 15 88 -8
5346 -8 51 -85 18 54 88 -33 -21 15 30 -6 -6 24 2 -50 -15 -73 69 -66 12 21 25 27 -2 3 -60 -40 43 -25 -51 9 16
5377 16 -11 -34 48 -39 -6 12 -51 45 -16 -54 -73 78 -28 38 23 -20 82 23 29 23 -47 -20 -25 6 21 19 -28 20 -43 -54 41
5408 41 11 -1 18 23 -15 11 15 10 51 36 32 41 -3 -17 -24 11 17 66 7 21 41 19 -49 -45 -33 -55 11 15 -24 -22 -58 -18 45 94 5
5443 5 -48 -13 14 -52 -1 -42 -59 51 1 10 69 -17 -8 -18 0 68 -34 -17 -3 -11 49 -8 26 -6 14 -12 13 44 66 -17 -39
5474 -39 -45 19 -41 15 -2 10 -62 -51 -69 -7 39 -7 21 -7 16 -9 14 4 10 -86 42 -12 -40 -21 -33 7 -29 -9 39 -10 -61
5505 -61 57 60 14 -20 -11 -78 15 -14 0 -54 -32 -40 0 15 -41 16 -23 -6 -14 27 6 -15 -42 22 46 4 -12 -44 25 34 21 -1
5537 -1 45 25 -1 5 8 -14 17 3 16 -103 63 65 -5 -62 0 30 2 31 1 -17 -38 -16 -42 -29 -21 24 53 -8 -24 30 -1 44
5569 44 13 -41 -24 -70 64 16 -40 1 -35 -12 26 41 -13 -6 21 3 11 -33 -5 -31 -4 -33 -59 -41 -16 -58 15 -28 29 23 -8
5600 -8 58 -23 17 23 -19 -7 -2 -28 -68 -6 -34 -29 3 21 33 30 -13 -10 29 37 -9 -6 19 20 -13 -43 -38 3 -20 34 24 39 18 -34 -13
5635 -13 -10 0 17 20 14 20 -10 32 -28 -6 -38 20 21 -1 16 -2 0 39 -11 38 -6 17 -21 -24 -20 -12 -21 -1 4 3 11 15 10 20 -21 -85 25
5672 25 -4 18 -45 12 -37 51 -24 9 42 -46 25 9 -31 -21 14 9 -69 3 -16 -6 2 -42 -9 26 19 63 36 -50 36 10 36 -13
5704 -13 -79 -5 1 63 49 -3 12 -6 89 -34 73 -30 -43 20 -23 0 5 22 25 -37 -17 -7 15 16 107 -46 22 65 23 13
5734 13 -47 19 -12 -8 -11 -35 40 -7 -15 -14 10 -22 -1 -21 -5 22 -19 20 -61 7 -45 -42 -104 23 20 -6 -68 62 26 -26 28 -2
5766 -2 -9 2 -84 -3 2 14 13 -67 -2 33 42 -5 -29 -12 55 -28 55 -31 22 -54 -2 -36 -68 -30 14 26 -3 33 -43 -58 33 0 -9
5799 -9 -4 -10 45 -20 15 5 -8 -20 64 12 4 21 -17 26 -49 55 10 33 76 5 1 21 39 28 3 6 10 60 14 19 52 18 25 41
5833 41 1 12 -37 28 28 -74 -42 -59 7 -9 -21 5 -32 6 -22 1 -19 -60 -4 61 -6 1 -24 17 -10 -55 38 7 -40 -1 -8
5864 -8 -76 17 20 88 15 -51 -20 -21 7 -50 -8 58 -10 -24 23 -59 -25 -11 9 0 -16 24 22 69 -33 37 -65 -4 -1 -46 64 -3
5896 -3 -60 24 -10 24 -45 -2 47 -52 68 -26 -46 -2 -5 -40 1 20 -48 7 28 2 -36 -11 24 -36 -6 -12 3 -39 -56 -5 -9 56
5928 56 0 55 18 6 38 59 62 58 -43 10 28 -1 41 -4 -71 41 -32 -15 58 -57 40 12 -2 -16 22 46 -3 26 19 12 15
5959 15 -52 20 32 4 -31 -24 3 28 21 -60 25 38 -21 3 -9 -49 -31 -61 -11 -6 52 45 -14 11 -13 -4 68 1 44 26 18 19 24 -2
5993 -2 -21 65 -25 -37 13 -4 18 -5 -8 -2 -37 20 6 0 -14 61 -8 7 -11 -45 42 14 -8 11 -34 27 53 -62 -30 31 23 27 1
6026 1 -9 9 8 4 9 -21 60 -25 -41 8 -45 -8 23 29 -17 59 28 -44 -33 12 47 -10 -65 3 29 12 64 7 26 32 55 82 -34
6059 -34 1 -33 26 37 10 -64 -52 26 -23 -23 -43 16 26 83 46 -24 -49 4 -12 -11 33 -92 35 36 -24 -39 47 8 14 -17 -5
6090 -5 47 17 -8 -16 -17 0 -31 10 50 -15 -22 -38 -20 22 98 -12 23 -5 23 22 -43 7 1 -18 -1 4 -36 25 -30 41 -22 -8 15
6123 15 -36 -23 -18 12 26 -21 -14 -9 71 31 21 -27 26 45 25 39 -55 39 -1 43 2 22 82 23 24 27 -6 65 -5 -94 48 27
6155 27 -33 -15 -20 -52 -45 67 0 -23 31 -13 7 25 -39 8 -15 -17 3 -54 4 16 -22 -4 -5 0 29 12 24 37 -5 23 -45 -6
6187 -6 44 34 45 -47 48 -15 -19 17 15 8 24 15 14 24 23 1 -11 -15 -5 45 -10 25 -33 48 14 -43 23 11 3 51 17 -14 -57 41 13
6222 13 -47 -16 21 44 36 -14 -60 24 -16 83 57 17 68 -31 -48 4 57 19 -16 -3 13 57 -7 -32 -2 -73 -65 49 -18 7 -28
6253 -28 -21 -61 11 -1 49 24 -15 23 -50 18 -13 -2 0 -29 -3 23 17 -71 42 -29 -31 19 35 -11 -12 48 -43 -2 6 24 -21 -69 -42
6286 -42 -17 27 6 57 -12 -38 33 -95 -38 -20 -13 -42 -65 11 -37 7 -11 20 62 -32 25 -8 14 89 29 -31 55 14 14 19 -88
6317 -88 -19 -8 -33 36 3 -66 11 -56 -34 -7 34 5 10 48 -11 -9 22 -2 21 -10 -53 38 51 -8 12 -60 -9 -40 2 10 4 44
6349 44 49 39 10 -31 -8 -15 8 -30 -61 39 35 -35 53 -17 25 -15 -46 9 -45 -33 18 24 -7 20 -14 21 8 12 8 38 0 -50 -15
6382 -15 3 -57 -1 -30 -36 -15 15 2 18 5 -12 33 13 -3 59 -15 -6 8 -21 -6 59 7 43 18 14 7 -13 -7 -15 -37 -88 -13 32
6415 32 23 -37 14 -7 -37 -17 30 15 38 -29 -29 -14 -16 35 19 17 -26 -61 17 -37 -66 16 7 3 -54 27 17 -26 36 -15 -11 -34 13 -8
6449 -8 -47 -64 11 -5 -39 -39 -56 0 13 21 25 30 -32 -5 0 -7 1 3 29 15 -44 -70 -27 13 24 -24 -14 -3 21 12 18 7 -38 5 30 -10
6485 -10 -38 16 1 18 -5 -2 19 14 12 -8 6 -43 -9 38 30 -19 62 29 24 -25 -23 11 0 43 -14 -73 34 3 -36 -11 -24 48 -1
6518 -1 14 6 7 27 -35 27 -9 -5 43 35 -26 -27 -7 48 -52 58 7 31 43 32 60 4 -26 -20 -1 25 -34 37 56 31 63 46 30
6551 30 -23 44 -73 15 -44 8 39 -15 10 23 -7 -6 9 -3 30 -13 21 23 49 3 -14 0 12 25 7 -20 -49 39 12 -32 -20
6582 -20 36 3 7 75 40 25 -60 8 13 -1 13 -27 28 -22 -3 7 11 17 34 -29 -16 53 -34 -14 -32 3 66 28 -22 34 73 32
6614 32 35 50 35 -9 14 -29 -10 -13 20 -21 -58 -9 -65 17 -42 40 -27 46 28 -21 -11 1 37 28 -64 15 25 -10 31 30 4 40
6646 40 -3 -33 40 -73 -6 -27 -59 -22 -42 -23 -12 30 19 -17 15 87 -12 58 -2 0 37 -10 23 -3 39 4 8 27 12 37 9
6677 9 -48 -8 -19 -64 22 -7 8 26 -20 12 6 -14 -10 -23 6 12 -15 -7 -50 31 21 5 23 52 22 42 -10 32 34 -44 6 -37 5
6710 5 -36 14 15 -12 -49 13 1 -41 -9 24 -10 43 -32 -15 -51 37 1 -62 -76 -1 9 14 55 10 -4 -92 16 42 16 -36 28
6741 28 66 -25 10 -17 -41 16 -21 -25 -45 14 11 2 -29 -35 57 79 52 -38 11 45 14 -9 38 -36 -33 -25 -6 -10 -39 20 -56 1 20 -53
6775 -53 -15 24 18 -28 25 -37 -25 3 -75 13 -37 30 45 4 -8 -40 -11 -33 9 -4 -71 19 -7 5 -41 4 32 -51 30 2 0
6806 0 14 -76 34 18 16 4 65 -9 -43 6 -63 -27 -25 8 -32 16 70 25 -16 31 -27 -26 -16 -42 -78 -28 -8 10 -33 -36 23 -52
6838 -52 -33 20 0 3 50 -43 18 26 40 -37 96 28 25 71 -30 -38 17 -2 -21 -3 -34 -2 -6 37 -42 56 -18 20 -4 -23 -14 15
6870 15 63 36 77 -16 -23 -25 -80 56 -67 18 -16 14 -7 40 2 6 15 -66 -5 -17 -27 -18 15 4 30 -38 23 -4 -28 10 -43 -8
6902 -8 -47 41 47 -14 -42 -16 67 13 48 -9 19 15 53 5 -14 -23 -10 -8 -65 -1 0 -13 -11 7 -20 8 -29 38 -113 -20 -10 8 36
6935 36 -54 -51 11 21 31 -4 -7 14 34 -12 8 -46 -44 -23 -88 18 31 -30 54 -15 -17 -33 20 84 -16 -15 5 -9 16 -32 25 -14
6967 -14 -17 14 53 -41 6 47 -42 19 7 56 -27 -39 7 -4 9 44 5 58 -33 -66 -45 36 11 -32 17 1 -10 -23 40 -23 13
6998 13 -64 -17 35 24 -21 -30 42 -18 25 54 30 -22 -13 -40 61 34 45 -64 23 -27 -21 -40 -25 19 -63 -16 5 79 -14 40 -63
7029 -63 -11 -44 -32 -54 -23 -30 20 67 -3 -42 -31 8 34 -21 67 -10 -26 21 -39 -41 -38 0 18 55 33 26 27 11 -18 -35 -6 17 6
7062 6 47 0 31 1 2 32 -29 29 62 34 31 28 -59 21 -3 30 73 -11 23 -30 12 2 -17 7 14 -16 -20 -3 36 -43 48 -9 -23
7095 -23 62 -75 -35 51 -51 61 16 25 52 15 -16 5 52 1 19 12 23 10 -18 -14 40 -3 26 15 -21 -61 45 13 23 38
7125 38 73 43 7 -9 -38 -29 10 -13 -3 -56 -16 29 48 0 -10 29 37 2 -37 -28 50 33 -20 -63 -1 -20 -2 66 -25 7 30 68
7157 68 -49 -27 -21 49 4 -21 34 6 -19 79 23 15 21 -58 -44 -17 21 -36 -30 42 -48 -19 -97 12 -18 -24 -50 -68 -18 8 0 4 5
7190 5 32 -19 -60 19 -43 -28 10 -18 -17 33 61 15 -4 70 -90 18 -9 22 -50 20 19 34 -37 2 -23 -33 -15 63 0 47 -1
7221 -1 -34 -20 -15 -4 3 1 -10 6 77 -34 -34 7 -17 -62 3 -2 -73 35 -37 -16 -28 74 0 71 -27 -17 39 4 30 12 -2 -25
7253 -25 -32 17 11 -15 -7 -28 -63 32 -64 31 -17 36 -4 -46 -9 -20 -5 -23 -4 3 -22 12 11 -2 5 4 -1 -12 2 47 -9 47 -25 -67
7287 -67 -21 -28 1 48 3 14 -36 -24 -14 31 -16 50 -5 -23 15 33 68 41 -12 9 23 -5 65 17 12 26 32 74 -11 -2 58 -21
7319 -21 -73 -22 35 3 -3 -11 10 4 12 -21 -5 27 34 0 7 -6 60 -25 -15 -17 -32 9 -9 -39 -50 -15 44 48 -4 -39 -27 -1 -19 58
7353 58 -144 -27 28 6 -44 12 -20 -72 1 -40 4 30 -12 24 2 43 63 -29 -18 -65 -7 -32 15 45 53 -32 -18 0 -13 -34
7383 -34 32 -82 -20 35 -31 10 68 -5 -44 -47 -9 -57 2 35 54 52 -29 -16 -16 33 -25 24 -13 27 -26 -22 -15 12 -4 28 52 22
7415 22 -49 -22 -49 -54 -44 9 40 -8 -63 -22 34 -9 9 -8 66 14 18 -25 2 -5 32 -33 -23 -18 14 -47 4 -48 -5 1 -26 -42 -50
7448 -50 -33 -24 15 -14 -8 -15 -12 12 -30 54 -9 28 -43 -23 22 29 43 -60 -65 46 -50 10 -27 -6 17 -50 -52 -72 -4 -4 2 -9 -10 16
7482 16 2 -38 22 14 -3 -16 9 33 -35 -13 -16 -32 26 -37 -1 4 22 26 -21 -37 46 7 -36 12 71 88 -38 -20 -32 12 20 -4
7514 -4 -56 -1 -27 -48 -41 51 -11 18 -7 -18 62 18 35 11 -36 -11 -1 -14 -31 -21 38 -107 14 13 37 -8 -42 -9 -14 -40 -17
7545 -17 -106 -4 21 29 33 14 0 -36 -19 10 11 10 5 3 54 -45 -20 60 -65 -33 -17 -89 8 -16 -5 -50 -74 24 -29 29 4 22
7577 22 -11 18 -15 37 35 12 -6 69 -3 21 -5 25 -34 1 54 41 25 1 71 41 -25 10 43 1 17 -7 6 29 -13 8 24
7608 24 -27 -45 12 14 -29 44 -60 12 17 -12 46 24 -49 0 -33 48 2 7 -39 6 37 -14 48 -23 6 -7 -3 44 -13 -49 48 -47
7640 -47 19 1 -3 -17 1 -1 25 -50 -6 -63 -47 -1 61 22 -1 9 -5 -15 -9 -7 30 -4 -29 36 -4 43 -28 18 0 36 -11 -15 55
7673 55 -16 10 61 50 -10 -11 -25 -15 -29 -39 -53 20 17 -7 -59 44 14 -9 34 -63 -28 -44 -78 42 76 12 8 -11 14 -34 19
7704 19 28 47 -2 1 35 -77 -22 -7 21 -36 11 27 33 58 -25 -17 35 13 -39 -34 26 11 -13 1 34 40 48 -10 -37 -4 13 29 5
7737 5 3 -6 12 14 -19 23 -3 -5 -24 -8 74 -78 -20 -17 -47 1 -41 -25 -42 3 -24 -49 2 68 2 -16 74 76 5 63 19 55 27
7770 27 45 24 -3 -53 17 58 -8 -25 28 -36 20 -39 -16 38 -41 33 -41 84 9 1 41 -64 -19 -24 -42 29 -27 26 -5 3 -28
7801 -28 33 -25 2 -54 2 31 -5 -59 -4 -61 -1 -16 18 43 -39 -27 23 -10 -25 -27 31 -10 -44 23 -35 6 -31 -3 -8 51 30
7832 30 -14 -6 -8 -6 47 -2 -13 30 -6 -71 17 65 46 -14 -15 -14 -57 11 36 -52 -48 25 27 55 8 -39 -7 -48 -16 -51 46 -18 45 27
7866 27 -7 -49 -45 -18 -9 51 -13 32 15 -10 -58 9 -20 -35 -7 -13 -13 -52 -39 31 -24 53 2 54 28 7 21 23 23 -64 -7 -36 -50
7899 -50 -30 -6 -7 1 -49 -19 22 49 -18 2 -12 -56 9 -15 -65 57 5 -12 23 24 40 69 -3 10 5 -14 0 -62 22 20 1 -80
7931 -80 -15 9 -29 40 4 -19 -28 -48 13 -4 -68 61 -40 -37 2 -8 17 -4 -56 -5 -58 29 66 2 12 16 -28 19 -32 9 -48
7962 -48 -29 19 -22 1 -17 -25 -4 -6 -1 8 5 -22 2 50 52 13 -27 -44 -38 -34 -85 4 -3 -3 29 -36 -9 -9 43 11 27 -6 6 4 -43 33
7998 33 -27 0 -3 14 8 -8 4 -32 40 34 -34 -62 -15 73 7 5 -59 -29 -60 38 -6 -71 9 -3 1 5 -22 -39 -62 40 -4 30 -13
8031 -13 14 14 20 3 -24 20 4 15 -62 -48 -8 7 -23 17 -17 -25 -17 -21 32 19 -18 -9 32 -87 74 -3 1 1 -37 -44 -58 -6 -30 0
8065 0 -32 70 -31 -16 -40 -14 -30 43 -14 30 -9 -14 24 2 -4 12 -31 43 -35 5 45 9 61 -53 41 35 10 -47 31 -31 -40
8096 -40 -5 31 41 -77 -4 -18 0 -47 -10 -43 5 -14 -52 37 56 -11 -21 -43 48 39 45 -43 -47 -15 35 -8 -14 -9 -33 -2 28 17
8128 17 -31 20 31 -28 -5 -7 35 23 -19 109 49 39 -47 23 81 25 -5 -9 17 -37 -19 0 -22 21 -11 -57 21 35 2 -16 22
8159 22 -18 45 -1 -44 -19 -30 -28 21 -9 26 12 -42 -20 25 41 7 44 5 24 -73 30 -2 22 -10 -33 22 -21 -27 -14 0 -78
8190 -78 -26
8191b6
$$ Imaginary data points
##PAGE= N=2
##DATA TABLE= (X++(I..I)), XYDATA
0 0 0 0 0 0 0 0 0 0 0 0 0 0 0 0 0 0 0 0 0 0 0 0 4 -4 8 -8 8 -8 8 -8 9 -12 15 -16 16 -19 20 -23 25 -28 31 -35 36 -42
44 -42 45 -51 58 -63 71 -81 94 -107 124 -148 180 -227 300 -429 707 -1548 8738 53590 42307
63 42307 -10848 -46086 -25704 26200 53979 28851 -18763 -37034 -8229 34531 46915 17489
75 17489 -20951 -28543 358 33980 38528 9721 -23117 -26498 2719 32677 31352 102 -28922
88 -28922 -25940 5297 30114 21594 -10436 -32345 -23197 5937 24328 13315 -15554 -33166 -23119
101 -23119 4609 22936 12038 -19182 -38278 -23557 11065 29246 9265 -29164 -42722 -13913
113 -13913 25938 32255 -2542 -39275 -35617 4875 36144 23658 -16060 -37797 -19079 18147
125 18147 33771 12636 -20182 -29397 -7415 21760 28561 6887 -20446 -24785 -1721 24074 25633
138 25633 1041 -23882 -21702 4991 26284 18801 -7860 -24669 -14698 10041 22097 9881 -11630
151 -11630 -20340 -9939 7941 16193 7533 -9671 -19503 -12450 5996 18267 9919 -12980 -25799
164 -25799 -12799 13334 23555 4972 -23029 -28020 -3407 22867 20920 -6684 -28761 -20909 7425
177 7425 24433 12011 -14624 -26405 -12358 12121 21279 5844 -17390 -23810 -6995 15268 19651
190 19651 1007 -20898 -21778 -311 19661 16116 -6745 -23208 -14894 8156 19448 7768 -12104
203 -12104 -18346 -6122 10092 13676 2790 -9694 -12197 -4136 6778 11287 5090 -6770 -12967
216 -12967 -6499 7553 15133 6366 -10790 -16984 -4176 13776 16766 721 -16773 -15745 2596
229 2596 17386 12400 -6210 -18207 -11175 6931 16499 7510 -9977 -17876 -8087 9357 16116 4163
243 4163 -14002 -18321 -3864 13847 15162 -1839 -18347 -15353 3701 16874 9602 -8961 -17646
256 -17646 -7356 9480 13776 2514 -10469 -11636 -1534 8645 9150 921 -7261 -7916 -1463 6519
270 6519 8976 2876 -6423 -9201 -1928 8549 10921 1788 -9435 -9970 1032 11321 9730 -2029
284 -2029 -11314 -8104 4026 11614 6999 -4805 -11585 -6567 5287 11680 5525 -7187 -12988 -5159
298 -5159 8453 12914 2394 -11786 -13451 -304 12729 10971 -3780 -14656 -9146 6101 13317
311 13317 5083 -8380 -12138 -2743 8579 9636 461 -7916 -7553 96 7064 6733 136 -6081 -5916
326 -5916 149 6463 6843 440 -6358 -6070 1176 7644 6536 -1136 -7225 -4984 2829 7790 4975 -2422
342 -2422 -6867 -4062 3212 7544 4478 -3063 -7624 -4357 4216 9018 4055 -5835 -9755 -2897 7720
357 7720 10001 471 -9960 -9306 1897 10534 6907 -4690 -11060 -5089 5951 9442 2180 -7030
371 -7030 -8398 -1083 6559 6512 -446 -6554 -5836 409 5814 5060 -1080 -6032 -4776 1280 5867 4208
387 4208 -2038 -5953 -3430 2639 5636 2768 -2664 -4974 -2042 2896 4702 2182 -2108 -4201 -2225
402 -2225 2448 5087 2929 -2359 -5466 -2752 3762 6872 2349 -5116 -6942 -839 6640 6773 -917
417 -917 -7729 -5667 2735 7717 3901 -4317 -7681 -2692 4778 6367 780 -5555 -6005 -531 4987 4689
433 4689 -911 -5702 -4722 754 5000 3367 -2254 -5752 -3284 2155 4725 1812 -3287 -4808 -1472
448 -1472 2838 3480 457 -2825 -3203 -663 2226 2737 838 -1731 -2870 -1298 1919 3629 1686 -2214
464 -2214 -4020 -1236 3467 4827 835 -4161 -4317 661 5248 4249 -1446 -5347 -2966 2842 5535 2316
480 2316 -3194 -5069 -1237 3840 4654 493 -4202 -4369 -57 4336 3759 -1204 -4940 -3435 1395 4406
496 4406 2142 -2878 -4909 -1772 2623 3472 155 -3461 -3497 -267 2468 1906 -699 -2455 -2010 -80
512 -80 1600 1616 89 -1605 -1981 -481 1737 2547 653 -1924 -2493 -2 3035 3209 41 -2868 -2217
529 -2217 1325 3969 2731 -1043 -3245 -1328 2526 4133 1779 -2094 -3230 -437 3401 3850 462
544 462 -3179 -3104 667 3972 3093 -1231 -3947 -2086 2080 3826 1266 -2795 -3487 -462 2684 2490 -417
561 -417 -2848 -2132 508 2155 1319 -776 -1891 -1261 353 1529 1110 -223 -1363 -1162 220 1718 1632
578 1632 -3 -1577 -1295 640 2223 1857 -271 -1825 -1010 1321 2705 1717 -700 -2103 -712 1905
594 1905 3058 1291 -1499 -2326 -194 2765 3006 156 -2589 -2162 926 3363 2165 -1306 -2990 -1030
610 -1030 2209 3008 603 -2241 -2397 273 2577 2024 -401 -2044 -1314 895 2114 1138 -639 -1380 -532
627 -532 966 1654 1011 -348 -943 -291 906 1546 990 -243 -925 -328 931 1655 1083 -297 -1060 -429
645 -429 967 1747 1031 -653 -1536 -531 1419 2061 684 -1467 -1940 -79 2051 2027 -357 -2225 -1582
662 -1582 929 2508 1233 -1453 -2413 -508 1842 2157 127 -1972 -1678 505 2103 1421 -541 -1664
678 -1664 -825 1011 1851 830 -720 -1204 -215 1153 1521 532 -636 -788 146 1135 1160 413 -423 -450 152
697 152 838 986 484 -332 -575 -120 798 1110 593 -525 -1143 -321 1045 1416 213 -1293 -1402 123 1584
716 1584 1308 -562 -1864 -1129 894 1815 665 -1309 -1817 -274 1475 1545 -8 -1637 -1420 382 1631
733 1631 1005 -683 -1578 -733 787 1346 345 -1068 -1279 -249 890 979 -69 -986 -844 43 734 506
751 506 -280 -745 -466 41 404 332 -49 -483 -617 -132 381 528 91 -537 -819 -214 766 881 -12 -971 -930
772 -930 244 1224 985 -355 -1189 -617 858 1447 609 -927 -1219 -130 1250 1303 -4 -1209 -986 469
790 469 1345 861 -653 -1353 -542 842 1099 155 -1040 -1128 -177 761 537 -470 -1167 -829 1 440 57
809 57 -666 -914 -629 -24 138 -120 -462 -632 -572 -266 56 102 -130 -638 -659 -139 403 413 -156 -748 -624 176
831 176 803 604 -288 -886 -417 584 1047 490 -618 -902 -2 1072 1088 128 -881 -693 444 1153 703
850 703 -429 -989 -321 715 1059 70 -813 -852 55 810 530 -328 -912 -526 125 501 61 -495 -709 -419
870 -419 22 138 -127 -447 -503 -427 -66 46 -77 -339 -485 -429 -188 204 176 -157 -544 -499 -11 496 267 -187
892 -187 -634 -372 331 752 315 -484 -676 -64 771 766 14 -680 -467 304 877 553 -291 -735 -204 654 866
913 866 150 -639 -586 137 682 502 -206 -598 -339 306 534 96 -394 -440 -74 308 259 -68 -308 -302 -104 119
935 119 85 -84 -246 -222 -151 2 145 5 -137 -316 -257 -43 271 180 -208 -422 -316 273 427 111 -379 -518
957 -518 -59 420 508 27 -545 -370 228 691 402 -312 -535 -179 495 699 119 -449 -389 155 594 422 -144
978 -144 -398 -177 286 500 153 -236 -316 9 417 286 -57 -227 -152 115 183 132 -133 -179 -32 -12 -7 49 5 -106
1002 -106 -183 -122 -5 133 149 -184 -301 -172 113 238 115 -303 -429 -115 328 372 -56 -438 -269 105 461
1023 461 231 -243 -414 -148 352 430 20 -388 -370 177 421 315 -241 -391 -135 317 401 116 -283 -261 45
1044 45 241 235 -121 -239 -105 154 199 95 -76 -192 -99 92 115 13 -58 -109 -99 -29 4 99 84 -95 -194 -103 72
1069 72 204 47 -186 -250 -46 235 215 -116 -285 -257 141 330 114 -250 -310 -65 213 299 -25 -316 -249 55
1091 55 344 135 -172 -376 -91 210 317 -5 -257 -203 62 218 134 -153 -267 -77 58 183 54 -88 -159
1112 -159 -26 78 42 0 -82 -40 8 -3 27 34 -45 -62 -82 -24 78 101 71 -138 -184 -5 189 95 -56 -140 -162 107
1138 107 243 102 -199 -204 -50 223 214 -49 -241 -167 129 226 103 -113 -256 -7 249 234 27 -207 -195 27 256
1161 256 180 -99 -216 -70 170 166 85 -169 -97 32 142 68 31 -30 -54 -10 70 22 -41 -56 7 -52 -13 63 64 -16 -47
1188 -47 -114 -49 2 52 -5 -68 -26 57 141 34 -140 -168 -27 167 145 7 -203 -141 108 185 40 -99 -187 -6 150
1213 150 187 12 -201 -172 43 191 139 -91 -200 -76 105 159 22 -55 -113 91 72 85 -15 -72 -44 94 47 -9
1237 -9 -49 -8 7 68 7 34 82 -2 -15 -29 0 4 112 -19 -41 -25 96 131 86 -65 -104 19 92 122 31 -122 -52 37
1265 37 177 97 -16 -108 9 115 107 -67 -144 -91 93 132 40 -94 -111 -14 129 143 -18 -97 -59 35 141 83 -11 -54
1291 -54 9 88 11 33 -71 -18 36 108 6 -11 -7 -51 -3 -3 69 -46 69 37 -53 -1 31 59 41 -41 -31 -45 82 103 34
1320 34 -40 -64 51 128 90 -20 -81 -45 60 98 -24 -105 -56 66 84 79 -129 -94 25 80 103 -8 -83 -61 57 135
1346 135 27 13 -33 16 81 59 22 -50 -13 60 -36 -21 -60 27 -42 59 -15 -5 -15 41 -6 -1 -40 16 103 65 43 -26 -44
1375 -44 22 88 -49 -50 -50 90 32 48 -80 -57 -16 90 69 8 -62 21 -1 130 1 -8 -126 -22 76 47 22 -109 -48
1402 -48 -9 87 32 -99 -33 -20 55 63 -48 -15 -26 25 48 37 -95 -76 -49 -41 -50 -33 -36 0 -10 -24 9 -64 -17 -29 8 -46 98
1433 98 6 61 35 -119 -47 27 68 -29 -97 -114 -38 64 87 -5 -23 -24 24 57 60 47 -21 -76 92 59 38 -42 -12 15 29 35
1463 35 -7 -17 -35 39 24 -4 -64 19 -9 -8 -5 -4 56 -23 16 -13 0 -65 6 -21 -27 28 -72 -25 -9 27 -30 45 14 -1 -16 -33
1495 -33 -20 7 -6 0 -52 -32 61 13 -20 -31 -35 -94 25 32 -47 -1 -71 -67 102 -25 -24 8 -60 45 73 24 -50 -28 -1 58 63
1526 63 10 -44 -8 18 67 -27 -16 34 -5 -5 21 -32 -21 5 -3 11 -55 -28 -28 -9 -32 16 -60 6 4 -37 -48 62 51 0 2 -23
1558 -23 -84 -1 91 -31 0 5 -8 59 -29 44 -61 -52 28 57 39 -6 -2 -60 54 57 53 2 18 11 -11 21 28 -70 6 8 -6 1 24
1591 24 -7 3 21 -34 27 -7 -18 -14 76 53 -61 -61 -34 -4 -18 -25 -83 32 53 -20 6 -8 -35 49 -8 2 21 -4 37 71 5
1622 5 25 2 24 12 22 -4 49 17 17 2 4 -13 22 -18 24 11 -30 -19 36 27 48 0 -17 -11 14 37 42 -29 10 4 -9 -6 -7 -15 -20 29
1658 29 -2 -56 -24 -7 18 -24 -40 -36 -31 -61 23 8 7 -17 3 -13 31 15 -25 -13 12 12 -2 -63 36 23 33 -43 -29 -8 11 -6
1690 -6 -6 -46 38 12 58 6 -14 -11 35 -35 17 -25 -34 -13 97 -2 -23 32 -75 -36 -63 43 -8 -29 -5 29 -10 -49 -11 -5 -14 -28
1722 -28 -38 -10 -46 25 16 -17 -23 44 19 -9 -45 16 -4 8 -28 -26 -69 -50 25 -13 -52 -11 14 26 -4 -43 -20 30 53 -9 45 41
1754 41 -18 55 8 1 -18 -31 -36 6 42 -8 -13 -14 -39 10 39 13 -96 -43 -44 -20 -2 0 25 -18 -32 -29 -21 -43 -47 -17 -1 -21 -13 78 -33
1789 -33 -29 7 -26 -80 -15 3 -24 -22 -6 -30 -29 3 -15 -61 9 17 31 -19 -18 50 53 25 -7 -59 -24 -18 66 65 -21 14 -7 30 -46 20
1823 20 -30 -23 37 27 14 6 -52 -34 37 18 -46 -2 -43 -17 12 -7 -49 -48 -8 29 -64 -83 75 -38 -2 -37 44 -27 52 -47 17
1854 17 9 13 21 28 13 36 -34 28 -28 27 46 61 -5 -1 36 23 32 -30 -47 23 -8 -2 16 -5 30 11 -13 3 19 49 22 22 49 -7
1888 -7 -44 21 -13 35 2 -32 6 23 -24 -4 -28 -9 67 65 -39 4 -61 -45 -74 -26 34 -6 -21 42 -27 -19 -37 -10 14 -24 74
1919 74 -35 -12 50 47 5 39 3 70 72 -51 8 84 8 0 1 -73 -42 -8 3 -5 8 -13 14 10 -27 -24 -46 -13 56 -27 -13 -54 8
1952 8 112 33 -8 -53 -22 14 -37 -24 -31 -8 -82 -53 -24 -9 -40 -34 -29 7 -49 -50 -33 3 -13 9 -57 -47 24 -21 -52 -5 -38 0
1984 0 4 -6 2 16 -60 39 79 -28 54 -73 -8 14 45 -41 15 0 60 -32 -27 45 -8 38 16 -1 24 -71 57 2 -32 -99 -53
2015 -53 14 8 -46 -47 -33 -54 -7 -3 17 -30 -34 -48 -8 86 -2 -36 -37 -18 -26 11 -82 42 63 -14 23 -5 -52 -14 -5 52 48 30 38 43 51
2050 51 -17 -5 16 -18 -8 -22 22 -38 11 4 -17 -7 -15 37 4 15 49 -69 -52 11 -2 5 -54 10 17 0 74 46 -44 -4 38 26
2082 26 -37 -29 22 -24 -2 14 -19 -2 -16 -9 -23 -47 55 -38 -45 -17 6 -18 27 -32 19 -17 31 26 -53 -9 18 -25 21 6 31 -76
2114 -76 41 55 47 5 29 -2 -9 41 7 43 19 38 20 -33 -14 -11 -8 -5 2 39 6 -26 -100 -18 -19 -21 -1 -5 -16 1 -24 25 14 -22
2148 -22 -9 -41 56 -11 49 -19 27 -49 -43 -47 34 -40 -73 26 -34 -4 -4 10 -23 -34 -19 -12 35 7 -35 -14 17 -21 -66 9 71 2
2180 2 50 -10 21 -59 49 65 -26 -7 17 -3 -63 33 16 0 49 -40 50 30 -13 -56 10 2 -15 -34 -45 1 29 62 -41 6
2210 6 13 42 -16 -17 59 -68 -8 -100 -4 -2 -7 -19 24 17 -32 0 58 33 13 15 -4 -20 20 -15 -23 37 -1 35 41 -6 -15 26 -16 67 -56
2245 -56 73 -2 36 27 -92 13 -17 -2 -73 26 65 -20 -19 -12 32 -35 -2 -99 84 3 2 -11 -14 -2 -20 -30 -15 -28 1 -16 10
2276 10 18 -29 57 -1 9 -12 -15 -41 -10 23 3 1 21 -36 20 -19 19 -16 53 14 -31 3 0 78 85 3 48 -15 43 -21 -35 67
2308 67 -52 77 6 -5 24 14 24 -9 40 19 2 23 -21 16 -54 50 -34 33 22 41 -29 -21 -51 34 55 62 -27 3 36 16
2338 16 -37 7 16 4 -48 56 10 3 -4 -49 -21 91 -12 44 44 -76 -21 20 62 2 3 43 19 8 41 -37 -54 16 11 -17 32
2369 32 -33 10 -31 36 15 -14 3 -2 -36 0 10 -26 15 46 -84 -6 -16 -3 33 45 26 -10 -8 -10 -90 -11 -13 -30 -58 -26 -15 22
2401 22 1 -14 -3 -57 -11 -15 17 -42 14 26 -32 29 38 -49 27 -9 -40 4 14 -7 -36 0 18 22 25 -38 36 50 5 -21 18 -14
2433 -14 15 -56 18 25 27 31 23 7 0 -40 -8 -19 -18 -16 2 32 60 42 27 -41 -5 -20 28 -69 -112 2 81 5 -1 8 2 39 27 14 8
2468 8 -9 24 43 84 -29 -53 60 37 78 11 16 59 -81 26 34 -6 47 22 32 41 -35 -23 6 4 5 33 -15 -52 29 -28 2
2499 2 -10 -35 27 1 -22 14 33 -35 -7 -30 19 -35 -16 12 10 -62 -96 -72 -9 11 -37 -20 -22 -108 66 15 -24 -16 6 -35 45 13
2531 13 -10 69 -3 -26 -4 8 65 -6 -21 2 28 11 -40 -32 83 -51 -29 -36 2 -26 45 -18 30 58 13 -47 43 20 30 6
2561 6 76 13 -13 8 9 13 9 -26 10 1 -65 -18 39 -24 -40 -24 -50 -25 -5 25 22 44 -82 -3 -27 40 -21 33 9 6 29 -4 -31
2594 -31 -3 3 3 5 -33 28 -28 9 53 -14 58 -31 -5 89 121 -4 -17 26 7 75 17 -83 50 14 71 -42 19 -45 -95 -14
2624 -14 36 -27 5 -30 -12 20 -9 42 -42 -46 8 -12 -28 5 -36 1 -23 3 49 0 -9 -39 -52 20 -5 -11 34 -28 7 -50 -44 -24
2656 -24 -14 -17 41 74 45 3 11 -14 -29 41 88 1 -2 -28 -3 -47 64 -31 -14 -20 27 21 49 28 -46 -33 -49 68 -25 -58 -29 -62
2688 -62 -3 6 28 -7 -33 15 -2 -61 -27 -62 -12 -21 -135 23 -13 74 -55 -48 -63 6 4 60 -30 -42 14 60 39 6 -2 44 26
2719 26 11 -64 -49 25 9 7 28 24 -20 -9 -22 -7 -49 20 14 28 1 -31 -17 -72 36 12 37 -11 29 -15 -15 48 -20 -23 21 35
2751 35 -43 -49 51 2 32 7 -32 -31 12 0 -24 -35 -37 14 -3 74 10 -12 -13 10 -43 17 38 58 25 36 -55 -16 -14 36 -16 29
2783 29 -13 -72 -34 -19 -24 63 -7 4 26 3 7 33 20 -80 -78 -34 -46 1 21 19 13 -4 -70 -2 90 38 10 -16 -35 -41 -45 50 86
2816 86 10 -22 -69 6 20 -18 -18 2 51 -40 20 -35 32 5 -1 -5 59 5 23 -27 4 158 13 -35 26 -8 -27 10 -34 -14 -9
2847 -9 6 -3 55 30 42 32 17 54 -83 0 20 -28 60 -15 46 12 54 -44 -21 26 -37 16 -22 -6 -17 -28 -52 4 -37 -13 30
2878 30 -24 28 -4 -36 -11 -19 -10 -74 5 -20 82 36 -19 18 -29 105 65 -21 29 -49 -37 -60 -25 18 -4 17 -37 8 -44 35
2908 35 37 -5 17 21 -22 16 27 -15 41 12 20 35 18 36 -28 35 28 -16 1 -30 -15 -65 18 -9 71 29 1 14 -32 3 -19 -14 23
2941 23 -69 18 45 -5 31 33 31 12 17 7 8 47 -24 17 -1 37 30 33 4 14 -2 19 22 -33 6 27 -66 -45 4 -27 -22 2 41 31
2975 31 14 -21 16 -3 17 -25 -45 0 -6 -28 43 -20 29 -36 -35 34 -19 19 32 -31 -27 28 62 16 45 -9 -4 18 -55 -32 -23 18 37
3008 37 -7 -19 -52 -24 -70 13 39 -26 -30 3 24 68 13 -23 12 -33 -44 -24 -4 -42 59 4 0 18 -84 -7 3 -9 1 -10
3038 -10 16 0 -10 -48 20 -2 28 27 25 -40 -23 25 -3 -29 25 -29 -37 -20 -63 19 -14 -13 46 -46 -4 -17 -9 2 -48 17 -5 2 -17
3071 -17 41 -37 -66 18 28 -25 -8 48 -35 -10 -30 7 51 -34 -1 47 71 16 -39 -58 0 57 34 59 14 13 -12 -29 -46 108
3101 108 33 -5 -31 -7 53 -24 62 -7 25 -16 3 23 -34 -92 -93 -19 -75 15 34 -28 52 -80 -40 -68 3 9 5 -5 -13 -12 -20 -17 28
3134 28 -39 -16 -30 -18 16 28 -6 -58 5 45 45 -29 3 -13 -14 -16 -65 30 -55 -26 -7 -47 18 57 5 34 -18 48 34 -72 19
3165 19 -52 1 16 -11 -41 -28 -65 5 -6 -36 -3 -41 30 -50 -31 6 -33 17 -23 -62 -31 -61 30 -43 -25 -75 31 3 -38 -45
3195 -45 14 6 -37 29 -14 48 30 -28 -8 12 -5 1 -52 33 31 11 29 27 -27 65 -7 6 58 24 20 29 -76 -29 41 -12 -44 -40 11
3228 11 -8 -13 -13 26 -48 -44 -22 35 -35 1 -20 45 -19 -18 8 -22 -27 -49 -14 -7 67 35 -1 48 23 27 5 -3 -37 -11 3 26 7 -82
3262 -82 46 -66 42 31 -11 -29 -66 -29 2 83 20 91 -30 44 8 24 70 -28 42 3 32 18 -44 -27 33 25 35 1 -57
3291 -57 -38 33 18 -57 -14 -4 -6 15 13 -10 40 24 -33 25 55 -35 47 58 4 15 79 67 -59 -28 -11 24 -13 33 3 1 -22
3322 -22 21 51 -26 51 -6 -17 47 -39 38 54 90 16 -3 14 -16 -75 31 30 -22 43 -7 7 2 78 -14 -18 63 15 -6 21 51
3353 51 -4 5 3 18 69 22 -58 22 19 -24 8 -50 62 -8 -8 33 2 -31 24 -46 -15 -4 11 -26 -76 4 13 26 24 -21 -18 -34 -7
3386 -7 36 20 18 -50 -30 -33 13 46 40 6 114 0 -48 -35 9 -33 -33 -40 25 19 -6 -3 -24 -15 -1 10 -31 0 -42 -62 51 -17 44
3419 44 -77 -7 28 -31 -2 -29 12 7 16 -41 -51 27 -14 -35 -44 -21 0 5 -51 -59 41 6 54 5 9 41 5 47 -12 41 36 80 29
3452 29 33 36 27 -18 31 9 46 -36 59 35 18 -58 -6 50 -21 -27 -11 12 -28 -48 10 -10 -10 -44 -46 -73 -88 18 -42 -30 -8 -14 44
3485 44 2 26 -64 54 -1 33 -18 -22 -32 -39 11 25 39 -7 14 -1 -46 1 53 -8 -48 1 2 37 64 4 24 58 9 43 30
3516 30 57 -50 35 -15 -40 -11 5 27 30 25 -30 84 1 56 24 -41 -35 -22 -51 78 -53 -18 -56 -3 43 -32 -43 6 5 45
3546 45 -45 -30 7 38 25 -32 -9 0 1 -26 27 -90 22 -28 25 12 20 -5 6 -9 -13 56 16 11 49 -3 0 -29 -29 -6 13 38 5
3579 5 -39 8 -17 50 4 9 -18 41 -30 -14 -44 -7 9 -39 45 -47 5 2 15 -21 -2 -20 -34 -50 -7 -35 -38 11 -12 -14 -50 -31 -30
3612 -30 -40 -4 -19 18 37 -40 70 18 -1 19 -35 1 34 -3 -78 24 24 -17 9 88 18 -12 28 18 -27 22 58 49 -14 15
3642 15 -43 -41 -25 -10 -45 -22 90 -9 -7 8 -20 -24 -32 31 1 -56 23 9 -30 5 -16 -24 27 -41 4 -5 -5 38 -60 -37 -63 4 3 -23
3676 -23 -16 57 34 -43 -14 5 10 7 -52 9 93 12 -38 25 -25 13 67 15 42 -22 15 47 32 -10 71 -22 47 0 -21 -88 -21 -41
3708 -41 3 20 42 2 -68 -7 -5 -43 -34 15 -5 23 -38 2 -47 -53 5 -78 -20 -15 8 -27 -30 -32 70 10 -57 24 -28 39 -31 -41 51
3741 51 8 18 4 8 18 30 -4 92 42 -18 77 26 -48 -26 73 49 47 -28 29 34 11 18 52 -38 -13 22 -31 -29 7 -28 65 65 7
3774 7 20 -25 17 -54 26 19 -3 -44 -48 -33 47 -63 28 3 27 -67 -19 -9 -4 40 -13 42 -12 -10 -37 25 48 -45 19 -16 -74 90
3806 90 10 -35 -28 10 3 4 22 0 45 -29 13 56 -94 -11 52 -4 -12 65 54 -10 4 1 46 1 -45 -2 -28 -3 -30 -47 23 -5
3838 -5 -47 -33 -37 -12 -44 -8 21 -64 45 -29 -58 21 -65 10 -23 40 24 -13 -3 13 -28 -46 -10 -10 41 55 62 -34 4 1 -17 41
3870 41 13 -16 39 10 -77 -52 -73 5 17 -38 13 20 22 -2 32 26 6 -2 -4 -7 -60 -49 5 -28 -14 63 -30 -96 -93 -68 24 -9 2 -45
3904 -45 -21 -12 -49 -31 3 3 -17 -25 3 10 71 -9 -8 12 85 54 -14 29 -88 29 -5 11 32 -20 -16 -75 48 14 -47 32 24 -17
3936 -17 12 31 6 -1 41 28 41 -3 4 6 2 69 -43 -13 70 25 18 36 -43 -16 -26 -14 -31 -38 -71 -40 58 -31 3 27 19 14 -23 -40
3970 -40 -47 53 1 4 -11 -42 -7 5 3 38 -26 40 -11 -62 39 -39 -19 1 -6 -9 41 36 3 22 22 -18 7 34 17 -50 -12 -23 9
4003 9 33 27 -37 45 -40 -49 32 -10 32 -1 3 21 -47 11 -2 25 -3 -5 -32 -41 33 -18 5 4 -57 -27 59 10 -8 36 32 -1 -61 -29
4037 -29 22 -2 -31 31 21 -92 -5 66 -62 3 18 11 -35 16 28 13 127 5 5 -22 92 53 -4 -3 11 56 -7 18 21 -8
4067 -8 -14 -11 107 21 7 34 44 13 27 36 35 6 -23 1 -39 -31 -10 -13 15 -12 -2 -22 -4 2 -21 -32 32 -45 -34 -47 24 -5 -31 -55
4101 -55 -6 50 -42 -2 -5 -32 -27 36 42 -71 -53 53 33 -29 -81 -16 -19 -13 -9 -27 51 75 13 58 34 14 10 -27 -46 -23 -76 13 -42
4134 -42 37 -44 -10 17 -57 -3 46 -12 12 -69 9 -17 8 -20 -61 -27 13 13 23 -15 -20 2 3 25 -10 60 29 -94 -42 -8 -22
4165 -22 9 -17 -26 43 -30 28 4 -53 -10 66 44 -14 6 7 23 -14 31 22 -66 -47 104 15 45 3 15 2 61 -9 0 -27 -17 60
4197 60 -20 -4 -4 18 -26 35 -89 19 26 9 0 48 9 12 -41 -21 -71 -11 -11 -46 -25 -1 -5 -5 13 49 42 37 1 0 0 22 25 -10 66
4232 66 -55 67 -17 37 -18 25 52 46 6 44 -3 36 46 -71 23 -10 60 -16 33 76 -9 -10 20 38 -14 -51 -55 -53 -46 -78 12
4263 12 20 -8 76 30 -1 -29 -12 35 -12 -32 -35 7 -37 6 -80 28 31 -39 -18 68 -79 -19 -67 -12 1 -40 28 22 -40 -20 12
4294 12 -19 -14 45 -5 -27 3 44 18 17 22 74 51 -28 18 14 -17 -37 31 8 -27 -11 3 -62 -61 13 27 -30 -13 -51 -4 11 13 -41
4327 -41 27 -11 -24 20 42 -13 -26 9 -47 -80 -62 18 -74 -7 -33 -34 -15 54 3 -42 -8 24 -4 -38 6 36 -5 7 23 16 -9
4358 -9 6 49 -1 86 7 -23 -54 15 -18 24 4 30 -2 -26 -38 32 -32 50 -45 63 63 -22 2 -36 50 -61 44 59 42 -3
4388 -3 22 -10 13 -99 -6 4 -4 -22 -19 21 -64 6 -70 -37 16 -34 -53 18 -30 -8 33 -7 -3 10 -11 0 -1 -37 20 -16 23 29 40
4421 40 2 31 38 74 21 65 24 49 66 -43 -8 -63 -46 -15 19 12 -3 -19 -32 -57 -26 -59 12 13 -45 20 -23 -50 -51 14 15 -15
4453 -15 34 -56 10 -2 -3 55 -25 5 -21 -27 -36 -1 -46 -32 -27 -28 -9 -24 17 65 17 18 -77 26 28 6 -66 23 30 13 16 19 4 18 16
4488 16 -14 77 14 46 -10 -23 23 51 15 7 14 -30 -47 3 -17 -54 10 -29 61 -27 38 19 -5 22 -13 5 -34 -44 -26 -21 18 -14
4520 -14 15 -26 29 -42 -31 -25 -36 5 26 15 -4 33 56 19 31 17 29 32 69 50 57 -15 -28 -72 9 11 44 25 9 4 -49 -26 -9
4553 -9 7 52 9 18 -34 -75 52 -25 23 -28 -45 -42 -41 1 -88 -50 -8 -56 6 11 1 -35 20 -20 -24 37 0 -57 -15 -32 3 5 -4 -22
4587 -22 40 -25 12 -28 -68 -29 -17 -10 -26 -4 5 15 -19 -17 -8 23 5 -10 17 32 3 10 18 3 17 -39 18 -4 -79 -22 58 -9 -26
4620 -26 48 20 -20 10 6 -36 -44 -23 -52 -2 -49 -38 13 -24 -31 0 -32 52 2 9 35 -32 8 14 28 -17 -29 -29 4 -7 -8 -43 1 1
4654 1 -19 54 51 -5 -1 -4 31 -41 32 28 -68 -29 2 -41 1 -56 -24 -44 42 8 10 -63 -7 2 21 -31 -42 32 -8 1 -17 -56 10 -9
4688 -9 -7 -15 8 -10 -37 2 0 -17 -10 -37 -50 42 9 0 106 -22 -23 -34 -24 19 -35 -17 -18 -6 43 -16 -4 4 -17 -13 -45 -27 42 30
4722 30 21 62 32 32 34 20 73 -1 51 43 -25 21 -6 27 -76 -2 -15 -33 -5 -36 14 -5 56 -17 -81 1 22 -3 27 15 25 -19
4754 -19 14 52 -3 16 26 -32 1 63 3 -15 -44 -1 22 -20 -2 12 4 40 -36 -19 -43 19 29 69 22 -10 36 80 49 50 21
4785 21 -46 -50 15 2 3 -6 -26 25 13 36 -1 12 11 -28 25 -10 9 -76 59 25 -64 12 10 -7 11 -14 19 31 33 27 -16 -42 11
4818 11 -15 -18 7 -8 18 39 65 2 25 -31 36 -15 -54 19 7 -33 70 35 21 4 15 43 31 46 -10 -16 -28 3 7 80 -12
4849 -12 12 66 -13 56 39 -9 -32 62 79 20 -33 76 -34 1 -6 35 17 -41 18 -93 -31 -12 -65 -12 2 38 -57 18 29
4878 29 -23 -33 33 9 -23 -13 32 59 0 -76 -36 -29 58 10 4 -16 67 7 63 41 41 -23 65 27 -38 -37 21 4 -34 7 19 1
4910 1 2 -23 -33 4 13 28 55 6 59 0 16 -23 -21 25 -51 29 1 -22 22 10 19 13 -39 -17 0 -23 17 49 -41 -4 -50 9 1 -18
4944 -18 10 11 43 -47 -31 -41 -32 -14 -14 -6 24 27 1 -53 34 -35 38 7 -45 29 -30 9 -29 -41 41 6 5 2 -52 43 -61 24 7
4977 7 -24 13 -6 35 -55 -41 -29 -61 -12 56 37 -22 -6 23 5 -75 49 -40 -14 -55 49 43 18 24 13 -27 22 34 -13 -4 -50
5008 -50 21 -23 19 -4 13 14 4 44 32 22 55 23 -17 7 29 21 41 -22 52 69 -4 23 50 -3 29 44 70 -44 16 -84
5038 -84 -4 48 16 38 -26 -17 22 6 40 -6 17 42 -11 -38 -48 -20 -53 8 5 -25 20 -28 17 -45 -58 -11 -18 -67 -12 39 -24 -3
5070 -3 -55 4 -58 -71 -27 17 77 13 35 44 69 46 -23 25 -25 2 9 -14 15 2 -23 11 -49 61 74 18 13 32 10 17 43 -4
5102 -4 -17 11 8 -14 -29 -30 -24 -10 -63 -21 -10 -44 -39 4 -47 -52 -1 32 17 -50 33 -5 -34 -21 3 -5 2 36 -27 -37 -3 34 3 21
5136 21 26 -20 12 -41 -30 7 23 67 44 31 -25 52 25 -28 33 -25 -65 66 -5 10 7 -18 -44 -35 66 81 -15 15 -52 4 109
5167 109 12 21 23 1 -31 14 22 -46 -19 -32 29 31 17 -2 -40 -67 13 25 24 3 -20 25 9 -5 -36 73 4 -39 -111 -16 21 1
5199 1 -13 -2 -20 -29 -65 15 44 58 -2 20 -5 61 44 -18 3 -25 -2 39 1 -17 -4 36 11 -27 20 -33 16 47 64 -21 -2
5230 -2 -17 46 -9 -24 24 -36 7 -63 -45 37 -34 12 -5 -42 -31 -56 21 -6 -43 -29 12 40 -82 -78 44 16 13 -18 -15 -14 37 -65
5262 -65 15 -51 14 -12 -40 22 -7 -18 -41 -8 -23 -63 -48 8 -29 42 -26 53 25 38 -9 5 -41 22 38 23 -25 -9 20 12 -20
5293 -20 -100 -12 -2 -8 -10 8 -23 -73 -6 44 -37 -37 -37 29 61 -10 6 20 -54 -13 -19 68 35 -9 56 42 54 -7 19 21 -51 97 31
5326 31 43 -19 57 5 -31 33 -23 -1 -47 -64 -13 -20 -20 49 0 21 56 46 7 -23 10 1 43 63 -17 -28 -20 -2 -61 -31 -39 -26 -4
5359 -4 -69 10 -12 5 32 11 24 -5 13 -18 14 20 59 22 8 41 41 43 -16 103 -65 30 8 58 -10 -11 31 26 -60 48 31 -25
5391 -25 8 23 -57 -22 66 -2 30 4 -33 1 -8 -12 44 9 84 -27 48 21 11 -24 -11 -48 -1 -13 -24 -8 -8 -69 -37 -23 -47
5422 -47 -37 -25 7 -91 1 7 -30 34 -10 17 44 -40 -57 77 16 -51 39 -38 -71 -7 6 55 68 46 14 -13 -6 -22 21 12 6 -24
5454 -24 30 13 -18 14 24 88 -6 62 -45 12 -25 -20 -32 -28 -71 -19 -62 19 31 8 -38 -58 68 -40 27 -31 41 -10 -10 -46
5484 -46 -43 -85 -15 -55 -7 74 31 -32 -28 -24 -16 -22 2 -39 30 -12 -30 13 -39 15 -20 10 15 21 16 -66 9 -5 42 -18 37 48 -36 4
5518 4 -12 55 14 66 22 5 17 -17 43 19 -12 -4 -46 -22 -28 -10 -10 35 -5 4 -42 20 -45 11 22 -32 -17 -31 -46 11 8 -3 35
5551 35 -54 -8 11 10 81 -16 -21 -19 -92 -67 -32 -22 -21 -13 -6 -39 10 67 20 6 27 -7 -14 -31 -23 46 37 -6 9 -74 -27 -10 32 21 14
5586 14 36 48 -15 -74 -2 -27 -72 -100 38 -8 80 0 6 -47 -8 -10 5 -24 21 -1 -29 10 29 -11 -29 -50 -54 -15 20 -45 -27
5617 -27 2 -10 -10 16 26 20 -25 50 41 -7 -69 -50 33 -23 15 99 15 -49 -78 -15 -56 -13 6 -51 -22 -19 -15 6 -16 37 -4 -34 -9
5650 -9 10 18 -14 63 18 -10 16 -16 35 -9 -28 -2 -9 11 33 10 21 52 -34 17 -9 21 20 -25 1 -29 -33 15 11 43 -34 -9 16
5683 16 -7 28 25 -14 26 28 -17 -43 26 44 8 6 -12 -1 49 52 13 23 61 -43 -15 7 55 -15 -17 34 -49 -67 41 41 7 76
5715 76 27 -29 -14 -19 35 36 -46 -17 -45 6 8 -27 -36 -25 -22 -5 -4 -35 12 -11 80 -6 22 -26 -23 -33 -78 40 11 39 4 -13 -35
5748 -35 -34 27 36 8 -9 -25 -16 -22 9 -28 2 59 16 -21 3 70 -3 55 16 -30 19 -18 -10 6 -6 -43 -56 -53 -23 52 18 -40 6
5781 6 -2 30 -66 -16 -15 -22 20 46 0 16 -66 -51 -14 -11 -11 -20 -37 -56 37 -9 -15 23 -8 -2 33 5 21 -19 21 -7 41 0 11 -13 3
5816 3 7 43 35 5 14 24 88 5 60 25 -4 -21 51 10 28 60 -8 -20 64 -37 16 22 -25 13 -4 -10 -39 36 -33 -13 -33 5 23
5849 23 -31 50 -58 -39 -38 -22 -18 -5 -31 -42 -22 -15 26 79 26 84 -11 25 14 26 -21 -19 -34 9 -2 49 0 8 16 -27 -22 32 1
5882 1 0 32 -4 -13 32 -20 -6 7 -23 10 -78 -31 -54 33 -36 -51 -13 -40 -15 8 -29 -56 80 2 9 23 -49 8 31 -59 -48 -16
5914 -16 -70 23 6 39 13 38 -33 -11 1 13 23 50 44 33 2 -32 -27 -15 -4 -6 -22 6 39 3 2 47 10 27 -22 8 72 18
5946 18 4 0 -17 32 -16 11 31 44 48 18 19 28 -56 -27 28 -27 -15 -38 -31 -14 -48 -48 -25 37 -64 -41 39 -108 33 -16 11 34
5978 34 10 -5 14 31 -24 -82 54 54 -12 57 -3 -19 -6 9 35 -4 25 -18 6 29 32 87 19 44 18 -20 54 -39 47 1 64
6009 64 -5 17 -5 -32 -4 31 3 -13 26 33 -61 7 13 -4 -52 18 -38 22 10 -43 11 -29 -57 -1 -6 -23 6 4 -15 58 16 14 -17
6042 -17 12 40 -11 6 -2 4 -15 35 -20 25 1 67 -53 19 42 26 38 35 82 20 17 -25 -26 -48 10 19 -12 -36 1 12 4 -8 -21
6075 -21 -2 16 7 18 -36 -23 20 -51 -13 105 -2 -15 24 -3 20 -4 -28 -18 -36 -10 -7 -13 -8 -33 -73 -27 67 -6 -11 19 48 -1
6107 -1 -32 55 34 8 72 -35 3 -14 -20 32 0 15 11 -5 -39 -68 31 30 -2 -32 -22 -14 -22 1 21 19 -37 14 -21 -31 -15 14 45
6140 45 31 -27 51 -15 38 -75 3 -54 -42 -21 20 21 -18 60 14 -20 -86 28 3 54 -54 0 -5 37 65 41 68 -11 25 -1
6170 -1 3 -24 -43 12 47 57 12 81 9 16 9 -24 87 -4 -22 6 18 27 86 20 -2 19 11 -31 -2 23 -5 36 24 -9 -33 26 -21
6203 -21 -31 -82 -37 -47 -14 16 11 -17 -39 -20 -77 -26 -3 -28 -102 41 65 -6 -29 -38 14 17 -50 -1 16 -12 -58 -81 -21 -27 -21 8
6235 8 39 -6 -11 56 -2 -4 25 88 35 -32 -20 78 -3 -31 -39 5 10 -18 13 32 -22 2 -29 24 -17 -50 21 13 21 24 -10 -1 29 43 10
6270 10 -28 -12 19 -10 19 -17 52 -29 37 -38 22 6 72 29 -17 78 10 5 28 -9 44 43 -9 -68 24 37 6 -4 35 -2 -32
6301 -32 84 23 103 19 -13 -60 11 10 4 11 -22 31 41 66 -6 -72 64 38 9 -28 -31 -1 -36 11 -8 -36 39 1 12 23 -6
6332 -6 15 -48 23 -37 4 -3 -88 44 -40 35 9 51 -51 39 -86 -1 -5 -8 -38 -9 18 -20 52 30 48 -27 71 -21 34 -22 -35
6363 -35 27 25 30 -29 6 -57 46 -3 4 29 11 -26 18 1 -13 -22 -26 -28 13 -9 42 55 -24 28 -87 28 -37 11 2 2 -45 -18 -5
6396 -5 -45 37 11 -23 -21 -10 -6 -28 -40 -17 11 13 15 24 -23 -16 62 47 49 24 41 10 39 32 -6 -2 50 -27 -28 -18 -21 7 12 16 -1 13 -84
6433 -84 -20 -1 4 28 21 28 -46 40 4 -5 -21 -24 -45 -75 34 11 6 24 -35 18 4 -15 -53 -48 6 -7 30 -59 82 -28 -5 -41
6465 -41 37 -37 -62 35 8 8 -25 22 -17 -7 58 34 19 1 -86 34 -1 37 -12 19 -16 37 7 20 -7 -88 -31 -10 -5 -21 -51
6496 -51 6 17 6 50 49 3 -27 25 0 -88 -41 -14 -16 -23 11 -15 55 10 -43 11 -28 4 18 -11 -7 33 20 -21 16 -41 16 -5
6528 -5 25 64 -70 -29 -4 -46 35 -17 59 25 0 3 -60 16 43 21 44 57 15 -22 88 -18 44 60 32 60 29 7 -19 -4
6558 -4 -6 -60 -62 10 14 38 -94 -62 19 -43 -95 -89 -3 -22 12 20 -14 33 -17 31 -41 -4 -18 -30 8 51 -6 24 -22 -28 24 51 45 11
6592 11 25 22 -19 29 57 66 -6 -9 1 24 45 -23 -7 -33 8 -3 11 18 3 47 -17 44 0 39 4 28 58 29 81 19 -7 -2 26
6625 26 7 11 -69 -35 -17 -75 -16 -8 -24 57 -73 -39 43 12 -54 -15 -10 -9 25 18 5 39 56 58 35 10 -3 -30 -35 22 51 7 32
6658 32 -3 55 -10 72 78 51 25 16 -25 -36 -10 -66 10 -29 27 22 -31 -35 4 -5 68 -44 -22 -1 -82 11 -4 4 -76 26 23 9 -83
6691 -83 -37 -7 3 -19 -16 2 -40 -2 32 -30 -17 -8 14 -21 -17 27 -34 -24 -21 -13 51 -3 43 59 6 -17 -3 -28 28 38 6 62 20
6724 20 21 3 16 -14 -37 -5 -3 -4 -28 13 -37 -38 36 15 -4 -21 32 -18 -23 6 -22 12 -5 21 -63 -41 -22 -50 -20 -22 -20 25 55 -22
6758 -22 47 -9 -30 -16 -44 -24 -23 22 32 -9 -7 -23 21 -11 -83 24 47 -33 -33 7 15 -5 22 20 55 50 -62 31 13 31 23 -42 -11
6791 -11 56 1 -17 40 -57 1 26 -8 10 102 -16 -5 -33 34 46 -68 29 -8 -20 -27 -69 -15 -69 54 40 -49 -9 -26 1
6820 1 8 -43 -54 -18 -10 5 -23 -22 -19 -24 5 2 -68 7 -31 -18 23 33 10 -25 17 56 46 20 -35 -23 23 76 2 43 51 7 -20 -12 94
6855 94 -53 -52 30 28 10 -1 -14 -32 25 -21 -23 -62 -20 22 -24 18 -17 -29 -24 15 2 -15 -31 -26 -51 9 -37 -7 6 3 4 22 -14
6888 -14 10 -5 16 -71 5 14 -9 1 -11 -17 -41 71 -30 10 -29 -22 83 29 36 -30 34 3 68 29 37 58 11 -61 -57 -107 -32 -28
6920 -28 -5 4 9 -18 -49 -55 -24 -53 8 -36 -68 -41 -22 -46 19 -19 -37 7 17 29 -26 -8 -8 4 -36 32 -71 -23 -14 23 23 -20 -8
6953 -8 24 -36 37 39 27 -10 4 35 -4 -26 16 39 22 38 -14 -44 -14 28 11 -30 51 -17 -9 -24 21 -20 -17 8 -9 37 -1 22
6985 22 -17 -23 -1 55 35 -63 1 12 -1 35 19 -20 -26 -50 4 -33 -52 -4 -65 49 59 -36 -19 -26 18 15 -58 7 -2 -1 -41 5 -48
7018 -48 18 -10 15 10 -3 65 5 3 2 -4 -8 47 23 -17 5 39 -1 28 3 40 -58 -28 11 -3 -31 -75 13 48 -12 -4 -56 10 76
7051 76 -19 -89 -31 -3 -57 -25 42 12 34 27 44 32 -26 -46 -9 -26 -36 39 -11 3 -38 -32 12 60 23 6 16 35 32 -56 -25 60
7083 60 42 -4 -9 23 57 4 -29 15 -3 -22 14 19 27 39 64 15 33 -66 -54 -9 28 -26 -18 -7 17 56 2 0 3 -48 -17 -14 -40 59
7117 59 -25 -39 16 -35 -25 -7 -31 -8 -23 18 -60 -3 -17 -14 -11 52 -51 -29 77 3 -35 -14 62 31 34 -3 -5 -37 -55 -76 2
7148 2 58 13 -13 -18 -76 16 40 -61 -31 -24 18 -8 13 -16 -20 -17 19 -13 -43 -10 -58 9 30 7 -45 -22 -13 4 8 19 -34 -16 16
7181 16 65 8 -56 61 -5 -4 -19 32 35 -4 25 44 31 -21 -8 -12 -3 41 -3 -13 -25 11 -14 54 17 24 31 13 -1 54 -56 -4
7213 -4 -3 -26 24 19 -8 -16 9 50 -12 1 -6 13 8 24 24 -60 -15 -8 -74 10 26 -37 28 8 -9 -54 34 -79 -28 17 27 -87 -34
7246 -34 1 12 11 -23 13 25 34 -25 60 -26 -6 7 25 17 -17 1 -49 7 -24 -63 14 -9 44 61 -13 38 -1 12 47 9 18 20 15
7279 15 7 -1 -47 -27 42 -59 -51 -9 20 -20 -25 -8 -34 9 -31 16 40 -12 -10 -3 12 -11 -6 13 -31 -17 2 0 53 -15 9 -14 41 -28
7313 -28 -14 -7 39 34 35 53 35 16 14 21 1 18 -4 46 -1 22 88 30 18 11 42 -8 7 26 20 44 108 18 24 53 -23 -13 -24 -71
7347 -71 2 -1 21 13 -12 -17 6 -67 -1 19 -59 -17 -31 15 -28 -6 -23 18 -50 -30 3 115 10 28 -49 -8 -44 -15 -29 25 52
7378 52 -7 27 25 -5 48 -2 40 -42 -46 -8 13 -10 4 58 -25 -1 -17 3 -18 21 -12 -35 53 -20 -22 -48 79 -23 4 -53 48
7409 48 4 -9 -42 7 6 -48 -16 1 30 -40 -73 -35 -47 19 61 62 -12 5 35 -21 9 -14 7 -45 -18 -19 28 61 1 13 41 11
7441 11 -3 -5 49 -49 57 13 -13 25 -35 -8 1 -1 -22 -11 35 63 28 12 -16 -49 -17 -17 -16 -25 2 8 30 -29 -60 31 -2 101 -17
7474 -17 -6 -36 -64 -41 -79 -52 -5 40 -28 13 -33 23 -56 25 12 -21 23 18 -66 3 -7 40 -4 30 -37 17 48 18 -103 15
7504 15 9 -4 1 32 -4 30 52 2 41 25 -63 -36 14 9 67 -28 -30 -15 -4 -38 -22 -3 77 2 -9 -40 -2 -33 16 -44 4 37
7536 37 -55 -22 -3 -48 44 -31 -29 25 -17 -41 -31 3 3 -2 32 22 0 24 48 9 16 45 2 47 4 -1 -6 -24 14 18 21 72 -49 20
7570 20 29 -63 2 33 -24 -15 51 -40 -19 66 63 -4 4 24 51 56 -2 -41 -35 -21 -27 0 58 34 -10 22 -13 -8 -23 20 39 -36 -9 40
7604 40 -49 19 -20 8 28 47 -38 -4 99 -40 -21 69 41 -43 42 4 -22 62 29 48 -72 18 27 -35 -54 5 -24 -38 21
7633 21 1 4 12 29 60 -9 25 0 21 24 -20 -5 14 -49 28 17 23 17 -29 -3 -68 33 -11 46 12 -13 -53 6 -36 -19 44 -3
7665 -3 -40 -86 -82 -15 -12 -26 31 -56 -17 -3 27 4 66 51 -42 30 41 6 2 46 9 -20 -68 -64 59 17 51 -24 1 32 15 56
7697 56 44 -44 25 20 -6 71 -14 36 -15 22 50 17 -19 -22 -48 -29 27 -14 22 46 37 -16 -42 -12 -27 -6 56 -39 -33 -23 -13 46
7729 46 -9 -42 -73 -31 -18 -2 -12 32 27 -50 -5 -6 13 78 0 21 16 9 -11 -8 1 56 26 54 17 19 -9 19 27 -35 -81 15 56 -14
7763 -14 30 30 8 37 -37 26 -11 -32 -33 23 -60 -23 -1 -16 -16 -16 -29 -69 4 35 47 -10 -11 -16 -30 -20 -39 -30 59 2 -7 44 2 -11
7797 -11 -9 32 -7 62 -25 51 60 0 -52 65 54 19 -33 -7 -15 5 10 -30 67 1 -8 33 13 31 48 5 -6 -17 45 -44 -34 14
7829 14 -10 9 -25 -1 27 23 -20 -63 -66 60 -37 -21 3 52 21 -7 4 -60 -19 33 1 -48 67 23 -17 -40 -27 29 63 -17
7859 -17 23 -36 -8 -1 26 11 -37 7 17 -20 -17 -27 -71 6 20 47 31 32 72 3 41 -28 -2 45 16 36 -10 63 -15 8 18 -13
7891 -13 46 -23 13 -7 21 23 -64 8 -53 -5 -6 -11 35 -23 39 -12 -55 -95 -1 -4 -48 39 -4 30 1 -35 0 1 47 12 -29 49 -5
7924 -5 -6 -5 68 -19 26 7 -8 13 41 -16 6 22 20 25 2 23 30 34 -14 -11 16 27 37 21 -28 -58 -12 60 -5 -84 8 39 59 -5
7958 -5 -1 -22 -40 -67 -5 -22 -19 6 7 -24 -39 -20 -31 17 -80 -5 20 -6 37 18 26 54 -37 41 31 18 46 82 26 -3 7 20 23
7991 23 6 4 50 -6 13 -29 -24 0 2 -37 -44 21 -37 -25 -19 29 7 75 -21 43 28 7 -15 -22 47 65 9 -57 15 20 5 3 -52 31
8025 31 5 -23 -52 -8 15 15 0 -1 2 92 -41 -3 11 32 46 -13 6 -32 47 -2 -80 -16 31 18 2 29 42 -25 53 4 8 -32
8057 -32 25 0 8 49 77 27 12 21 -42 43 -10 -5 -31 -12 52 0 -8 13 54 -30 0 -11 17 5 15 25 9 -9 -25 -11 -30 10
8089 10 46 9 18 -13 29 45 18 -15 -42 -7 13 2 10 -22 39 54 -51 18 98 6 26 55 -13 0 -9 10 -3 -4 26 16 19 20 34
8122 34 -14 -14 88 26 12 26 -13 23 -34 5 56 10 -15 41 -61 -52 -20 33 -23 19 49 -21 8 1 11 -39 38 -43 -28 22 -28
8153 -28 -14 -36 6 -10 12 62 1 101 -2 56 -9 -20 53 -22 -63 30 6 -22 -26 8 13 46 -27 30 52 3 -8 27 5 9 -18
8184 -18 -25 -2 57 -13 16 3 -45
8191d5
##END NTUPLES=NMR FID
##END=
