##TITLE=1H_CA-8603-2
 CDCl3, 8 sc, 
 3.6.2019
##JCAMPDX= 6.0         $$ Bruker NMR JCAMP-DX V2.0
##DATA TYPE= NMR FID
##DATA CLASS= NTUPLES
##ORIGIN= UXNMR, Bruker Analytische Messtechnik GmbH
##OWNER= root
$$ XWIN-NMR		Version 3.5
$$ Mon Jun  3 16:28:39 2019 Russian Standard Time (UT+4h)  she@DPX200
##.OBSERVE FREQUENCY= 200.13155
##.OBSERVE NUCLEUS= ^1H
##.DELAY= (6, 6)
##.ACQUISITION MODE= SIMULTANEOUS
##.ACQUISITION SCHEME= undefined
##.AVERAGES= 8
##.DIGITISER RES= 18
##SPECTROMETER/DATA SYSTEM= spect
##.PULSE SEQUENCE= zg30
##.SOLVENT NAME= CDCl3
##.SHIFT REFERENCE= (INTERNAL, CDCl3, 0, 15.7039)
##AUDIT TRAIL= $$ (NUMBER, WHEN, WHO, WHERE, WHAT)
$$ ##TITLE= Audit trail, XWIN-NMR		Version 3.5
$$ ##JCAMPDX= 5.01
$$ ##ORIGIN= Bruker BioSpin GmbH
$$ ##OWNER= she
$$ F:/spectra/data/she/nmr/H-F/1/audita.txt
$$ ##AUDIT TRAIL=  $$ (NUMBER, WHEN, WHO, WHERE, WHAT)
(   1,<2019-06-03 16:27:18.96 +0400>,<she>,<DPX200>,
      <created by zg, POWCHK disabled, PULCHK disabled
       configuration hash MD5:
       00 E9 B6 7A A2 85 ED C7 34 08 36 98 17 FE 4E 26
       data hash MD5: 16K
       DA 57 6C 1E 9E 16 56 50 78 FB E0 DE 49 27 7C CD>)
$$ ##END=
$$ 
$$ hash MD5
$$ 35 93 7F 3D BB CA BD E6 79 10 A8 92 C4 1D BC 6B
##$RELAX= 
##$RELAX= 
##$RELAX= 
##$RELAX= 
##$RELAX= 
##$RELAX= 
$$ Bruker specific parameters
$$ --------------------------
##$DU= <F:/spectra>
##$EXPNO= 1
##$NAME= <H-F>
##$PROCNO= 1
##$TYPE= <nmr>
##$USER= <she>
##$AMP= (0..31)
100 100 100 100 100 100 100 100 100 100 100 100 100 100 100 100 100 100 
100 100 100 100 100 100 100 100 100 100 100 100 100 100 
##$AQSEQ= 0
##$AQ_mod= 1
##$AUNM= <au_zg>
##$AUTOPOS= <>
##$BF1= 200.13
##$BF2= 200.13
##$BF3= 200.13
##$BF4= 200.13
##$BF5= 200.13
##$BF6= 200.13
##$BF7= 200.13
##$BF8= 200.13
##$BYTORDA= 1
##$CFDGTYP= 0
##$CFRGTYP= 5
##$CHEMSTR= <none>
##$CNST= (0..31)
1 1 145 1 1 1 1 1 1 1 1 1 1 1 1 1 1 1 1 1 1 1 1 1 1 1 1 1 1 1 1 1 
##$CPDPRG= <>
##$CPDPRG1= <>
##$CPDPRG2= <>
##$CPDPRG3= <>
##$CPDPRG4= <mlev>
##$CPDPRG5= <mlev>
##$CPDPRG6= <mlev>
##$CPDPRG7= <mlev>
##$CPDPRG8= <mlev>
##$CPDPRGB= <>
##$CPDPRGT= <>
##$D= (0..31)
0 1.2 0 0 0 0 0 0 0 0 0 0.03 0 0 0 0 0 0 0 0 0 0 0 0 0 0 0 0 0 0 0 0 
##$DATE= 1559564838
##$DBL= (0..7)
120 120 120 120 120 120 120 120 
##$DBP= (0..7)
150 150 150 150 150 150 150 150 
##$DBP07= 0
##$DBPNAM0= <>
##$DBPNAM1= <>
##$DBPNAM2= <>
##$DBPNAM3= <>
##$DBPNAM4= <>
##$DBPNAM5= <>
##$DBPNAM6= <>
##$DBPNAM7= <>
##$DBPOAL= (0..7)
0.5 0.5 0.5 0.5 0.5 0.5 0.5 0.5 
##$DBPOFFS= (0..7)
0 0 0 0 0 0 0 0 
##$DE= 6
##$DECBNUC= <off>
##$DECIM= 24
##$DECNUC= <off>
##$DECSTAT= 4
##$DIGMOD= 1
##$DIGTYP= 9
##$DL= (0..7)
0 120 120 120 120 120 120 120 
##$DP= (0..7)
150 150 150 150 150 150 150 150 
##$DP07= 0
##$DPNAME0= <>
##$DPNAME1= <>
##$DPNAME2= <>
##$DPNAME3= <>
##$DPNAME4= <>
##$DPNAME5= <>
##$DPNAME6= <>
##$DPNAME7= <>
##$DPOAL= (0..7)
0.5 0.5 0.5 0.5 0.5 0.5 0.5 0.5 
##$DPOFFS= (0..7)
0 0 0 0 0 0 0 0 
##$DQDMODE= 0
##$DR= 18
##$DS= 0
##$DSLIST= <SSSSSSSSSSSSSSS>
##$DSPFIRM= 0
$$ [...]
##$SUBNAM2= <"">
##$SUBNAM3= <"">
##$SUBNAM4= <"">
##$SUBNAM5= <"">
##$SUBNAM6= <"">
##$SUBNAM7= <"">
##$SUBNAM8= <"">
##$SUBNAM9= <"">
##$SW= 24.9336996594482
##$SWIBOX= (0..15)
0 0 2 0 0 0 0 0 0 0 0 0 0 0 0 0 
##$SW_h= 4990.01996007984
##$TD= 16384
##$TD0= 1
##$TE= 0
##$TE2= 300
##$TE3= 300
##$TEG= 300
##$TL= (0..7)
0 120 120 120 120 120 120 120 
##$TP= (0..7)
150 150 150 150 150 150 150 150 
##$TP07= 0
##$TPNAME0= <>
##$TPNAME1= <>
##$TPNAME2= <>
##$TPNAME3= <>
##$TPNAME4= <>
##$TPNAME5= <>
##$TPNAME6= <>
##$TPNAME7= <>
##$TPOAL= (0..7)
0.5 0.5 0.5 0.5 0.5 0.5 0.5 0.5 
##$TPOFFS= (0..7)
0 0 0 0 0 0 0 0 
##$TUNHIN= 0
##$TUNHOUT= 0
##$TUNXOUT= 0
##$USERA1= <user>
##$USERA2= <user>
##$USERA3= <user>
##$USERA4= <user>
##$USERA5= <user>
##$V9= 5
##$VALIST= <valist>
##$VCLIST= <CCCCCCCCCCCCCCC>
##$VD= 0
##$VDLIST= <DDDDDDDDDDDDDDD>
##$VPLIST= <PPPPPPPPPPPPPPP>
##$VTLIST= <TTTTTTTTTTTTTTT>
##$WBST= 1024
##$WBSW= 4
##$XGAIN= (0..3)
0 0 0 0 
##$XL= 0
##$YL= 0
##$YMAX_a= 22971
##$YMIN_a= -13786
##$ZGOPTNS= <>
##$ZL1= 120
##$ZL2= 120
##$ZL3= 120
##$ZL4= 120
##$ABSF1= 10
##$ABSF2= 0
##$ABSG= 5
##$ABSL= 3
##$ALPHA= 0
##$AQORDER= 0
##$ASSFAC= 0
##$ASSFACI= 0
##$ASSFACX= 0
##$ASSWID= 0
##$AUNMP= <proc_1d>
##$AZFE= 0.1
##$AZFW= 0.1
##$BCFW= 1
##$BC_mod= 2
##$BYTORDP= 1
##$COROFFS= 0
##$CY= 11.3945322036743
##$DATMOD= 1
##$DC= 2
##$DFILT= <>
##$DTYPP= 0
##$F1P= 18.9103706918063
##$F2P= -1.10871071338519
##$FCOR= 0.5
##$FTSIZE= 0
##$FT_mod= 4
##$GAMMA= 1
##$GB= 0.15
##$INTBC= 1
##$INTSCL= 1
##$ISEN= 128
##$LB= 0.24
##$LEV0= 0
##$LPBIN= 0
##$MAXI= 10000
##$MC2= 0
##$MEAN= 0
##$ME_mod= 0
##$MI= 1.114404
##$NCOEF= 0
##$NC_proc= 0
##$NLEV= 6
##$NOISF1= 3.799351
##$NOISF2= 2.8
##$NSP= 1
##$NTH_PI= 0
##$NZP= 0
##$OFFSET= 15.70392
##$PC= 1
##$PHC0= -8653.709
##$PHC1= 13.80022
##$PH_mod= 1
##$PKNL= yes
##$PPARMOD= 0
##$PSCAL= 0
##$PSIGN= 0
##$REVERSE= no
##$SF= 200.130013532006
##$SI= 16384
##$SIGF1= 3
##$SIGF2= 2
##$SINO= 400
##$SIOLD= 16384
##$SREGLST= <1H.CDCl3>
##$SSB= 0
##$STSI= 0
##$STSR= 0
##$SW_p= 3612.71676300578
##$SYMM= 0
##$S_DEV= 0
##$TDeff= 0
##$TDoff= 0
##$TI= <>
##$TILT= no
##$TM1= 0
##$TM2= 0
##$TOPLEV= 0
##$USERP1= <user>
##$USERP2= <user>
##$USERP3= <user>
##$USERP4= <user>
##$USERP5= <user>
##$WDW= 1
##$XDIM= 8192
##$YMAX_p= 0
##$YMIN_p= 0
$$ End of Bruker specific parameters
$$ ---------------------------------
##NTUPLES= NMR FID
##VAR_NAME=  TIME,          FID/REAL,        FID/IMAG
##SYMBOL=    X,             R,               I
##VAR_TYPE=  INDEPENDENT,   DEPENDENT,       DEPENDENT
##VAR_FORM=  AFFN,          ASDF,            ASDF
##VAR_DIM=   8192,          8192,            8192
##UNITS=     SECONDS,       ARBITRARY UNITS, ARBITRARY UNITS
##FACTOR=    0.0002004,     1,               1
##FIRST=     0,             0,               0
##LAST=      1.6414764,     0,               0
##MIN=       0,             -13786,          0
##MAX=       1.6414764,     22971,           0
$$ Real data points
##PAGE= N=1
##DATA TABLE= (X++(R..R)), XYDATA
$$ [...]
1319a107q3J468P04j06o82j389L30K025K61j476o47J13O76J352k34k181l91J738
1337C71Q91n11p74j107K45J902L35j574p96L95N38J053N7k006o38J646J008n06
1355E29p91r92J02J876O76j704j088O45Q49P75p8j709o37J589J025n36o65p75
1373i09j82J750J032j638j350O63R25Q23j19j579q27J566J223p05q15m87p1J368
1391F68R34j405j341N99R83M48Q9j373j120J352J590o74j246m57J81J283Q46j406
1409d9j402P35J117K07r3j000j122J118J665m68j352m47L39J107J015j217j672
1426a519P02J411K13l86p76r18J030J646o09j310j95L01Q13R92p69j819K85J561
1444F53M84n87q71q77R85J735n00j684j89O12O35O98o64j537J37J458L98m91q22
$$ plain form
1319 -1107 -1190 278 982 876 194 -1195 -865 1160 1421 -55 -702 -589 87 1439 1205 -976 -1367 371
1337 371 1262 751 -23 -1130 -885 1017 1352 -222 -1018 -623 -85 968 1025 -981 -1619 27 1035 529
1355 529 -262 -1254 -1152 724 1400 -304 -1392 -747 102 877 799 -910 -1547 42 1067 531 -134 -909
1373 -909 -1091 659 1691 53 -1297 -634 291 1114 995 -584 -1411 155 1378 673 -142 -629 -700 668
1391 668 1602 197 -1144 -545 438 886 975 -398 -1518 -166 1424 750 -496 -953 -772 511 1357 -49
1409 -49 -1451 -716 401 608 515 -485 -1607 -489 1176 708 -644 -1091 -752 355 1370 153 -1519
1426 -1519 -817 594 807 421 -355 -1273 -243 1403 794 -516 -711 -410 403 1395 626 -1193 -908 653
1444 653 1137 550 -321 -1198 -213 1522 1022 -662 -851 -239 396 1094 430 -1107 -970 488 886 395 -427
1463d27p53O12J726q8j955k88P32Q05N72o27j663K62J726K52q59n65m01M17J419
1482H97J38j607n49P36Q50N90m72j730o4J973O44j189p97j18M99J331j2j569n21
1501i70R89N95K83k97j360m33J681Q77r86r91k48L98J419K80j845p98J222R96
1519H12k12m88j026j23J381P17r75p97j48K21J227O45j561j212J038J201j2n69
1537A19j029k29J594Q73j232j026L09N55P90L70j230j070Q51J116J00l63r42o65
1555a109J388J349j061j506K64R03P54J4j269j017J092J205l69n06n65n18Q65
1572h6J239o46j334p7O72P41M09j172j366J000J705l69j007n41j42R69J062p15
1590C42j306J48P20L26M31m99j339L96J646J13j097o40j06J094J268p74j804K18
$$ plain form
1463 -427 -1180 -568 1158 1070 -885 -1173 -441 364 936 309 -1354 -1092 634 886 27 -538 -939 -522 897
1482 897 1035 -572 -1121 -385 465 1055 583 -1147 -1211 762 1406 217 -580 -698 -199 1132 1120 -449 -970
1501 -970 19 614 897 600 -760 -1193 488 1365 379 -612 -860 -462 957 1237 -608 -1406 -184 812
1519 812 600 112 -914 -1037 344 1061 86 -711 -859 -638 589 1234 -327 -1539 -501 700 688 119
1537 119 -910 -1139 455 1328 96 -930 -621 -66 724 1094 -136 -1206 -355 761 861 498 -444 -1109
1555 -1109 279 1628 567 -939 -675 228 982 996 -273 -1290 -198 1007 638 132 -433 -951 -86
1572 -86 1153 507 -827 -904 -232 509 918 -254 -1620 -620 1085 716 -291 -832 -974 -5 1057 342
1590 342 -964 -816 -96 230 661 162 -1177 -781 865 978 -119 -759 -865 229 1497 723 -1081 -863
1608h63J216L59k9n65r22L47J306Rq92k86k02M85J178k35j741l53J368Q78l43
1627G15q48j107M98J632m8j248l04L03K87O86m6j233l80J035P01p9o75j147J90
1646a068J829N29j567q08M07Q16N53j44j241k35J234M27m60l14n55o6J316O58
1664A311j089j112K67P37R73n9j607o23J498Q60p81o67k20K68Q78L18j077o51
1682g76L67N43N05K27j283r97J093J300l75r26m69J26J150M98j324q67Q40Q47
1700D79Qk40p71o46R55J037k66p25m72k45J038J070r08j415N24J128J88l89r31
1719e81l83J171J045p27r32J2M3O57Q10n58j318J02Q98L96K6q57q30Q72J394o21
1739F19j414LO21O58M04p72j185L56J077R1j91l77q69L71J231O0j181l70N00O82
$$ plain form
1608 -863 353 712 683 118 -804 -457 849 858 -34 -320 -522 -37 1141 906 -835 -1188 180 1058 715
1627 715 -133 -1240 -742 890 842 -406 -710 -407 -120 566 520 -713 -1093 -58 643 564 -111 -1258 -1068
1646 -1068 761 1290 -277 -1085 -678 138 691 547 -694 -929 305 732 272 -42 -597 -663 653 1311
1664 1311 222 -890 -623 114 1087 1028 -579 -1202 296 1156 375 -292 -512 -244 634 952 -125 -776
1682 -776 -409 134 639 866 -417 -1414 -321 979 604 -322 -791 -665 485 983 -341 -1208 -368 479
1700 479 487 247 -524 -1170 -215 822 556 -169 -641 -886 152 1222 314 -1101 -577 551 739 350 -581
1719 -581 -964 207 1252 525 -407 -395 -352 305 1115 557 -761 -659 239 635 661 -196 -1026 -154 1240 619
1739 619 -795 -792 -171 487 891 119 -1066 -710 367 458 267 -110 -979 -608 623 683 -498 -868 -368 314
1759C14O31q56j414M82J532J80q20m06l50L62J082pr79k15K75L03O43k98j207
1778g48o2J432N54q28q81l29P64J253k10j400k50Q11J71J48pq71j54R13M46n94
1798A58n33l92M15J243J33j595p11R60Q61M7n00r13m3J126L24p95k31K8J07O45
1818C34M10j083q03P78Q74L07m60j151l06J421Q56j001o62J15L86M57J53q53m43
1837f71P91N19n6k74p38m65J109J044p13j096q9M48Q23K96j173p77R38Q70m32
1856C54n95k23m2O07Q34p98q94M6M03P35M55q97j239P20J117r3o91m13j9Q98O53
1877I18q95r10L80O08L48K25n87j031L56J149J86n18n35m40Q12J000o08j215K81
1896d76Q74L04k08p22o70O78J096k72o12l14k49L92J038k13j239j08P05N00j1
$$ plain form
1759 314 945 89 -1325 -843 689 869 49 -357 -707 -345 737 730 -249 -464 -189 114 757 459 -748
1778 -748 -810 622 1176 348 -533 -862 -98 1155 945 -455 -705 106 277 425 418 -453 -607 306 752 158
1798 158 -375 -767 -352 891 1024 -571 -1282 -322 539 586 86 -827 -870 256 580 -215 -446 -418 -311 334
1818 334 744 -339 -1142 -364 510 817 357 -794 -1100 321 1177 176 -486 -371 15 472 625 -228 -671
1837 -671 120 639 583 309 -429 -894 215 1259 546 -550 -639 -191 632 928 -245 -1022 -84 786 354
1856 354 -241 -464 -506 101 935 137 -757 -711 -308 427 882 -15 -1254 -534 583 490 -201 -614 -633 265 918
1877 918 23 -887 -507 101 449 674 87 -944 -588 561 747 229 -306 -746 66 1066 458 -757 -476
1896 -476 398 702 494 -228 -898 -220 876 604 -8 -322 -571 -179 859 646 -593 -701 4 504 493
1915D93p52o94N02J317j48j197k45K50M95P35l46j085j10P58K71Q8k28q15J09
1934f02J152L02j175m38L56O64O67m88j123j78J128M05k71l28n38l9J033K99q12
1953A4l91R3M59N24k8j291l37J217P68n17p04m57K29R92K76r84m49K64L74K89
1973C41O5q55m58Q77P11l60o29n24K05J074M99j078p72N49N62K72j06q05l04Q66
1993A30M64l83m62j99N6Q16N31r13r10M55Q10L03j10r46m77Q63Q38m66p27P4O4
2014a89N73K95o08q61M56P47J42j04p64o11P92J016m18p84k82K37N78M29p39p99
2034h94N17P47J1k46n20m45O36R15k65q16k84K70N46N62o17r60L03R63R8m60l75
2055c14l12N87R34l42r94o4M44L95M57m49j004J14R95K37n12m27l10M66R01j76
$$ plain form
1915 493 -259 -953 -451 866 718 -479 -724 -474 21 756 410 -675 -785 -27 244 332 104 -711 -602
1934 -602 550 852 -323 -761 -405 259 926 438 -685 -863 265 670 399 71 -467 -506 527 826 14
1953 14 -377 -284 175 699 671 -620 -957 260 1028 511 -193 -650 -421 571 847 -137 -586 -322 52 341
1973 341 406 -449 -907 -30 681 321 -308 -832 -627 447 946 -132 -904 -355 207 479 373 -432 -736 130
1993 130 594 211 -251 -450 -394 422 953 40 -870 -415 395 698 588 -358 -835 28 866 400 -327 -253 -189
2014 -189 384 679 71 -790 -334 413 555 451 -313 -924 -132 884 466 -318 -600 -363 215 644 -95 -894
2034 -894 -377 370 381 135 -385 -830 -194 721 456 -360 -644 -374 172 734 117 -843 -540 423 521 61 -314
2055 -314 -626 -39 895 553 -441 -505 -61 334 791 342 -662 -548 447 684 172 -255 -565 -99 802 626
2075F26j135j31N94M27J90m18q82R0R96K03m60l71l34K47R11M2j049k83O34M27
2095C24J18l81q03O5J072K64o43l75j74K82P85J46q97m43N89M39P5k17p87j5J036
2116D60L75p48m94JK86P81P4r89m07O24N45j17k47n95j79Q87N78p22o11J56K50
2137i2N83J27r28n59P03O50r6l86n28j25P63O28o72o02J38K33N38J11p53n69O61
2158a75P57j37m95l87j51P87O38o40o94J95L66L40J40o62n32N36P51k14l97m33
2178d07n4O41P33n29r75J68M81L86J05o01o64M47P69o2n24l14o1N22O18m71q55
2199f47J5N80L95N8m84o88L31R23k7o78k77P3M94N52m06q07P2O80K80n1m50o15
2221f77L26R33Q2p27l52Q3M47N26j99r10n6P95K75j91m58m91K66Q72J16p48l69
$$ plain form
2075 626 -509 -640 -46 381 571 153 -729 -639 357 560 100 -271 -605 -358 553 595 -454 -737 -103 324
2095 324 442 61 -742 -677 395 659 16 -359 -533 -251 534 680 -217 -660 -71 368 443 226 -561 -576 460
2116 460 835 87 -407 -406 -120 661 735 -254 -661 -37 508 391 144 -451 -630 257 835 113 -498 -342 -92
2137 -92 491 618 -310 -869 -166 484 388 2 -526 -651 112 740 68 -534 -396 -163 375 486 -267 -836 -175
2158 -175 582 445 -50 -437 -588 199 837 197 -497 -302 64 404 544 -118 -650 -114 637 423 26 -407
2178 -407 -461 180 913 384 -591 -423 58 444 549 -52 -716 -269 500 438 -86 -400 -461 61 679 208 -647
2199 -647 -632 -52 343 401 -83 -771 -440 483 456 -222 -499 -426 68 620 214 -593 -521 159 439 388 -62 -677
2221 -677 -351 582 664 -63 -415 -332 115 641 442 -468 -524 271 546 355 -103 -594 -328 544 660 -88 -457
2242d57J42L77N42j35r58j72P96K89j81m07m34J94Q63J32q44l43K83L94M38j93
2262C26q27k60P67M08k42k93l25M9P55L05q67m08L64M60K95j79p73k16Q43M11
2282E93l51k89k96RP21L06p12m71K89M74K28j81o59k75P85N41l94n50j59N7O37
2303C03L21o88n60L66N11N3o9m73m12O28O43l88o69q1J81N49L79o67o70L68O25
2324B50J03j93m57k83N36O65l88n41j01K28M81L41o53o49L78O62K02l09m79l40
2344e47N36O52k73o15j4J82L16K94l96p32K97P25J32l85m06l32L92Q65k95p08
2364c12j35K59L30K65l82o19J89O57R3l78l01k10L20Q03j12q53j68L32M06K85
2384D69k36p72O2Q03R9m19k79n1K39O28q2p32k62N32M10J21k42q09R6P42L71n16
$$ plain form
2242 -457 -315 62 604 469 -489 -661 135 424 243 -164 -598 -404 459 591 -253 -596 -313 81 519 326
2262 326 -501 -761 6 414 172 -121 -446 -397 358 663 -204 -612 -248 212 507 328 -445 -661 182 593
2282 593 242 -47 -343 -334 387 693 -19 -490 -201 273 501 320 -339 -614 171 712 318 -232 -391 -334 303
2303 303 624 -64 -624 -258 253 306 237 -236 -648 -20 623 235 -434 -515 -334 215 594 -73 -743 -375 250
2324 250 353 160 -297 -580 -44 621 233 -308 -409 -181 300 641 -12 -661 -283 379 581 272 -207 -547
2344 -547 -11 641 368 -247 -261 -79 237 531 135 -597 -300 425 557 172 -234 -566 -174 691 396 -312
2364 -312 -447 -188 142 407 25 -594 -405 252 345 -33 -334 -544 -224 579 467 -386 -554 -222 184 469
2384 469 233 -539 -477 326 425 6 -273 -324 -85 543 461 -271 -533 -1 409 530 288 -521 -425 317 688 172
2406A72m08o6L08N57r2p72k54O38L10j49r0o16rP10L49n26m29n3K01N22J43p42
2428b96l42N61M29j12l67l78o1Q52L37o23m29R2K29M66J54p03m13N27M02l5k61
2449B9l11j14O59M12n83n71K14L06L89J20o61m67M86N70j08k94l02j35N15M43
2469E97m25o13R5M40L20%o24m86N42O14j26l72l47q8M69M68l53o03J70L19K32
2490B29J9m78l96L66P52q7n61k53j1N25N28m68n78J18M12J42P8l58m57L87O31
2511E40j10n52j61P3L68N80l97q23J3O62K09n1l54n01K45P16j28n03j72J92K00
2532D6M22k11p95K8N92K93q7l44n15J19Q17M4o47k50K00K61L48j70o10k9O03K25
2554C40k01k74l68J02Q71J27o54l74J86L85L15q7p23NO34K06l30l32j29J11O22
$$ plain form
2406 172 -236 -302 6 563 471 -301 -555 83 393 244 154 -462 -471 239 588 62 -367 -420 -219 303 446 -296
2428 -296 -638 -77 352 240 -127 -505 -566 286 623 0 -429 -337 -108 358 512 -191 -604 -77 325 290 29
2449 29 -282 -396 263 675 92 -479 -265 41 430 550 -111 -578 -92 478 370 76 -226 -361 154 597
2469 597 172 -441 -346 94 414 414 -210 -696 -154 460 334 -38 -385 -473 -4 464 111 -492 -322 -3 229
2490 229 248 -230 -626 -260 492 405 -156 -409 -420 105 633 165 -413 -295 117 259 337 -21 -478 -91 540
2511 540 430 -122 -283 -210 158 738 341 -482 -469 193 402 351 -3 -504 -259 457 329 -174 -346 -154 46
2532 46 468 257 -538 -510 82 375 288 -56 -571 -452 365 409 -238 -488 -288 -27 321 151 -459 -488 115 340
2554 340 139 -135 -503 -401 470 597 -57 -431 -245 140 455 368 -355 -350 284 490 160 -172 -301 -190 432
2575D32J84o00m83L30K73L04l0o91k52O25L98k95l41k25J89N73Q8o34l87L68L45
2596A71P7J6n84k83M90M83j89l15k21N1M94K86n89n41M54M66M5j43m52k17M94
2617gN32k45m81j2n8M44M09m09n69K42M36R7j57l83l04N90N54l69o27m4K68L46
2639B53J88l72m85J48M83O5q2m15k46L49N51j53p09j01L10M60J74m07n82K09O30
2660B68P2l01j72k82K66N11r6n13j23L25K69J02j99o49J87P36Q9l38l31j33K48
2681f4N33j53n57n9L45J55J70j44n78K5O23J61l56l21j40K48O45p3p69j58M29
2702c8K52l6r9m41K5N70J19m22k80l0J88N55P5o10l88M39L23Q4l16m10lO21L10
2725D88n43k66R7J84L82M4o21j84L81L57nj85l77j68O14M21m38m16lK19L06R0
$$ plain form
2575 432 616 16 -467 -137 136 440 410 -281 -533 92 490 195 -146 -371 -182 391 479 -155 -542 -174 171
2596 171 248 264 -320 -603 -113 370 181 -134 -355 -304 190 476 -113 -654 -200 266 311 168 -284 -501 -7
2617 -7 525 280 -201 -213 -271 173 582 173 -396 -154 282 379 222 -161 -465 125 679 310 -317 -361 -93 253
2639 253 441 69 -416 -268 215 280 198 -217 -463 -114 437 284 -425 -526 -216 244 418 11 -571 -362 268
2660 268 340 39 -133 -415 -149 362 266 -247 -370 -45 224 326 127 -522 -335 401 490 152 -179 -312 -64
2681 -64 469 316 -241 -300 45 200 370 226 -352 -327 296 457 101 -220 -360 -112 533 460 -309 -467 -38
2702 -38 214 178 79 -362 -337 233 352 -70 -350 -380 -192 363 438 -172 -560 -121 202 286 -30 -440 -443 178 488
2725 488 -55 -321 -224 -40 342 386 -235 -419 -38 319 314 129 -248 -416 198 619 181 -235 -238 -19 287 377
2747C77n77k50N17K97j36k46k68j16N65L44l78m24J6J73L66J53n57m20M17M84
2767C37k06k26k76OM92L39m47m09J26K57K24J41m39m81L82M66J9l53k21m9M84
2788A66L21l74n31J16M57J65l0l66l19K72N37j31k75j31j19K80M91k61o09K9M61
2809A49R3jk76m52L04N81r7m45j10L4K37L64k24m80K2L50J63l7k34l60J32O47
2831C60o2n01j64J30K54L14n6n95q1N15J35j17k29k40Q5N58J34n18k14J59K04
2852G1L49j39o23mM97K02k09j88k12N9M56J36m91k67K95J42K56j03m78j76N35
2873A08K67k53k32k31R2N11J53n18k80K40K19J85j02m25j38M36L20k92j37j50
2893b27o3M92K55m95l72K56L07J19r0m30j11M73L32k87l01n4J22K27L24l87m82
$$ plain form
2747 377 -200 -450 67 364 228 -18 -286 -402 163 507 129 -295 -279 -106 260 413 -144 -564 -147 337
2767 337 131 -95 -371 -365 127 466 19 -390 -264 -7 217 358 -81 -562 -180 286 305 -48 -269 -318 166
2788 166 487 113 -418 -302 155 320 290 -76 -395 -123 414 283 8 -123 -242 38 529 268 -341 -312 149
2809 149 242 241 -35 -487 -183 398 301 -144 -254 -220 17 381 157 -323 -301 49 212 175 -59 -419 -287 360
2831 360 298 -203 -367 -237 17 331 275 -320 -401 114 249 132 -97 -337 -252 306 440 -78 -292 -133 71
2852 71 420 281 -342 -346 151 353 144 -44 -256 -197 259 395 -96 -363 -68 74 330 227 -251 -427 108
2873 108 375 122 -110 -341 -249 262 415 -103 -383 -143 76 261 159 -266 -404 32 352 60 -77 -227
2893 -227 -290 202 457 -38 -410 -154 153 272 182 -248 -359 114 446 159 -142 -196 -74 153 477 90 -392
2914c92K41L10J21q8l50k64M80L80k80l97o2K23K29J56k85n03K63M49k2p2l18
2935a81j90K89M49j42m13o8J05K75J91l61m30K96M27K9k07k46j69L60M04k15l74
2956a71n0J68J11K86j76n29R4N11L8k53j29j67K51L93p0m86j21L25J35Q4j24m54
2978c34J03M32J18k88j69j61J52M86m1n89qK86J78M8j74m51N9N87M6l52r1n7J00
3001a20L84N7n12j61L13J79J31j69l90q1O20J28l63k13K5J72L34nn24r4K76K32
3023B19j4q0l64o6M83K42l61l00K3J68L49K8n20k70M35K60l8j44k48r7M25K13
3045C43k95l41J71P2J62K07m47l15K88L90rk80k45K4M37K00l37k90J67R4J54J18
3067B68l28l16L23L54Nk38k49r6L70L40k79m33J29K43J71Ll03k10J78M05j09k49
$$ plain form
2914 -392 -151 159 280 192 -158 -422 58 438 158 -239 -301 -78 151 307 22 -481 -218 231 209 137 -181
2935 -181 -371 -82 367 225 -188 -256 -151 124 315 -46 -476 -180 247 276 69 -177 -346 14 418 203 -171
2956 -171 -221 -53 58 344 168 -361 -267 244 282 29 -100 -267 -16 377 307 -179 -300 25 160 244 120 -334
2978 -334 -231 201 319 31 -138 -299 -147 339 298 -291 -299 -13 165 213 39 -412 -353 234 280 -72 -163 -220 -120
3001 -120 264 321 -191 -352 -39 140 271 102 -288 -369 251 379 16 -197 -172 0 334 329 -195 -289 -13 219
3023 219 205 125 -239 -305 178 420 59 -241 -218 -50 299 327 -193 -463 -28 232 194 50 -198 -295 130 343
3045 343 48 -293 -122 -50 112 319 -128 -443 -155 235 226 -54 -299 -275 162 362 25 -265 -98 -4 150 268
3067 268 -60 -376 -53 301 306 68 -181 -277 93 433 154 -279 -150 93 264 267 -36 -246 -68 337 228 -21
3089b1p6n9K25L22k32m49K4K55J97P1l07l76K52M23p0l10p9J8K19K54j73m26M8
3112b70L05O7K6j20l64J06M86M7l91j01M9K30L06j80m68M0M03P4j06j52j95Q2
3134a26M48n0k78j64J6J66L23r3m46j25M49J26j22j16l10J35L60R5l70j28J26
3155h4L3K37Jm33j35L78J70m8k17j62j4M19J54m50j80K25J43J55l6l58j04L25
3177A9J78k05q7Oj25M09K30m70k06J34K75P8P6n24j38M38K80k08j65j74R1K60
3199A72J42k50l22J81J21J40k5k92j99K81M30k14l29j28J20L60Q7k71l38K16K40
3220A22r%k29k42K81L18j46k87o1P2L09J78k66m44K59L05Q1j55j34j50K10L15
3242C27k14k99L1J01J03L07k64l67J16L36J32j04k02l10K73M37j89l84l7J47J60
$$ plain form
3089 -21 -97 -156 69 391 159 -290 -266 -11 186 257 -50 -426 -174 249 179 -131 -210 -192 27 281 108 -318 -270
3112 -270 35 102 128 8 -356 -250 236 283 -108 -209 -160 70 376 196 -272 -232 171 245 139 -13 -208 -126
3134 -126 322 272 -6 -170 -154 12 335 242 -204 -329 120 246 124 8 -302 -167 193 288 -82 -210 -84
3155 -84 -51 186 187 -246 -381 -3 167 119 -98 -260 -274 145 299 -151 -331 -106 37 192 156 -202 -306 19
3177 19 197 -8 -95 -89 -214 195 425 -45 -251 -117 158 236 312 -212 -350 88 368 160 -5 -179 -88 172
3199 172 314 64 -258 -77 44 184 159 -133 -332 -51 379 165 -164 -292 -172 188 275 4 -334 -118 122
3220 122 113 113 -116 -358 -77 241 95 -192 -253 -181 128 306 40 -404 -145 160 241 86 -48 -198 12 327
3242 327 113 -186 -155 -54 49 356 92 -275 -159 177 309 205 3 -307 -34 403 214 -170 -207 -60 100
3263A00L6r0l12L4L78J8j11j53j58J39L66lm13r4J03K42J32k48l47N5N07K7k48
3286d0j59J7J48K82j1l97p4K00J04J49j14l26K2M10J03k71k26L6J68K83j15l68
3308a79m5L25J57j52M4l37j24M38J64l09p9m5L9L27O1m40j81L50K29j22k6l75
3330b80k7M20J32l27j01mN5K48J67l77k30K77K00l1j45k56J3L87K37l36j99J5
3352a62J24K38n4j51k32J78K80m2q6r4j97K94L40l59k62Q9J44J86jk85k05K01
3374e6L00r6j72k4j07J90K56k36l01N6J21J80J29k42l81J98L95m0j99j94k1K36
3396hK98j99l29J39K00K8j9j44k52J18M07J2k51j43o0K43L45j90m20K9K67R6k3
3419A44r1k63J85K79k7k42n1m0J65K01p6l48r1L40Q5J5k13k30O0M03J8k84j23
$$ plain form
3263 100 136 46 -266 -232 146 164 53 -100 -258 -119 247 244 -169 -263 -160 82 214 -34 -381 -326 181 208 -40
3286 -40 -199 -182 -34 248 237 -160 -234 -34 70 219 105 -221 -199 211 314 43 -183 -147 21 304 189 -179
3308 -179 -224 101 258 106 150 -187 -311 127 291 -18 -97 -142 -103 224 285 -155 -336 14 243 121 95 -280
3330 -280 -307 113 245 -82 -183 -187 -132 116 283 -94 -324 -47 153 122 -23 -279 -266 121 358 22 -177 -162
3352 -162 -38 200 146 -5 -237 -59 221 179 93 -1 -198 96 436 77 -185 -96 48 234 233 -52 -257 -56
3374 -56 244 148 -24 -48 -155 35 291 55 -246 -190 -69 111 240 -2 -383 -185 210 170 -29 -223 -244 -8
3396 -8 290 91 -238 -99 101 129 110 -34 -286 -168 239 251 0 -143 -203 40 385 195 -225 -196 71 167 144
3419 144 53 -210 -25 254 227 -15 -66 -106 59 260 184 -164 -255 85 170 185 -28 -258 -198 205 223 -61 -184
3442a84N0J35J23k3l17p2K68J43j1q7k44l7L89J21l79r4J49N2K61j79k74p7L59
3465G2J02j00k9j55l9L32R9k19k03Q1J33J40J9l47q7K68K24j56j69o7JK90J03
3488B93k97k10J15J76J10n6j85k02K40K75j85j76j08J03K77N3k27k81J79J87Q7
3509A68j10k22q1J82K49r6j80k3j6K29J68k99k42J17L21L0j17j67j62L24K00r2
3531A81k60o6R6J21J21j17k65J05J89N8n7j52k33K87K98o1m13M8J05J07R3j53
3553C2k62N4K42J6l7r2j96J57K37k9k92kJ03J34J58j73l62J01L30K6j55l3j33
3576a76J22K65m6k80K0J14P4Q0q2k99K8L14J33j50j93j17J35K96j6l48n3K66K7
3599A14J3r8k13l1L58R1k09j12r2Q1L02L5l74j58L10P8jL6l22n3L84J7j95j13
$$ plain form
3442 -184 -134 1 124 101 -216 -288 -20 123 112 25 -219 -256 133 254 -125 -219 -70 -18 243 64 -210 -287 72
3465 72 174 74 45 -110 -149 183 282 63 -140 -59 74 214 233 -114 -201 67 291 135 -34 -101 -100 190 293
3488 293 -4 -214 -99 77 187 131 -54 -256 -16 259 74 -102 -210 -107 170 223 -4 -285 -106 81 168
3509 168 58 -164 -245 -63 186 90 -90 -113 -129 100 268 -31 -273 -156 165 195 78 -89 -251 73 273 181
3531 181 -79 -145 -49 72 193 76 -189 -84 105 163 106 -46 -279 8 306 245 -168 -120 -15 92 185 32
3553 32 -230 -176 66 82 45 -47 -243 -86 151 122 -170 -172 -69 65 223 50 -312 -211 119 145 -10 -43 -176
3576 -176 -54 211 165 -115 -95 19 93 173 91 -208 -180 134 267 117 -76 -193 -58 238 222 -126 -179 87 114
3599 114 127 29 -184 -215 143 234 25 -87 -179 -98 204 239 -135 -293 17 95 94 130 -192 -245 139 156 -39 -152
3623a52K0R8J84N4k98j86K39J31K5p5k25l8K66K27k32j94L6J51K04l9k27k32L03
3646D0J17m1q2j39q3K77J75j73k35K2J40J38jk16j46J81K47j01j01j81j3J91J92
3669B08k10j40k6J31J10M0j89j76J18L56j31j06o4j53K73J81j21l13Q6J27N0J05
3691A56j39k03J03L30j52q5r5q4J98K65j64l50Q8J90J36p5j27j57J34K24k5k16
3713d8m9l9J29K06r0k96R0J11Q6M2q1l02R8K47Q6k43j16L2J29J69p6k40j2J55
3737a2R0j2j16j24R9K09N6k19j07K6J00J96l9l32J1J74Q0np0j30PK88J4k27j20
3762a63R9R7J08M1k95n4L02nj10p1j27J08J57J27k74j02R1Q2Q9Ok03j25K04J81
3786A63j13j13q9K0K16Q2j97j66J05J07J25l2k85n1K78J77j29o1j59L0K27O2k07
$$ plain form
3623 -152 -132 -34 150 204 -94 -280 -41 90 115 40 -185 -223 43 270 38 -156 -120 31 235 196 -31 -263 40
3646 40 157 116 34 -105 -188 89 264 91 -144 -122 18 156 155 -61 -207 -26 221 120 19 -162 -175 16 208
3669 208 -2 -142 -168 -37 73 113 -76 -252 -134 222 91 -15 -79 -232 41 222 101 -212 -126 1 51 156
3691 156 17 -186 -83 247 95 10 -85 -169 29 294 130 -220 -132 58 194 119 -8 -165 -31 193 168 -48
3713 -48 -97 -136 -7 199 109 -187 -97 14 100 142 61 -241 -143 104 190 -53 -169 -137 -8 161 85 -155 -167 -12
3737 -12 78 66 -50 -174 -75 134 190 -29 -136 -110 -10 186 147 -185 -174 0 80 75 5 -125 -118 170 184 -43 -163
3762 -163 -64 33 141 182 -113 -167 135 130 20 -51 -178 -70 87 214 -60 -162 -71 11 100 106 -97 -222 -18 163
3786 163 50 -63 -152 -132 84 166 -31 -197 -92 15 140 108 -177 -228 50 227 98 37 -122 -92 135 197 -10
3809a0j96J72J50o7R8k09j11K10J90j14j45j8m0J62J42k10j30j5J82L4J8j37k24
3832b68J70K62o9k51JM0J86J25j65k30J13J76Q4j22r7j35J02K42o7k30k7J23J12
3855G5O5j9k65J7K79Pj36j7j39J18K10K0k94j9P5J37O6j41k49N7K87n0p4q5j3
3880h8N8J79l4k02o2J58O8M4r2j97k2K24J07n6k08l0N6K38Kk45l7J19O4O6o9k43
3906b02O3K38J08j81l9o9kK27Pk04q0J49J00j7l4j74l3K24J06j42p4j01J33J75
3930A78lj87j34J02J81l2j36r0l4J94J91j76j41l2O8J36P4k34j07J52R0L8q5k10
3954a97N1J40J59j92p6J1J11P6J11k66j50J63J37N6j36p6j3J47J40j94j32M0P0
3977b0J55l5j15j35J04K35m2r2j47m8J44J58p6k22K0J36J24lj28j73J15J75J3
$$ plain form
3809 -10 -206 -34 116 49 147 -62 -173 37 227 113 -32 -50 -90 72 214 4 -126 -141 41 75 93 -44 -268
3832 -268 -98 164 95 -156 -155 -115 71 196 31 -199 -86 90 174 52 -45 -180 -78 164 97 -133 -160 -37 75
3855 75 140 121 -144 -127 152 159 23 6 -133 -15 195 215 -79 -98 -23 114 180 39 -210 -153 134 84 10 -75 -88
3880 -88 -30 149 115 -87 -149 9 77 121 29 -168 -190 34 141 85 -123 -153 -97 141 143 -102 -139 -20 44 110 41 -202
3906 -202 -139 99 207 26 -13 -82 -84 143 150 -54 -134 15 115 98 64 -110 -143 81 187 45 -29 -130 3 178
3930 178 175 -12 -146 -44 137 105 -31 -121 -155 39 230 54 -87 -119 -51 85 159 -75 -182 -30 60 98 13 -197
3954 -197 -146 -6 153 -39 -115 -104 7 83 194 -72 -222 -59 78 134 -2 -78 -91 56 196 2 -130 -90 -20
3977 -20 135 100 -15 -150 -46 189 147 55 -92 -140 4 162 86 -136 -116 20 144 141 13 -160 -45 130 143
4000A43j74k0p2J04K10j21j96j3O8J07O5j72j44J34J73J7j64j11P3J09J06q2j84
4023a44RJ58Q2l5j00j47P0K33l4r6q8M7J02J09m1k19m0K10L3l1r5j25R0J63Q2
4048A93j63j08J6L7J12l8j11j10J80J57j69l8r7N6K42nk41k5K8O2J37q1j65m3
4072a74J54R9o9j52KJ32J55lk24q5N0J50J07m2j95J2J55O8q5j10P4k0J82m1j13
4097B7j70J66Q2m9R2j75j44J70K37k11r0JM3O0R3j86r9J42P9P5j47r4j29K12J56
4122A41j11j05o2M5J22J05j32k17J29J62j9k9j04r8J69P0j8j80j2P3J38M8nl13
4146b03J20J54j4K7j29r9J36J64k3k12J1R8N2M5r8j38oK05K2o8r9n7N6J46mk22
4172a36LJ43N4k2p6j31M8J80Oq7l5j36J05J34K1j25j53J88L9Q9m8k22N6J57R2
$$ plain form
4000 143 -31 -51 -123 -19 191 70 -126 -139 -71 36 101 -71 -215 -81 92 109 -55 -166 -93 16 122 40 -144
4023 -144 -135 23 105 70 -30 -177 -107 126 92 -4 -92 -45 57 166 125 -94 -134 76 109 78 -17 -142 -52 111 193
4048 193 30 -78 -62 -25 87 49 -62 -172 8 165 -4 -42 -139 -83 159 154 -87 -112 -84 -22 115 34 -131 -174
4072 -174 -20 79 10 -142 -140 -8 147 144 -80 -165 -115 35 142 100 -95 -83 72 140 55 -55 19 -1 181 140 27
4097 27 -143 23 105 56 148 -27 -171 -1 236 25 -65 -64 -21 39 132 -54 -153 -11 68 143 -4 -98 -227 -15 141
4122 141 30 -75 -137 -92 30 135 3 -214 -85 77 58 29 -75 -173 -4 66 48 -132 -144 -71 67 115 110 -203
4146 -203 -83 71 57 84 -45 -144 -8 156 133 -79 -68 30 82 127 29 -109 -115 90 112 44 -55 -112 -56 90 86 -136
4172 -136 -133 10 64 42 -34 -165 -117 63 69 -18 -53 -189 -84 50 71 -54 -207 -19 20 109 61 -161 -105 52 144
4197A44j61K7j06K6K52j08j78N6K4Q3O4nk18N7J31J7o1q5o9J03J72L0k99r1J99
4222DJ13K5q9j63k4J78P6j37r5J7O0PQ7j71o6J75J19q7o6q5j8J86Q9j68r5O9K7
4249c2J11Mj49j57J81Q3ql4j25J4J89J31j10j77m3J41J15jj78k7J00Q3lj37pl1
4275f7J38J28j02j65k1R3M5M5j40j84K13R4M5j25m6K0J06N2r9j62K2J27J5M4r8
4300b2j20P3J44L0j35l5n2J03J02m0j63M4J46Jl2o8OkJ55o4n8n7j6J16N1L3k06
4327f6l3J27J05q3n0j06P1J81m1j90J5M2J3J26j5k22K5J48J9jj14K4p2K56q5j40
4353f6p4J31P6N8j57j20M3J58M5j02K4j00n2J68J2n0r6O9J21l0j7j37j0J76J46
4378B16j88p1k6jJ94J4r5j17L3O4M9nj35m1J22J56j53p8p2J16R8R1k46p1R0P7
$$ plain form
4197 144 -17 10 -96 -70 182 74 -104 -48 -24 59 123 118 -100 -43 88 105 44 -41 -110 -7 165 195 -104 -195 4
4222 4 117 142 53 -110 -134 44 120 -17 -112 -95 -35 -28 59 -112 -178 -3 116 29 -37 -122 -140 46 135 -33 -128 -59 -32
4249 -32 79 83 -66 -223 -42 41 33 -1 -126 -112 77 208 98 -79 -122 19 134 133 -45 -72 28 111 108 -29 -36 -67
4275 -67 71 199 97 -68 -89 4 49 94 -46 -230 -17 77 122 -3 -49 -29 77 129 30 -132 -110 17 32 76 -22
4300 -22 -142 -69 75 105 -30 -65 -117 -14 88 48 -115 -71 75 76 44 -24 -18 -20 135 71 13 -44 -60 56 107 140 -66
4327 -66 -99 28 133 50 0 -106 -35 146 105 -85 -70 -28 -15 111 96 -126 -101 47 66 65 -49 -25 -97 159 74 -66
4353 -66 -140 -9 67 125 -32 -152 -109 49 94 -8 16 -84 -136 32 44 -6 -102 -33 88 58 41 -96 -106 70 216
4378 216 28 -43 -69 -70 124 138 43 -74 -41 23 72 67 -68 -109 13 169 16 -62 -134 -18 80 171 -75 -146 -56 21
4404B1Ol1m3m9J33J14r0j08k6J9J18Q3j62j68J20J20mJ7j09p6R4J58j36m2J9m2
4430f4J34Jm4j62L2J63k1k1l0j29J70R0o2j70Q3NN9O6p9j46R8R4L7j15j6q0J21
4457A4J54q5j77p0J30Q1K5n5j10K9J78j14J1p2r2K15K6l6j43K9O7N9K8n4j75K8
4483a09J52P2j11k4pM2J18n1j81j4J11J19p2m9p6j1J28O0j53J7m9L7K26p7j78
4508h0JP2Q9j2Nj60K1J07O3p3j54K3MJ98qj80k4P9N4NN5j66k0J69J2j23m1lN5
4537c2J04K9j06j54J89N7k5pj23m5J74P8j43o5N5K6M6J6j67r3J56J35p3p6qLM1
4564hJ18j37m3J9O2Q8kj95q4J55J42r4Qj03OO5J43j18j41L6P1R8m7n3j09R3J43
4591A13l5j43L4k1Q7J23j09j39JJ31M5k4n2j33J03Q3K9p8r6J5O0J06q4j86R9J04
$$ plain form
4404 21 27 -4 -47 -96 37 151 61 -47 -73 -54 64 147 -15 -183 -63 57 53 70 -39 -115 -21 137 1 -41 -22 -64
4430 -64 70 71 27 -135 -103 60 39 18 -12 -141 29 119 57 -113 -30 -25 34 100 21 -125 -27 67 104 -11 -27 -107 14
4457 14 168 83 -94 -164 -34 47 72 17 -93 -64 114 0 11 -61 -153 62 88 52 -91 -62 5 64 92 38 -137 -109
4483 -109 43 115 4 -20 -27 15 133 82 -99 -113 -2 117 45 -4 -80 -91 37 97 -56 -39 -88 -51 175 98 -80
4508 -80 -79 -7 82 70 75 -85 -64 43 106 33 -121 -98 -94 104 96 -84 -108 -29 25 30 85 -81 -101 68 80 -43 -84 -87 -32
4537 -32 72 101 -5 -159 30 87 62 55 -68 -113 61 139 -4 -69 -14 12 58 74 -93 -186 -30 105 32 -44 -52 -49 -8
4564 -8 110 -27 -70 -51 11 99 97 -98 -182 -27 115 21 29 -74 -68 -3 140 22 -119 -83 -12 86 39 -14 -123 -30 113
4591 113 78 -65 -31 -52 35 158 49 -90 -89 42 87 63 11 -122 -19 64 93 15 -81 -66 -6 100 16 -170 -71 33
4617C3Ql4k7j08P9K05j25j43J13m6L7P2p0j04J4J93j4l5q2j13J02J78o5r8o6L6
4643f0O7Q4j6j87O1J05N1n8m7m8k6J57m2J7j09N2J6Q5q5o3m8R6Q2p8J0q8l4J88
4671H2M3j90pO0J9L9mq4j46K25L0l0q7p0L4J42J04j90J0kM6L8m8p2m9J06J15j22
4699hM4j08%J03J3o3q8N9J17r5L6n9j4N8J06m7r6Pk7J44J8j11p9J02J3J9L3j14
4727c7n1O0J15j02m2mL7N2O4r0j17Q6P5m5K9q1r0N8J60Jj65M1M1N4M5mj84M5J21
4756G2m8R3j13r8J18Q1m0j16J8Q8k5J8J4j76Q5O7J7ln0j11P7J26j5j67M7P6M2
4783G7j9l8j12m4K04%j13l8QL5R7l0r1J9K4J2Q5L6k44O9J42k1j27J4L9l9J33k9
4811D9j32m4J16O8m4J2j43PK22k1l9j15L8QJ27L3j40q7J25L8N1j15n6L2K7J42
$$ plain form
4617 33 41 7 -20 -128 -49 156 31 -112 1 -45 -8 64 -6 -110 -96 97 83 48 -34 -147 -45 133 68 -30 -96 -60
4643 -60 7 91 75 -112 -51 54 105 47 0 -48 -74 83 41 58 -51 1 17 102 17 -46 -94 2 84 6 16 -72 -106 82
4671 82 125 -65 -72 -12 7 46 42 -42 -188 37 67 37 -50 -120 -86 56 160 -30 -20 -22 24 62 14 -58 -107 -1 114 -8
4699 -8 36 -72 -72 31 44 -19 -107 -48 69 -26 10 -49 -63 -5 101 54 -42 -35 -62 82 100 -11 -90 12 25 44 77 -37
4727 -37 -88 -28 87 -15 -57 -61 -24 28 92 2 -115 -29 46 1 30 -51 -141 -83 77 78 -87 -46 -5 49 94 90 -94 -49 72
4756 72 24 117 4 -94 24 105 65 -51 -33 55 30 48 62 -114 -29 38 55 52 2 -109 -32 94 79 -88 -41 35 77
4783 77 58 20 -92 -136 68 68 -45 -83 -75 -40 57 27 -64 -45 -21 -9 76 112 -132 -63 79 58 -69 -55 -16 -55 78 49
4811 49 -83 -127 -11 57 13 25 -118 -111 111 90 51 -64 -26 -18 109 142 2 -85 40 78 129 14 -42 -10 17 159
4837A59j42r0J8RJ02M0j80n3Q9J71r8J3j41M4J24j9p3kk3K5J19K6j94p6O1J10
4863A9k3rn9n2J15J13j43k4J1P7L3K3p4o4N8J18r7ql6o5J50O3j39n4O5L3J7M3
4891I1j50j06J47O2L9n1j28K3P1R6n5j47oN3J30l1l7j27M5J77k2o7j25K4P9J64
4917A49j15j31L4mJ12r4L5k3M0P3n2q7L3m3P4K04j51j11k4J02Q6k8o7l9J02J0
4943H5P3j77l0P6m4Q7l4j21M0P2J5k9j9j3l8J85j10n6K8N5q6Q5N9j14j09J31K3
4970C4m4o6k0P3J07J0j08o3J8J01k5k3q9k1J26M0m1l4q4J30O2L1j54r1P6R1K8
4997F4J3r8m3J48M5n7q4M1m5N8N9q3o6J3J16k9K7j03l2O6K0m3Pl8KO0K6n1j42
5026a49J22J19j34M4r7j2R6J14j28p8N9mM1Q7mj64N6O2M8n6o7l7Q0Q8j8j79M7
$$ plain form
4837 159 17 -73 -55 -46 56 96 -84 -137 -48 123 25 38 -103 -59 65 46 -27 -29 -52 -27 92 118 -76 -152 -91 19
4863 19 -4 -13 -72 -124 -9 104 -39 -63 -52 25 58 81 7 -57 1 119 22 14 -22 -87 63 126 -13 -67 -2 31 48 91
4891 91 -59 -165 -18 44 83 32 -96 -73 -2 94 39 -108 -114 -61 69 38 1 -126 -81 96 74 7 -118 -94 -15 149
4917 149 34 -97 -63 -67 45 -49 -14 -37 3 76 24 -63 -30 -73 1 205 54 -57 -81 21 107 79 12 -27 75 85
4943 85 158 -19 -49 27 -17 70 36 -85 -45 27 42 13 -6 -19 -57 128 18 -38 -10 45 -41 44 103 -11 -120 11 34
4970 34 -10 -76 -96 -23 84 94 -14 -77 -59 42 17 -6 -95 -116 10 50 9 -25 -109 21 83 114 -40 -131 -55 36 64
4997 64 77 -21 -64 84 129 72 -12 29 -16 42 101 18 -48 -35 81 52 79 -24 -56 10 30 -13 -6 -44 -42 18 44 -7 -149
5026 -149 -27 92 -42 2 -95 -107 -11 103 -25 -103 -44 -48 -7 80 76 -88 -32 30 78 22 -45 -82 -2 86 68 -111 -64
5053f4R0K6P3o5j71R8Q2Ll9lr8K3J01K8j24l1J07KM3k7j11j3J83p0l3k0LQj9L4
5083A6o0J1k4J41l6k6j22N2P3K7j13KJ5L9J8K3j02j7P3P2m7qq0J1J63l7q3l3J
5112e1P4M9Rj28J2O3K1j5K0o4j16J76N6j05m0K5oQ1Nj53j3P7R6k8n2l3o1K00n2
5141D7m7q2J39p8P5mp7j9l5J11L4m2k8r7J17Q4j46m4j0J53rK7j19rL9J00j6j19
5169e5M4o7J21O2r4m1ol7J42J7n3o3O6P4m6l1k5j0k7J37j09j1K6oJ5O6j61J7k2
5198g7J36n6r1K5j1P2M6l9j45J11Q3M8p9k6j19R4J26K5j38k9l2P6O6m5j41M1R1
5225A2N1k2p9m7Q9J03r9l4%J8L2LK1m5rN2M8o2l7o4MJ39o9n2m2J39p4O5L9j00
5255b0q7J34rK3l6k6m8J04K5o8j8m0O9K0jq8l5J21oo6P0l6k9P6Mq2J5M5M7LMr7
$$ plain form
5053 -64 26 52 125 60 -111 -13 69 72 33 30 -68 -45 56 84 -40 -71 36 38 81 54 -57 -70 113 43 10 -10 -7 1 -18 16
5083 16 -44 -33 -57 84 48 22 -100 -48 25 52 -61 -59 -44 -5 13 36 -66 -83 -10 62 15 7 -73 -62 101 64 -19 -52 -51
5112 -51 23 72 81 -47 -35 28 49 34 54 -10 -126 50 106 1 -39 -14 -20 61 66 -87 -100 -23 73 45 -7 -40 -101 99 47
5141 47 0 -82 57 -21 54 50 -27 -46 -81 30 64 22 -6 -103 14 98 -48 -92 -102 51 42 69 -50 -59 -20 80 64 -55
5169 -55 -11 -78 43 105 11 -30 -36 -73 69 86 33 -30 36 110 64 33 8 -2 -29 108 -1 -12 14 8 23 89 -72 -55 -77
5198 -77 59 3 -88 -63 -74 -2 44 5 -140 -29 54 102 23 -3 -122 -28 98 123 -15 -44 -76 0 66 21 -120 -79 12
5225 12 63 41 -38 -85 4 107 8 -26 -26 -8 24 27 48 3 -6 46 94 32 -5 -69 -65 74 5 -47 -89 50 -24 41 80 -20
5255 -20 -107 27 18 41 5 -21 -69 35 60 -8 -26 -66 3 23 22 -66 -101 20 14 -52 18 -18 -47 29 33 -49 -34 11 58 61 65 -32
5287c2l3Q8Q2o8m8r6O4J22L8j43l0P4k7R5p7o5nN0L6j8r5N0J4Q2M3r9q1O2P4%
5317E7n2l7n0J14L8j14K9n5M6N9J17j57o2JJ11Rl4qj14J03O5jj11M8j6lP1m8p3
5346f7N4QJ3j7ml6Q3P1p5j20M2K9O0J1nj73N1J42o3q0L4k5Q2N5m6n3Ql0O8N2m3
5377B6m1k8J13jn5m5j4N0NM1o6o5L5O8K5k1n5m1P8O9n8q1P9p7O5P3j20J0J1k8
5407d8J47r5q6M5R3Kp3L1J2p3R1L6j16l7O6O5k4l7Pj01J27M4o6l4m5N4P1qm3l9
5437c4K5lM6rp5k0K3J62j16l0K4KPP3j20OO8m0m5N8l5l0M1P8k4j15N2MJ67r4j57
5468a11J5N2P4Nr4l3j9J41N7p9p4LP7%pJ9k6j9P8j08LN2k7N1J6no4m6R2l8N3l6
5500Bl9RJ08p0L4k8k5O3L7n8q1M4k7Q0j2p0J3k9J34n9l7Nr3N1L4J28j76QR3m4
$$ plain form
5287 -32 -65 23 105 37 -11 -107 -43 79 117 -26 -56 18 -9 86 9 -56 -61 -11 25 7 -88 -38 -24 58 101 2 -79 -17 57 57
5317 57 5 -32 -82 32 70 -44 -15 -70 -24 35 152 -5 -67 -66 45 54 20 12 -102 1 66 65 -46 2 -14 -17 54 6 -67
5346 -67 -13 -5 8 -9 -13 -49 34 105 30 -90 -48 -19 41 52 47 -126 -75 67 4 -76 -42 -67 15 70 24 -29 -21 -51 17 69 26
5377 26 -15 -43 70 69 14 -31 -45 5 10 51 -15 -80 -45 23 48 27 -28 -69 9 78 20 -61 18 -59 6 79 -41 -31 -20 -48
5407 -48 99 4 -82 -37 56 58 -15 16 28 -45 46 82 -34 -71 -5 60 36 -1 6 -95 32 76 10 -24 -69 -15 56 48 5 -34
5437 -34 -9 -12 34 25 -50 -70 -47 115 -1 -31 -7 -5 2 75 -45 -39 29 -11 -56 2 -33 -63 -22 56 32 -83 -31 -27 140 46 -111
5468 -111 -96 -44 30 35 -59 -92 -111 30 87 8 -66 -63 14 14 7 26 0 -19 59 -49 -46 6 -21 30 46 41 -23 -69 23 -15 38 2
5500 2 -37 -28 80 10 44 16 -9 54 91 33 -48 -4 -31 49 37 -33 -20 -49 85 26 -11 -6 -99 -48 -14 114 -62 -54 39 -5
5530emL0l2QO0o6j1Kn9J00j1J8q4l5N9M3ln6M8n0J23lj22R6n3QO0m3r9J11J9L
5562E2K5p2l7o1R9L7j04k0J00mrK3o6p2J38k9j9N4r0qO9Qk0m1l2N6L3p8N6j06
5592a18J45O5r3J9n8L4K5K3n3l7J7QR3n0j02NR2M0j6m5P3j05M4J5jq0Q1l0P8L5
5622A04j35o3J06Q8j03Qj7j1L2J03j40l5K1N0M8l1mj07P4O7j01k1k8Q1K7jo4n7
5650a09Q4L0Ro1M7q6R4O4n9l4k7J3L1Q0n4l5jL2K5m5m5J5L3P4J4m8k0Ql8M4rj20
5682i4R5Qj6N0o8K5J5J20o2j08PK4O0m6L2p3J0O4L3q1O%M7p0K9j1m4N5n9J4M4
5713Fp4mJ19n1K8j0Nk7P1qj14M3oM1O7n1mr3R7P6j30M5q4P1N2m3n0ML6LO4q2k
5746eJ2k0Q9j0j26L1K1J8Qq1K3L1K1K8Jo7j2N3j1J2p7L4M2kM6q2m6N4M4o3K9m4
$$ plain form
5530 -5 -9 21 -11 -3 57 -9 -20 -18 -77 23 12 30 -54 -89 -30 13 10 -46 2 -48 75 72 -50 46 -7 1 61 18 -81 30 49 52
5562 52 77 5 -32 -93 6 43 -61 -81 19 15 6 29 -37 -109 29 0 -19 35 -55 -63 6 14 -6 -47 -79 -23 10 -68 -12 -118
5592 -118 27 92 -1 18 -40 -6 19 42 -11 -48 -31 -23 70 20 -82 -77 15 55 39 -6 67 -38 6 21 20 -60 21 -9 69 104
5622 104 -31 -94 12 100 -3 5 -12 -23 9 112 -28 -63 -42 8 56 25 21 -86 -12 55 -46 -67 -95 -14 13 12 -52 -109
5650 -109 -25 5 14 -47 0 -86 8 72 13 -21 -48 -35 -4 76 22 -13 -14 18 43 -2 -47 -32 1 75 89 41 21 29 -9 35 26 -94
5682 -94 1 9 -7 43 -25 0 15 135 73 -35 -28 -4 56 10 42 -31 -21 43 76 -5 1 1 48 -22 7 -4 -48 7 -52 -38 6
5713 6 -68 -72 47 -4 24 14 19 -8 63 55 -59 -16 -22 19 86 35 31 -62 35 111 -19 26 -58 13 65 22 -28 -24 12 15 79 -3 -5
5746 -5 7 -13 76 66 -60 -29 -8 10 18 -63 -40 -9 12 40 41 -26 -38 15 4 16 -61 -27 15 13 59 -23 -69 -15 29 -34 -5 -49
5778d9j0P3L3J4j37O7JP4m6Kp3L4J05q5L1l9mnM0J4l8p5N7P5jr7l2r3J95L7r6
5809b8rk3rR6N3j28k5J02m8L1o6R2p1J54Mk20L3N4m4oN7n0qR3q4R7k5q2J4P8r
5840B3m9j2jN2L2j6k7J8j3JkRo6P0K0N6j28J3K5O5k7N1q0n5Kj5J19n9k7j1kO2
5872B8j3q2L3m1R0j5k1l0Q2l3M5q9J9LK8P1n3k6N3%l4J5n9o8J05P0q0j9N3n7K4
5903aOK1q3M2MjN1o0k8O5K3m3l6J4%K2R7j16m6k7R5jj5JK0J5k9L0l5l8M8PK5k1
5937Fl3n2J05l8Ok0k9Q5K1q3M3Nn2Q3j5J1o8j7L6L9Mj8J1p2Q1Q0j17o0O3J5M2
5968F2q0k4O7Pl1pl6MQ6j8K2r1J9RN6j6M2j22K9K2M2k0Mo6RL6%o2J4qN6L4l4q5
6002h0L4L0M4M6n7m4oJ21n6m7n0O4M7n3N1r0J9N1k1mN0l5Rnj0k2r7Q1J17r8NK8
$$ plain form
5778 -49 -59 14 47 61 -76 -9 -8 66 20 22 -51 -17 88 3 34 -5 -9 -14 26 40 2 -73 -16 59 58 -39 -71 -164 31 68 -28
5809 -28 -37 -60 -69 27 80 -48 -73 29 -19 12 -54 38 -33 121 125 -95 -62 -8 -52 -58 -1 -51 -59 34 -50 47 22 -60 -46 32 23
5840 23 -26 -38 -39 13 45 29 2 20 7 8 6 15 -51 19 39 95 -33 -20 5 70 43 94 14 -41 -39 -54 65 6 -21 -32 -34 28
5872 28 15 -67 -34 -75 15 0 -21 -51 31 -2 43 -46 -27 -24 4 75 22 -4 49 49 15 30 -29 -97 8 78 -2 -21 32 -25 -1
5903 -1 5 26 -57 -15 -11 -12 39 -21 -49 16 39 -4 -40 -26 -26 -4 93 -23 -69 -96 -1 -2 -17 -16 4 19 -10 20 -15 -53 -5 2 27 6
5937 6 -27 -79 26 -12 -6 -26 -55 30 51 -32 11 16 -36 47 32 43 -25 -42 -6 33 37 19 30 -42 39 119 2 -58 5 20 62
5968 62 -18 -42 25 32 1 -6 -42 -38 48 30 52 -39 -20 -11 45 29 71 -51 -22 0 42 22 26 -40 -31 5 5 -57 -43 -51 5 39 5 -80
6002 -80 -46 -16 28 74 17 -27 -33 88 32 -15 -65 -1 46 -7 44 -46 -27 24 3 -1 49 14 23 18 8 -14 -111 -30 87 -11 -6 22
6034B2l7L9N4j45N2mL6M3O9j41rM7N1n5o2J00o0l2Q7q1L3l0M8J5k9k0J6j0RM5
6064E1r4Lj1L8L6m0n0K2L0mL2nq5L8M5M8m3o3LR2m8N3j10L0L3J3L7j7q1L3L6J3
6096C5j1p0O3j2L4m3o5l1P6L7k7j5n2M2L7K2m1j0K5N0Nj3l8l0j0Q3m4ko0M7N9
6127D1l6J9p8K0L7R5r0o1R%Q4j8k3K5q0J16K8p6O0j35J34l4n7Q9l7l5nN3l5m5
6157c5K4L6Lj2l9J6J9k0O0m6m5L2K0n1M6m5RqR2l4q0N9J5l3J00n2j06J07L6n2
6187A6l4nQk6P7j3o4J4JP2n4m5k1M9M2J6Qm8q2R3mp0P9O1n2l0L3J2n6L2K3rl8
6220a5L9o4K0P2j08N8j7K0Q9p4J0n7N3k1N6p3n5Q5K3K3n6n6j6O0j2PK0l1K4L5
6250C9L2p3Nj6jO3m8p9P1P5p9M4j5o3L6M4j3l8j9j9O3Oj9op6Q5n8P4p0N9m2Q3
$$ plain form
6034 22 -15 24 78 -67 -15 -19 17 60 129 -12 -21 26 77 22 -40 60 0 -32 55 -26 7 -23 25 40 11 -9 7 -3 6 51
6064 51 -43 -40 -51 -13 23 -17 -67 -45 -15 -19 13 8 -77 -39 6 54 11 -52 -49 43 -5 48 -62 -32 1 14 51 34 -47 -14 22 35
6096 35 24 -46 17 5 39 -4 -69 -100 -24 13 -14 -29 -81 -39 -2 20 -21 -31 -6 44 49 36 -2 -32 -42 41 -3 -5 -65 -18 41
6127 41 5 24 -54 -34 3 98 8 -53 -44 -44 40 22 -1 24 -56 60 88 12 72 -63 71 37 -20 69 32 -3 -8 45 10 -35
6157 -35 -11 25 28 16 -23 -7 12 -8 52 6 -39 -7 13 -38 8 -37 -28 -36 56 22 -58 1 16 -17 83 31 -75 32 68 16
6187 16 -18 -23 -15 -41 36 23 -41 -27 -26 46 -8 -53 -74 -25 17 33 41 -7 -89 4 0 -70 9 70 18 -12 21 33 -23 9 32 23 -15
6220 -15 24 -40 -20 52 -56 2 -15 5 94 20 30 -27 26 5 61 -12 -67 18 41 64 8 -48 -64 -4 -16 -9 11 -20 4 39
6250 39 71 -2 3 -13 -14 49 1 -78 -7 68 -11 33 18 -45 -9 35 22 -16 -35 -54 9 15 -4 -10 -86 -1 -59 15 -55 4 -38 45
6282D5Nl9l0J00rj4n3K6p8L7j4Q0n5ll2J15qq5k7n0R6Rm3J5k3P4K5r5L0kMJ2k9
6315a6M3j02J17q3L5Jo2P4j4Q2m0p1l5M5M1k8l0J5k2J01n4om5J4J46l2j04K1K1
6344A2m7N2M9o6n1k2Q0K8m5J4o0L2M6O2n2J4m8j1K6K4q2OJ33j82P5rL9k4K1l2
6374a8pl5K7J17q2k2Jn3R6jj5r0Q2k4J09j14M2M2l5l4qK1l2O2lK4m3L0o0K5J19
6405A21q5k3m8j6R3m7L0o7L5P0q6M6l4j8LL7J2o2J6K6N2n3K4o7J7J9l6L9m8nP4
6436A9m5K4l3MM7K9m3Lm5l1R3K0l3k4j1O8p4L7K0N2n6n1O4K8j22j7R3J5j3o2J04
6467F0j21O0KO4m6J6l9M4l8l8n0J12No4rL3O2j05N0k1K4L8Jk5PRnn3Jj3J8K0o
6500gK6j6o6J2QQ6o4KJ1k8J3N2J8m5o8Q6kJk8j4L8qJ6L4o9L6pM6l7q2M0K8k3J1
$$ plain form
6282 45 50 11 -19 81 72 58 5 31 -47 -10 -24 56 1 -2 -34 81 73 -12 -39 -89 7 16 -27 -12 -35 39 64 -31 -1 -3 1 13 -16
6315 -16 27 -75 42 -41 -6 -5 -67 7 -7 75 35 -36 -71 -26 15 -13 -43 -28 -50 51 -3 -9 -54 -40 106 74 -30 -9 12
6344 12 -35 17 66 0 -51 -73 7 35 -10 4 -56 -24 22 84 32 46 -2 -13 13 37 -45 -39 94 -88 -13 -22 17 -7 14 -18
6374 -18 -25 -60 -33 84 2 -20 -19 -72 24 23 8 -82 0 -24 85 -29 13 55 20 -14 -22 -1 -33 29 26 50 7 37 -23 2 121
6405 121 36 13 -35 -51 42 -5 25 -42 -7 63 -23 23 -11 -29 -26 11 23 -39 -23 3 55 2 26 -41 -24 -5 -41 -2 -50 -55 19
6436 19 -26 -2 -35 -31 16 45 2 5 -40 -71 22 42 9 -15 -26 42 -32 5 25 77 21 -30 34 62 -60 -77 16 31 18 -44 60
6467 60 -61 -1 1 65 19 35 -4 40 2 -36 -86 26 31 -33 -42 -9 53 -52 -2 -23 1 39 40 15 22 31 26 -27 -26 -39 -21 -1 -7
6500 -7 19 3 -63 -51 -43 43 -21 -19 -8 -36 -23 29 47 2 -66 20 18 19 -9 -23 15 7 23 57 -12 24 17 63 26 -56 -16 12 -11 0
6534@Jk3L8l6NK0l6L0o3O2k2L9k4j0L8oJ9j03K7L1L3j18P7j17J43J1L4j28k2P1
6564b9PK1L2r3J34n9k3L1pN0n5J1K0q5O7k4P4o9l6J4M8m6N3p4N6L2l6k3j4N0n1
6595b4kN1o8N8mkJ4L5m8l2L1k1j4K1k9n9J10K2ll2j9l5P6L1l8Oj1l4Q7q8K3n7
6627e5M0oN4p7J8P1p3N0k2k1j5M7lN1j35L0R3J6rp7M9q9J11j4ok6n0P7L6l0p9
6658d4M0N5RJ7q5k4L5J2K9o8J7m8O7Kl1kl8R2l4Jk2L5K8k1k4k1M2oJK1k1Jq7O6
6692fj5K1M9J4m6l9O4m%n4PO4L4r6m2%J38m2r5M8Q3o3QK4p7kN6K5pk5L0j5j5j1
6726A1j3j4QJ8l9K7k6n2L0N6Op4M2K0J1K0p5qR5m4j3KM6n8P6k0l0O2l3m0J1K5
6758B7l9M3r5M1oR2p9j8J1R2k0q7lQ1J2pp2K2n7Q1m3M6j05P5j4P1k6q3O4j4k9
$$ plain form
6534 0 1 -22 16 -20 -15 5 -31 -1 -64 -2 -24 15 -9 -19 19 13 32 -71 -44 -13 20 -98 -21 -138 5 16 50 -78 -100 -29
6564 -29 -22 -1 31 -62 72 13 -10 21 14 64 9 20 40 -45 22 -2 72 3 -33 -19 29 -17 36 -38 18 50 14 -9 -23 27 -24
6595 -24 -26 25 -43 15 11 9 23 58 10 -22 9 -12 -26 -5 -34 -93 17 39 36 4 -15 -50 26 57 19 25 14 -20 67 -21 2 -55
6627 -55 -15 -21 33 -44 -26 45 -28 22 0 -21 -36 11 8 59 -76 -46 47 63 54 -23 26 -63 48 34 28 2 -48 29 65 35 -44
6658 -44 -4 51 60 77 -8 -32 3 15 44 -24 -7 -55 12 14 -17 -19 -57 35 1 2 -20 15 43 22 -2 -23 19 13 14 35 14 15 -72 -6
6692 -6 -21 0 49 63 17 -22 42 38 38 -16 -9 55 89 -7 -49 -49 89 47 -48 0 83 20 28 52 -25 -27 29 54 47 22 52 37 22 11
6726 11 -2 -16 -8 10 -29 -2 -28 -80 -50 6 12 -62 -20 0 11 31 -44 -52 43 -1 -14 -12 34 -24 52 32 2 64 31 -9 2 27
6758 27 -12 31 -64 -23 -29 63 -16 -34 -23 69 49 -38 -41 40 52 45 -27 -5 -62 19 -24 22 -83 -8 -22 49 23 -60 4 -10 -39
6789c9M1N4j69Q1M9k5l3N3o0N3M3jj05j3R7K5j7m6k5RM3K3j7j7J7l7L9Mn2K7l7
6820c5O3j6M6r0L1L1oL5j08L2j4M6O6r8m4J03o1O3l0m7K2N4m4k3L1M9j00Q7q0
6849c7K0m5L8PJ1n4J7L0j2N9p3L9l1m5J16r0M2l7Q4o9N8l7j8L0m7Q5m4l1J6K5
6879GM3Lo4k8RM3Poj3K3M8r6l8M1O5m0%J2n2m3L8N0k0j2m8N2M0n7R9q8k3J0O0
6912B2rl3o7Q5P4m3j08P0l4k6J08l0j7N3q4M5J0l3k7K2Q9k1l7K1J5k9L6o7n4O8
6942aK2L6l1l2K4m0R5l7LNj17J29o6N7o7oK0L4K1j7j8lK2K6N6j00m0oN3jm2K6
6974EJ0M1r6qm0Q8K2p2J12o3K7lk7O0q8j9L7M6J2l6J6lPJ7Rj05M5M6L8r2k0J5
7006a9N2l2n8R4k8jM%JK7l7N0K3m8k3j4K5M1l9L4j50N2L8k0M0n4L1O7o9J6j05
$$ plain form
6789 -39 2 56 -113 -32 17 -8 -41 12 -48 5 48 47 -58 -71 26 51 34 -12 -37 -28 15 38 21 4 21 -16 23 27 -25 2 -35
6820 -35 28 12 58 -32 -1 30 24 59 -49 -17 -31 15 81 -17 -61 42 -19 44 14 -33 -11 43 -1 -24 7 56 -44 43 -37
6849 -37 -17 -62 -24 -17 -6 -60 -43 -13 -25 34 -39 0 -31 -76 40 -50 -8 -45 39 -30 28 -9 -27 3 -44 41 -3 -34 -18 7
6879 7 50 53 -11 -39 -30 13 20 14 1 24 72 -24 -62 -21 44 4 4 16 -36 -79 -41 9 -11 -23 -71 -19 21 -36 63 -25 -48 -38 22
6912 22 13 -20 -87 -2 72 29 -79 -9 -43 -69 39 9 -8 45 -39 6 16 -17 -44 -22 67 46 9 30 45 16 52 -15 -69 -1
6942 -1 21 57 26 -6 18 -22 73 36 39 44 -73 56 -10 47 -20 -26 -6 28 49 32 14 11 33 59 115 15 -25 -31 22 21 -21 5
6974 5 15 56 -40 -48 -88 0 22 -50 62 -1 26 23 -4 56 -32 -51 -14 32 44 8 24 21 28 45 54 -51 -6 40 78 -14 -34 -19
7006 -19 33 1 -57 37 9 8 12 12 13 40 3 53 76 28 5 -9 16 57 18 52 -98 -46 -8 -28 12 -42 -11 56 -13 3 -102
7037a02MJ23j2n5M8j7k9M9l5n9J0Q0l1L1j7K2m6QJ01p8J4j7J9K6Qp1J7L9k7J1
7067A4l7jN1j9K2J5rl9j3M2N9q7MJ1k7L1MJ2n2k0R3j2p7l2J08o6M5r8P6K3ml8
7099b1P2j31O7M3n2l1N7k4QL4J9oj16P4K3K0k0J6k9K2k8J6jj5L3p7L0K6k1K8j
7130A5L1l8L1m5N0jl6kl1lQ4n0Pnj4M5M2o0q8K4Q3m0k2Mo1L7k9O5j2O5q1O3o9
7163d1j9ML4Q4oo2l6l3o5J72k1pJ8J0m5J7K2m6KOK0%oPJ9M8p3N7n8O6KJ4m2L2
7197G4m2j4M0Ln1o4K4L3m8K1J7n4J03j6o1j1N8k4N0q7Q4o5j3M8L1r5ML8P9m4l4
7228a6k2j7K4J9N8o4j5J0N2j8j6k4K4P6j0j24R1n5O9j4mn7L5P1m0k3pJ6N8r2N9
7259D4j8l7oN2M2n9j4j6J2M2k9K1o2k9K7K6j0j9L4l9L4QK7j2n7P2O4j61N7Kj5
$$ plain form
7037 -102 -98 25 13 -42 6 -11 -40 9 -26 -85 -75 5 -26 5 -12 10 -36 -28 73 -5 9 -8 11 37 45 -26 -9 30 3 14
7067 14 -23 -24 27 8 30 45 36 -3 -16 26 85 -2 2 13 -14 17 21 33 -19 -39 54 42 -35 -67 41 -25 20 -78 -2 21 17 -21
7099 -21 51 -80 -13 30 -22 -53 4 -20 -12 22 41 35 -81 -7 16 36 16 32 3 25 -3 13 12 -3 30 -47 -17 9 -12 16 15
7130 15 46 8 39 -6 44 43 7 5 -26 -29 55 5 12 7 -7 38 80 20 -68 -44 39 -1 -23 -19 -80 -43 -72 -7 -19 46 -35 28 -41
7163 -41 -60 -56 -22 62 56 -6 -42 -75 -140 32 11 4 22 32 -13 4 26 -20 -18 -12 8 8 2 9 28 76 3 60 2 68 70 84 42 74
7197 74 32 18 58 61 10 -54 -30 3 -45 -24 -7 -61 42 26 -35 -46 12 -12 38 -49 35 -30 -43 5 36 -59 -55 -17 62 18 -16
7228 -16 -38 -55 -31 -12 46 -18 -33 -23 29 11 -5 -29 -5 71 61 -63 28 -27 42 28 24 -33 2 73 33 10 3 19 77 -15 44
7259 44 26 -11 -17 35 77 18 4 -12 0 42 13 34 -28 -57 -30 -4 -14 -33 1 -38 -4 4 31 19 -38 34 98 -63 -6 -4 -19
7290a9K1O5m5l5J9o2N9n3j7O3P5j31L8O9m6O2mmq8p6J79mk0K1n8KjO8m2m1J2l9
7322c2J6O0j31%P4R2q9Mo7O8KM2jl3m2L7M3p1M7o1L4mM2j06N0J9K0l2L2k9JNj2
7355b2J8j7MRO9r1L7Kj2L6n0Q3q2K1J6J6m1l2j3N0P0l4n6NL8k3N4l8jn8Q0p6n
7388d3qK4P0k7k0q7M5P4o9L2rj0R7o8M0n6O7r1K6P0q4o2P3K2J3K0o3K6n5J19k3
7419D3j3p3j5O5L6M1J0n1j4rk5P4l8n6jP8m6j1k3L7M4j7n0O8n7m6J04Lj11L6n
7450b2Ol5K4k5K8k8O0on0M8nL5k0pj4L9N7o3j7opR6n4j33R1j6NK7Jl0J1M4L5m2
7484B7l3k4rJ12j3o3R2q5L0qk7L7n2K7j8jJ9k8kJ8K5q2PK0O7o6J9k4m3Q6K5rm8
7517b4K0l0J2j2lmM8mkRj2l2O2l1M4o6K5nMl2j0K2K8ML1l2k8M3j5l5J01L5j15
$$ plain form
7290 -19 2 67 22 -13 6 -56 3 -50 -67 -4 71 -60 -22 47 1 63 59 55 -33 -109 70 66 46 67 9 11 10 78 36 -5 7 -32
7322 -32 -16 44 -87 -87 -13 79 -10 -6 -73 -5 -3 39 38 5 -37 0 43 -28 19 -42 -8 -12 30 -76 -26 -7 13 -19 13 -16 -15 -10 -22
7355 -22 -4 -21 -17 -8 61 -30 7 9 -3 33 -17 66 -16 5 21 37 -4 -36 -49 1 71 37 -19 -14 24 1 55 17 16 -42 38 -38 -43
7388 -43 -51 -27 43 16 -4 -91 -46 28 -41 -9 -18 -28 69 1 41 -15 52 -39 -13 57 -27 -89 -16 6 19 39 -24 2 -53 66 43
7419 43 30 -43 -58 7 43 84 94 43 29 20 -5 69 31 -25 -26 52 6 -5 -28 9 53 36 -14 54 -3 -49 55 58 -53 -17 -22
7450 -22 -16 -51 -27 -52 -24 -52 8 2 -48 0 -5 30 10 3 -11 28 85 22 5 -1 -8 88 34 -99 -8 -24 -19 8 9 -21 -10 34 69 27
7484 27 -6 -30 -39 73 60 -3 89 4 34 26 -1 36 -16 11 -7 -8 11 -17 -19 -1 24 -58 -51 -31 36 -30 -11 -35 -78 8 33 24 -24
7517 -24 -4 -34 -22 -34 -37 -41 7 3 1 10 -2 -34 28 -3 41 -25 0 -5 -1 -33 -43 -21 7 11 42 10 -18 25 10 -25 76 111 -4
7550dJ7K2jJ5q4j3O3J8J7p5L5j1L4n9O3rk5pJ0M5n8k8M5j8j1ml9R7j1p2l3K2L6
7583b3rL1n6jP1m3QJ2j5N8rJ6RJ3m0M9j6j5J9m0N9m5j9p7lQ4QK6j9r9Q6n7J21
7616H4n3MJ8k9RK8n7j4k5L9JN2n1j3j5P1m0q0Q5qJ3k2k6m9j4R1o7P1J4m6jM0K
7649A2rpo0J00o2O3m9k7O0Kj6L3k8K3M9j14M2j8N8o2M8L4m1j7L3k0p7N8m9M8O2
7680F9j14l5J24n2ON6j29J0O8JRj9N1o3L0j5n8LK2j1O1k7j7K9j2J8n1L3Mj1O3
7711D3j7j6Kq7N0j9L9o3K8J0Rkk0P7o2O9j1J0m4k0K1N8n1L1rN1m7j1p3O8M7o5
7743dPLnn2K9L2j4m5K8m2N5j4K4K8p0jN7QJQl9j4L0p0L5oM0M2j05O5Mm9RJ0l6
7778e1L5J9J5n9L2j6Q2J0p2j2o9Q5J8m4M0K5rM6kq6j6m3J33l4j6Rnk5QJ7m5O3
$$ plain form
7550 -4 13 35 34 49 -35 -48 15 33 50 -25 10 -1 33 -26 37 28 3 -4 6 51 -7 -35 10 -8 -19 -23 -62 35 24 -48 -81 -59 -23
7583 -23 -32 -1 -57 -58 13 -30 -22 -10 -25 33 24 40 49 62 22 71 55 40 59 19 78 33 14 -63 -66 18 26 52 33 -66 20 -37 84
7616 84 31 35 53 24 33 61 4 -10 -35 4 5 57 6 -7 -22 49 9 -71 14 6 19 -3 -29 -78 -92 -1 -68 3 17 -29 -30 10 12
7649 12 3 -4 -64 36 -26 37 -12 -39 21 23 7 40 12 35 84 -30 12 -6 52 -10 38 72 31 14 47 27 -50 8 -41 7 69
7680 69 -45 -80 44 -8 -2 54 -75 -65 3 4 13 -6 45 -18 12 -3 -61 -58 -36 -47 14 -13 -30 -1 -13 5 -46 -13 -9 -20 43
7711 43 26 10 12 -75 -25 -44 -5 -68 -40 -30 -21 -23 -43 34 -28 41 30 40 -4 -24 -3 55 4 35 26 77 30 19 -54 14 61 -4
7743 -4 3 6 1 -51 -22 10 -4 -49 -21 -63 -8 -22 2 30 -40 -41 16 24 25 33 -6 -20 10 -60 -25 -31 9 51 -54 11 15 -34 -25 -15 -51
7778 -51 -16 3 18 -41 -9 -25 57 67 -5 -17 -86 -1 17 -27 13 38 29 75 73 -13 -29 -72 61 27 11 20 15 -10 -2 15 -30 33
7810C3p6jK7mkk3M4N5qm2L3p6K2Ol4L2o9P9jnRk8pK9k8l5K7M3M9j4l0k4jk1P0
7845B9l4Mr7R9lkM0m1O4J1nn5pn1P3kn9K5JM5k4J5Qp1K9PlK7l0m3J6R4p0QOk4
7881b0K4j0kM7q2O6J7j3n5n1N9K7O5o8j4l9N8k6l7j7Q1pqJ0p2K7L3j6NJM1n9O1
7914B6O0o5k6K3j7K1K2o5K1JJ1Q6j17k5L4N2k7K8r9M3M6n2k7M2m4M7J6J8m8m7
7944f2N0K5l4m0Q8Qk3k4l3K0k8L6M0j0j6m9L4J6jm0O0q8Q3LPq5L5rN8L3l8lk9
7977a6Q6m8l5ok5N0N0mm6j8KK7Pr8OO7QJ5j6nmn9J55j09l1M4j9J2km4QM2j4Np
8012b2N1n7kN8k9m9K0jN3m1K5j29P7M0J3NNm1MK5jm5J7Q6n0l9P1o8J1K9KK1q8
8045d9O1m3K3N8l8p1J38j44P3J3pL2n4l1K5l9M9J1o8N7Pl2J8L2Qk7k7K8j0Jlp8
$$ plain form
7810 33 -43 -44 -17 -21 -23 -46 -2 53 45 3 36 -40 -18 -12 -46 -14 -83 -4 -5 -10 -1 -29 -36 -7 -35 -70 -43 0 49 35 5 -19 -20 -41 29
7845 29 -5 -1 -98 1 -2 -4 36 -5 59 70 65 10 3 -48 25 23 -36 -11 -10 35 11 26 34 -37 -8 -1 -4 23 -7 -50 -34 60 -10 -2 4 -20
7881 -20 4 -6 -8 39 -43 23 40 27 -28 -79 -20 7 72 4 -10 -49 9 -17 -54 -71 10 3 -5 5 -67 -40 -7 -23 -18 -17 24 -35 26
7914 26 86 21 -5 18 1 22 44 -21 0 1 12 98 -19 -44 -10 42 15 43 -56 -13 33 -19 -46 -4 -48 -1 15 33 -15 -62
7944 -62 -12 13 -21 -61 27 35 12 -12 -45 -25 -53 -17 23 13 -3 -52 -18 -2 -3 -43 17 -71 12 15 22 -63 -28 -37 21 54 16 13 -16
7977 -16 70 22 -13 -19 -44 6 56 52 6 -12 -10 17 24 -74 -68 -1 7 22 6 1 -3 -62 93 -16 -47 -3 -22 -10 -12 -56 -48 -6 -20 -15 -22
8012 -22 29 -28 -30 28 -1 -50 -30 -31 22 -19 6 -123 -46 -6 7 12 17 -24 -20 5 4 -41 -24 62 12 -27 44 -24 -13 16 18 39 -49
8045 -49 12 -31 -8 50 12 -59 79 -65 8 21 14 46 -8 -39 -14 -53 -4 7 -61 -4 3 -29 -11 21 29 2 -25 3 -7 -6 -9 -87
8077h7K9N9n6N6j7Nk6N8j1l7oRM0m9R4n6m5L5oL4j8l8L9J9rLp3P2J6J7j9j00O8
8110@n9J50j23l2L4M1LNo2j3O9J4j3j01R6r0J03n1J5j9k8qL0j0L8K4r2N4L6m9
8140c8jPJ1PJPn6j5J52p4n4k8P0L2M6o4L4j8l8O9k4m2M9l0K6L2p1N4j8Pn8QN4
8173C7j7K3k8k1J4m4L6MK9m0J4o3P7m1M3m9k1N9
$$ plain form
8077 -87 -58 1 -55 1 -16 -11 -37 21 10 -27 -33 -24 16 -33 61 5 -40 -5 -11 23 5 -33 6 25 16 19 -54 18 34 51 32 -68 0
8110 0 -59 91 -32 -64 -30 11 14 19 -43 -56 13 27 14 -87 9 -81 22 -29 -14 -33 -61 -69 -39 -49 -11 13 -79 -25 11 -38
8140 -38 -39 -32 -21 -14 -13 -6 -62 -77 75 1 -53 -81 -11 21 67 3 37 19 -19 50 26 -16 33 3 29 61 -10 44 26 33 -25 -17 37
8173 37 20 43 15 -6 8 -36 0 4 33 -7 7 -56 21 -20 23 -26 -47 12
8191A2
$$ Imaginary data points
##PAGE= N=2
##DATA TABLE= (X++(I..I)), XYDATA
0@%%%%%%%%%%%%%%%%%%%%%%%%%%%%%%%%%jMoQj0J0j0J0j0J0j1J3j5J7k0K3k5K8
51A5l4M1n0O6q8J23j92L41p75L435K0089j3319k0324L364Q839j06p24J448P46
70B895k69k273p68K366k863m808P008J0888l291j2816p367L903J3883Q461j1081
85C868j3390N162Q859l216m209K319K113J346J67m723l583J003J452N614P960
100A0742n958j6500j441J4219Q112m110q213l526N851N410n965n506O156N652
114D923j518j179l658o665K587J0177L206k758m886q260m67J3033O563j0035p549
129f486N714P187k610r169k387J0654P698o806p122R58j423j008R122O251q051
144B522r451J73O200O157j943q912M33J0429K35j0830l830N898O597L109l951
$$ plain form
0 0 0 0 0 0 0 0 0 0 0 0 0 0 0 0 0 0 0 0 0 0 0 0 0 0 0 0 0 0 0 0 0 0 0 -1 3 -3 5 -5 5 -5 5 -5 5 -6 7 -8 9 -11 12 -13 15
51 15 -19 22 -28 38 -50 73 -119 222 -553 2882 22971 9652 -10672 -7308 1531 1425 701 2149 2895
70 2895 2626 353 -415 1951 -912 -5720 1288 12176 8885 -3931 -11298 -7395 6488 14949 3868
85 3868 -9522 -4360 4499 1283 -2926 -607 1506 2852 3019 -1704 -5287 -4284 -2832 2782 10742
100 10742 4784 -11716 -13157 1062 9174 5064 -3149 -6675 -824 4586 -1379 -6885 -729 4923
114 4923 3405 2226 -1432 -8097 -5510 4667 7873 5115 229 -8031 -8498 4535 11098 1063 -6486
129 -6486 -772 6415 3805 -5364 -7751 2903 10601 3795 -3327 -2369 -3792 -4800 4322 10573 2522
144 2522 -6929 -6756 -556 5601 3658 -5254 -4821 5608 5843 -4987 -8817 -2919 3678 6787 2836
159B836q263j234M152K043L568L285o860p920N109P989k106o062o47N746O151
174G787m418j1921q0J2053M583m507l044k981k692L915N938N8l222l214j073M631
190A813K977o353m253O797O533k459o750n994J668J0755M766q342o153K455J321
205a219K68L381k82m161j12K676R93j520m643j492Q925P036q585j0531K365P859
221I58L726o36m956l843K990L304j417k25O60j920J344M172k513o154k8N027N617
238F106J290q226q443N763J0332j444o291o85J416P57J190j441k038J589J451
253A326O84J307l568o938K917J0271J384p685n032L19M825N156k755o152J157
268b784M672o12k141r68j459K124M966m00m748k837n07L574P191l84r410l132
$$ plain form
159 2836 -5427 -6661 -2509 -466 3102 6387 -473 -8393 -3284 4705 2599 -3463 -4110 1636 7787
174 7787 3369 -8552 -8632 3421 8004 3497 453 -2528 -5220 -1305 4633 4691 1469 -1745 -2818 1813
190 1813 4790 -1563 -5816 981 7514 5055 -1695 -7689 -6021 4734 9500 1158 -4995 -2540 -1219
205 -1219 -951 2430 2148 -2013 -2125 551 1544 24 -4619 -6111 2814 9850 1265 -9266 -6901 958
221 958 4684 4048 -908 -4751 -1761 1543 126 -99 561 -1359 -15 4157 1644 -4510 -4538 489 6106
238 6106 7396 -830 -9273 -3510 6822 5378 -913 -1598 -182 575 1765 324 -1714 -125 1326
253 1326 2010 3317 -251 -7189 -4272 5999 7383 -302 -5334 -5015 -190 4966 2211 -3941 -2784
268 -2784 1888 1276 -865 -1833 -3292 -1168 3798 3398 -1350 -4187 -4694 -1120 6071 5687 -3723 -6855
284f855O617M197j817l377j821L053M548k424n224N35K726J282K917l16o746l012
300e717N371M756j79k852m794j82O489J934o012k678L657L202M69l182m950Q79
316c789O083J505k492j434k927j915N326M954l985n266P35L674K496j759n529
331d323p6O841K387m850l197j34J211M399K450m190m240J268K403K170J133l832
347e80l439M081M512k540m266j092K598N105R55o479m051M118L718j13k70k242
363A5l352K078M309o57k987j606M92L713K338m972m962L404N330K04k357l500
379b510k263L853M784k026l850j56Q17J399K246j857m072J269M009J067j525l495
395b310k738M355O214k384o073m12K861J951J431j771l653Q74L452N63j313j842
$$ plain form
284 -6855 -238 3959 2142 -1235 -3056 -3 4545 2121 -3103 -2568 158 1440 4357 4041 -2705 -5717
300 -5717 -346 4410 4231 1379 -3415 -3597 2892 4826 -1186 -3864 -207 2995 3464 282 -4668 -3789
316 -3789 2294 3799 1307 -127 -3054 -4969 357 5311 1326 -3940 -3205 469 2965 1206 -4323
331 -4323 -4399 2442 4829 -21 -3218 -3352 -2141 2258 4708 518 -3722 -2454 -51 2119 3252 -580
347 -580 -4019 62 4574 2034 -2232 -3324 -726 4379 5334 -1145 -5196 -1078 2640 2527 2257 15
363 15 -3337 -1259 3050 2393 -594 -2200 -1708 2005 4343 -629 -5591 -2187 3143 3347 990 -2510
379 -2510 -4773 -920 3864 1838 -2012 -2168 -1351 48 2294 437 -3635 -2366 1643 2710 1185 -2310
395 -2310 -5048 -693 5521 3137 -2936 -3348 -487 1464 2895 1124 -2529 -1655 1797 2360 1047 -795
411g95j986K343N126j125n790j321K844K960J892k642n239O96N393Q35k999j613
427a421m98J456L225o53m235r44K266K025J836j700n538k94O026K364l504k753
443b342m85J745L521l33m283q94K894J623M81j232l761k75N208K081l146k554
459a752o55J170M000J080m722k674L287K848j80j862k959L12M385J424l434k082
475a814J11R58L264J424m623l379L018L408n6j800k777p58M108K428l346k970
491b804O25J788K505N95m197k860L242L207l77j439k342j251L319L422k396l669
507b632K60K267K264M78l847k755L441L595j028k046j488q41K699L447j998l936
523b120J86K125J996N36k999k958K488L810p53k375j623n62K823L338k256m577
$$ plain form
411 -795 -2781 -438 4688 3563 -2227 -3548 -704 2256 4148 1506 -3733 -3037 2356 3191 192 -1421
427 -1421 -1919 -463 2762 2109 -2126 -3070 -804 1221 3057 1357 -4181 -4475 1551 3915 411 -2342
443 -2342 -2827 -1082 2439 2106 -2177 -3071 -177 1446 1927 695 -3066 -3341 1867 3948 802 -1752
459 -1752 -2407 -1237 2763 3843 -879 -3553 -266 2582 2402 540 -2419 -2107 2278 3702 268 -1814
475 -1814 -1703 -745 2519 3943 -680 -4059 -1041 2367 2311 511 -2266 -3024 1084 3512 166 -2804
491 -2804 -2179 -391 2114 2709 -1488 -4348 -1106 2101 1724 285 -2057 -3308 11 3433 1037 -2632
507 -2632 -2372 -105 2159 2637 -1210 -3965 -524 3071 2043 -3 -1491 -2332 367 3814 1816 -2120
523 -2120 -1934 191 2187 2723 -276 -3234 -746 3064 2311 -64 -1687 -2249 574 3912 1656 -2921
539b921N40K886J184J72k076k860J273L919J17k745j852j04K669L126k165m562
555c399N35L297J168k8j819l053J185M359K72l190j443M39J980K583j254m003
571b371j91L303J610l94j941k797J033M571M73l613j498P75J575K196p10l893
587a872n51L302J467p29j623k480N14M390Q79l901j974J243J686J773l67l677
603a920j165L121J997r63j806j862O47L709R09l544j849J288J530J813Ml668j808
620c567L602K664j476k064j159N68L098J251l086k173J268J872J485j31l509j733
636c090L432K951j720k142r09J63K775J802k892k921J387K288R13o11k765j517
652b856K966K729j490k348q60J93K490K118k629l244J131K593P51n50k390j618
$$ plain form
539 -2921 -2381 505 1689 1861 -215 -3075 -1802 2117 2234 -511 -2363 -2467 202 3328 1163 -3399
555 -3399 -2864 433 1601 1573 -246 -3299 -2114 2245 2517 -673 -2116 -1677 303 2886 1632 -2371
571 -2371 -2562 741 2351 1957 16 -2781 -1748 2823 3296 -317 -1815 -1040 535 2731 2021 -1872
587 -1872 -2423 879 2346 1617 -6 -2486 -1972 2418 3297 -604 -2578 -1335 351 2124 1757 -1920
603 -1920 -3085 36 2033 1070 -736 -2598 -1951 1758 2667 -877 -2726 -1438 92 1905 1909 -1759 -3567
620 -3567 35 2699 1223 -841 -2000 -1432 1666 2917 -169 -2342 -1074 798 2283 2152 -1357 -3090
636 -3090 342 3293 1573 -569 -1478 -1315 1460 3262 370 -2551 -1164 1124 2037 1426 -1339 -2856
652 -2856 110 2839 1349 -999 -1859 -1666 824 2942 313 -2931 -1800 793 1544 994 -1396 -3014
668c014K661K997j609k570m34O22K012K003k102l551J088K922P37p32j900j656
684b526J978L236q67k933n84R63K002J703k254l461J188L262M49j176j414j620
700b054J281L300k32l225j039J300J821J281j928l267R57L332M34j493j486j521
716b539J426L456l12l515q44J569J346R49r38k973J01L225J050j738j638r99J445
733i29L351k11l697j014K096J418O51p37k640l01L101J215j688j504o71J067K851
750B358J36l416j526K198J902L91j046k696m47L218J546k047j709j50P70K114
766A596M20k980j467J942J736K65q93k619q62L426K243k397k381K03J180J718
782A130M46k445j609J809J893K9r96k007n48K915K161k072k423R4J042J945J063
$$ plain form
668 -3014 -353 2644 1035 -1535 -1969 -1347 665 2668 566 -2985 -1897 1025 1762 1030 -870 -2526
684 -2526 -548 2688 1821 -1112 -1696 -733 1269 2972 718 -2743 -1555 1707 2156 980 -434 -2054
700 -2054 -773 2527 2295 -930 -1969 -669 1152 2433 505 -2762 -1805 1527 1961 468 -1018 -2539
716 -2539 -1113 2343 2031 -1484 -2328 -759 587 1536 598 -2375 -2274 951 2001 263 -1375 -2374 -929
733 -929 2422 2211 -1486 -2500 -404 1014 1665 928 -1712 -2013 1088 2303 615 -889 -1560 -493 2358
750 2358 2494 -922 -2448 -250 1652 2043 997 -1699 -2146 1072 2618 571 -1138 -1288 -518 1596
766 1596 2016 -964 -2431 -489 1247 1512 619 -2000 -2862 564 2807 410 -1971 -1768 -588 1130
782 1130 1576 -869 -2478 -669 1224 1253 257 -1750 -2298 617 2778 706 -1717 -1623 -581 1364 2427
799B427k559k467J974K552m23j371j244k14K177J764j845k178J53J152J508J050
815B456k321k823J613K915m3j578j387m79J931K072j742k731O75J664R36L28j863
832c77k365J286K938P3j537j303q08J617K538r45k988j8J966J240o1j846j975
849b565J698K950m64k002p30l17J192K456k67l153o69K095J282M6j340k041Q98
866i31L022Rk437j094M12J511J870q54l033l68K168R16j07o63j923j73K818P69
884A912k244j430N41J414J750q36l153m75K751J288o45j138j514J37K479R10j924
901a77j278M56Q61J577j52k741q85K711J788r18j623j422K98L008J196k577j754
918a632J029J044Q10O5j819j093J808J616o83j325j370K42K797J348k867k193
$$ plain form
799 2427 -132 -2599 -625 1927 1504 133 -1111 -1325 852 2616 771 -1407 -1254 -102 1406 2456
815 2456 135 -2688 -1075 1840 1797 219 -1168 -1647 284 2356 614 -2117 -1442 222 1158 1486 -377
832 -377 -2742 -1456 1482 1555 18 -1285 -2093 -476 2062 1117 -1871 -1889 77 1317 1256 -590 -2565
849 -2565 -867 2083 1619 -383 -1113 -1430 -238 2218 1951 -1202 -1871 224 1506 1552 212 -1829 -931
866 -931 2091 2100 -337 -1431 -1019 492 2362 1508 -1525 -1893 275 1191 1084 421 -1502 -1675 1143 1912
884 1912 -332 -1762 -1221 193 1943 1107 -2046 -2521 230 1518 873 -265 -1779 -1642 837 1747 -177
901 -177 -1455 -999 -138 1439 1287 -1454 -2339 372 2160 1242 -381 -1803 -1505 1503 2699 122 -1632
918 -1632 -603 441 1251 1316 -503 -1596 212 1828 1145 -180 -1550 -1308 1489 2837 -30 -2223
934b223J146J650P84j36k027j264J909J723j007j331m06P4J774J253j966k325
950b372Q70J833J093j25k352j624K077K551r71j766l70L63J405J116j686j874
966a832R97J732M58k01j648j748J770K841n57k267q38M46J569J384j468k301P76
983h87K079K24q17j256j126J635K297o79k269p36N12J337J718j074k956K56K473
1000G31N60j038j160q02J256K184p57k415k56J034J153J131r68k626l5K557R43
1017A492q71j066j073P32K432j73k502n13J550J061N46j070k245K33K639P04j206
1034F70j017q06K99K244N88k288j144J201J233M79r89k073J3K766P41j698j289
1051a070l37O53K075N02k348j418J268J194L38l56j773n59K254J418j644j634
$$ plain form
934 -2223 -1077 573 1357 1221 -806 -2070 -161 1562 555 -776 -1182 -1108 666 1919 -47 -2372
950 -2372 -1502 331 1424 1299 -1053 -2677 -600 1951 980 -786 -1156 -793 612 1728 42 -1832
966 -1832 -835 897 1355 1154 -494 -2242 -472 2369 1812 -455 -1293 -847 722 2106 638 -1663 -887
983 -887 1192 1416 599 -657 -1783 -148 2149 1470 -799 -1535 -1023 314 2032 958 -1998 -1742 731
1000 731 1291 253 -907 -1709 -453 1731 974 -1441 -1697 -663 490 1621 653 -1973 -2008 549 1492
1017 1492 621 -445 -1518 -786 1646 1473 -1029 -1542 8 1069 1615 545 -1700 -1467 1172 1876 670
1034 670 -347 -1153 -854 1390 1978 -310 -1454 -253 980 1459 470 -1603 -1590 1176 1917 219 -1070
1051 -1070 -1407 -754 1321 1823 -525 -1943 -675 519 857 501 -1272 -1831 423 1841 197 -1437
1067a437j22J084J894L30k623j353J701J507%m34j337q09J830J562j261j432j2
1084i12O83J482P07k472j612J724J947j35r49j293o82J860J602j264j546J38N81
1101a41R07O85j648j584J187J869k2j036j444o59J990K121j531k253K68J107P74
1118E90N07j294j587R71J943k94r69r39m61J511J959j096k373O5J327J159N20
1135A539j448j972J087K280k43j388n76o3J015J553p90k224J33J362R04L30j167
1152C32k106O32K639K33j767r16L0J012J542p69k256J04J613N78j03q97j587M29
1170a257K342M28j698r46j06P96J800k66k400m08J813R29l82j042j192O11K176
1187A198K51j787p86K79O74J544J28k364q62J880J280n32q76j176K54K142N54
$$ plain form
1067 -1437 -1559 -475 1419 1749 -874 -2227 -526 981 981 547 -790 -1599 231 1793 532 -900 -912
1084 -912 -229 1253 1960 -512 -2124 -400 1547 1412 463 -830 -1512 348 1950 686 -860 -722 -141
1101 -141 766 1451 -197 -1781 -594 1275 1253 217 -1227 -1886 104 2225 694 -1559 -1291 -184 590
1118 590 1097 -197 -1784 -813 1130 836 -133 -1072 -1533 -22 1937 841 -1532 -1467 -140 1019 1539
1135 1539 91 -1881 -794 1486 1243 -145 -721 -784 231 1784 994 -1230 -1097 265 1169 1499 332
1152 332 -1774 -1142 1497 1730 -37 -953 -923 89 1631 862 -1394 -1290 323 901 798 -99 -1686 -1257
1170 -1257 1085 1513 -185 -1131 -1237 -441 1359 1093 -1307 -1715 98 1027 645 -397 -1589 -978 1198
1187 1198 1449 -338 -1124 -845 -171 1373 1501 -863 -1725 155 1435 903 27 -1149 -895 1247 1801
1204A801j892j103O77R21R97k60k023p34J772J198m85p97j071j96J915J031j822
1221g1j442O25J164Q19j56j967q59J955J302r05r47n66j56J581J226j660j415
1238a472N84J062O75O6j641j122J727J733q65j281n08K65J458J140j633j641Q36
1255f17J294K79l0j153j172J290J759o14j375n69K38J454J086j499k064R04J602
1272H13J26l10j056j096J156J857o46j512l65L43R82J037j068j919M56J745M27
1289I70n67j041j004J052K091o52j805k12P15Q41Q37q04j780K38J766M42n61q66
1307c40r94Q40K025j99j938m77Q55Q71P52q47j778K17J931L41q21p35p12O06J768
1326A365q2j952m44Q29P47O41m55j971j33K100P07j166r31l89N98J534N5j783
$$ plain form
1204 1801 -91 -1194 -517 404 1401 1141 -882 -1616 156 1354 869 72 -999 -1195 720 1751 -71
1221 -71 -1513 -888 276 1095 939 -1028 -1887 68 1370 465 -482 -1048 -1204 377 1603 -57 -1472
1238 -1472 -888 174 849 915 -726 -1848 -121 1612 747 -534 -1042 -777 681 1821 188 -1453 -617
1255 -617 677 956 926 -227 -1399 -109 1650 1036 -339 -908 -670 784 1870 371 -1693 -789 813
1272 813 939 629 -427 -1523 -367 1490 844 -668 -1033 -690 292 1329 261 -1658 -1202 543 970
1289 970 403 -638 -1642 -590 1501 849 -956 -1168 -453 388 1225 421 -1359 -1121 645 1087 526 -340
1307 -340 -1334 -494 1531 1332 -606 -1083 -228 643 1395 548 -1230 -1013 918 1259 438 -297 -1009 -403 1365
1326 1365 1283 -669 -1113 -284 463 1104 649 -1322 -1455 645 1352 186 -745 -1134 -536 998 1053 -730
1344g30p12J044P83M12l65j661k46J938Q88j172r92k17M65J615L64j974r21J271
1362b10J034O6m69j300l02J742R39j103r59j09L45J319N34j751j199J138J280
1379I95L2n86j321l41J711J045j241j173K05M25R84M74j499j321J102J282l1o15
1397A27j000n42J436J422j066j506J23P23Q90M88j497j203J153J391k88o35o49
1414f33n14J199J453q45j554n1R29Q65L85j194j544J094J681j98j048n56k81J083
1432B71J284q56j643J67R53N42L31q88j456M95J805Q9j171p12k19R71J489q18
1450F34j877J14J277M17K1o79j252M64J716M8j117n55j24O94J370m04j850j98
1468a301J436O63j07p34j209M21J941J3j399m09L00N14R84k61j589k96J285P67
$$ plain form
1344 -730 -1442 -398 385 797 432 -1229 -1475 463 1351 179 -813 -1030 -565 1050 1414 -560 -1481 -210
1362 -210 824 890 421 -879 -1181 561 1500 397 -562 -671 -326 993 1527 -224 -1423 -285 995
1379 995 1027 441 -880 -1221 490 1535 294 -879 -674 -249 735 1209 -290 -1611 -509 773 742 127
1397 127 -873 -1415 21 1443 377 -1129 -1006 -283 607 1095 -402 -1605 -452 939 651 16 -633
1414 -633 -1147 52 1505 660 -894 -945 -16 849 1234 40 -1504 -410 1271 1073 25 -531 -812 271
1432 271 1555 699 -944 -777 176 718 1049 161 -1295 -800 1005 1094 -77 -789 -1008 -37 1452 634
1450 634 -1243 -1129 148 565 586 -93 -1345 -881 835 883 -234 -789 -913 -219 1151 747 -1103 -1301
1468 -1301 135 798 691 -43 -1252 -831 1110 1123 -276 -685 -385 129 1113 852 -737 -1033 252 1019
1486A019j23o78j290K24J931M51j603r27N85O60P97k82j663k68J488N26l31n82
1504f6r26qJ602O48j414r72L47P53R18m8j691p02J647R44p12p99m37K04J255O17
1524A160j372q18N02O31O73J92j380j075J425J327n36r29n70K10J325P01j499
1541c3j021P68R06J97p5j040q29J051J269m64q62n14j34J162J078j266j580O73
1559g14J228L01m05j138o04J242J262p62r73q9M0O83J037q59j478L03J208M11
1577F93k26j021q95J203J620o75j484r2N47Q40O74q72j381N30J020J52p7n39q43
1596h26M85J539q1j426n11N18R33O59q47j660M51J598Q2o61n05n55M85J213j69
1615G22j221k22M45M90O88m26j664n6J768N47q47r08n19P08J489k15j489k23Q17
$$ plain form
1486 1019 896 218 -1072 -848 1083 1534 -69 -996 -411 249 1046 764 -899 -1167 321 847 516 -66
1504 -66 -992 -1000 602 1250 -164 -1136 -789 -36 882 834 -857 -1559 88 1032 320 -479 -916 -712 543 1160
1524 1160 -212 -1030 -528 103 776 968 -412 -1487 -62 1265 729 -200 -770 -560 765 1466 -33
1541 -33 -1054 -286 620 817 742 -298 -1127 -76 1193 729 -133 -647 -781 381 1459 193 -1387 -714
1559 -714 514 815 410 -728 -1332 -90 1172 410 -563 -652 -612 71 1108 249 -1229 -926 282 693
1577 693 467 -554 -1449 -246 1374 699 -785 -877 -330 510 1184 312 -1069 -539 481 633 556 17 -826
1596 -826 -341 1198 1117 -309 -820 -302 631 1290 443 -1217 -766 832 914 253 -252 -807 -322 891 722
1615 722 -499 -721 -276 214 902 476 -1188 -1244 524 1071 224 -684 -1203 -495 994 779 -710 -933 -116
1634a16L17K48j58j003k30J369N21o73p58m97M79J738J11j834p06J023Q91M6l94
1653C74j043n2J370L61r65l48l5J02J008M13j390r21P70R59L52m14j427k24J543
1672D33P76j174p84K12M03O54R6j149n54Q28P81m1k47r56n77J248J253p92j219
1691h09l6N48Q48K45j278o62J076R77m63m76m92k84J075R08p04r88j67L96Q23
1710E37O98j049j303Q01J291k10q50m84j8J031Q07j029j080L15O43M03L40o31
1728B12j192K84J100K51n09n77m75Q66J106q17j425K39J155M53j21q87q54O70
1746e21J200n9o66k44m73L28J250j34j360j86R14O32M1q88r87P89J481j18j244
1765b45l72K00M61P87r8j134k04P44K89Q1k38r98J40J395K43j180p83K76R01Q32
$$ plain form
1634 -116 201 449 291 -712 -942 427 948 275 -483 -980 -501 1237 1348 -486 -1192 -169 722 768 374
1653 374 -669 -721 649 1010 45 -303 -338 -236 772 1185 -205 -1126 -356 603 955 541 -886 -1110 433
1672 433 1209 35 -749 -537 -134 520 616 -533 -1087 -259 522 481 234 -722 -1299 -51 1202 410 -809
1691 -809 -845 -297 551 796 -482 -1144 -68 909 446 -30 -522 -806 269 1177 473 -515 -682 -286 537
1710 537 1235 186 -1117 -316 975 765 -85 -569 -587 444 1251 222 -858 -543 100 503 843 212
1728 212 -980 -696 404 655 146 -431 -906 -40 1066 249 -1176 -937 218 671 550 -337 -1191 -521
1746 -521 679 620 -46 -290 -763 -435 815 681 -679 -865 49 681 722 -166 -1153 -364 1117 999 -245
1765 -245 -617 -417 44 831 733 -401 -605 139 428 509 271 -727 -587 808 1051 -129 -912 -636 265 1097
1785A097m85j525q5J122L83k94j80n70j40J011L73r29m73J17N68Q69j84j573m83
1804a381J461Q23m36o01o15J98J080K13r46l31M79J77L37J86j113m28R39R27l13
1823F56o69p99J44J398O15j305q75O48N34J72j69o54l67R00M96m31m81l10j94
1842f91J080Q25j051j269L68Q85M96j41j039m90R97Q39p19o72J21K06N34M81q31
1861g1r03L43Q41L72N5q61r36Q76J219l03j048o9L39O70M16j018p82O63P93J1
1881F07k78n02o59O26J160k26p98m31J14N93P25o43j211M55J152p4n73n64k19
1900g46O85R69m58r82j63K43N01O26k36j235l7J115L27m45o62l57P28J084m23
1919E34j255n3P55M61J89l28j048N9J047K32k84l46n16K15J174j0j180m21Q01
$$ plain form
1785 1097 612 -913 -998 124 507 213 33 -537 -677 334 707 -222 -695 -578 -10 859 675 -898 -1381
1804 -1381 80 903 467 -134 -749 -551 529 742 -204 -535 -56 121 458 644 -469 -897 42 969 656
1823 656 -13 -812 -668 730 1345 40 -835 -187 347 519 350 -304 -671 229 725 294 -187 -497 -691
1842 -691 389 1214 163 -1106 -738 147 643 502 -537 -1027 -30 809 90 -582 -461 -255 279 760 -71
1861 -71 -974 -631 210 582 637 -224 -1160 -284 935 632 -416 -485 -146 524 940 -78 -860 -197 596 607
1881 607 329 -173 -832 -206 954 728 -70 -501 -387 206 931 288 -923 -468 684 610 37 -527 -746
1900 -746 -61 908 450 -532 -695 -452 49 675 439 -796 -833 282 609 164 -498 -855 -127 957 534
1919 534 -721 -774 -19 442 631 303 -745 -686 361 593 309 -37 -553 -338 836 826 -354 -775 26
1938B6O48J00o34r91K29J225L35q50l89j68J83Q65J45r47m03N02M66J42l10r50
1958g76j33J297O00r72o48r2M32Q18J16r88m81O58L96L6q5o63k51R89N03o61o52
1979e57p0M59Q40K41j174p53R25P02m6m04n27j72Q54M71n95o42J88K88N23K37
1999G88r66p39P38Q92o5m87o86j96R06P01o81q35K17M93K56J45p47o27O32P66
2019E05m6m88m64l51Q01R78o25j030J06N35M23J41o89o92P04Q22k43n12k39k22
2039e86O57P44l66j052%O70M61J33n13r38N02J095j49p25l83J39N17O68n49r19
2059e94P6P11K99pm85p71L68R70N3p67l27L9M17P60l97j098R5Q56L69l22m47n94
2081g96K80J034N8p08m08J42L79O57j56j034k01R20M55k61n22m23K17J059P9r32
$$ plain form
1938 26 674 774 140 -851 -622 603 938 88 -301 -469 -286 579 724 -223 -626 -124 342 484 174 -776
1958 -776 -909 388 988 16 -632 -724 -292 526 642 -346 -827 -169 227 263 178 -485 -736 253 756 95 -557
1979 -557 -627 -168 672 913 -261 -1014 -89 613 567 163 -364 -536 318 789 194 -448 -260 28 551 788
1999 788 -178 -917 -179 713 648 161 -525 -721 185 886 205 -630 -413 80 336 481 -266 -893 -261 505
2019 505 459 -29 -493 -844 -43 935 310 -720 -614 -79 344 485 -204 -896 -192 630 387 -125 -364 -586
2039 -586 71 815 449 -603 -603 67 528 661 148 -790 -288 807 658 -67 -450 -311 206 874 325 -594
2059 -594 -518 193 492 485 0 -771 -403 567 620 -147 -474 -435 -18 742 345 -753 -658 198 567 245 -202 -796
2081 -796 -516 518 576 -132 -540 -398 -19 638 482 -552 -753 167 622 361 -161 -584 -367 692 771 -161
2101a61l55K64M04M66j21q77l06Q43M56k36l79m94J20R69J75r12m51L62M45K91
2121E03o8r07l34Q31N93m29m10l22O5P33L79q04n75L83M93L21j07p37m93Q87P05
2142G07l99n63k55P9P31M64p86o14L28N94J98j51o39l62P64O55m11n43k40J99
2162b44O35L91p42o61L65O36L6j09n03m88O59Q20m15o58j40J60N62L73o76p65
2182g64L58O52J63j34n95l62N33P23k72p48KJ96L99M50o08p67K72Q84J33l48m29
2203b62l62N00Q50k96p42j01K89M38K74m17p76K21Q83J43m93l42l01L66Q34j50
2223E56q38j41L51L53K99l02q51J80P77J87n28l71j19K60P91j46q19k68M42M11
2243B24K00k63p81rR01K90n91l55o6K53O37L1q84l06N88M72J04k84o93o3Q34M15
$$ plain form
2101 -161 -516 -252 152 618 497 -380 -686 157 613 377 -2 -496 -376 593 768 -144 -595 -233 212 503
2121 503 435 -472 -806 25 618 189 -221 -543 -478 255 634 -170 -745 -362 131 452 345 -392 -885 2 707
2142 707 308 -255 -510 -431 300 764 -22 -636 -308 286 484 333 -306 -668 96 751 340 -203 -443 -244
2162 -244 391 782 40 -621 -256 380 416 307 -196 -684 -25 795 380 -278 -418 -258 304 677 1 -764
2182 -764 -406 246 409 275 -320 -682 -149 574 302 -446 -444 -248 151 601 -7 -774 -502 382 515 167 -262
2203 -262 -624 -124 726 430 -312 -413 -124 314 588 171 -605 -384 499 642 149 -193 -494 -128 706 556
2223 556 -282 -423 -72 281 580 278 -573 -393 384 571 43 -328 -447 -187 604 458 -361 -629 -187 224
2243 224 424 161 -620 -629 272 562 -29 -384 -450 -197 440 471 -413 -719 -131 341 445 161 -532 -595 239 654
2265F54m83l91o2J69O26J41r34l39O94M35l9l69n66j0Q94L53n83n52M0K45N49
2286D72J08p97m88O18N06j21k71n48p5Q61M52o55o17K9M34M63J03p15n36O28N12
2307C63r2l34l23j43O30N70o56n66J45M26M07R9p26m94N74O75j06m32k75j07M40
2328G5O09m53o40J70M15K19J12o22n03M63P11p1m24m33j5N19N01l90q13K33L94
2349E7J98M3l99n71L80P60m1o13k88OM62O00l36q35O7N61K69j23l44m61L47P93
2371E32j37o16k09K27K89N84l18q24j17P64L42j03l49n20J56Q70p6o40k18K37
2391a26K98L57k42p15n6O78K96j60l65n25K09P47J88o95l47K14K95L44j33p63
2411e01n2P55K53l87l33k96J39P98K66p79m62K73L00L58J1p79j99P22M61m13l77
$$ plain form
2265 654 171 -220 -282 -113 513 654 -280 -619 75 510 471 102 -464 -474 420 773 190 -362 -322 -77 472
2286 472 580 -217 -705 -87 419 298 27 -521 -596 265 717 62 -555 -526 -92 371 474 -241 -777 -149 363
2307 363 271 -63 -386 -529 101 671 15 -551 -406 20 427 526 -200 -694 -120 555 449 17 -258 -365 75
2328 75 684 231 -409 -239 176 395 507 -115 -618 -155 556 485 61 -372 -387 132 633 243 -570 -337 57
2349 57 255 298 -101 -672 -292 468 427 -186 -474 -468 -6 594 258 -577 -510 51 320 197 -147 -608 -261 532
2371 532 395 -221 -430 -203 86 670 352 -472 -589 175 517 414 65 -455 -299 571 495 -145 -363 -126
2391 -126 172 529 287 -428 -484 194 490 330 -35 -560 -351 396 584 -111 -458 -244 51 395 262 -501
2411 -501 -553 202 455 68 -265 -561 -422 376 642 -137 -599 -326 -26 332 343 -436 -635 87 548 135 -242
2432b42j36J80O44K12p96l78L56L15L29j09n50l01N37N01l88k89k27J20O21K70
2452F69p82m94M40M36J86k37n36l34O71N11k86m50j15N0M04L25n06n91L61N08
2472B30R4j83n50l43O93O68m20n54NP7L82M23m81n45K85N05P3k27l16k79M79O49
2494F65k75q05M8K22M75L34n11o69K40O68n8j98j85l17L15O04k66n84m3L10K96
2515B66K37m82o59K14P14J24l11k92k45K89O07j95o64k1L55K25J42k76n17JQ14
2536C26J69m28l47k93L76P14p9p57j11M33K02J04k37m60J02O59J20m04l17o8K29
2557f7N31N6p13l12M65L05J11k28n61nP12K37n88l41Q5K88M35k3o47l32M63M48
2579C19p9q6n92j97P45L94n54l93J00L00L66M5p26k62N91M14j70j99l35j76N43
$$ plain form
2432 -242 -378 -198 446 658 -138 -516 -160 155 484 375 -175 -476 61 562 174 -115 -342 -222 399 669
2452 669 -113 -607 -167 269 455 218 -318 -652 19 530 244 -206 -321 -271 133 458 -48 -639 -278 230
2472 230 324 141 -409 -752 -59 609 189 -365 -360 -283 99 522 41 -504 -219 286 359 132 -184 -463 16 665
2494 665 390 -415 -367 -145 330 664 153 -516 -276 392 334 136 -49 -366 -51 553 287 -297 -340 -30 266
2515 266 503 21 -638 -424 290 414 103 -189 -434 -145 462 267 -397 -418 -63 162 304 28 -489 -488 326
2536 326 495 67 -280 -573 -197 517 438 -319 -430 3 205 309 72 -388 -286 373 493 89 -228 -296 -67
2557 -67 464 520 -193 -505 -40 265 376 148 -413 -418 294 531 -57 -398 -313 -25 410 387 -260 -592 -129 319
2579 319 240 154 -438 -635 110 504 -50 -443 -343 -43 323 368 -358 -620 -29 385 215 16 -319 -495 48
2600D8N19m77m32Q7J87L92J50o08l91N18N12j95l22k47p5N32M35m78m54O8J75
2621e6L43J27l88m78K82N30k6m69j95j1N22M75n82o48K00M76J44J05m61m20L40
2642a90N20o7l72j04j04K74N65m20o35J47M81J70K6m77l54L56O12k9n26j02j8
2663b47L11L71j77n95K7N11J30p6l09m55L32O90j6n48k66N9L32L97j84o29MM63
2685A25J41j12j64l65Q7O33O0n24k89J14K59N05j88p68qO00K23k01k26l12J40
2706b70N29J35n56k71K89K57K62r0o16j27N62L33j35l24l35Q5N71K19o07k70K71
2727h8J97K35q0n31j72N84L14k86j66l42O2N85K10n81m01K81L06R0J5n28j87N56
2749G3K99k96k73j16P4L72K34l83m95K74L15J34k8m54l11N71M50k85m00q7J99
$$ plain form
2600 48 567 90 -342 -255 -68 324 474 -134 -525 -7 505 310 -12 -259 -334 198 633 155 -299 -231 -56
2621 -56 287 414 26 -452 -170 360 334 -135 -330 -341 181 656 74 -574 -374 102 246 351 -110 -530 -190
2642 -190 330 263 -109 -213 -317 -43 522 102 -533 -386 95 265 291 -186 -540 -184 428 399 -127 -229 -247
2663 -247 64 435 258 -337 -310 201 331 255 -54 -509 -177 513 497 -51 -317 -258 74 471 287 -342 -338 125
2685 125 266 154 -10 -375 -288 345 405 -119 -408 -294 -35 470 282 -486 -494 106 329 128 -98 -410 -270
2706 -270 259 394 -162 -433 -144 113 375 285 -331 -458 104 437 302 -22 -357 -272 299 518 -89 -359 -88
2727 -88 109 344 264 -267 -439 145 459 173 7 -335 -273 312 522 -59 -460 -179 127 217 232 -296 -483 73
2749 73 372 76 -197 -313 -239 133 367 -16 -511 -237 78 212 184 -270 -581 -10 440 155 -245 -332 -133
2770a33L81J48l34n48L80L09K3Q3m27l61M34N07k13l69j87K26L24K35l97n15K27
2791b07N47mk00l00j51K54N05k09m22r5J34K27K76l00n47J84N91M8k82l35r7L09
2813g4N13k11n81k9K77K02J44j72m75J64M03J57k45k06j99K55N07o9n90n2K67
2834a4K96P5k54n10J55N24J11l77q4j23R7N37n9n59j81L76K68L4j77n17M3N86
2856B47J63m54k30L6M9M61n9m68j68L75K57%j79l65j13N28L29m45k19l7K03L99
2878C10J7n61k26M69K99j93p6k09j37N05K88m88k20KJ64L83O9n10l60L97M38m5
2900C16k73k46q4M83K68l79m37K00J10K25J20l70l36K58M47j61j52k28p2L86L69
2921D44l80m73J51K84J79rl07k91K87M63j42k59j54p8K76L83j94n05L5L42J93
$$ plain form
2770 -133 248 396 62 -486 -106 203 226 309 -118 -479 -45 462 249 -120 -307 -81 243 478 81 -434 -207
2791 -207 340 336 136 -164 -315 -61 444 235 -187 -282 -148 79 355 55 -492 -308 283 331 49 -286 -383 -74
2813 -74 439 228 -353 -382 -105 97 241 69 -406 -242 161 318 73 -133 -332 -77 430 361 -229 -281 -14
2834 -14 282 357 103 -407 -252 272 383 6 -78 -201 -104 433 374 -185 -366 10 278 312 135 -382 -339 247
2856 247 410 -44 -274 -238 -189 272 213 -255 -423 -48 209 209 30 -335 -448 80 409 -36 -255 -292 -89 310
2878 310 327 -234 -460 9 308 115 39 -170 -307 198 486 -2 -222 -220 -56 327 396 -114 -474 -77 361 316
2900 316 43 -203 -287 196 464 85 -352 -152 -42 183 303 -67 -403 -145 302 141 -11 -239 -311 75 444
2921 444 64 -409 -258 26 205 196 -111 -402 -115 348 206 -53 -207 -285 -9 374 180 -325 -290 52 245
2942B45M2k71m58L68N32j54k74k36K1K06L76k57m29O4L04J81M8k46m50J30O07
2963C49n3l45j38q5L03M05l56m68J27L81O8k4k76k50K03M23k5l72j16L6J24M27
2985C38j01o33j4M56K05j08k77j89J39M48M9l76k20K30O8K78n3m45l8L45K07j53
3007A56k23k46Q9N99P9m62k54K29K10P8j9m98p8M77J46j81j74j54m8M38J96l89
3029b9l58K59K30R0mm21j91N26K14k90j91j00O8L22K50n06k37K50K14Q0K8m03
3051a99j48L02M73k25l19o3QL70J72m09l13K34K85O1q1k38k26L49L00k48j35j47
3073a97Q0K23L03l53m54J79L59R7j47k14k23L08K96j43l20j2R9K00K46k97l81
3094c51R9M24mq0k10j92J82M61r6m30j01K36K14J45k58l46J37L81Q0j84j21k54
$$ plain form
2942 245 287 16 -442 -74 458 304 30 -206 -185 21 397 140 -289 -225 79 260 308 62 -388 -258 349
2963 349 296 -49 -187 -272 31 436 80 -388 -261 120 188 164 -112 -362 -159 264 239 -133 -249 -213 -89 338
2985 338 237 -396 -410 46 251 143 -134 -323 -184 264 313 -63 -283 -53 15 293 240 -205 -243 102 309 156
3007 156 -67 -313 -224 375 454 -8 -262 -33 177 255 236 -262 -340 137 283 102 -72 -226 -274 164 360 -29
3029 -29 -387 -128 102 192 188 -233 -424 102 316 26 -165 -265 -197 125 375 -131 -368 -118 96 176 204 -199
3051 -199 -347 -45 428 203 -116 -179 -171 199 371 -38 -351 -117 168 229 148 -90 -316 33 333 85 -50 -197
3073 -197 -117 106 409 56 -398 -219 140 237 90 -124 -347 -39 257 114 -206 -218 -119 81 327 30 -351
3094 -351 -252 172 168 88 -122 -314 -132 329 233 -197 -298 -62 152 297 39 -307 -170 211 291 107 -14 -268
3116b68J56N08r8l96j24K54J63J17k22l79J31M56Nk51j07j44R6M26m9m38r7J82
3138g9J40K06j73m15M4M53J18l36j52l4J02L85k0m41p0K26J54L2r0l51M7L59J47
3161B52k63j89M7O8L57O6n16j04K85J89K8j41k29j03M93J26k81j78l4J08K23J36
3183C40m45j82K87J64O4j71k30j22L98K47l50k72Q2K16M0K11l70k40K66K26j61
3204bl3j82j07K92L58k48l45L0J16K59Q5l15l19L81K38l4j76n5j20K53K94k75
3226I5l08P2K21M7J47l28k65K37M05p7k20j43q8K70K96j85m23R7J53J73J2k01
3248a3k95J13M42K0k83j60m0J98L41k24m08J45K04J14l5j31k65J47L75m2k33k46
3270b76Q9J12L24j03l97K5K80J52j21j21k13J23L73k1l36p3P9J16K53q9l47j06
$$ plain form
3116 -268 -112 396 298 -98 -222 32 195 312 90 -289 -158 298 303 52 -55 -199 -103 323 274 -164 -261 -79
3138 -79 61 267 94 -321 -277 176 294 -42 -194 -228 -126 259 239 -202 -272 -46 108 140 50 -301 -254 105 252
3161 252 -11 -200 -153 -85 272 338 -178 -282 3 192 220 79 -150 -253 240 366 85 -93 -127 -19 204 340
3183 340 -105 -287 0 164 228 57 -173 -295 103 350 0 -272 -190 26 66 277 -93 -333 -67 159 -2
3204 -2 -35 -217 -324 -32 326 78 -267 -237 -121 138 223 -92 -411 -30 208 174 -2 -57 -177 76 370 95
3226 95 -213 -141 80 127 274 -54 -319 -82 323 246 26 -117 -205 65 361 176 -247 -150 3 176 188 -13
3248 -13 -308 -195 247 267 -16 -176 -216 -18 323 99 -309 -164 40 154 119 -12 -277 -130 245 203 -30 -276
3270 -276 -187 -75 249 146 -251 -226 54 206 85 -36 -249 -126 247 226 -110 -183 -104 12 265 176 -171 -277
3292b77L75M0J9r4k63kM45R9l96j04R4J76J29o0m36p1M25J19j09j43j42PK46K07
3316B84l68j60O8J35K48r4l51l4K84J84j16j92n7k4L71J45m33j35J67J17Q1J04
3338B24l27j73K82L04j92j96r3J7L55J83m54k49K08K62J8k9k61j07K41K04j13
3359A04k36O0o4K95J16l12k69J60K53P5p5l66l8K61K87j38k40k1K5J40J09j85
3381e9k37J14L24j0q6k17j98L13M10j31l81l2J19J85J15k24l14K73K44n9o3j40
3403e4j62K49L16j30k95q3J37J62J97k60l23J1M06Lj20j09r3J17L06k00l06j3
3425b44J76R5K45j53m23k4L94J19k05r1p9Q3L09j0m46nK69J12L5j40k35JL11J62
3449B56k35j12p3R6K44N1l56j44K66J56K2j03k40OL56P7k76j26L9J00K35N4l63
$$ plain form
3292 -277 98 138 157 63 -200 -202 243 342 -54 -158 -64 112 241 181 -255 -326 99 218 109 -34 -176 -169 77 284
3316 284 -84 -244 -176 -41 207 113 -238 -272 12 196 80 -112 -169 -193 178 323 -110 -245 -78 39 120 224
3338 224 -103 -276 6 310 118 -78 -171 -154 201 384 -70 -319 -111 151 169 140 -121 -228 13 217 104
3359 104 -132 -72 -136 159 275 -37 -306 -146 107 182 107 -259 -297 -36 251 113 -127 -148 -123 17 126 -59
3381 -59 -296 -182 142 132 46 -171 -369 -56 354 223 -158 -190 -71 114 229 5 -309 -36 208 149 86 -54
3403 -54 -216 33 349 219 -76 -159 -22 140 337 77 -246 -235 171 174 54 -55 -148 -31 275 75 -231 -244
3425 -244 -68 27 272 119 -304 -328 66 185 -20 -111 -190 -107 202 192 -254 -259 10 122 157 17 -218 -217 94 256
3449 256 21 -91 -164 -68 176 227 -129 -273 -7 149 171 68 -172 -166 190 267 -9 -135 -96 4 239 293 -70
3472g0j32J47J60O7o8k76o8L42K02k99j57LQ1K76L1k74k86K45J80no2k21k0J90
3496a4K31j92k59N1K15O1Q5l67j65L34K51j19q4k19j1K76K24j97k72N6J24J04
3518A13J11k22l22K28L51j03j25j73j31L04K92j69l16K9J48jJ18j15k13Q9K26
3539A19k1j40r4r9K08K50j13l36qK54J35L9j87k56Q5L63j18j60j3l2O5K60j09
3562I2l30M4L30MO8k13k73J71M24o9k80q3L5J40J26j02k99L8K43R3n9j14j49M9
3586a14K74P8k92j21j2J56K42j26l18K8K68M2k3r1j74N8K86M4k81j24Q0J15J84
3609A79j5l59q7L53J64j51j70r8J05K06J31l25j11J38Q9J01K8l29j64L16K61r6
3631A66j46p1o4K35J28k47k39J45J25J90j72j56j39K86J47j04k05L4j3K54L9k45
$$ plain form
3472 -70 -202 -55 105 172 104 -172 -240 102 304 5 -152 -149 -68 208 239 -35 -321 -76 104 99 37 -184 -204 -14
3496 -14 217 25 -234 -183 32 93 178 -189 -354 -20 231 112 28 -191 -202 74 298 101 -171 -115 9 113
3518 113 224 2 -320 -92 259 156 31 -142 -273 31 323 154 -162 -133 15 14 132 17 -196 -107 119
3539 119 98 -42 -136 -235 -27 223 110 -226 -234 20 155 194 7 -249 -164 199 81 -79 -92 -124 -59 201 92
3562 92 -238 -194 136 140 208 -5 -278 -107 317 248 -32 -115 -80 60 186 84 -215 -177 66 159 100 -14 -163 -114
3586 -114 160 238 -54 -175 -187 -31 211 85 -233 -205 63 105 82 -9 -183 -125 161 205 -76 -200 -120 -5 179
3609 179 164 -195 -282 71 235 84 -86 -184 -79 127 258 -67 -178 -40 49 150 178 -151 -315 1 262 166
3631 166 20 -51 -115 120 248 1 -238 -93 32 222 50 -106 -245 41 188 84 -121 -87 -100 154 193 -52
3653e2j64R4J33O0J6k42j25L35J90k29j29k5L5K10O6j63k36P2K29J3O8k72j54
3676b70K75K99j88k10l7J34J28K9j20k57Q9K38%K9k41p6J91K62j22k30k8KJ79
3699G6J79k31k38M4K63K8j11p1j27J10K63j40k05l7J20J01J04j31k36R3K49qq4
3722A1r9p4N4K74m0k20j03J79O4P6j9k70lL06L4j28n0j57J11K31J5k52j68J75
3746e3J56L0l5k89m7L83N1j54j27j2O3J74M0k95j06K03R8O0q0k20j0K16J14k01
3770d1k9k5j1K59n2k07r3J45J68p4m5j61j00L02J64k31q0p6J81J48Kk13j28J37
3794f0J98m0q3j58K5K25J22j46k49J69jJ44J7k43j05J63J73l8j44q3l1J68J58
3817A81j67j68N2P7J17K1j11j88J12K21o9n9j15o0J28K05q7k78O3R6J09L6j13
$$ plain form
3653 -52 -216 -122 11 71 87 -155 -280 55 245 16 -113 -138 -103 107 173 10 -226 -154 75 88 156 -116 -270
3676 -270 5 304 116 -94 -131 3 131 160 40 -217 -128 110 110 139 -102 -178 13 275 153 -77 -105 -103 76
3699 76 255 24 -214 -170 93 121 10 -61 -188 -78 185 45 -160 -197 -77 24 128 -3 -239 -146 103 95 11
3722 11 -88 -162 -108 166 126 -94 -197 -18 46 122 103 -167 -170 136 170 42 -8 -165 -54 177 192 -60 -228 -53
3746 -53 103 133 98 -191 -238 145 196 42 -85 -97 -34 140 180 -115 -221 -18 80 140 60 -160 -170 46 160 -41
3770 -41 -70 -95 -106 153 101 -106 -199 -54 114 40 -5 -166 -266 36 200 -31 -111 -187 -6 142 144 -69 -197 -60
3794 -60 138 98 15 -143 -118 107 229 83 -166 3 2 146 163 -80 -185 -22 151 113 -31 -114 -145 23 181
3817 181 14 -154 -102 -25 92 113 2 -186 -74 147 78 19 -96 -156 -28 177 90 -188 -125 -29 80 116 3
3840Ck46K06K08q8o0j26l6J51K45j36k83J37L6J12K0j17j96J16L10n4k13q0LJ34
3864D6J87j65k86Q0J41Q8N8j14j84KK46J04k61r6K2Q3J92q0k43N0J73Q5m6j17
3888c5j22L8K10P8j95q5J8R3J56p2k16q9J91J30M0j34j50M7K68M2k09j75P7K08
3912A14L0m3j67j01J73J19q3n4j10L0K55K8k27j05J07M8J13J2k55n8J77O6m1j01
3936g3k7KJ80J13k62j02P8J10P4J1k27o9K22J25q3j35q9R0J26J04j73j35O9J11
3960D0O5jk43j6J77J64l8j63p5J4J73J54j80k55Q6J97jn0p4k16K24K26r9j68l9
3985i8L4Q4J22j25j33k4J99k0K1j52j39K21J50j14j60j7J30O9M1o7k10J10J45
4008F7K3j3k09n0J38K68j22k59O1Q6P8R8p4k47J50J67J1j53j28RN0J72K6k33K3
$$ plain form
3840 3 -243 -37 171 83 23 -103 -139 12 257 121 -162 -25 11 123 143 26 -170 -54 256 202 -11 -91 -88 46
3864 46 233 68 -218 -138 3 91 149 35 -149 -147 99 203 -58 -154 -132 -49 143 63 -180 -130 43 128 82 -35
3888 -35 -157 -119 91 169 -26 -111 -93 0 156 84 -132 -221 -30 100 140 6 -144 -97 171 213 4 -171 -94 114
3912 114 144 101 -66 -167 6 125 42 -12 -122 -92 163 191 -36 -141 -34 14 127 139 -116 -174 3 69 28 -73
3936 -73 -100 -98 82 195 -67 -169 -91 19 93 104 -123 -192 30 155 72 -63 -152 -62 64 168 -5 -140 -71 40
3960 40 105 104 -139 -155 22 186 148 -15 -90 -76 97 251 71 -184 -98 99 98 48 -26 -242 -18 208 109 -59 -98
3985 -98 -64 20 142 17 -116 -140 59 39 60 -92 -231 -10 140 26 -134 -151 -21 48 89 22 -188 -78 67
4008 67 90 77 -132 -182 -44 224 102 -157 -96 -10 68 166 92 -155 -5 162 173 20 -108 -99 -49 123 149 -84 -61
4033f1M8L9J20j03k01N4K35O2j33j43r1R8J77j4k70J9J40M9L8m0j38n4K12P8j36
4058a5q3l8J07J52jk23p4K07QN7o9j51JK19N9j64q4L9L7J40K2k36jJ12P4P8j28
4085D5j05j14K62J01j57j18N1MJ05K5j16j70J18K04mj03j73K6J68J28j61j30K4
4108i0M2O9M5k04l3J37J49q0j13l4k1K19J44j85k04OJ44J21K7k21q4R9J89m5j00
4133b3o8J00J1J73j69k00M8K09JJ3m2k46J45J47l4j0j03p5J65J22j51j54J16N8
4157C3J02j23Lj67N2J72N0r1j27j2J9J52L5j87n7J68P8k6j19j09R5K02r6j03K5
4182c1q3R2J63mk23j6J86M0o2mj66J5K56N6l11n6J59L8J04k2k26n6J84P5j02Q
4208A4n0j8J35Q9j85p8O6RJ47o9j82o0K65K8n0j41j2k9J97P7k25l0N9K6N4L8j61
$$ plain form
4033 -61 -13 26 146 43 -158 -104 131 193 60 -83 -174 -76 101 87 -183 -164 -24 25 63 23 -115 -169 43 121 -15
4058 -15 -98 -136 -29 123 122 -101 -175 32 40 97 28 -123 -122 97 156 -8 -92 -53 -16 124 146 -90 -91 21 95 173 45
4085 45 -60 -174 88 189 32 -86 -35 -31 74 99 -17 -187 -69 135 131 28 -145 -119 49 177 16 -114 -90
4108 -90 -48 21 66 -138 -171 -34 115 35 -78 -112 -133 86 230 45 -159 -153 -9 112 139 -82 -166 -67 122 77 -23
4133 -23 -91 9 20 193 24 -176 -128 81 82 95 53 -193 -48 99 65 55 -48 -123 42 164 13 -141 -25 33
4157 33 135 12 15 -152 -100 72 122 31 -96 -108 -89 63 98 -89 -146 22 100 74 -45 -154 -59 143 47 -56 -31
4182 -31 -114 -22 141 137 -86 -102 84 124 62 58 -108 -93 163 219 -92 -148 11 49 153 131 -95 -151 33 108 6 14
4208 14 -36 -54 81 170 -15 -93 -27 -18 129 60 -122 -182 83 111 61 -80 -92 -121 76 153 -72 -102 -43 -17 37 75 -86
4235h6r2K11R9n1j81nRJ71R0r7k04J31P1J6N3j27q8J09P1nj44m7OK29Q0j98k66
4262b45K18J27l2j2p0j71J89J45j05j05rJ9N4Q8j23j88R5J63K0J6j53j41J49J62
4286I1q1j29QN8Q7Q1j69m6J09PR9n5o6j47J52J83j31n2m5J0Q0P4q7j48N9J88k2
4313A08q8L7r3kJ76o6j32LP1j8Q0Rk20M4J48J9q2m1n3O4K15j60j08l4J17NP6%
4341G5j84o8K13J4Pj11m9P2J39nk30LJ61oK4l7j53R2R6J03j35n2k1MJ17K0j17
4368b8p5L9J53k8l5r0p5K30N6j92m2%O1Q1O1j18j14J20J3N6K6j58o7J33J16j27
4394dr7oR2J43lj74o2J24J04q6p0L2j3J01Op4r0L8J02JR0k10j53J59J48K6j59
4421c5l8%R3O5q7j28J21oP1N2j85r0R9K36j05j11k7J6P4K05k03j34N3J24m7L8
$$ plain form
4235 -86 -178 33 132 81 -100 -105 -96 75 165 68 -136 -5 66 82 135 8 -80 29 100 95 -49 -96 -90 139 219 21 -245
4262 -245 -27 100 68 56 -14 -185 4 149 44 -61 -70 -51 3 91 -32 -220 -125 38 58 74 -79 -220 -71 91
4286 91 10 -119 -111 -53 34 115 -54 -100 9 16 115 60 -6 -153 -1 182 51 -1 -46 -36 44 118 31 -117 -58 130 108
4313 108 20 57 -36 -38 138 72 -60 -57 14 -4 76 85 -135 -91 57 76 -6 -47 -100 -36 179 19 -89 -123 -6 -1 75 75
4341 75 -109 -177 36 50 57 -54 -103 -31 108 103 -127 -124 37 31 55 18 -135 -43 53 156 21 -31 -52 -48 69 89 -28
4368 -28 -103 -64 89 61 26 -64 -139 91 147 -45 -87 -87 -26 55 116 -2 -116 4 17 73 99 -59 -126 7 123 -4
4394 -4 -101 -107 -15 128 125 -49 -111 13 117 31 -39 -7 -20 81 87 13 -77 -39 63 64 154 -56 -209 -50 98 124 -35
4421 -35 -73 -73 20 85 -2 -130 -9 -15 56 108 -77 -167 -68 168 63 -48 -75 -59 15 220 17 -117 -64 60 13 51
4447E1j11j24J67J02m5j07M7QL2O3k5k12L6J57m3J02j02j28P2J88q3q5LKQ1R3
4473A39pk02PJ52O2n6j00p7J1K07k4j22n0N8O7M1l8k40J39J21Jj07n4Rl5K25k2
4500A05j29n1RP5J45j25j42j6J36N2k4j9j07P3J14k5j78J0Q7pN1L5p7j49J51L9
4526C3PNj29K4J55L3j64k1Q4O0m4J7j10p3J48J26j87M5r9J4K05Rj76p2Q3R6R0
4553A59j29q5q3J77R2j74r0N6O0J08J8j14j01l9K01nj1n9j29J09J27p1r5l5J06
4578gM7R7j43j28J05R3km6p1PM1J49j23j15P7m6J26O4j06j92J33R9K7q6k1j12
4604a33R6J60o4r3k8J23o7J24k17m4O0J15M8l9j18l4J22Q1qk13R3P2k7J40j40
4629Ij32J04J25j6o2l2OJ0J37qj99q1J70RL7p8p7L1J38M6j88oK8JJ42rj35k7M3
$$ plain form
4447 51 -60 -184 -17 85 40 -67 -20 -12 20 83 58 -154 -118 39 -4 98 -4 -132 -60 128 45 -40 -37 -35 46 139
4473 139 132 -70 -63 89 151 95 -5 -82 -71 136 112 -10 -60 -2 65 106 68 -172 -33 88 89 -18 -72 -63 -98 127 105
4500 105 -24 -75 -66 9 154 29 -113 -129 7 59 35 16 -91 -18 96 71 -107 -97 -10 -17 34 69 -8 -157 -6 33
4526 33 40 45 -84 -60 95 128 -36 -57 27 87 43 60 -50 -123 25 151 -36 9 -90 -76 129 138 -38 -110 -27 69 159
4553 159 30 -55 -138 39 131 -43 -133 -77 -17 91 109 -5 -106 -145 56 51 40 -19 -148 -39 88 17 -78 -113 -7
4578 -7 40 137 -6 -134 -29 64 62 16 -55 -48 -7 142 19 -96 -19 -65 61 125 19 -173 -40 59 86 0 -21 -133
4604 -133 -37 123 59 -34 -62 61 -6 118 -99 -143 -83 32 80 41 -77 -111 11 92 84 -129 -36 36 9 149 9
4629 9 -123 -19 106 90 28 -4 2 12 149 141 -58 -139 31 40 77 -1 -78 -47 91 137 -51 -57 -29 -28 114 105 -30 -57 -14
4658a4P8m7O8k00L8J29J02k17L2k7J00j8K6j13k3J23M5l0j5j61J4J61K4p0j31
4683a26O2O4L8J6j09k9J09M6o2J7o7K1R9J5j00k1kJJ40kj58m8R4N7M7n9q2m0O9
4712a0J29j07r4Q7k6J00K1j25p5P8J05j3j17M5p9P3P7o6o0j2P7j9L5j00o0J33
4738cP9p2%n8l4J46O3p5r3j4J31K6L3j32m7N5J09q1pk2p2J45N2q8j24k5J97l0
4766E9J2j12n0L4J39N7j88ln1O9J44m5j93M5J32K9m7o0k8k5J87k2j10m0K7KJ26
4793H8p8r5j6J32R6j23j2j01R2J38n7j26n6J28Q4l1j7j41LJ56M0j4r5k5rJ77j1
4820A27j60l4P5L0J20q0j20o5J29O9o5o4rQK7J41j02r8O8j6R5l5j10n3J42N7j28
4847e1m0j8Q1O2J09j69n7J02PlP3j26m4O3J66j32o6lO7P7k9n7j24P0J29o0j4k0
$$ plain form
4658 -14 64 17 85 -115 -77 52 154 -63 -31 -58 42 24 50 -63 -86 37 82 52 37 -124 -110 51 75 5 -126
4683 -126 -64 0 38 54 -55 -84 25 71 9 26 -41 -20 79 94 -6 -27 -29 -28 112 110 -48 -96 -2 55 102 43 -39 -79 -10
4712 -10 119 12 -82 5 -21 79 100 -25 -100 -22 83 70 -47 -2 -81 -8 69 3 -57 -69 8 -11 24 -76 -136 -3
4738 -3 76 4 4 -54 -88 58 121 46 -47 -61 70 96 129 -3 -50 5 114 33 26 4 -68 77 129 41 -83 -108 89 59
4766 59 71 -41 -91 -57 82 139 -49 -52 -103 -34 110 65 -128 -83 49 78 31 -29 -57 -82 105 83 -27 -67 -40 -38 88
4793 88 10 -85 -101 31 127 4 -8 -109 -17 121 64 -62 -118 10 94 63 46 -95 -92 64 104 90 -5 -30 -39 138 127
4820 127 -33 -67 8 38 158 78 -42 -107 22 91 26 -38 -47 -39 -12 129 27 -71 -3 -19 76 41 -69 -122 20 77 -51
4847 -51 -91 -109 -28 34 143 -26 -83 19 26 23 96 -30 -74 -11 155 23 -43 -46 21 98 69 12 -112 -42 87 27 13 -7
4875gm1O8J04q6n2k8PM5J15j07j44P6J15k8n1m4m4J23O4n8j43O7O2m1J17j06o8
4902h5MJ40l3q5L6p8J03J02l4j46%J12KP4j58k1J3N6L3O7j05NK9L4J0j73L5Q4
4930B1P4j4n9j32L0J85q5k6Rm9K0R5k2j39n7J70k6O1o4j07J13Q2j8l5j80J13J1
4957b9O8K1k30J08O6J7PJ2j44N1J13M9r8n2kO2M6Q2k19K0L6O3K4Kj27QQ0M3j14
4986c7J9k8R0K0k2o5o8J38k0L4r8jn7J58M4p9m2N0j6N3R0k10m1O2R0q5l7J0o1
5015a09R1J29j19m1o5O8O2L2m0o9M1J45o5m9j36P6J6J46q6j18O3K1k3P8m2o1O
5042d9J72n1j01M4j7l3J43q1j15J00J8N3k5p4l6Q1Jpm3l3J4L4J09j53n0N6L0Q6
5070G3r6Kp9R8L6j42J05n0pj9J87p0o9QK0M5l7j0q3N0P3k4k5j05R3P8O9q3j32
$$ plain form
4875 -7 -48 20 124 38 -14 -42 -35 10 125 18 -126 -50 65 37 -14 -58 -102 21 85 27 -116 -49 13 -28 89 -17 -85
4902 -85 -81 59 26 -59 -23 -101 2 104 70 -76 -76 36 38 112 -46 -67 -54 2 35 102 -3 2 31 65 75 -98 -63 21
4930 21 95 81 22 -110 -80 105 20 -6 3 -46 -26 69 47 -92 -149 21 -5 56 -8 -115 -2 80 62 27 -153 -40 -29
4957 -29 39 60 -170 -62 4 21 28 40 -104 -53 60 109 11 -41 -43 19 65 147 -72 -52 -16 47 71 73 -54 -46 34 77 -37
4986 -37 -18 -46 44 64 42 -23 -91 47 27 61 -37 -38 -95 63 107 28 -14 36 20 73 163 -47 -88 -26 64 -21 -58 -48 -109
5015 -109 -18 111 -8 -49 -114 -46 16 48 8 -61 -20 125 60 11 -125 -49 -33 113 27 -91 -28 -7 -30 48 6 -55 -49
5042 -49 123 72 -29 15 -2 -35 108 27 -88 12 30 83 58 -16 -52 29 30 23 -20 -53 -39 -5 104 -49 -99 -43 -13 73
5070 73 -23 -21 -100 -2 34 -108 -3 -53 -60 -79 108 38 -31 -23 -3 42 5 -5 -88 -38 35 11 -14 -119 -26 52 121 38 -94
5099i4P6M3J11j75J8rkQ9M3j53QN0M1M9m6j27J1J25L9l7q7m6J4J28j6q1m7K2N3
5128@M4q4l8o6J38K4j0qm9k4J47o4n1k2j8J09LK5o9L9N8m6Qj08j4L2R7K4n5q5
5158f3oJ24N8o1q7N2kJ12p3r8K9j0P4M3j28j15Q7J00l0k6OOL4M0o2k4mnN0O1j24
5189d2p4P4J10Ql1p3m6R5L8m4o1M6pP4m9K8j01J5R7j2m0j01K8P2P6nk03Q3PP0
5219C2P7m2j09k6J06l5Pn4l2Q5L7rp2k5P0L4Jj4q6LO3Qj6m0Mk9J23k8r3m9O8M0
5251aK0L3j12k7J77k8q2n7j4P8P6J1q9n7L2J14J9p6n5nJ54qr1q2j1P6O3J6m0j15
5281h1O4J26n8l5n6pO0N0j36J2J7L1O3O0j88j9P5P0K9m6K4r1k9R5L1j46N1jQ8
5310E3M3j17n9R4J1q7O9rp9O3Q9j20k7P5j6J7Q0j40m9L0J63Kq0k9m4Q7N3j9j26
$$ plain form
5099 -94 -18 25 136 -39 -21 -30 -32 57 100 -53 -45 5 46 95 49 -78 -67 58 97 60 -27 -73 -59 69 53 -28 -75 -53 0
5128 0 44 -40 -78 -144 -6 18 8 0 -49 -73 74 10 -41 -63 -81 28 31 56 -13 26 84 38 46 -62 -76 -44 53 77 22 -63
5158 -63 -69 55 113 52 -35 17 15 127 54 -44 -15 -25 49 92 -36 -151 -64 36 6 -20 -14 -8 26 66 4 -20 -24 -29 21 82 -42
5189 -42 -116 -42 68 76 45 -28 -74 21 59 15 -46 0 -7 67 18 46 -55 -40 57 45 5 -96 -68 4 80 75 -128 -45 -38 32
5219 32 109 67 -42 -68 38 3 10 -44 -76 9 46 37 -35 -60 10 44 45 31 -55 -52 11 19 3 -37 -33 -62 61 33 -60 -109 -41 -1
5251 -1 19 52 -60 -87 90 62 -20 -77 -91 -13 63 74 -15 -72 -40 74 93 17 -38 -43 111 103 12 -70 -81 -5 58 74 34 -81
5281 -81 -17 109 51 16 -40 -47 13 63 -73 -61 -44 -13 50 110 -78 -97 -22 48 77 31 55 -36 -65 30 61 -85 -34 -35 53
5310 53 96 -21 -80 14 25 -62 7 -2 -81 -18 71 -49 -76 -1 -17 0 80 -60 -109 -79 84 86 6 -23 -67 20 73 54 -72
5339g2k2J61p2%j5l9N8R5n3j4pm5jO6m2q1J1P4j7j7N4q1M0Q1p2o9M4k9P5N6j03
5370c6Pn4R1N0l0j7q0L6J04K3k06P2Lk9J50r4no0Q5J4J3q6Q%Q9k4l5n0J4L9O2
5401E4J1j64O0M7K0J9%n0k9P0N9j16k3J4M4l5N7j25O1Q4k7l1ppm1R6O4j39l8Q3
5431A1O1j8Lp4j05J56JJ5m9q3M6M0P8q1qK1k4O3m2k5j32J99Pr8qjL5nO0m0j17
5462a14P9P6kl3n8o9J43m3J1nn2j7J53J3r8l0K9J7Q7m0j01M0Q3ko3n4O6m1N1L1
5492E7o7j9J6K9mj0Ol4PP8mj08M9L0N1k4k4j13JR9P8j19L7m0K1N7k9m4K0M2j6
5523B3J0m9p2K9R0jKl3J0j5R0k7o6k3K7PN2p9oJ3P8Q1j39l1K5m3J15k6nn0j8K2
5555iO0j17N9m5R2K3r5MPKJ00n7J7n7KL4Jk6j9p4J34L7p8m3l1N1N4J6j14m4Q9
$$ plain form
5339 -72 -94 67 -5 -5 -20 -59 -1 94 41 27 20 -25 -26 40 -2 -83 -72 2 -15 -32 22 -59 -19 62 -10 -79 -35 -64 11 67 -36
5370 -36 -29 -83 8 58 28 11 -69 -33 71 94 -112 -40 -37 -66 84 -10 -15 -75 10 24 37 -49 -41 -41 48 24 -11 -61 -47 -8 54
5401 54 65 -99 -39 8 28 47 47 -3 -32 38 97 -19 -42 -28 16 -19 38 -87 -26 58 31 0 -7 -14 -55 41 105 -34 -72 11
5431 11 72 54 57 -17 -122 34 35 50 1 -82 -36 4 82 1 -7 14 -10 53 11 -14 -146 53 60 -38 -46 -47 -12 -17 43 3 -114
5462 -114 -35 41 39 6 -52 -121 22 -21 -10 -15 -67 -84 69 82 -16 -46 -17 0 87 47 -54 -14 69 67 4 -50 16 -25 26 57
5492 57 -10 -29 -13 16 12 2 8 -26 -19 59 55 -53 -4 26 77 53 29 -84 -83 16 94 -25 12 -28 -7 50 21 -23 -3 39 23
5523 23 33 -16 -88 -59 31 30 32 -1 9 -6 84 57 -9 -32 -5 2 54 -25 -31 -18 60 141 2 -29 -4 -47 68 42 37 -13 -31 -9
5555 -9 51 -66 -7 -52 40 63 -32 -28 -21 -19 81 24 41 -16 -14 20 21 -5 -24 -98 36 73 -5 -48 -79 -28 26 42 -72 -116 -27
5586b7qQ9l6m3k2R0j0l6l0L1L8J4n9l3l5J08OQo7Oj5P9mJ0j51J26p3Q5l5Ml6l9
5618f5J56n7j5j45J15L3M6j2j35L7M5l5O6k9r1M0Q7J2r5J7rN8M8j15n7Q0M0qM3
5647E5j9q1K9N2K1nr6n4Q0K5km4j6N5lQ5r4p7J26K4K6o0q0O9K8J6p8o5k3M2J17
5678E3m0Mm2OM2Nk2m6j6M3L9K9j01O5k9LM4q4jmJ78o0r5j9J6N0J6m3j5j0N6K6
5710D8m9n8O8p6O0k8M8j4l5R3j3K5j18k1J20k1M8l1j25J9K5R2n8k6rJ5Q2r7N1
5739A5p3J35n5l7k5J0k6Q5L2q3J8lJ3k0N5r2k4O0M6J7l3l5K3j8MM2q4P2n8K1M3
5770B5l3m9O4M7ol3Km3L2L7j8j03L3P3P4l9p6l7R9k5J3j3o8P6m6J01o6m8RK4o2
5801e6M3qq6J32l3kj1j7K9J8N0m8o7j9M0N1k9l4J4K9O6o2J9l5RK7rK5m6m4O5K0
$$ plain form
5586 -27 -35 54 18 -25 -47 43 33 -3 -33 -2 36 50 -9 -42 -77 31 37 45 -22 -16 -31 48 44 54 -97 29 -44 41 6 10 -26 -65
5618 -65 91 34 19 -126 -11 22 68 56 -79 -42 3 -32 34 5 -86 -46 41 53 -42 -25 -34 24 72 -43 -100 -20 20 12 55
5647 55 36 -45 -16 36 57 52 -44 -98 -18 7 5 -39 -55 0 -3 82 -12 -89 37 61 87 27 -53 16 44 60 -18 -83 -106 -64 53
5678 53 13 17 -25 -19 23 28 6 -40 -56 -13 26 55 -46 19 -10 -7 37 -47 -48 -52 126 66 -29 -48 -32 18 34 -9 -24 -34 22 48
5710 48 -1 -59 9 -67 -7 -35 13 -1 -36 57 44 69 -49 -70 50 29 77 46 -79 -60 -35 57 -1 -27 -36 -21 61 -36 15
5739 15 -58 77 22 -15 -40 -30 -56 29 61 -22 -4 -7 6 -14 41 -51 -75 -15 31 48 15 -20 3 -15 -11 31 -53 19 -39 -18 25
5770 25 -8 -57 7 54 48 15 17 -26 6 43 25 -78 -45 28 102 63 -13 -50 49 24 37 24 -44 32 -14 87 21 -27 -18 6 -56
5801 -56 -13 -21 -107 25 -8 -10 -21 -38 -9 9 59 11 -56 -75 -35 16 -13 -47 -33 -4 62 0 19 -16 -7 20 11 36 -10 -54 11 31
5833C1l8po4R6J6K3n8k9O4j8nM4l3p2N6Kj5L5m0j9O3j1n4j8K4J0N1n0p6N3L8M7
5865D6m1n3Ol3L8Q1n9L2j9PK9l4k9K4J1N3o6m2L8J1ON7l8j38Q8M9n8Q3n8j0Q8
5896F9o8NJj1m3Q2N1m9r0QJ39p0k8M5o1NM5o2m3L2P5N2q7Oo1P9M8Mj8j07K1j0
5928d1R8n6l7k5Q5Olk5n1P8PKn4J2j4K2O3k9l0k1k0O7l8n9L5lM4J5m5Ll2O1k5
5961a0L4J6j8rM9o8Pr6R8L0qk5k2K6l0lpj6Q5o4M7Ln2o6K3J19k6Km5L7k1R3j6
5994F7q3n7O1k2P3n4j8J1M0J1n0K4m7J06%K3m2p3L7Lm4L3M5n2K0M8l5n1N8k3k3
6025a4O8k4k3jM9np9j2K3N5l1l0k0K7l0K7N2J4q5N0K1nj1j12J3O6J2%m2J1M6L3
6057D3m2M8n1rR1n3l2lj3J8L3j0n8k4P9k0M8m7q4N6J16j13j2P5n3J0N4Kp4N2j2
$$ plain form
5833 31 -7 -14 -78 18 34 57 -1 -30 34 16 11 55 22 -50 6 8 -7 28 -12 -31 32 21 -33 -51 -27 -17 34 -16 -92 -39 -1 46
5865 46 5 -48 -42 -75 -37 44 -15 17 -2 5 34 0 -29 -5 6 59 -7 -49 -11 0 6 63 25 -113 -25 24 -34 49 -9 -19 69
5896 69 1 6 7 -4 -47 35 86 37 -53 -45 94 24 -4 41 -20 -15 30 -32 -75 -43 32 84 -3 3 -58 21 69 73 55 -52 -31 -41
5928 -41 57 1 -36 -61 24 30 27 2 -49 29 36 38 -16 -4 -18 4 67 38 8 -13 -33 34 -4 -63 -28 -31 13 28 -17 -14 -46 15 -10
5961 -10 24 40 22 13 62 -6 1 -95 3 33 25 0 -22 4 -26 -29 -36 -52 33 -31 16 19 -33 -99 -76 43 17 19 -26 11 -10 83 67
5994 67 -16 -73 -12 -34 39 -15 -33 -22 18 29 -21 3 -44 62 62 85 43 -30 7 10 -34 -1 44 -8 12 60 25 -26 32 9 -14
6025 -14 54 30 7 6 55 50 -29 -41 -18 37 6 -24 -44 -17 -47 -20 32 46 -39 11 32 27 16 -96 -83 -17 -5 -5 -47 -36 10 43
6057 43 1 49 -2 -11 80 27 -5 -8 -21 -3 30 20 -38 -62 17 -3 45 -2 -86 -30 86 -27 -39 36 -17 -7 47 49 -25 27 15
6088A5o6K1QL3k3R3p6m9KP7J3K1p2n2K5J00m3k3m6M2n0K2L1Oo6N5L3k1J2o9j8
6119f5J17lm1n7M7L5J2j4j5M8r5O8l9N0p2j7K9N2K6Oj12K6P3kn4o0MK9J14m7l7
$$ plain form
6088 15 -51 -30 -22 11 -12 81 5 -44 -42 35 48 69 -3 -55 -30 70 27 4 -42 0 -50 -28 3 9 -57 -2 31 10 22 -47 -65
6119 -65 52 49 8 -49 -2 33 45 31 16 64 -31 37 -2 48 -24 -41 -12 40 66 72 -40 -14 59 57 3 -57 -53 -24 90 43 6
$$ [...]
8191B6
##END NTUPLES=NMR FID
##END=
