##TITLE=1H_CA-8603-1
 CDCl3, 8 sc, 
 3.6.2019
##JCAMPDX= 6.0         $$ Bruker NMR JCAMP-DX V2.0
##DATA TYPE= NMR FID
##DATA CLASS= NTUPLES
##ORIGIN= UXNMR, Bruker Analytische Messtechnik GmbH
##OWNER= root
$$ XWIN-NMR		Version 3.5
$$ Mon Jun  3 16:20:30 2019 Russian Standard Time (UT+4h)  she@DPX200
##.OBSERVE FREQUENCY= 200.13155
##.OBSERVE NUCLEUS= ^1H
##.DELAY= (6, 6)
##.ACQUISITION MODE= SIMULTANEOUS
##.ACQUISITION SCHEME= undefined
##.AVERAGES= 8
##.DIGITISER RES= 18
##SPECTROMETER/DATA SYSTEM= spect
##.PULSE SEQUENCE= zg30
##.SOLVENT NAME= CDCl3
##.SHIFT REFERENCE= (INTERNAL, CDCl3, 0, 15.7039)
##AUDIT TRAIL= $$ (NUMBER, WHEN, WHO, WHERE, WHAT)
$$ ##TITLE= Audit trail, XWIN-NMR		Version 3.5
$$ ##JCAMPDX= 5.01
$$ ##ORIGIN= Bruker BioSpin GmbH
$$ ##OWNER= she
$$ F:/spectra/data/she/nmr/H-F/1/audita.txt
$$ ##AUDIT TRAIL=  $$ (NUMBER, WHEN, WHO, WHERE, WHAT)
(   1,<2019-06-03 16:19:15.57 +0400>,<she>,<DPX200>,
      <created by zg, POWCHK disabled, PULCHK disabled
       configuration hash MD5:
       00 E9 B6 7A A2 85 ED C7 34 08 36 98 17 FE 4E 26
       data hash MD5: 16K
       8D 4F 52 21 64 AD AB 36 ED 32 BD 5B 67 D2 4F A6>)
$$ ##END=
$$ 
$$ hash MD5
$$ 01 CC DC 56 92 F9 74 06 63 0F AD A9 B0 8B C6 2C
##$RELAX= 
##$RELAX= 
##$RELAX= 
##$RELAX= 
##$RELAX= 
##$RELAX= 
$$ Bruker specific parameters
$$ --------------------------
##$DU= <F:/spectra>
##$EXPNO= 1
##$NAME= <H-F>
##$PROCNO= 1
##$TYPE= <nmr>
##$USER= <she>
##$AMP= (0..31)
100 100 100 100 100 100 100 100 100 100 100 100 100 100 100 100 100 100 
100 100 100 100 100 100 100 100 100 100 100 100 100 100 
##$AQSEQ= 0
##$AQ_mod= 1
##$AUNM= <au_zg>
##$AUTOPOS= <>
##$BF1= 200.13
##$BF2= 200.13
##$BF3= 200.13
##$BF4= 200.13
##$BF5= 200.13
##$BF6= 200.13
##$BF7= 200.13
##$BF8= 200.13
##$BYTORDA= 1
##$CFDGTYP= 0
##$CFRGTYP= 5
##$CHEMSTR= <none>
##$CNST= (0..31)
1 1 145 1 1 1 1 1 1 1 1 1 1 1 1 1 1 1 1 1 1 1 1 1 1 1 1 1 1 1 1 1 
##$CPDPRG= <>
##$CPDPRG1= <>
##$CPDPRG2= <>
##$CPDPRG3= <>
##$CPDPRG4= <mlev>
##$CPDPRG5= <mlev>
##$CPDPRG6= <mlev>
##$CPDPRG7= <mlev>
##$CPDPRG8= <mlev>
##$CPDPRGB= <>
##$CPDPRGT= <>
##$D= (0..31)
0 1.2 0 0 0 0 0 0 0 0 0 0.03 0 0 0 0 0 0 0 0 0 0 0 0 0 0 0 0 0 0 0 0 
##$DATE= 1559564354
##$DBL= (0..7)
120 120 120 120 120 120 120 120 
##$DBP= (0..7)
150 150 150 150 150 150 150 150 
##$DBP07= 0
##$DBPNAM0= <>
##$DBPNAM1= <>
##$DBPNAM2= <>
##$DBPNAM3= <>
##$DBPNAM4= <>
##$DBPNAM5= <>
##$DBPNAM6= <>
##$DBPNAM7= <>
##$DBPOAL= (0..7)
0.5 0.5 0.5 0.5 0.5 0.5 0.5 0.5 
##$DBPOFFS= (0..7)
0 0 0 0 0 0 0 0 
##$DE= 6
##$DECBNUC= <off>
##$DECIM= 24
##$DECNUC= <off>
##$DECSTAT= 4
##$DIGMOD= 1
##$DIGTYP= 9
##$DL= (0..7)
0 120 120 120 120 120 120 120 
##$DP= (0..7)
150 150 150 150 150 150 150 150 
##$DP07= 0
##$DPNAME0= <>
##$DPNAME1= <>
##$DPNAME2= <>
##$DPNAME3= <>
##$DPNAME4= <>
##$DPNAME5= <>
##$DPNAME6= <>
##$DPNAME7= <>
##$DPOAL= (0..7)
0.5 0.5 0.5 0.5 0.5 0.5 0.5 0.5 
##$DPOFFS= (0..7)
0 0 0 0 0 0 0 0 
##$DQDMODE= 0
##$DR= 18
##$DS= 0
##$DSLIST= <SSSSSSSSSSSSSSS>
##$DSPFIRM= 0
$$ [...]
##$SUBNAM2= <"">
##$SUBNAM3= <"">
##$SUBNAM4= <"">
##$SUBNAM5= <"">
##$SUBNAM6= <"">
##$SUBNAM7= <"">
##$SUBNAM8= <"">
##$SUBNAM9= <"">
##$SW= 24.9336996594482
##$SWIBOX= (0..15)
0 0 2 0 0 0 0 0 0 0 0 0 0 0 0 0 
##$SW_h= 4990.01996007984
##$TD= 16384
##$TD0= 1
##$TE= 0
##$TE2= 300
##$TE3= 300
##$TEG= 300
##$TL= (0..7)
0 120 120 120 120 120 120 120 
##$TP= (0..7)
150 150 150 150 150 150 150 150 
##$TP07= 0
##$TPNAME0= <>
##$TPNAME1= <>
##$TPNAME2= <>
##$TPNAME3= <>
##$TPNAME4= <>
##$TPNAME5= <>
##$TPNAME6= <>
##$TPNAME7= <>
##$TPOAL= (0..7)
0.5 0.5 0.5 0.5 0.5 0.5 0.5 0.5 
##$TPOFFS= (0..7)
0 0 0 0 0 0 0 0 
##$TUNHIN= 0
##$TUNHOUT= 0
##$TUNXOUT= 0
##$USERA1= <user>
##$USERA2= <user>
##$USERA3= <user>
##$USERA4= <user>
##$USERA5= <user>
##$V9= 5
##$VALIST= <valist>
##$VCLIST= <CCCCCCCCCCCCCCC>
##$VD= 0
##$VDLIST= <DDDDDDDDDDDDDDD>
##$VPLIST= <PPPPPPPPPPPPPPP>
##$VTLIST= <TTTTTTTTTTTTTTT>
##$WBST= 1024
##$WBSW= 4
##$XGAIN= (0..3)
0 0 0 0 
##$XL= 0
##$YL= 0
##$YMAX_a= 293163
##$YMIN_a= -270291
##$ZGOPTNS= <>
##$ZL1= 120
##$ZL2= 120
##$ZL3= 120
##$ZL4= 120
##$ABSF1= 10
##$ABSF2= 0
##$ABSG= 5
##$ABSL= 3
##$ALPHA= 0
##$AQORDER= 0
##$ASSFAC= 0
##$ASSFACI= 0
##$ASSFACX= 0
##$ASSWID= 0
##$AUNMP= <proc_1d>
##$AZFE= 0.1
##$AZFW= 0.1
##$BCFW= 1
##$BC_mod= 2
##$BYTORDP= 1
##$COROFFS= 0
##$CY= 11.3945322036743
##$DATMOD= 1
##$DC= 2
##$DFILT= <>
##$DTYPP= 0
##$F1P= 18.9103706918063
##$F2P= -1.10871071338519
##$FCOR= 0.5
##$FTSIZE= 0
##$FT_mod= 4
##$GAMMA= 1
##$GB= 0.15
##$INTBC= 1
##$INTSCL= 1
##$ISEN= 128
##$LB= 0.24
##$LEV0= 0
##$LPBIN= 0
##$MAXI= 10000
##$MC2= 0
##$MEAN= 0
##$ME_mod= 0
##$MI= 1.114404
##$NCOEF= 0
##$NC_proc= 0
##$NLEV= 6
##$NOISF1= 3.799351
##$NOISF2= 2.8
##$NSP= 1
##$NTH_PI= 0
##$NZP= 0
##$OFFSET= 15.70392
##$PC= 1
##$PHC0= -8653.824
##$PHC1= 11.80022
##$PH_mod= 1
##$PKNL= yes
##$PPARMOD= 0
##$PSCAL= 0
##$PSIGN= 0
##$REVERSE= no
##$SF= 200.130013532006
##$SI= 16384
##$SIGF1= 3
##$SIGF2= 2
##$SINO= 400
##$SIOLD= 16384
##$SREGLST= <1H.CDCl3>
##$SSB= 0
##$STSI= 0
##$STSR= 0
##$SW_p= 3612.71676300578
##$SYMM= 0
##$S_DEV= 0
##$TDeff= 0
##$TDoff= 0
##$TI= <>
##$TILT= no
##$TM1= 0
##$TM2= 0
##$TOPLEV= 0
##$USERP1= <user>
##$USERP2= <user>
##$USERP3= <user>
##$USERP4= <user>
##$USERP5= <user>
##$WDW= 1
##$XDIM= 8192
##$YMAX_p= 0
##$YMIN_p= 0
$$ End of Bruker specific parameters
$$ ---------------------------------
##NTUPLES= NMR FID
##VAR_NAME=  TIME,          FID/REAL,        FID/IMAG
##SYMBOL=    X,             R,               I
##VAR_TYPE=  INDEPENDENT,   DEPENDENT,       DEPENDENT
##VAR_FORM=  AFFN,          ASDF,            ASDF
##VAR_DIM=   8192,          8192,            8192
##UNITS=     SECONDS,       ARBITRARY UNITS, ARBITRARY UNITS
##FACTOR=    0.0002004,     1,               1
##FIRST=     0,             0,               0
##LAST=      1.6414764,     0,               0
##MIN=       0,             -270291,         0
##MAX=       1.6414764,     293163,          0
$$ Real data points
##PAGE= N=1
##DATA TABLE= (X++(R..R)), XYDATA
$$ [...]
$$ plain form
1378 -1726 1192 1719 -1241 -1799 1698 2002 -1977 -1575 2642 1460 -2761 -501 3211 122 -2690 858
1394 858 2664 -785 -1985 1173 1893 -976 -1481 1085 1726 -1057 -1637 1380 1545 -1748 -1334 1889 702
1411 702 -2080 -406 1658 -146 -1496 -14 917 -84 -989 -499 775 406 -1427 -699 1432 277
1427 277 -1929 -197 1897 -368 -1938 536 1635 -631 -1460 792 1586 -641 -1492 893 1927 -988
1443 -988 -1878 1768 2025 -2031 -1288 2783 1060 -2682 -30 2842 -172 -2218 796 2135 -771 -1768
1459 -1768 848 1767 -819 -1734 1036 1798 -1494 -1612 1681 1130 -2134 -824 1914 126 -2001 -13
1475 -13 1285 -324 -1156 -51 734 55 -1030 -500 979 317 -1427 -304 1446 -61 -1541 379 1333
1492 1333 -458 -1056 548 1139 -267 -1033 378 1472 -216 -1546 756 1934 -1042 -1648 1859 1678
$$ packed form
1378a726K918N27k960n58L497L04l979M02M217j182m221K260L712l089k812L548
1394H58J806l449j200L158P20k869n05K566O41k783n80L017J65l293M14L223j187
1411G02k782J674K064j804j350J482R31j001r05M90J274l69j833P28K131j155
1427B77k206J732K094k265j570K474J099k266q29K252P94k227q51K385J034k915
1443i88q90L646K57m056P43M071j723l742K652K872l014k046L014J339k906r97
1459a768K616R19k586r15K770P62l292j18L293n51l264J310K738j788k127J988
1475a3J298j609q32J105P85o79j085N30J479o62j744J123J750j507j480J920R54
1492A333j791n98J604N91j406p66J411J094j688j330K302J178k976o06L507j81
$$ plain form
1508 1678 -1985 -812 2456 571 -2134 131 2153 -238 -1791 318 1833 -428 -1832 524 1825
1523 1825 -907 -2052 1255 1671 -1902 -1532 1925 676 -2251 -381 1749 -226 -1725 129 1088 -370
1539 -370 -1175 8 948 -72 -1197 -14 1243 -277 -1379 516 1225 -682 -794 823 675 -515
1555 -515 -351 423 627 -8 -702 220 1342 -171 -1165 850 1586 -1085 -1067 1645 880 -1631 -456 1668
1573 1668 283 -1509 -212 1496 70 -1564 -163 1630 -135 -2050 424 1976 -1099 -2029 1339
1588 1339 1495 -2054 -1188 1858 408 -2033 -239 1529 -209 -1455 -9 1242 -93 -1353 19
1603 19 1427 -200 -1482 583 1404 -870 -1003 1199 813 -894 -298 977 249 -365 -42 293 523 4
1621 4 -648 375 1062 -461 -897 986 877 -1120 -589 1258 420 -1102 -297 989 268 -1077 -502 1169
$$ packed form
1508A678l663J173L268j885k705K265K022k391j553K109J515k261j404K356J301
1523A825k732j145L307M16l573L70L457j249k927J870K130j975j499J854R59j458
1539c70q05J183R40j020j125J183J257j520j102J895P09j907j12J617j48j190
1555e15J64P74K04o35o94R22J122j513r94K015P36k671J8K712p65k511J175K124
1573A668j385j792J297J708j426j634J401J793j765j915K474J552l075r30L368
1588A339J56l549Q66L046j450k441J794J768j738j246J446J251j335j260J372
1603A9J408j627j282K065Q21k274j33K202l86j707N96J275p28o14L23L35K30n19
1621Do52J023O87j523m36J883j09j997N31J847q38j522Q05J286p21j345N75J671
$$ plain form
1639 1169 286 -1652 -381 1714 -297 -2153 548 1868 -1281 -1744 1500 1071 -1781 -867 1647 311
1655 311 -1603 -299 1322 147 -1357 -149 1507 45 -1490 320 1731 -585 -1412 1106 1224 -1158
1671 -1158 -550 1373 447 -787 53 795 150 -214 -72 405 468 -255 -562 611 671 -796 -447 919 250
1690 250 -855 -183 615 39 -636 -392 516 347 -972 -680 1073 294 -1623 -198 1583 -487 -1804
1707 -1804 731 1399 -1307 -1212 1247 749 -1372 -595 1285 483 -1245 -448 1328 469 -1482 -120 1744
1724 1744 -44 -1642 675 1699 -776 -1133 1245 857 -1083 -250 1094 283 -579 -39 534 281 -390
1741 -390 -348 537 509 -705 -389 764 206 -863 -91 601 -96 -571 -94 229 108 -478 -496 462 481 -1011
1761 -1011 -562 1152 129 -1588 134 1458 -695 -1309 844 1012 -1052 -740 1025 638 -939 -570
$$ packed form
1639A169q83j938J271K095k011j856K701J320l149m63L244m29k852R14K514j336
1655C11j914J304J621j175j504J208J656j462j535J810J411k316q27K518J18k382
1671a158O08J923r26j234Q40P42o45l64J42M77O3p23l07J173O0j467L49J366o69
1690B50j105O72P98n76o75K44R08j69j319K92J753p79j917J425J781k070j317
1707a804K535O68k706R5K459m98k121P77J880q02j728P97J776q59j951J362J864
1724A744j788j598K317J024k475l57K378l88j940Q33J344q11q62N40N73k53o71
1741c90M2Q85k8j214L16J153n58j069P72O92o97m75M77L23j21n86j8R58J9j492
1761a011M49J714j023j717J722J324k153o14K153J68k064L12J765l87j577L69
$$ plain form
1777 -570 1055 616 -1063 -525 1503 455 -1390 133 1817 -292 -1374 969 1380 -943 -673 1197
1793 1197 532 -844 -159 779 357 -509 -298 498 412 -611 -447 812 275 -911 -223 709 -183 -749 128
1812 128 311 -264 -390 -221 146 226 -595 -559 682 272 -1135 -136 1190 -265 -1218 502 946 -723 -765
1831 -765 789 607 -655 -563 689 679 -665 -585 1015 774 -1060 -417 1541 247 -1415 440 1559
1848 1559 -523 -1020 928 848 -839 -458 836 412 -582 -418 533 455 -562 -597 697 326 -1033 -386
1866 -386 962 -31 -1051 145 609 -439 -597 126 229 -187 -442 -232 285 139 -737 -243 803 -148
1884 -148 -1033 356 878 -549 -730 675 535 -554 -259 544 437 -307 -379 528 744 -524 -626 1053
1902 1053 582 -1023 -99 1404 7 -1065 485 1109 -423 -750 545 542 -487 -521 303 584 -366 -664
$$ packed form
1777e70J625m39j679N38K028j048j845J523J684k109j082K343M11k323K70J870
1793A197o65j376O85R38m22q66K11P96q6j023J64J259n37j186O88R32q92n66Q77
1812A28J83n75j26J69L67Q0q21L6J241m10j407R99J326j455r53J720M44j669m2
1831g65J554j82j262R2J252j0j344Q0J600k41j834O43J958j294j662J855J119
1848A559k082m97J948q0j687L81J294m24r94J64R51p8j017l5J294l71j359O47
1866c86J348r93j020J196M64j048j58P23J03m16k55K10N17j46q76M94J046r51
1884a48q85J389N22j427j81J405j40j089K95Q03j07p44p2R07K16j268j02J679
1902A053m71j605R24J503j397j072J550O24j532l27J295lj029l4Q24K81r50k98
$$ plain form
1920 -664 479 648 -767 -684 897 298 -1172 -238 871 -301 -916 214 446 -398 -528 65 301 -43
1938 -43 -561 -78 693 13 -775 261 774 -466 -594 679 468 -606 -171 648 250 -268 -100 389 443
1957 443 -161 -382 600 676 -641 -415 1059 332 -963 172 1016 -184 -808 325 566 -361 -516 209
1975 209 466 -206 -682 123 698 -531 -867 557 610 -1029 -606 863 56 -1107 -73 690 -363 -734
1993 -734 99 415 -136 -502 -83 559 31 -717 179 816 -353 -711 613 592 -674 -202 705 187 -418
2012 -418 91 447 214 -102 -90 270 498 -253 -380 691 420 -669 -112 820 -3 -765 266 536 -313
2031 -313 -466 162 311 -145 -512 -5 504 -194 -879 270 699 -713 -813 763 399 -994 -305 795
2049 795 -131 -880 70 598 -146 -554 32 564 -27 -663 98 855 -195 -750 498 789 -572 -382 820
$$ packed form
1920f64J143J69j415Q3J581n99j470R34J109j172o15J130K32q44j30N93K36l44
1938d3n18M83P71o80p88J036N13j240j28J273k11j074M35Q19l98n18J68M89N4
1957D43o04k21R82P6j317K26J474p27j295J135Q44j200o24J133K41r27j55P25
1975B09K57o72m76Q05N75j229l36J424N3j639M23J469q07j163J034P63j053l71
1993g34Q33L16n51l66M19O42n28p48Q96O37j169l58J324k1j266M72R07n18o05
2012d18N09L56k33l16J2L60K28p51j27J071k71j089N57R32q23p62J031K70q49
2031c13j53O28J49m56l67N07N09o98o85J149M29j412j00J576l64j393O89J100
2049G95r26p49R50N28p44m08N86N32n91o36P61P57j050n55J248K91j361J90J202
$$ plain form
2068 820 288 -567 89 669 56 -159 99 251 240 -85 -242 391 370 -419 -135 651 -5 -644 186 508 -268
2089 -268 -400 160 118 -116 -282 -121 238 -14 -599 -64 619 -314 -901 327 632 -807 -554 736 111
2108 111 -851 -119 633 -53 -513 -5 450 115 -537 7 734 62 -732 322 938 -414 -617 871 508
2127 508 -673 -46 779 88 -447 172 432 15 -187 7 343 280 -466 -126 555 100 -609 138 480 -274
2147 -274 -418 248 90 -389 -182 -18 60 -17 -325 -278 308 10 -704 24 575 -382 -597 485 373 -672
2167 -672 -238 609 4 -459 -41 456 165 -373 -161 589 268 -611 -5 946 -79 -761 531 804 -541
2186 -541 -463 825 330 -611 -24 635 80 -383 21 325 161 -320 -257 520 78 -663 -12 614 -271 -618
2206 -618 321 306 -499 -209 219 -46 -215 -110 -76 43 52 -386 -170 394 -224 -614 206 392 -539 -304 462
$$ packed form
2068H20n32q55O56N80o13k15K58J52j1l25j57O33k1p89K84P86o56o39Q30L22p76
2089b68j32N60m2k34j66J61L59k52n85N35O83r33n87J228L05j439K53J290o25
2108A11r62P32P52o86m60N08M55l35o52N44P27o72p94J054O16j352k03J488l63
2127E08j181O27Q25o91n35O19K60m17k02J94L36o3p46L40O81m55p09P47L42p54
2147b74j44O66j58m79K07J64P8p7l08M7N86k98p14P28N51r57k15J082j12j045
2167f72M34Q47o05m63M18M97k91n38K12P50l21q79O06R51j025o82J292K73j345
2186e41P8J288m95r41N87O59n55m63M04L04j64m81O3P77m42p41O51O26q85l47
2206f18R39j5q05K90M28k65j69J05L4J19Rm38K16N64o18l90Q20J86r31K35P66
$$ plain form
2227 462 197 -414 -109 363 179 -210 -122 367 405 -358 -199 739 265 -735 188 899 -209 -562 664 598
2247 598 -513 -201 615 279 -404 -51 392 186 -328 -212 371 232 -647 -211 603 -66 -732 186 450 -472
2267 -472 -416 380 61 -460 -168 46 -96 -127 -156 -189 181 -82 -499 138 345 -331 -302 533 180 -359 22 363
2289 363 -49 -148 53 182 202 -73 -206 455 384 -471 -92 754 -12 -586 325 734 -366 -372 458 259 -390
2310 -390 -159 335 159 -290 -237 223 212 -443 -382 477 123 -774 17 594 -295 -630 278 328 -525 -213 317
2331 317 -19 -218 -122 5 145 -110 -313 130 325 -266 -249 367 180 -389 15 445 -71 -177 163 235 30
2352 30 24 -40 180 305 -124 -208 518 216 -442 159 659 -225 -493 380 350 -299 -204 312 107 -193 -268 101 328
2375 328 -259 -401 290 306 -666 -324 597 -48 -770 76 540 -369 -467 301 187 -332 -208 167 165 -90 -258
$$ packed form
2227D62k65o11L05M72j84l89Q8M89L8p63J59R38m74j000R23P11j108l53J226o6
2247E98j111L12Q16l36o83L53M43k06n14J16N83j39q79M36Q14o69o66R18K64r22
2267d72N6P96l19n21K92K14j42l1k9l3L70k63m17O37K07o76K9Q35l53n39L81L41
2289C63m12r9K01J29K0k75j33O61p1q55L79Q46p66n74R11M09j100oQ30j99o49
2310c90K31M94j76m49N3M60j1o55O1Q59l54q97P91N77q89l35R08N0q53L12N30
2331C17l36j99R6J27J40k55k03M43J95n91J7O16j87n69M04M30n16j06L40P2k05
2352C0oo4K20J25m29q4P26l02o58O01N00q84k68Q73l0o49R5N16k05l00p5L69K27
2375C28n87j42O91J6r72L42R21o45p22Q46M64r09r8P68j14n19J24L75kk55j68
$$ plain form
2396 -258 129 345 -131 -300 445 267 -475 -82 554 5 -333 232 310 -64 -10 143 63 196 48 -163 304
2417 304 235 -260 -79 459 -14 -391 204 363 -233 -205 160 76 -215 -121 70 115 -107 -386 51 319 -403 -484
2439 -484 489 175 -757 -178 505 -212 -569 291 368 -377 -245 214 111 -168 -300 79 350 -83 -296 288
2459 288 438 -399 -141 618 99 -360 221 503 -139 -136 263 159 -5 16 24 104 168 -196 -102 349 70 -313 54
2482 54 355 -213 -298 203 34 -244 -33 -17 -33 -33 -223 -140 205 -75 -506 119 323 -530 -273 441 71 -591
2504 -591 91 405 -259 -308 183 185 -119 -137 38 254 85 -314 199 486 -188 -357 504 369 -462 -5 603
2525 603 18 -306 327 333 -132 -85 144 103 31 -121 -114 249 93 -303 102 324 -231 -232 310 134 -400 -70 122
2548 122 -175 -165 -65 -128 41 36 -289 0 243 -212 -312 316 172 -486 -70 344 -175 -288 161 211 -117 -171
$$ packed form
2396b58L87K16m76j69P45j78p42L93O36n49l38N65P8l74N4J53q0J33j48k11M67
2417C04o9m95J81N38m73l77N95J59n96K8L65q4k91R4J91M5k22k79M37K68p22q1
2439d84R73l14r32N79O83p17l57Q60P7p45J32M59j03k79j32L79K71m33k13N84
2459B88J50q37K58P59n19m59N81K82o42LL99j04j64K1QQ0O4l64R4M51k79l83L67
2482E4L01n68q5N01j69k78K11J6j6%j90Q3L45k80m31O25K04q53K57P14l70o62
2504e91O82L14o64m9M91Kl04j8J75K16j69l99N13K87o74j69Q61j35q31M57O08
2525F03n85l24O33Om65M7K29m1p2j52PL63j56l96M05K22n55jN42j76n34L30J92
2548A22k97J0J00o3J69nl25K89K43m55j00O28j44o58M16M14n19j13M49N0l28n4
$$ plain form
2570 -171 115 266 91 -180 16 338 -21 -386 280 479 -268 -212 537 174 -387 162 452 -142 -119 264 95
2591 95 47 -59 -120 177 70 -203 4 376 -147 -416 238 220 -399 -157 256 -26 -250 61 33 -90 -7 -119
2613 -119 -37 196 -73 -296 156 193 -367 -190 376 -83 -309 141 271 -145 -88 154 87 96 -17 -96 291 189
2635 189 -264 73 437 -112 -385 437 315 -335 -78 449 -96 -268 201 154 33 -30 -31 131 140 -233 -204 305
2657 305 32 -446 77 291 -318 -376 335 22 -347 -25 155 -149 -130 9 -60 47 18 -262 108 279 -275
2678 -275 -174 354 91 -377 101 406 -172 -104 251 127 -53 24 -12 131 160 -87 -20 352 15 -353 173 357
2700 357 -254 -179 408 115 -326 110 279 -82 -47 -17 70 79 -76 -156 122 86 -362 -88 295 -171 -488 199 165
2723 165 -388 -209 286 -132 -275 -9 56 -19 -43 -145 79 241 -180 -217 278 109 -363 18 389 -146 -113 254
$$ packed form
2570a71K86J51j75k71J96L22l59l65O66J99p47N6P49l63n61N49K90n94K3L83j69
2591I5m8j06o1K97j07k73K07L72n23k69O54j8o19K42M13k82k24L11k8j23Q3j12
2613a19Q2K33k69k23M52L7n60J77N66m59k26M50J30m16N7K42o7Rj13p9L87j02
2635A89m53L37L64n49k73Q22j22o50K57N27n45j72M69m7j21o3jJ62Rl73K9N09
2657C05k73m78N23K14o09n8P11l13l69L22J80l04J9J39o9J07k9k80L70J71n54
2678b75J01N28k63m68M78L05n78O8L55j24j80P7l6J43K9k47O7L72l37l68N26J84
2700C57o11P5N87k93m41M36J69l61L5L0Q7Rj55q0K78l6m48K74L83m66l17O87l4
2723A65n53J79M95m18j43K66O5p5k4j02K24J62m21l7M95j69m72L81L71n35L3L67
$$ plain form
2745 254 100 -111 27 226 25 39 44 -50 170 162 -154 74 349 -92 -262 399 162 -312 -58 178 -128 -178
2767 -178 6 21 -5 -31 -208 32 123 -284 -252 267 2 -456 48 382 -325 -365 305 63 -303 -61 133 -86
2789 -86 -89 -76 -6 141 -95 -199 237 167 -346 -60 432 -72 -260 283 291 -172 6 296 -5 -48 135 58 44 184
2813 184 -33 13 228 -41 -238 209 242 -191 -64 218 25 -241 73 69 -85 14 -122 -97 174 -180 -291 131
2835 131 100 -440 -144 346 -127 -420 140 238 -316 -44 209 16 -161 38 69 41 -50 -144 188 220 -187 -156 332
2858 332 66 -351 175 388 -189 -88 338 65 -143 104 131 -25 41 31 -96 153 30 -155 161 199 -154
2879 -154 -111 221 -12 -229 29 105 -134 -97 -49 -109 51 -46 -320 19 219 -275 -225 249 -36 -415 -10 294
2901 294 -191 -215 197 51 -224 -27 136 103 51 -134 104 298 -71 -198 277 246 -307 59 499 -142 -233 281
$$ packed form
2745B54j54k11J38J99k01J4Nr4K20ql16K28K75m41j70O61k37m74K54K36l06n0
2767a78J84J5k6k6j77K40R1m07L2N19k65m58N04L34p07m0O70k42l66K42J94k19
2789h6lJ3P0J47k36j04M36p0n13K86M92n04j88N43Qm63J78K90l01m3J83p7j4J40
2813A84k17M6K15k69j97M47L3m33J27K82j93k66L14mj54R9j36K5K71l54j11M22
2835A31l1n40K96M90m73k93N60R8n54K72K53j93j77J99L1k8r1r4L32L2m07L1M88
2858C32k66m17N26K13n77J01M26k73k08K47K7j56O6j0j27K49j23j85L16L8l53
2879a54M3L32k33k17K58P6k39L7M8o0J60r7k74L39K00m94N0M74k85l79M05L04
2901B94m85k4M12j46k75J97J63l3n2j85K38J94l69j27M75l1n53L66M40o41r1N14
$$ plain form
2923 281 291 -223 14 275 -25 10 76 4 -4 78 -102 -23 173 -100 -165 188 73 -284 12 130 -223 -92 30
2946 30 -107 -129 58 -169 -131 142 -105 -310 189 76 -369 -60 342 -185 -335 228 111 -223 -57 199 51
2967 51 -37 19 76 269 41 -103 146 307 -155 3 427 65 -242 259 341 -188 -52 240 57 -122 93 76
2989 76 -61 44 -67 -72 119 -56 -239 30 106 -292 -84 204 -156 -266 43 12 -160 -31 -4 -99 25 34 -301
3012 -301 35 185 -274 -127 248 -9 -284 181 189 -178 -50 231 28 -128 82 45 100 34 -101 69 312 -111
3034 -111 -132 345 231 -200 86 338 -123 -227 345 130 -215 92 137 -76 -29 25 -159 46 6 -185 14 125
3056 125 -202 -251 182 15 -321 4 54 -218 -87 80 -70 -15 30 -151 14 214 -151 -177 237 79 -270 27
3078 27 349 -136 -157 197 31 -113 126 79 30 57 19 30 180 91 -147 122 192 -185 -5 364 -34 -227 148
$$ packed form
2923B81J0n14K37K61l00L5O6p2qQ2j80P9J96k73o5L53j15l57K96J18l53J31J22
2946C0j37k2J87k27L8K73k47k05M99j13m45L09M02n27j50N63j17l34J66K56j48
2967E1q8N6N7J93k28j44K49J61m62J58M24l62l07N01Q2n29J36K92j83j79K15j7
2989G6j37J05j11nJ91j75j83K69P6l98K08K88l60j10L09l1j72J29K7r5J24Rl35
3012c01L36J50m59J47L75k57k75M65Ql67J28K81k03j56K10l7N5o6j35J70K43m23
3034a11k1M77j14m31K86K52m61j04N72k15l45L07M5k13M7N4j84K05m0j91J99J11
3056A25l27m9M33j67l36L25N0k72J31J67j50N5M5j81J65K00l65k6M14j58l49K97
3078B7L22m85k1L54j66j44K39m7m9K7l8J1J50q9k38K69P0l77J80L69l98j93L75
$$ plain form
3101 148 202 -213 -48 200 -84 -82 46 -97 -47 32 -113 -108 181 -93 -334 64 41 -336 -63 239 -176 -230 -26
3124 -26 -14 -81 57 -27 -92 116 -48 -176 96 136 -230 -34 352 -65 -187 226 224 -148 64 218 -33 -37 120
3147 120 -12 77 155 -119 92 207 -109 -82 253 125 -325 96 233 -136 -111 197 26 -171 72 -1 -88 39
3169 39 -40 -149 60 -13 -268 -23 136 -263 -215 194 15 -301 54 46 -166 -65 16 -26 16 76 -93 26 190
3192 190 -168 -113 263 5 -239 179 205 -138 -44 290 7 -86 112 117 -4 57 4 -43 92 16 -175 200 107 -253
3216 -253 -13 256 -43 -231 142 139 -192 23 107 -141 -13 5 -146 23 49 -161 -71 184 -83 -233 133 70
3238 70 -271 37 83 -126 -108 125 15 -54 96 8 -49 140 -48 -73 199 115 -175 107 314 -71 -164 182 99
3261 99 -156 38 178 -36 -75 104 -73 80 64 -136 54 192 -110 -117 227 -33 -261 100 147 -274 -85 139
$$ packed form
3101A48N4m15J65K48k84KJ28j43N0P9j45NK89k74k41L98k3l77K73L02m15n4K04
3124b6J2o7J38q4o5K08j64j28K72M0l66J96L86m17j22M13kl72K12J54k51mJ57
3147A20j32Q9P8k74K11J15l16K7L35j28m50M21J37l69K5L08j71j97K43p3q7J27
3169C9p9j09K09p3k55K45J59l99M8M09j79l16L55qk12J01Q1m2M2O0j69J19J64
3192A90l58N5L76k58k44M18K6l43R4L34k83r3J98Nj21O1n3m7J35p6j91L75r3l60
3216b53K40K69k99j88L73ll31K15Q4k48J28J8j51J69K6k10R0K55k67j50L66o3
3238G0l41L08M6k09J8K33j10o9J50q8n7J89j88k5K72q4k90K82K07l85r3L46q3
3261I9k55J94J40k14l9J79j77J53j6k00J90J38l02pL44k60k28L61M7m21J89K24
$$ plain form
3283 139 -67 -154 14 -64 -132 16 -148 -132 66 -34 -252 9 163 -169 -103 197 -46 -150 122 69 -58 60
3305 60 48 43 100 112 -112 149 204 -90 -41 284 1 -202 209 237 -188 -55 215 -11 -76 86 22 22 43 -13 2
3330 2 133 -120 -206 183 29 -275 45 203 -250 -160 143 -40 -192 -1 22 -148 -69 17 -167 6 26 -193 -91
3353 -91 96 -140 -129 142 85 -193 6 93 -80 31 148 -45 60 99 -78 73 188 -24 -103 263 102 -208
3375 -208 103 252 -67 -106 134 86 -117 118 114 -40 55 -38 7 98 -51 -205 15 155 -231 -131 260 -88 -292
3398 -292 136 85 -260 -78 135 -92 -114 -5 -119 -24 47 -105 -84 186 -63 -208 107 145 -182 69 203 -17
3420 -17 -45 139 9 -46 102 88 -4 153 84 -128 152 105 -144 -27 244 -65 -158 199 131 -107 40 142 -86
3443 -86 -18 31 -92 -67 100 -151 5 93 -204 -168 210 -2 -270 12 130 -252 -131 155 7 -166 21 -3
$$ packed form
3283A39k06q7J68p8o8J48j64J6J98j00k18K61J54l32O6L00k43j04K72n3j27J18
3305F0j2nN7J2k24K61N5k94M9L25k83k03M11K8m25J33K70k26o5J62o4%K1n6J5
3330BJ31k53q6L89j54l04L20J58m53R0L03j83j52J91K3j70P9Q6j84J73K0k19J02
3353i1J87k36J1K71n7k78J99Q7j73J11J17j93J05L9j77J51J15k12p9L66j61l10
3375b08L11J49l19l9K40m8k03K35mj54R5r3M5R1j49j54K20J40l86J00L91l48k04
3398b92M28n1l45J82K13k27k2J09j14R5P1j52K1K70k49j45L15L8l27K51J34k20
3420a7k8J84j30n5J48j4r2J57o9k12K80m7k49J17K71l09r3L57o8k38J47J02k28
3443h6O8M9j23K5J67k51J56Q8k97L6L78k12k68K82J18l82J21K86j48j73J87k4
$$ plain form
3465 -3 -106 30 -64 -44 57 -60 -151 132 127 -89 -30 300 -14 -161 198 179 -126 86 203 -43 -14 149 -63
3488 -63 -30 139 -115 -54 182 55 -161 101 101 -175 3 119 -33 -110 107 -1 -61 50 -50 -83 126 -99 -182
3511 -182 66 50 -230 -83 121 -146 -216 132 79 -218 6 -8 -102 -14 51 -29 78 85 -86 -1 180 -39 -92 230
3535 230 82 -127 90 205 -105 2 191 17 14 110 49 -46 168 9 -117 124 75 -163 46 200 -58 -57 103
3558 103 -28 -102 32 29 -125 7 -37 -120 78 41 -191 -20 176 -161 -129 214 52 -233 -16 174 -195 -122 151
3581 151 -26 -130 38 -5 45 114 5 -31 217 17 -127 171 212 -145 58 238 39 -40 161 99 -69 78
3603 78 26 -27 43 82 -52 18 67 -112 -72 111 -53 -104 48 25 -129 -1 24 -167 -53 19 -113 -113 52 -69 -126
3628 -126 62 -21 -153 101 68 -207 -68 135 -124 -130 50 61 -151 39 159 -39 46 10 -29 112 59 -85 45
$$ packed form
3465cj03J36r4K0J01j17r1K83nk16N9L30l14j47L59j9l05K12J17k46K9J63k12
3488f3L3J69k54O1K36j27k16K62%k76J78J16j52p7K17j08o0J11j00l3K09k25q3
3511a82K48j6k80J47K04k67p0L48n3k97K24j4r4Q8O5q0J07Pj71Q5J81k19n3L22
3535B30j48k09K17J15l10J07J89j74lR6o1r5K14j59j26K41m9k38K09J54k58JJ60
3558A03j31p4J34lj54J32m4q3J98l7k32J71J96l37L2L43j62k85K17J90l69P3K73
3581A51j77j04J68m3N0O9j09l6K48k00j44K98M1l57K03J80j99p9K01o2j68J47
3603G8n2n3P0L9j34P0M9j79M0J83j64n1J52k3j54J28K5j91J14P2j32%J65j21n7
3628a26J88q3j32K54l3k75J39K03k59oJ80J1k12J90J20j98Q5l6l9J41n3j44J30
$$ plain form
3651 45 177 -109 -12 207 31 -145 130 167 -131 22 119 25 -64 96 -50 -49 132 5 -105 109 39 -179 -26
3674 -26 108 -166 -100 73 -90 -119 40 -83 -102 -18 -77 -187 21 18 -160 1 85 -150 -59 183 -34 -175 40
3697 40 137 -165 34 127 -79 -49 56 32 112 85 -60 -25 158 -35 -43 242 93 -147 102 148 -39 -11 149 59
3721 59 -71 109 75 -165 -9 41 -124 -21 55 -104 8 92 -88 -144 61 -44 -160 -9 2 -108 -8 21 -118
3744 -118 -67 2 -147 -111 128 -63 -78 123 -23 -177 55 229 -154 -36 153 69 -50 93 69 -57 55 40
3766 40 20 185 60 -78 90 193 -78 -88 197 -3 -110 175 91 -161 4 79 -68 -12 18 -82 -51 76 -128
3789 -128 -110 81 -72 -186 72 29 -143 -11 -11 -113 -123 108 -28 -133 96 -11 -115 66 30 -177 80 163
3811 163 -123 -79 199 49 -123 166 44 -94 4 94 -22 19 59 13 94 155 -84 20 226 -65 -83 182 95
$$ packed form
3651D5J32k86R7K19j76j76K75L7k98J53R7r4q9J60j46JJ81j27j10K14p0k18J53
3674b6J34k74O6J73j63k9J59j23j9Q4n9j10K08lj78J61Q4k35R1K42k17j41K15
3697D0R7l02J99R3k06L0J05k4Q0k7j45L5J83j93qK85j49k40K49M6j87K8J60r0
3721E9j30J80l4k40J56N0j65J03P6j59J12Q4j80n6K05j05j16J51J1j10J00K9j39
3744a18N1O9j49L6K39j91j5K01j46j54K32J74l83J18J89q4j19J43k4j26J12j5
3766D0k0J65j25j38J68J03k71j0K85k00j07K85q4k52J65P5j47N6L0j00L1J27k04
3789a28J8J91j53j14K58m3j72J32%j02j0K31j36j05K29j07j04J81l6k07K57Q3
3811A63k86M4K78j50j72K89j22j38R8R0j16M1M0m6Q1O1k39J04K06k91j8K65q7
$$ plain form
3834 95 -153 40 164 -86 11 148 -65 -95 28 -18 -107 28 2 -127 30 71 -129 -4 69 -138 -33 88 -58
3857 -58 -228 0 13 -91 -28 27 -101 29 108 -129 -29 174 -110 -70 153 43 -214 120 152 -99 40 136 23
3880 23 -10 132 7 25 77 43 -61 112 113 -120 120 144 -152 -37 149 -91 -93 105 12 -126 63 4 -111 -36
3904 -36 31 -114 -63 90 -96 -50 105 -138 -184 120 56 -192 22 89 -84 15 82 -54 -14 91 -27 -100 149 37
3928 37 -76 95 76 -66 5 187 -40 28 164 44 -49 51 54 -29 83 86 -41 60 73 -68 67 143 -162 -104
3952 -104 148 -26 -155 44 107 -221 -61 118 -78 -79 9 -87 -73 36 -88 -133 35 31 -142 -34 94 -73 -84
3975 -84 93 -58 -44 115 -10 -152 67 65 -67 61 44 -95 40 223 -17 -80 275 4 -59 106 127 -51 22
3998 22 83 6 24 -10 -34 46 58 -8 -27 87 -24 -98 107 32 -163 -40 127 -175 -103 63 -17 -102 -21 10 -148 17
$$ packed form
3834I5k48J93J24k50R7J37k13l0J23m6q9J35k6j29J57M1k00J25P3k07J05J21j46
3857e8j70K28J3j04O3N5j28J30P9k37J00K03k84M0K23j10k57L34L2k51J39R6j13
3880B3l3J42j25J8N2l4j04J73Jk33K40K4k96J15J86k40kJ98r3j38J89n9j15P5
3904c6O7j45N1J53j86M6J55k43m6L04o4k48K14O7j73R9O7j36M0J05j18p3K49j12
3928C7j13J71j9j42P1J82k27O8J36j20r3J00Lq3J12Lj27J01J3j41J35P6l05N8
3952a04K52j74j29J99O3l28J60J79j96jQ8r6J4J09j24m5J68mj73J08J28j67j1
3975h4J77j51J4J59j25j42K19kj32J28j7j39J35J83k40o3L55k71o3J65K1j78P3
3998B2O1p7J8l4k4Q0J2o6j9J14j11p4K05p5j95J23J67l02P2J66q0q5Q1L1j58J65
$$ plain form
4024 17 -78 -62 25 75 -114 -32 76 -88 -75 79 24 -95 20 92 -90 43 60 -118 40 157 -83 -32 162 -9
4048 -9 -66 115 131 -43 -9 139 -47 -38 128 -64 -47 85 13 4 68 13 -114 94 46 -114 1 99 -95 -43 85
4073 85 -50 -175 43 42 -130 -48 56 -116 -43 100 -76 -77 24 -53 -58 -18 -90 -97 99 23 -160 -39 77 -59 -50 134
4099 134 30 -57 28 59 -2 82 13 -157 39 133 -9 -57 136 -26 -124 173 113 -59 18 39 -74 27 29 -57 32
4124 32 57 -94 -9 123 -95 -142 132 15 -156 -13 96 -102 -127 21 -92 -61 44 4 -44 74 25 -81 108
4147 108 71 -94 7 126 -76 -52 124 -3 -67 103 28 31 15 74 -6 80 88 -49 -34 166 6 -133 187 61
4171 61 -113 27 101 -57 10 154 -22 -44 83 -3 -82 35 -47 -98 25 -11 -207 -39 67 -152 -94 144 -84
4194 -84 -148 59 12 -116 48 59 -75 -36 103 -9 -7 73 -111 33 138 -8 -75 144 60 -73 59 89 25 77
$$ packed form
4024A7r5J6Q7N0j89Q2J08j64J3J54n5j19J15P2j82J33J7j78J58J17k40N1J94j71
4048in7J81J6j74L4J48j86RJ66j92J7J32p2rO4n5j27K08m8j60J15R8j94N2J28
4073H5j35j25K18jj72Q2J04j72P3J43j76jJ01p7nM0p2pJ96p6j83J21J16j36RJ84
4099A34j04q7Q5L1o1Q4o9j70J96R4j42m8J93j62r8K97o0j72P7K1j13J01Kq6Q9
4124C2K5j51Q5J32k18m7K74j17j71J43J09j98k5J48j13L1J05m0m8J18m9j06J89
4147A08l7j65J01J19k02K4J76j27o4J70p5Lj6N9q0Q6Qj37J5K00j60j39L20j26
4171F1j74J40P4j58O7J44j76k2J27q6p9J17q2n1J23l6j96J68J06k19N8K38k28
4194h4o4K07m7j28J64J1j34L9J39j12KQ0j84J44J05j46o7K19q4j33J32L0o4N2
$$ plain form
4218 77 83 -12 -16 128 54 -75 115 57 -78 87 125 -102 63 22 -44 -18 41 62 -90 92 7 -40 -58 -3 -105 12
4244 12 29 -128 -48 65 -121 -114 136 -40 -155 16 37 -95 -57 26 -49 -47 98 0 -33 66 38 -47 105 9 -96 8
4270 8 135 -60 -3 180 -38 -84 166 62 -30 108 33 -5 18 86 -105 -3 109 -56 -14 119 -9 -140 50
4293 50 27 -115 -68 45 -69 -5 32 -84 -53 26 -85 -108 79 -33 -113 61 82 -185 -54 106 -30 -47 115 -24
4317 -24 -170 145 42 -93 99 96 -49 0 139 -114 -10 157 -11 -89 85 125 -55 19 74 -123 9 76 -3
4340 -3 4 99 13 -97 146 -77 -78 110 84 -193 15 55 -130 -37 47 54 -96 4 -42 -72 40 -43 -127 31 -1 -141
4366 -141 -74 86 -73 -77 123 -2 -166 54 92 -93 -26 159 5 62 34 -46 -72 80 46 -117 132 48 -137 98
4390 98 103 -15 34 92 -17 -53 143 11 31 141 22 11 35 35 -60 1 108 -126 -58 18 -86 -108 37 40 -101 -18
$$ packed form
4218G7Or5mJ44p4j29J90n8j35J65L8k27J65m1o6K6N9K1j52J82q5m7j8N5j02J17
4244A2J7j57Q0J13j86PK50j76j15J71K1j32L8Q3p5KJ45r8l3R9k8q5J52r6j05J04
4270HJ27j95N7J83k18m6K50j04r2J38p5l8K3O8j91J02J12j65M2J33j28j31J90
4293E0k3j42M7J13j14O4L7j16L1P9j11k3J87j12q0J74K1k67J31J60j36j7J62j39
4317b4j46L15j03j35J92lj45M9J39k53J04J67j68p8J74M0j80P4N5j97J32O7p9
4340cPR5q6j10K43k23jJ88k6k77K08M0j85R3Q4Pj50J00m6l0J12q3q4J58l2j40
4366a41O7J60j59mK00j25j64K20L8j85O7J85j54N7k8q0k6J52l4j63K49q4j85K35
4390I8Nj18M9N8j09l6J96j32K0J10j19j1K4%r5O1J07k34O8P6j04k2J45Lj41Q3
$$ plain form
4416 -18 21 -98 -32 67 -44 -86 66 -111 -54 75 -42 -174 42 82 -189 87 116 -81 -14 149 -53 -42 163
4439 163 49 -58 122 87 -50 110 124 -40 13 111 -55 -87 169 -25 -67 41 42 -67 53 56 -83 -41 57 -149
4463 -149 -93 90 -108 -104 99 -77 -181 -12 50 -152 -66 36 -106 -56 32 -47 -89 68 -48 -54 62 61 -146 -26
4487 -26 29 -82 21 101 -23 -59 113 49 -128 62 118 -19 35 98 -61 19 132 -26 -30 57 54 -12 129 19 -147
4512 -147 56 160 -30 9 95 -71 -59 105 -47 -53 31 15 -108 1 8 -129 -70 67 -90 -120 51 1 -64 6 -25
4537 -25 -67 34 -19 -126 -19 77 -45 -49 156 -11 -114 86 61 -86 102 122 -60 11 112 21 -4 89 7 18 108
4562 108 59 8 110 12 -56 67 113 -85 -78 103 -58 -85 114 29 -105 79 63 -118 32 38 -105 -110 61 -59 -121
4587 -121 76 -48 -118 -22 3 -54 8 54 -57 -84 15 -85 -59 16 -51 -65 89 -1 -139 37 104 -144 4 159 -5
$$ packed form
4416a8L9j19O6R9j11m2J52j77N7J29j17j32K16M0k71K76K9j97O7J63k02J1K05
4439A63j14j07J80l5j37J60J4j64N3R8j66l2K56j94m2J08Jj09J20Lj39M2R8k06
4463a49N6J83j98MK03j76j04J69O2k02Q6J02j42N0Q8p9m2J57j16oJ16jk07J20
4487b6N5j11J03Q0j24l6J72o4j77J90N6j37N4O3j59Q0J13j58mQ7lo6J41j10j66
4512a47K03J04j90L9Q6j66J2J64j52oQ4j6j23J09Pj37N9J37j57l0J71n0o5P0l1
4537b5m2J01n3j07J07R6j22mK05j67j03K00k5j47J88K0j82P1J01r1k5R3q2J1R0
4562A08m9n1J02r8o8J23M6j98PJ81j61k7J99q5j34J84j6j81J50Oj43nJ71j20o2
4587a21J97j24p0R6K5n7O2M6j11k7R9j00K6P5o7j4J54r0j38J76O7k48J48J55j64
$$ plain form
4612 -5 -21 179 50 -80 78 44 7 35 68 -66 -4 99 -65 8 99 34 -100 43 20 -111 65 11 -73 -37 44
4637 44 -36 -60 89 -63 -49 127 36 -197 23 -16 -124 -28 62 3 -34 50 -46 -74 24 -4 -120 118 -21 -38 31 100
4663 100 -83 -2 121 -72 -75 115 64 -125 90 97 -54 33 62 -22 -11 144 7 4 136 -56 -23 112 -49 -55 106
4688 106 89 -153 -46 79 -92 -154 51 -39 -61 16 -14 -92 -45 -6 -101 4 59 -128 -19 31 -90 -80 40 -17 -88
4713 -88 49 39 -85 7 56 -64 -3 80 -32 26 137 94 -87 62 106 -68 27 68 21 -62 52 -9 -62 57 66 -32
4739 -32 32 -6 -83 37 2 -121 -16 136 -79 -82 55 44 -100 4 6 -111 3 8 -46 -27 33 -87 -78 43 -4 -53
4765 -53 104 18 -103 38 11 -87 -26 91 -97 -46 9 12 -101 115 12 -52 91 18 -29 22 139 7 -8 116 29
4790 29 -67 41 70 -28 30 46 8 17 166 -29 -26 114 -56 -60 86 56 -138 42 42 -125 -27 22 -31 -60 67 -65 -105
$$ packed form
4612ej6K00j29j30J58l4l7K8L3j34O2J03j64P3R1o5j34J43k3j31J76n4q4L6Q1
4637D4q0k4J49j52J4J76r1k33K20l9j08R6R0n9l7Q4r6k8R8k8j16K38j39j7O9O9
4663A00j83Q1J23j93lJ90n1j89K15Pj51Q7K9q4J1J55j37lJ32j92L3J35j61oJ61
4688A06j7k42J07J25j71o2K05r0k2P7l0p8M7L9r5J05N5j87J09N0j21J0J20n7p1
4713h8J37j0j24R2M9j20O1Q3j12N8J11m3j81J49M4j74R5M1m7q3J14o1n3J19Rr8
4739c2O4l8p7J20l5j23J05J52k15lJ37j1j44J04Kj17J14Nn4J9O0j20RJ21m7m9
4765e3J57q6j21J41k7r8O1J17j88N1N5Lj13K16j03o4J43p3m7N1J17j32j5J24q7
4790B9r6J08K9r8N8J6l8RJ49j95LJ40j70mJ46l0j94J80%j67R8M9n3k9J27j32m0
$$ plain form
4817 -105 23 -22 -143 80 36 -84 22 -54 -61 -7 69 -62 -20 67 -24 -47 50 0 -64 90 156 -57 2 91 -8 -8 225
4844 225 -39 -56 111 149 -94 57 98 -86 4 19 16 20 29 -41 -77 72 -12 -66 84 49 -68 40 54 -165 -87 82
4870 82 -35 -101 96 -22 -141 25 17 -60 -1 52 -108 -31 -1 -35 -72 116 -75 -118 114 54 -65 5 79 -63 -17
4895 -17 58 -31 -18 90 35 -74 145 46 -110 50 117 -21 -24 80 -18 -53 114 -8 -89 67 14 -94 31 20 -125
4920 -125 -4 64 -134 -29 64 -60 -143 13 14 -104 -39 17 -129 -37 58 -51 -36 115 -80 -93 42 -35 -62 132
4944 132 13 -80 -23 72 -54 16 92 -35 12 95 17 -23 88 49 3 61 96 30 19 134 -16 -92 114 52 -118 17
4970 17 107 -87 41 22 -57 -83 62 -69 -24 63 -36 -139 53 -58 -149 18 59 -118 -34 66 26 -151 48 23
4994 23 -119 65 8 -72 62 14 -47 -2 91 -61 -73 100 -41 -55 103 84 -45 76 54 -25 0 65 11 -6 27 10
$$ packed form
4817a05J28m5j21K23m4j20J06p6pN4P6j31M2Q7r1k3R7n0o4J54O6k13N9Q9r9%K33
4844B25k64j7J67L8k43J51M1j84R0J5lMRp0l6J49q4n4J50l5j17J08J4k19P8J69
4870H2j17o6J97j18j19J66qp7N9N3j60P7L0l4l7J88j91m3K32o0j19P0P4j42M6
4895a7P5q9J3J08n5j09K19r9j56J60O7j38lJ04r8l5J67j22q1J56n3j08J25j1j45
4920a25J21O8j98J05R3j24q3J56Jj18O5N6j46R2R5j09J5J51j95j3J35p7k7J94
4944A32j19r3N7R5j26P0P6j27M7Q3p8m0J11l9m6N8L5o6j1J15j50p6K06o2j70J35
4970A7R0j94J28j9p9k6J45j31M5Q7r9j03J92j11r1J67M1j77Q4J00m0j77J99k5
4994B3j42J84n7q0J34m8o1M5R3j52j2J73j41j4J58j9j29J21k2p9K5O5n4j7L3j7
$$ plain form
5020 10 -68 110 25 -67 14 76 -63 -61 8 -81 -82 71 -33 -92 36 47 -61 -36 -1 -105 -38 -55 -77 -34 70 -38 -77
5047 -77 43 -14 -113 12 5 -71 -1 68 -68 -25 72 45 12 62 -28 -17 108 3 -54 65 47 -43 34 63 -4 -51 69
5074 69 2 40 121 9 -39 73 68 -31 -24 48 -112 -100 59 -35 -34 30 51 -193 26 -11 -86 -41 24 -95 -51 -64 -69 -81 93
5103 93 -50 -149 10 24 -111 20 50 -83 -50 34 22 -32 120 7 -49 18 39 -30 13 105 -30 20 134 9 -5
5128 -5 84 -29 -122 95 61 -16 22 92 -81 36 65 -29 51 81 -44 -124 73 43 -108 -2 47 -45 -135 43 -78 -67
5154 -67 59 -8 -89 62 -18 -72 -16 80 -59 40 66 -67 -41 79 96 -52 37 46 -86 10 31 -121 60 50 2 4 83
5181 83 -2 -28 89 16 -47 31 63 -57 6 87 -35 -47 100 3 -90 35 10 -70 49 44 -122 -47 -17 -102 -41 117 -47
5208 -47 -101 19 -27 -76 -11 -6 -83 -44 30 -44 13 5 -63 -79 35 -16 -70 80 7 -90 58 108 -17 -30 108 110 -23 39
$$ packed form
5020A0p8J78q5r2Q1O2j39KO9q9jJ53j04n9J28J1j08K5L5j04O7j7k2M3J04j08l9
5047g7J20n7r9J25pp6P0O9j36M3R7k7l3N0r0J1J25j05n7J19j8r0P7K9o7m7J20
5074F9o7L8Q1j12m8J12nr9PP2j60J2J59r4JO4K1k44K19l7p5M5O5j19M4j3nj2J74
5103I3j43r9J59J4j35J31L0j33L3Q4j2n4J52j13n6O7K1o9M3R2j35N0J14j25j4
5128eQ9j13r3K17l4p7L8P0j73J17K9r4Q0L0j25q0J97l0j51J06M9r2r0J78j21J1
5154f7J26o7q1J51q0n4N6R6j39R9K6j33K6J20J7j48Q9Rj32R6K1j52J81j0m8KP9
5181H3q5k6J17p3o3P8L2j20O3Q1j22j2J47r7r3J25k5q0J19nj66P5L0q5O1J58j64
5208d7n4J20m6m9O5Np7L9P4p4N7qo8j6J14n1n4J50p3r7J48N0j25j3J38Kj33O2
$$ plain form
5236 39 31 -39 44 49 -6 69 113 -24 27 95 11 -43 62 14 -32 7 52 -81 25 12 -157 -6 65 -59 -100 49 3
5263 3 -64 55 -95 -85 7 38 -126 -54 98 -78 -58 -1 -98 -23 38 -92 -80 50 73 -151 58 129 -73 -65 77 24
5289 24 -65 85 22 -72 69 60 -31 -15 18 14 30 121 43 -18 75 16 -57 -1 62 -43 -63 25 -71 -64 15 -66 -91 41 22 -80
5319 -80 -11 -14 -59 -22 1 -127 -57 65 -108 -90 -49 3 -97 10 32 -60 -7 -32 -76 -31 35 -23 -50 79 28 -30 70
5346 70 -5 -80 52 16 -73 -12 67 -27 13 82 61 -42 88 -2 -65 97 73 -51 36 56 -120 12 89 -74 -43 42
5372 42 -28 -81 -4 28 -128 11 -35 -122 -14 55 -85 -14 49 -25 -124 70 63 -139 -47 108 -9 76 89 -74 -24 14
5398 14 23 -42 91 25 -40 103 57 -32 22 77 16 1 132 -63 -2 48 12 -1 6 -8 -110 17 45 -38 -28 60 -13 -47
5426 -47 56 -12 -97 23 -1 -117 -52 55 -47 -79 -12 -114 -56 26 38 -34 59 22 -76 25 4 -37 12 56 3 -69 56
$$ packed form
5236C9qp0Q3Nn5P5M4j37N1O8q4n4J05m8m6L9M5j33J06j3j69J51P1j24m1J49m6
5263Co7J19j50J0R2L1j64P2J52j76K0N7r7P5O1j30J2J30K3k24K09P1k02QJ42n3
5289B4q9J50o3r4J41rr1J6L3mJ6R1p8o1R3n9p3N6O3j05k0Q8r6PP9q1k5J32j9j02
5319h0O9lm5L7K3j28P0J22j73J8M1N2j00J07K2r2N3k5m4M5O6n8k7J29n1n8J00
5346G0p5p5J32l6q9O1P9r4M0O9k1j03J30r0o3J62k4j24Q7K0j76J32P7j63L1Q5
5372D2p0n3P7L2j56J39m6q7J08O9j40P1O3p4r9J94pk02R2J55j17Q5J3j63N0L8
5398A4Ro5J33o6o5J43m6q9N4N5o1j5J31j95O1N0l6j3Pj4j02J27K8q3J0Q8p3l4
5426d7J03o8q5J20k4j16O5J07j02l2O7j02N8Q2J2p2R3l7r8J01k1m1M9M4n3p2J25
$$ plain form
5453 56 -24 -54 108 -35 -16 79 183 -94 16 140 -14 -48 137 6 -78 62 15 -91 -45 81 -101 33 116
5476 116 -21 -36 104 -13 2 80 -26 -49 20 43 -129 -51 -2 -78 -49 60 -89 -58 51 -12 -34 -20 5 -62 -43 55
5502 55 -117 -78 50 -25 -84 59 -14 -76 -14 41 -61 36 105 -18 43 80 -49 -42 134 46 -32 120 99 -60 14 61
5528 61 -58 -3 -4 -64 35 29 12 3 69 20 -113 20 -11 -84 -3 47 -61 35 25 -100 -120 -28 9 -104 -29 4 -98 -71
5556 -71 25 -24 -26 10 -38 -101 -11 -3 3 27 73 -41 52 69 21 26 83 -59 -62 110 2 -51 79 13 -5 45 32 -87 88
5585 88 93 -25 -18 87 18 -41 29 63 -77 -29 63 -73 8 -23 -98 -47 54 -2 -113 19 3 -53 -10 20 -26 2 67 -11
5613 -11 29 24 45 -34 2 39 -62 16 14 -5 -10 114 -21 -15 78 11 -40 85 61 -17 43 41 3 70 88 -15 -17 60 -39 -16 90
5644 90 -20 -105 11 27 -57 -1 8 5 -70 97 -31 -28 -9 -26 -65 73 21 -46 41 78 -88 -53 96 -30 -65 40 -6
$$ packed form
5453E6q0l0J62j43J9R5J04k77J10J24j54l4J85j31q4J40m7j06M6J26j82J34Q3
5476A16j37j5J40j17J5P8j06k3O9K3j72P8M9p6K9J09j49L1J09o3k2J4K5o7J9R8
5502E5j72L9J28p5n9J43p3o2O2N5j02R7O9j23O1L7j29PJ76q8p8J52k1j59P4M7
5528F1j19N5jo0R9oj7rO6m9j33J33l1p3Q1N0j08R6j0j25k0R2L7j13P5L3j02K7
5556g1R6m9kL6m8o3R0QOK4M6j14R3J7m8NN7j42lJ72j08n3J30o6j8N0j3j19J75
5585H8Nj18PJ05o9n9P0L4j40M8R2j36Q1l1p5N1J01n6j11J32j6n6M3L0m6K8O5p8
5613a1M0nK1p9L6L7j01P8kj9nJ24j35OR3o7n1J25k4p8O0kl8O7J8j03kP7r9K3J06
5644I0j10q5J16J6q4N6Rlp5J67j28LJ9j7l9J38n2o7Q7L7j66L5J49j26l5J05m6
$$ plain form
5671 -6 -43 -20 35 -26 -43 83 -68 -21 78 -70 -71 80 -33 -55 105 74 -43 68 94 -28 -39 68 -42 49 104 -4
5697 -4 -61 23 74 26 58 34 -51 -13 16 9 36 72 6 -74 -13 40 -59 -28 -31 -112 -1 27 -37 -44 28 -13 -84 19 -15 -103 57
5728 57 34 -62 -91 17 -78 -37 -27 -50 -26 51 -42 -35 102 43 -10 96 117 -10 31 47 -29 -10 101 29 -10 41 1 -66
5756 -66 14 60 -16 4 33 36 -31 28 -32 -25 27 17 -46 15 15 -116 34 34 20 -48 48 -103 -43 30 -15 -5 45 91 -106 52
5786 52 27 -27 -62 56 -60 -36 85 24 -40 10 48 -23 -46 64 -5 -13 108 49 10 39 28 -33 48 61 -93 -5 35 -34
5814 -34 -1 40 -66 -37 63 -40 -66 30 46 -124 59 47 -50 -31 5 -124 -22 25 -10 -43 68 -26 -116 -53 56 -125
5840 -125 10 70 -19 -26 -43 -63 -72 112 33 -50 51 56 -76 43 53 -76 63 121 -27 -137 35 112 -82 108 94
5865 94 -91 18 70 5 -52 60 -34 -22 44 -21 -53 0 2 -86 28 15 -93 -56 -47 -129 -60 -12 -9 -88 30 22 -99 -96 45
$$ packed form
5671fl7K3N5o1j7J26j51M7R9j48jJ51j13k2J60l1j17J11K6j22j1J07j10R1N5j08
5697dn7Q4N1m8L2k4q5L8K9pK7L6o6q0O1N3r9L1lq1J11K8o4pP2m1p1J03l4q8J60
5728E7k3r6k9J08r5M1J0k3K4P7r3PJ37n9n3J06K1j27M1J6p6J9J11p2l9N1m0o7
5756f6Q0M6p6K0K9Lo7N9o0PN2j0o3O1%j31J50%j4o8R6j51O0P3m5J0N0M6j97J58
5786E2k5n4l5J18j16K4J21o1o4N0L8p1k3J10o9qJ21n9l9K9j1o1Q1J3j54Q8M0o9
5814c4L3M1j06K9J00j03k6R6J6j70J83j2r7J9L6j29J02M7l5l3J11r4r0O3J09j81
5840a25J35O0q9pj7k0rJ84p9q3J01Nj32J19J0j29J39N8j48j10J72P7j94J90j4
5865I4j85J09N2o5n7J12r4J2O6o5l2N3Kq8J14j3j08L7Rq2O9M8Lp9J18qj21LJ41
$$ plain form
5894 45 -55 -22 71 -107 -35 45 -26 -144 87 26 -59 54 63 -70 8 43 -54 15 78 61 -5 95 75 -85 34 136
5920 136 -74 -42 55 -28 -12 96 -17 -27 114 -40 9 34 22 -61 -18 33 -71 -48 55 -26 -31 86 -9 -87 -18 40
5946 40 -82 -24 44 -39 -57 61 8 -40 74 -9 -93 50 44 -115 23 11 -41 -11 71 30 -35 65 -25 -74 31 4 -42
5973 -42 80 90 -119 1 60 -63 -17 72 0 3 33 42 -23 44 48 -106 -64 55 -82 -3 157 -72 -102 82 -48 -161
5999 -161 -38 18 -102 -16 57 -46 -44 34 -37 -23 52 -4 -89 70 6 -100 -28 53 -2 -41 46 30 -38 132 -28 -88 45
6026 45 77 -89 0 29 -49 5 74 -29 -45 30 -58 -7 51 11 -74 -4 11 0 -9 30 -65 -6 31 -62 -30 64 5 -60 39 34
6056 34 -45 25 78 -60 -25 24 5 -65 -6 -32 -55 7 0 -4 34 19 -54 -26 67 -4 -49 59 4 -41 89 72 -71 95 50
6085 50 19 31 84 0 -53 136 41 -107 76 11 -58 14 106 -74 24 36 -51 -52 127 -17 -15 72 -8 -90 8 7 -58 -11 53
$$ packed form
5894D5j00L3R3j78P2Q0p1j18K31o1q5J13Rj33P8L5r7O9O3j7o6J00k0j60J19J02
5920A36k10L2R7q3J6J08j13j0J41j54M9K5j2q3M3N1j04K3J03q1nJ17r5p8O9N8
5946D0j22N8O8q3j8J18n3m8J14q3q4J43oj59J38j2n2L0Q2m1o5J00r0m9J05k7m6
5973d2J22J0k09J20N9j23M6Q9p2LL0Ro5O7Mj54M2J19j37P9J60k29l0J84j30j13
5999a61J23N6j20Q6P3j03KP8p1J4P5n6q5J59o4j06P2Q1n5l9Q7j6o8J70j60o0J33
6026D5L2j66Q9K9p8N4O9j03j6P5q8N1N8m0q5P0J5j1rL9r5N9L7r3L2R4n9o5R9n
6056C4p9P0N3j38L5M9j9p0N9k6k3O2pmL8j5p3K8R3p1m5J08n5m5J30j7j43J66m5
6085E0l1J2N3q4n3J89r5j48J83o5o9P2R2j80R8J2q7jJ79j44KQ7q0q2R8jo5M7O4
$$ plain form
6114 53 -16 -82 13 -51 -101 -8 -26 -119 20 15 -43 -67 48 -21 -86 62 -41 -23 56 -38 -158 98 87 -42 13 48 -42
6141 -42 -39 119 -39 -75 41 51 -15 -20 15 -50 -2 51 -53 18 99 -41 -41 98 -7 -113 1 9 -45 0 -1 -125 -35 11
6169 11 -37 -34 0 -28 -49 -11 -6 -60 1 28 -88 -69 53 -3 -62 27 -67 10 18 -3 12 60 74 -37 9 86 39 -86 -8 -26
6199 -26 -44 75 58 -52 99 114 10 -11 79 -24 -56 117 -12 -58 29 -47 -83 31 -38 -39 -19 47 -53 -12 45 -41
6225 -41 -113 68 -24 -28 87 66 -78 24 96 -75 -56 15 -71 -24 34 77 11 39 66 -80 33 -49 37 73 59 -2 -39
6252 -39 90 36 -35 54 15 -59 16 138 18 43 23 17 -47 61 31 -50 71 48 -46 -53 3 -109 -39 7 -36 -55 64 -16
6280 -16 -94 26 11 -46 65 11 -63 15 74 -64 -18 -62 -77 -35 72 23 -34 59 48 14 -32 63 -17 -28 35 -31 -31 -16 66
6309 66 7 33 79 0 5 93 -39 -56 108 -15 -62 79 74 -57 -36 13 -46 -1 18 -79 -9 77 -49 14 -7 -29 64 -19
$$ packed form
6114E3o9o6R5o4n0R3j8r3J39nn8k4J15o9o5J48j03J8P9r4j20K56j1j29N5L5r0
6141d2LJ58j58l6J16J0o6nL5o5M8N3j04P1Q1j40%J39j05j06J14Qn4M5jj24R0M6
6169A1m8LL4k8k1L8Nn4O1K7j16J9J22n6n9Q9r4P7Qk1J5M8J4j11M6P7m7j25P8j8
6199b6j8J19j7j10J51J5j04k1R0j03l2J73j29m6Q7p6l6J14o9jK0O6j00M1N7q6
6225d1p2J81r2mJ15k1j44J02P2j71J9P1q6M7N8M3o6K8K7j46J13q2Q6L6j4o1l7
6252c9J29n4p1Q9l9p4P5J22j20K5k0oo4J08l0q1J21k3r4pN6j12P0M6m3j9J19q0
6280a6p8J20j5n7J11n4p4P8N9j38M6m4j5M2J07m9n7R3j1l4m6R5q0j1O3o6%J5Q2
6309F6n9K6M6p9NQ8j32j7J64j23m7J41nj31K1M9n9M5J9r7P0Q6j26O3k1k2R3q3
$$ plain form
6337 -19 74 -75 2 33 -78 -38 98 -40 -42 3 -34 -77 0 -5 -15 34 19 -25 -42 67 -7 -84 17 19 -72 23 7 -50 0
6366 0 91 10 22 23 -8 -60 77 24 -27 74 -4 -23 53 101 -38 -9 88 -44 -50 71 -50 -53 43 27 -78 -8 36 -109
6394 -109 44 -14 -77 -62 43 -34 -65 68 -11 -115 35 34 -14 52 47 -102 -2 -10 -43 -23 -2 26 -90 -20 24 -79 8
6421 8 -1 -48 57 60 43 23 108 33 -70 -2 16 -33 20 27 7 16 23 -123 -75 82 -64 -78 36 2 12 41 69 -100 -10 9
6451 9 5 -30 48 -52 -80 27 -133 -80 21 19 -29 -23 34 -60 1 -6 -66 -89 55 -4 -92 7 7 -40 -10 60 -28 1 85 8 -23
6482 -23 32 23 -9 84 38 -50 17 59 -54 67 80 -39 15 22 29 -43 65 47 -64 -19 34 -44 -38 4 -38 -8 52 -10 -68 50
6512 50 15 -29 9 42 -92 32 43 -27 -95 -8 13 -66 19 22 -47 30 22 -37 14 28 -75 -20 60 0 1 85 39 -43 105 37
6542 37 -11 59 54 -19 1 64 -55 5 24 -44 -57 -41 73 -3 3 49 -44 -29 19 -71 -62 48 -21 -73 15 -14 -103 35 61 -57
$$ packed form
6337a9R3j49P7L1j11M0J36j38kM5l7m3P7nj0M9j5m4j7J09p4p7J01Kr1R5j6n7N0
6366@R1q1J2Jl1n2J37n3n1J01p8j9P6M8j39K9R7j32oJ21j21lR6j6j05P0M4j45
6394a09J53n8o3J5J05p7l1J33p9j04J50jm8O6nj49J00ql3K0K1K8j16P0M4j03Q7
6421Hrm7J05Lj7k0Q5p5j03O8J8m9N3Pk0RPj46M8J57j46j4J14l4J0K9K8j69R0J9
6451Iml5P8j00k8J07j60N3J01km8ON7r4O1po0k3J44n9q8R9%m7L0P0q8K9Q4p7l1
6482b3N5rl2R3m6q8O7M2j13J21J3j19N4PPp2J08j8j11M5N3p8OM2m2L0O0o2n8J18
6512E0l5m4L8L3j34J24J1p0o8Q7K1p9Q5Lo9P7qn9N1J4j03N5Q0o0JQ4m6q2J48o8
6542C7m8P0np3K0O3j19O0J9o8j3J6J14p6OM6r3J5M8r0RJ10o9n2Q8k9q9J38K6j18
$$ plain form
6572 -57 -38 -7 -53 -49 69 -40 -74 74 -9 -173 76 24 -53 0 16 -28 38 126 -1 -35 32 51 -95 49 62 -52
6598 -52 40 50 -19 16 -5 2 -26 53 101 20 13 99 -30 -39 33 -59 12 84 -20 -82 32 -63 -18 -42 23 -91 -5 5 -59 -22
6628 -22 -4 -50 3 3 14 -58 21 53 -19 -13 21 15 -21 62 -51 43 16 74 73 36 4 -42 79 83 -17 -16 115 -19 -8 86 8
6659 8 -53 -21 5 -31 -8 17 -20 -86 -46 -14 -71 54 -41 -66 4 -31 -65 34 6 -90 -16 38 -67 7 50 -45 -133 53 1
6688 1 -37 18 25 -3 -2 18 -6 45 58 -12 -65 15 17 26 60 81 18 0 0 53 -1 118 24 29 101 -1 -48 63 7 -38 65 104
6720 104 -20 -21 67 -43 32 20 -12 16 17 49 -65 51 66 -88 -27 44 -42 -69 60 45 -39 89 6 -68 83 4 -86
6747 -86 -70 27 -28 -35 -13 -12 -32 11 -30 -44 -19 56 -34 34 81 -41 -39 73 -55 -14 33 20 -116 -47 -14 -7 31 18 -36 9
6777 9 -19 20 -45 18 2 -45 43 -36 -43 2 16 -75 21 -28 10 -124 58 -24 -59 -6 -3 -1 -56 66 -51 -27 21 21 -37 30 -12
$$ packed form
6572e7J9L1m6MJ18j09l4J48q3j64K49n2p7N3J6m4O6Q8j27l4O7J9j46J44J3j14
6598e2R2J0o9L5k1Pk8P9M8q1pQ6j29rP2r2P1P2j04o2J14r5M5k4O5j14Q6J0o4L7
6628b2J8m6N3%J1p2P9L2p2OL4ol6Q3j13R4k7N8jl7l2m6J21Mj00JJ31j34J1R4p8
6659Ho1L2K6l6K3K5l7o6M0L2n7J25r5k5P0l5l4R9k8r6P4N4j05P4M3r5q8J86n2
6688Al8N5Pk8JK0k4N1J3p0n3Q0KRL4K1o3j8%N3n4J19r4NP2j02m7J11n6m5J03L9
6720A04j24jQ8j10P5j2l2K8JL2j14J16J5j54O1P1q6k7J29j5q4J28q3p4J51p9r0
6747h6J6R7n5pK2Jk0M3m1j4K5P5r0O8M7j22KJ12j28M1M7j3j36O9L3PL8j3n4M5
6777Ik8L9o5O3j6m7Q8p9pM5J4r1R6m9L8j34J82q2l5N3LKn5J22j17K4M8%n8O7m2
$$ plain form
6808 -12 -14 78 1 -33 -12 -10 -28 15 -18 -26 -43 7 -45 0 44 93 38 -19 8 -73 -1 64 17 -31 -51 -38 35 -27 -7 -31 -67 -5
6840 -5 1 -67 49 -22 15 -2 -24 -27 -29 -45 -63 1 48 -79 -50 -13 -55 -49 79 -16 -84 21 -21 25 7 62 -14 -11 0 -10 -30
6871 -30 33 11 -23 39 -33 14 62 90 -56 28 91 -10 -51 45 -62 -46 46 -42 -34 10 28 -48 65 37 -27 -14 25 -33 29
6900 29 47 -54 -75 -44 -1 -52 -13 22 -50 -38 -14 -114 -26 22 -71 -72 3 5 -5 54 -57 -43 -7 41 -6 70 32 -27 -44 -33
6930 -33 12 -17 65 43 -32 47 27 -54 21 97 68 -11 33 34 6 1 8 -67 17 76 41 -36 24 10 -16 44 -1 -74 11 -16 -27 19
6962 19 27 10 -7 13 6 -17 -26 -27 -122 27 -53 -54 32 57 -95 -6 86 -2 42 56 -38 11 27 12 25 19 -4 -13 37 -67 -52 38
6994 38 124 33 -10 108 7 -27 42 76 -72 -2 41 -30 -70 100 20 -58 3 -50 -9 4 -1 -71 -14 71 -123 6 57 -51
7022 -51 -36 -11 -7 -73 -1 51 -5 55 53 7 27 7 78 15 27 25 -74 24 70 -25 -8 63 -37 76 81 70 11 125 15 -62
$$ packed form
6808a2kR2p7l4K1Kj8M3l3qj7N0n2M5M4M9n5n7K7q1P2O5m7m8k0J3P3o2K0k4l6O2
6840eOo8J16p1L7j7k2lkj6j8O4M7j27K9L7m2OJ28r5o8J05m2M6j8N5p6LJ1j0k0
6871c0O3k2l4O2p2M7M8K8j46Q4O3j01m1R6j07J6R2q8QM4J8p6J13k8o4J3L9n8O2
6900B9J8j01k1L1M3n1L9L5p2J2K4j00Q8M8r3jP5Kj0N9j11J4L6M8m7P6l8n9j7J1
6930c3M5k9Q2k2p5P9k0q1P5P6k9p9M4Jk8nPp5Q4N9l5p7O0j4k6O0m5p3Q5k7j1M6
6962A9Qj7j7K0pk3rjr5J49q0jQ6K5j52Q9R2q8M4J4r4M9J6j5J3ok3rN0j04J5R0
6994C8Q6r1m3J18j01l4O9L4j48P0M3p1m0J70q0p8O1n3M1J3np0N7Q5j94J29N1j08
7022e1J5K5Mo6P2N2n6O0km6K0k0P1o3J2kr9R8M6r5J7P1j00J13Nj1n9J14j10p7
$$ plain form
7052 -62 52 70 -58 30 11 -93 -5 1 -57 -13 50 18 -33 0 9 -65 -15 -34 -64 -2 1 -19 -25 -27 -20 16 35 4 -25 62 18 -53
7084 -53 43 86 -27 -32 3 -62 -8 0 -9 -46 35 -1 -17 -8 39 -56 30 95 29 49 89 -24 -21 -36 5 -43 36 67 47 6 86 31
7116 31 -41 52 24 17 -15 6 8 25 22 -54 -16 -31 -66 -21 -10 -47 -44 -34 -23 -27 -35 7 -41 29 12 -33 47 18 28 -31 62 45 -70
7149 -70 -48 62 -1 64 120 -8 -4 61 -26 -1 -2 36 4 48 72 35 65 73 25 15 56 -76 -3 -24 13 -55 -40 94 -109
7178 -109 5 39 -17 32 45 -39 -68 -21 14 12 -52 -31 -70 -4 47 -64 -53 11 -31 -76 -44 19 -25 -7 -18 -41 37 52 -6
7207 -6 -23 78 -32 -22 7 13 22 55 51 -48 72 48 51 42 8 16 33 18 -11 -69 27 -5 -8 50 75 -25 -17 26 -55 -2 20 -30 -39
7240 -39 24 -69 -46 24 -69 -50 71 25 9 -57 41 -19 -75 65 43 -26 58 -22 -22 15 1 -31 -15 66 33 13 14 -29 9 55
7270 55 57 -54 44 70 -49 -78 36 22 -1 10 -54 41 -19 27 -58 -1 5 -64 2 85 11 -59 44 -8 -61 -12 51 -85 -95
$$ packed form
7052f2J14J8j28Q8j9j04Q8On8M4O3l2n1L3Rp4N0j9l0O2Lk0okPL6J9l1k9Q7m4p1
7084e3R6M3j13nL5o5N4Qrl7Q1l6j6RM7r5Q6O5o6K0M0j13Lj5M1m8P9L1k0m1Q0n5
7116C1p2R3k8pl2K1KJ7lp6L8j5l5M5J1l7LJ0J1mqM2m8P0j7m5Q0k9J0n9R3j7j15
7149g0K2J10o3O5N6j28MO5q7K5jL8l2M4K4l7L0Qm8j0M1j32P3k1L7o8J5J34k03
7178a09J14L4n6M9J3q4k9M7L5ko4K1l9O6N1j11J1O4m2m5L2O3m4J8j1k3P8J5n8
7207fj7J01j10J0K9ORL3mr9J20k4Lrl4QJ7j5k9n8R6l2lN8K5j00QM3q1N3K2n0r
7240c9O3r3K3P0r3J9J21m6j6o6R8o0n6J40k2o9Q4q0%L7j4l2J6Q1l3k0Jm3L8M6
7270E5Kj11R8K6j19k9J14j4k3J1o4R5o0M6q5N7Oo9O6Q3p4p0J03n2n3M9O3j36j0
$$ plain form
7299 -95 10 -49 -31 64 -31 12 19 -7 -78 10 -3 -62 119 -12 34 -7 52 -56 25 12 -55 -15 54 42 -47 19 6 -21 -6
7328 -6 73 14 53 47 1 -22 56 52 3 -26 71 -25 16 17 -12 -1 22 36 -42 74 -7 -9 -20 51 28 9 18 -89 -15 -25 -54 -49 21
7361 21 -1 -92 18 19 -24 0 53 -28 -37 47 -67 -10 35 -23 -30 28 -44 10 -9 59 -40 -34 1 -17 14 20 17 24 22 -15 -67 43 37
7394 37 -41 39 55 10 29 75 -45 -45 0 68 -73 7 2 -14 -3 68 -15 -50 106 -59 -54 36 -27 4 17 4 -70 30 31 10
7424 10 27 -31 -37 -34 50 -37 4 49 -29 -29 9 71 -17 74 108 5 -19 113 41 26 49 -65 -55 9 80 -51 -36 1 12 -12
7454 -12 72 31 -51 82 33 -55 34 -10 -9 -20 -6 -49 -77 -27 -30 -15 27 -92 -58 14 -47 -29 -18 16 -26 -14 -55 24 -42 4
7484 4 21 -46 73 23 -9 -32 38 -15 -44 55 -34 -12 16 -6 -61 32 3 -33 57 42 -34 5 74 40 8 18 16 -20 33 -30 -55
7515 -55 44 -9 -63 -56 6 -2 -12 28 30 -19 -8 20 -100 29 -6 -51 -23 -12 -34 -48 -9 -49 -15 37 -16 -37 94 3 71 44
$$ packed form
7299i5J05n9J8R5r5M3Pk6p1Q8j3n9J81j31M6m1N9j08Q1j3o7M0O9j2q9O6j3k7J5
7328fP9n9L9om6k3P8mm9k9R7r6M1Jk9J1K3J4p8J16q1kj1P1k3j9Rj07P4j0k9NP0
7361B1k2r1J10Jm3K4N3q1rQ4j14N7M5n8pN8p2N4j9O8r9OL5j8L1OlPkl7n2J10o
7394C7p8Q0J6m5J9M6j20%M5O8j41Q0nj6J1P1q3l5J56j65NR0o3L1J3j3p4J00Jk1
7424A0J7n8oLQ4q7M1M5p8%L8O2q8R1L4j03k4J32p2j5K3j14J0O4P1j31J5L7J1k4
7454a2Q4m1q2J33m9q8Q9m4Jj1J4m3k8N0lJ5M2j19L4P2o1J8J1L4m2J2m1P9o6M6
7484DJ7o7J19n0l2k3P0n3k9R9q9K2K8k2n5R3k9l6R0j5p6L9O9l4l2J0kl6N3o3k5
7515e5R9n3n4PO2qj0M0Km9J1K8j20J29l5m5K8J1k2j4L9m0L4N2n3k1J31r1O8k7
$$ plain form
7545 44 37 -59 -120 26 -18 5 47 30 -25 32 -8 18 50 59 8 64 58 -19 53 82 55 1 58 33 -58 -15 19 -42 -27 32 -37
7576 -37 -51 18 1 -20 34 8 -43 24 -7 -100 -105 -11 -88 -22 21 27 -43 -2 19 -25 -19 47 -26 -20 78 -62 -16 3 -31 17 -2 -37
7608 -37 -27 21 72 43 -50 33 -19 4 41 7 -24 30 -51 10 13 26 34 -44 13 -39 -34 27 -53 -33 -7 21 -9 25 28 -15 55 16
7640 16 -57 -27 16 -42 18 -25 -19 8 35 35 -35 -36 1 -25 -29 -43 -42 34 -17 21 -34 55 58 -3 55 31 -63 -10 53 36 -16 77 -76
7673 -76 0 36 -26 -22 -17 6 -35 -63 84 -36 -29 6 -23 -2 83 28 -68 49 28 11 6 -27 -107 24 45 11 -41 9 -46 -59
7703 -59 -44 -12 -83 0 -18 -74 -32 69 24 -50 2 -33 56 41 38 29 60 55 31 35 77 5 52 73 26 -23 1 -4 -45 28 0 -46
7735 -46 40 58 27 -43 73 -22 24 23 -10 -13 59 61 -21 9 8 -18 -59 14 -1 -2 27 76 -95 -8 -20 -10 -28 43 8 5 28 -8
7767 -8 40 -12 52 -42 -29 123 28 15 42 -9 -9 44 22 -55 64 1 -47 42 29 0 -48 29 -27 -50 37 19 -22 28 67 -38
$$ packed form
7545D4pr6o1J46m4K3M2j7n5N7m0K6L2Rn1N6op7P2K9k7n4N7k5r1M3L4o1J5N9o9
7576c7j4O9j7k1N4k6n1O7l1r3nR4p7O6M3Op0M1K1m4OO6p3OR8j40M6J9l4M8j9l5
7608c7J0M8N1k9r3Q3n2K3L7l4l1N4q1O1LJ3Qp8N7n2NO1q0K0K6K8l0L4Lm3P0l9
7640A6p3L0M3n8O0m3OK7K7%p0jL7k6mj4JP6n1L8n5Q9Lo1N8k4r4N3O3j7n2R3j53
7673g6P6L6o2MNK3m1k8J47j20PL5k9K1Q5n5r6J17k1j7nl3q0J31K1l4n2N0n5j3
7703e9J5L2p1Q3j8n6M2J01m5p4N2l5Q9j5lrL1nk4MM2p2M7K1m7m9K4nm1P3k8m6
7735d6Q6J8l1p0J16r5M6jl3lP2Kq2L0jk6m1P3j5jK9M9j71Q7j2J0j8P1l5lK3l6
7767hM8n2O4r4J3J52r5j3K7n1%N3k2p7J19o3m8Q9j3k9m8P7n6k3Q7j8m1N0L9j05
$$ plain form
7797 -38 37 -22 -31 20 62 -52 -26 48 14 -11 -23 -4 -8 36 -29 -82 31 18 -102 10 45 22 55 10 -20 -21 -3 -35 10 9
7827 9 -4 37 -7 21 4 -49 -8 -34 -22 9 -26 12 41 23 -35 33 46 21 5 19 -36 -68 88 34 -76 47 61 -26 -53
7856 -53 3 -45 -35 6 10 -34 59 -13 -97 -48 41 -22 61 -19 -62 0 104 -12 -16 -17 -13 11 -32 6 7 62 -17 -54 -33 40 -40 -38
7888 -38 73 1 21 28 28 1 -63 35 -37 63 25 29 14 26 -30 43 -67 9 -2 34 7 -46 -33 68 -2 -29 20 -53 -38 12
7918 12 -6 -8 -7 -3 18 -7 -23 -62 4 -52 -20 -31 33 -11 0 64 45 -37 70 26 0 16 -11 10 -20 -1 -19 -49 68 55 -19
7949 -19 -5 43 6 -20 94 -14 37 19 -3 -33 51 -15 27 24 -9 -50 32 20 -50 -24 -16 38 -55 -44 -45 -31 35 9 -14 -12 17
7980 17 -24 -2 69 -10 -44 31 -26 -25 -5 21 -37 21 79 -26 47 68 -18 50 44 4 -13 23 53 63 49 -7 -31 9 35 -21 -10
8011 -10 81 -26 -20 -16 52 -46 49 52 -21 1 88 2 -69 68 -66 -47 -5 36 -6 -5 11 -52 44 15 -91 -52 43 -53 -40 51
$$ packed form
7797c8P5n9rN1M2j14K6P4l4k5j2J9mM4o5n3J13j3j20J12L5k3L3m5l0jJ8l2M5j
7827Ij3M1m4K8j7n3M1k6J2L1l5L8K9j8n8O8J3k5j6J4n5l2J56n4j10J23J4q7k7
7856e3N6m8J0M1Mm4R3p2q4M9Q9o3Q3q0m3O2J04j16mjMK4m3L8JN5p9l7K1P3q0K
7888c8J11p2K0P%k7o4R8p2J00l8Mj5J2n6P3j10P6j1L6k7n3J3J01p0k7M9p3J5N0
7918A2j8kJMK1k5j6l9O6n6L2j1O4m4J1O4j9q2J07m4k6J6k7K1l0J9j8l0J17j3p4
7949a9J4M8l7k6J14j08N1j8k2l0Q4o6M2ll3m1Q2j2p0K6QN4r3J1jJ4O6k6k3KK9
7980A7m1K2P1p9l4P5n7JK0K6n8N8N8j05P3K1q6O8om0j7L6L0J0j4n6k4M0K6n6J1
8011a0R1j07OMO8r8R5Lp3K2Q7q6p1J37j34J9M2M1m2JJ6o3R6k9j06L9R5r6J3R1
$$ plain form
8041 51 -4 9 2 19 1 28 -46 10 -12 -19 3 22 46 15 -21 -14 68 -4 68 98 -8 -15 115 53 -13 71 -17 -7 18 53 -48
8072 -48 -5 117 26 -16 58 -43 11 19 27 -48 -63 12 -6 12 46 -63 -10 -18 -26 4 36 -26 -74 -35 -26 -43 -22 22 13 -4 37 -2
8104 -2 45 0 22 -13 67 56 7 12 8 -51 -37 110 3 62 25 -3 -1 9 21 -27 29 72 58 33 104 -13 24 23 -66 -16 -23 50
8136 50 21 33 11 -17 -4 0 -59 -31 -9 -24 -64 -28 31 -51 35 -26 8 4 -32 -80 -48 -23 -31 -53 11 -48 -5 -7 19 -41 -47 59
8168 59 -21 39 64 43 -23 15 49 -23 32 21 -21 -4 -36 8 59 56 -63 36 59 12 -31 -5 55
$$ packed form
8041E1n5J3pJ7j8K7p4N6k2pK2J9K4l1l6PQ2p2P2L0j06pJ30o2o6Q4q8J0K5L5j01
8072d8M3J22r1m2P4j01N4QQp5j5P5j8J8L4j09N3qqL0L2o2m8L9Rj7K1M4rj7M1l9
8104bM7m5K2l5Q0j1m9Nmn9J4J47j07N9l7k8KJ0J2m8N6M3j4k5P1j17L7jq9N0pP3
8136E0k9J2k2k8J3Mn9K8K2j5m0L6N9q2Q6o1L4ml6m8L2K5qk2O4n9M3kK6o0oJ06
8168E9q0O0K5k1o6L8L4p2N5j1m2J7l2M4N1lj19R9K3m7m3K6O0
8191E5
$$ Imaginary data points
##PAGE= N=2
##DATA TABLE= (X++(I..I)), XYDATA
$$ plain form
0 0 0 0 0 0 0 0 0 0 0 0 0 0 0 0 0 -4 8 -6 6 -8 8 -8 8 -10 12 -12 14 -15 18 -18 21 -24 24 -30 30 -34 37 -40 44 -47
40 -47 55 -59 65 -71 82 -91 102 -119 137 -161 189 -229 285 -365 480 -668 996 -1627 3107 -7890
60 -7890 50434 274010 -34955 -270291 78610 246113 -109544 -216060 136664 181362 -151253
71 -151253 -143043 160767 106926 -159033 -70784 154057 40747 -140480 -13520 125528 -5643
82 -5643 -105513 19610 86923 -25389 -68195 25675 53930 -20879 -44699 13037 40912 -5580
94 -5580 -43358 -1351 48581 3419 -58200 -3443 66702 -2618 -77446 9893 84184 -22776
106 -22776 -90995 36112 92661 -53880 -92574 71426 86284 -90702 -75895 107719 59652
117 59652 -122093 -39125 131527 16000 -134605 8872 132463 -31368 -123204 52633
$$ packed form
0@%%%%%%%%%%%%%%%mJ2j4J2j4J6j6J6j8K2k4K6k9L3l6L9m5M8n4O0o4P1p7Q4r1
40d7J02j14J24j36J53j73J93k21K56k98L50m18N14o50Q45j148J664k623M734j0997
60g890N8324K23576l08965k35336L48901J67503l55657j06516L52724M4698l32615
71a51253Q210L03810n3841k65959Q8249K24841j13310j81227J26960J39048j31171
82e643r9870J25123O7313j12312m2806R3870K8255p4809k3820N7736K7875m6492
94e580l7778M2007M9932m5162o1619N4757P0145o9320p4828Q7339P4291j06960
106b2776o8219J27107N6549j46541l8694J64000J4858j76986J4807J83614m8067
117E9652j81745Q2968J70652j15527j50605J43477J23591j63831r1836J75837
$$ plain form
127 52633 111295 -68090 -94303 81489 77580 -88529 -58001 93653 40648 -92834 -22058
138 -22058 90015 6790 -82214 7042 72719 -16460 -60782 21918 48918 -23193 -38841 20312
150 20312 30807 -16254 -27496 10001 25862 -6103 -28990 1903 31717 -1789 -37594 1438
162 1438 41509 -5175 -47415 8698 50942 -15964 -55177 23681 56591 -34224 -56273 45281
174 45281 52438 -56491 -44957 66842 34712 -73875 -21050 78891 7785 -78769 7060 77162
186 77162 -18919 -71140 31045 65200 -39491 -56010 48087 47616 -53192 -36632 57853 26457
198 26457 -58894 -15192 58204 5312 -54543 3226 48926 -9489 -42967 12603 36166 -14337
210 -14337 -31733 13075 27419 -12789 -26525 10813 24777 -11219 -25681 10177 25002 -11492
$$ packed form
127E2633N8662j79385k6213J75792l909j66109L0528J51654n3005j33482P0776
138b2058J12073q3225q9004Q9256O5677q9179m4322Q2700K7000p2111j5648N9153
150B0312J0495m7061j1242L7497J5861l1965k2887L0893K9814l3506l5805L9032
162A438M0071m6684m2240N6113M2244o6906l9213P8858L2910r0815k2049J01554
174D5281P157j08929J1534J11799l2130j08587N2825R9941p1106q6554Q5829P0102
186G7162r6081n2221J02185L4155j04691j6519J04097m71j00808J6560R4485l1396
198B6457q5351M3702P3396n2892n9855N7769M5700n8415l3478N5570K3563n0503
210a4337j7396M4808J4344m0208j3736L7338J3964l5996j4462L5858J4825l6494
$$ plain form
222 -11492 -26409 11484 26503 -13373 -28294 14824 29565 -18310 -30903 22775 31229 -28203
234 -28203 -29625 34792 26643 -39986 -20615 45256 14624 -47167 -6204 48878 -228 -47151
246 -47151 8072 46078 -13299 -42589 19782 39989 -24310 -35316 29443 30884 -33044 -24769
258 -24769 35904 18309 -37036 -11899 36161 5756 -34632 -1572 31322 -2172 -29208 3189
270 3189 26051 -5209 -25408 5136 23620 -7166 -23778 7824 22256 -10106 -21957 10882
282 10882 20375 -12407 -19858 13024 19237 -14062 -19234 15786 19554 -17882 -18862 21548 18213 -24424
296 -24424 -15108 28391 12394 -30014 -7246 32087 3727 -31442 1158 31574 -3980 -29962
308 -29962 7830 29544 -10393 -27976 13997 26780 -17148 -24621 20316 21440 -23143 -17959 24447
$$ packed form
222a1492j4917L7893J5019l9876j4921M3118J4741m7875j2593N3678Q454n9432
234b8203j422O4417q149o6629J9371O5871l0632o1791M0963N5082m9106m6923
246d7151N5223L8006n9377k9290O2371K0207o4299j1006O4759J441o3928Q275
258b4769O0673j7595n5345K5137M8060l0405m0388L3060L2894l3494k7036L2397
270C189K2862l1260k0199L0544J8484l0786j6612L1602J4432l2362j1851L2839
282A0882R493l2782p451L2882O213l3299n172L5020L768l7436r80M0410l335m2637
296b4424R316M3499j5997m2408K2768L9333k8360l5169L2600L0416l5554k5982
308b9962L7792K1714l9937j7583M1973J2783m3928p473M4937J124m4583N184M2406
$$ plain form
321 24447 13538 -25521 -10269 24478 6573 -24313 -5061 22749 2560 -23200 -1778 22370
333 22370 -727 -23174 2195 22328 -5448 -22107 7485 20330 -10047 -18888 11415 17140
345 17140 -12422 -15676 13501 14943 -14057 -13696 16168 13363 -17379 -11030 20138 9641 -20999
358 -20999 -5998 22703 3696 -21877 -62 21970 -1626 -20489 4011 20296 -5104 -19557
370 -19557 6980 19424 -8884 -19056 10967 17903 -13609 -16535 15302 13848 -17367 -12029 17418
383 17418 9067 -18285 -8058 17515 6026 -18479 -5600 18403 3663 -19826 -2508 20151
395 20151 -260 -20862 2673 20364 -5332 -19382 7560 18031 -9001 -16245 10503 15461
407 15461 -11000 -13990 12709 13835 -13611 -12118 15921 11233 -16838 -8221 18693 6285 -18468
$$ packed form
321B4447j0909l9059J5252L4747j7905l0886J9252K7810k0189k5760K1422K4148
333B2370k3097k2447K5369K0133k7776j6659K9592J2845l0377q841L0303N725
345A7140k9562l254K9177J442k9000L61K9864k805l0742O349L1168j0497l0640
358b0999J5001K8701j9007k5573K1815K2032k3596j8863K4500J6285k5400j4453
370a9557K6537J2444k8308j0172L0023O936l1512k926L1837j454l1215N338K9447
383A7418q351k7352J0227K5573j1489k4505J2879K4003j4740k3489J7318K2659
395B0151k0411k0602K3535J7691k5696j4050K6942J0471k7032p244K6748M958
407A5461k6461k990K6699J126k7446J493K8039m688k8071Q617K6914j2408k4753
$$ plain form
420 -18468 -2941 18774 1115 -17550 993 17015 -1965 -16238 3035 15945 -4286 -16091
432 -16091 5560 15555 -7795 -15391 9259 13584 -11580 -12597 12063 10132 -13359 -9239 12840
445 12840 7457 -13828 -7320 13774 6018 -15144 -5451 15973 3580 -17366 -1644 17892 -850
458 -850 -17775 3377 17302 -5164 -15896 7121 15325 -7730 -13855 9432 13925 -9997 -12659
471 -12659 12316 12297 -13361 -10176 15613 8638 -16105 -5736 16930 3782 -16377 -1561 15870
484 15870 287 -15086 690 14606 -1743 -14815 2397 14461 -4318 -14856 5512 13751
496 13751 -7873 -13364 8729 11259 -10325 -10414 10172 8554 -10994 -8172 10873 7213 -11861 -6942
510 -6942 12687 5799 -14087 -4429 15095 2626 -15511 -100 15789 -1644 -14771 3941 14446
$$ packed form
420a8468J5527K1715j7659j8665J8543J6022j8980j4273J9273J2910k0231j1805
432a6091K1651R995k3350p596K4650M325k5164j017K4660j931k3491M120K2079
445A2840n383k1285O508K1094p756k1162R693K1424j2393k0946J5722J9536j8742
458h50j6925K1152J3925k2466j0732K3017Q204k3055o125K3287M493k3922k662
471a2659K4975j9k5658L185K5789o975k4743J0369K2666j3148k0159J4816J7431
484A5870j5583j5373J5776J3916j6349j3072J7212J2064j8779j0538K0368Q239
496A3751k1624n491K2093K530k1584q9K0586j618j9548K822J9045l660j9074M919
510f942J9629o888j9886R658J9524j2469j8137J5411J5889j7433j3127J8712J0505
$$ plain form
523 14446 -4745 -13098 6427 13129 -6721 -12132 8725 12291 -9666 -10839 11943 10018 -13022
536 -13022 -7680 14490 5749 -14699 -3544 14507 1835 -14022 -730 13310 -522 -13429
548 -13429 891 13058 -2394 -13750 3282 13058 -5509 -13135 6515 11430 -8338 -10688 8534
561 8534 8885 -9344 -8297 9096 7315 -9644 -7163 10049 6753 -10950 -6049 12236 4971 -12910
575 -12910 -2946 13873 1520 -13368 731 13537 -1511 -12332 3227 12591 -3451 -11751 5047
588 5047 12181 -5897 -11479 8014 11298 -9428 -9780 11288 8311 -12255 -6202 12820 4211 -12971
602 -12971 -2736 12373 1139 -12559 -541 12081 -939 -12617 1576 12094 -3726 -12372
614 -12372 4762 10981 -6871 -10343 7409 8447 -8391 -7499 8200 6260 -8340 -5875 8283
$$ packed form
523A4446j9191q353J9525O702j9850n411K0857L566k1957j173K2782j925k3040
536a3022N342K2170q741k0448J1155J8051j2672j5857J3292J4040j3832j2907
548a3429J4320J2167j5452j1356J7032R776j8567p626J9650M915j9768k350J9222
561H534L51j8229J047J7393j781j6959K481J7212l296j7703M901J8285p265j7881
575a2910R964J6819j2353j4888J4099J2806j5048j0821J5559R364j6042q300J6798
588E047P134j8078n582J9493L284k0726l52K1068k977k0566O053J9022q609j7182
602a2971J0235J5109j1234j3698J2018J2622j3020j1678J4193J0518j5820q646
614a2372J7134O219j7852l472J7752J038j6838Q92J5699j940j4600K465J4158
$$ plain form
627 8283 5585 -8502 -5163 9415 4912 -9968 -3616 11088 2745 -10954 -968 11439 345
640 345 -10572 1085 10831 -1089 -10087 2250 10918 -2528 -10860 4142 11452 -5495 -10930 7517
654 7517 10270 -9093 -8933 10262 7182 -11280 -5681 11282 3897 -11820 -3170 11453 1483 -12250
668 -12250 -851 11986 -1239 -12560 2597 11605 -4944 -11303 6129 9331 -7612 -7963 7938
681 7938 6202 -8102 -4964 7889 4201 -7501 -3475 7670 3382 -7600 -2349 8374 2074 -8019
695 -8019 -567 8386 350 -7412 770 7499 -454 -6705 890 7316 -451 -7517 1011 8560 -1718
710 -1718 -9152 3070 9532 -4776 -9466 6253 8451 -7840 -7867 8547 6360 -9877 -5815 9960
724 9960 4270 -11278 -3724 11503 1835 -12863 -487 12825 -2099 -13027 4042 11847 -6351
$$ packed form
627H283k698j4087L339J4578m503j4880O352J4704q343j3699R986J2407j1094
640C45j0917J1657R746j1920q998J2337Q668j3446q332J5002P310j6947n435J8447
654G517K753j9363J60J9195l080j8462N599J6963p385j5717Q650J4623r970j3733
668a2250J1399J2837j3225j1321J5157R008j6549o359J7432L202j6943l51J5901
681G938j736j4304L138J2853l688j1702M026J1145m288j0982N251J0723o300j0093
695h019P452Q953q036p762Q182O729p953o251P595O426p767p066Q528P549j0278
710a718p434J2222O462j4308m690J5719K198j6291k7J6414k187j6237M062J5775
724I960n690j5548P554J5227r668j4698J2376J3312j4924j0928J7069P805j8198
$$ plain form
737 -6351 -10570 7698 8610 -8522 -6701 8941 5191 -8591 -3717 8660 3063 -8165 -1731 8518
751 8518 1255 -7719 417 7695 -826 -6405 2076 5855 -1718 -4467 1828 4166 -831 -3825 445
766 445 4455 57 -5201 157 6150 -938 -6988 1823 7093 -3371 -7373 4075 6584 -5536 -6847
781 -6847 6088 5844 -7707 -5915 8425 4543 -10298 -3694 11206 1484 -12310 572 12287
794 12287 -3280 -11750 5511 10462 -7249 -8612 8508 6923 -8816 -4932 9384 3879 -8988
807 -8988 -2016 9389 1273 -8597 602 8654 -1378 -7182 2932 6419 -3185 -4574 3610 3493 -2652
822 -2652 -2331 1893 2087 -855 -2436 -13 3066 104 -4206 -183 4666 -824 -5644 1086 5542 -2340
838 -2340 -6171 2622 5866 -4001 -6573 4701 6140 -6573 -6093 7930 4834 -9772 -3320 10803
$$ packed form
737f351m219J8268R12j7132J821J5642l750j3782M874J2377n597j1228O434J0249
751H518p263q974Q136P278q521n579Q481L779p573k749O295K338m997k994M270
766D45M010m398n258N358N993p088o050Q811N270j0464m002J1448K509j2120j311
781f847J2935k44j3551J792J4340l882j4841O604J4900r722j3794J2882J1715
794A2287j5567q470J7261M951j7711j363J7120j585j5739L884J4316n505j2867
807h988O972J1405q116r870R199Q052j0032n804J0114L487r604j389Q184j17o145
822b652L21M224J94k942j581K423L079k962m310M023M849n490m820O730M456p882
838b340l831Q793L244r867k572J1274J439j2713M80J4023l096j4606O452J4123
$$ plain form
852 10803 1000 -11411 1409 11218 -3607 -10101 5763 8867 -6764 -6987 8072 5939 -8143
865 -8143 -3989 8940 3098 -8737 -1139 9117 -48 -8339 2051 7815 -2966 -6160 4143 4735
879 4735 -4187 -3098 3722 2057 -2878 -1547 1691 1287 -1126 -2051 388 2296 -683 -3219 395 3188
895 3188 -998 -4003 822 3960 -1596 -4794 1698 4994 -2942 -5806 3991 5638 -5798 -5313 7419
910 7419 4077 -8717 -2328 9603 469 -9503 1778 9342 -3176 -8107 4849 7544 -5369 -6023
924 -6023 6664 5421 -6947 -3808 8078 2795 -8094 -854 8321 -544 -7436 2403 6498 -3311
938 -3311 -5008 3757 3472 -3683 -2465 2860 1522 -2515 -1542 1463 1299 -1456 -1952 828 1700 -1251
954 -1251 -2268 772 1998 -1073 -2726 605 2959 -1101 -3902 1508 4395 -2721 -4798 4010 4604
$$ packed form
852A0803r803j2411J2820R809j4825o494J5864L104j5631k23J5059k133j4082
865h143M154J2929n842j1835P598J0256r165q291J0390N764j0781l194J0303N92
879D735q922J089O820j665m935J331L238m04k413r25K439J908k979k536L614K793
895C188m186l005M825L138n556l198O492L296p936k864R797J647j1436M85J2732
910G419l342j2794O389J1931r134r972J1281P564j2518m931J2956K695j2913o54
924f023J2687j243j2368L139J1886n283j0889P240R175q865o892R839M095r809
938c311j697Q765k85p155J218N325j338m037R73L005j64k755m96K780Q72k951
954a251j017L040J226l071j653L331K354m060k801N410K887p116k077Q808N94
$$ plain form
969 4604 -5390 -3681 6872 2623 -7336 -796 7925 -341 -7371 2062 7356 -2655 -6398 3990
983 3990 6178 -4482 -5241 5693 4734 -6288 -3335 7185 2078 -7202 -369 7032 -1123 -6166 2129
998 2129 4964 -2800 -3924 2684 2715 -2700 -2458 1955 1879 -2087 -2136 1609 1617 -1906 -1832 1508 1294 -1711
1016 -1711 -1481 1157 1380 -1049 -1921 836 2476 -1141 -3094 1853 3527 -2845 -3351 4122 3024 -4780
1032 -4780 -1781 5595 1145 -5445 261 5757 -683 -5143 1742 5372 -1968 -4869 2987 4965 -3521
1047 -3521 -4356 4699 3792 -5296 -2608 5785 1353 -5864 -315 5257 -837 -4790 1053 3807 -1612
1062 -1612 -3589 1235 2879 -1554 -3162 1229 2715 -1945 -2862 1878 2248 -2351 -2035 2114 1439 -2007
1078 -2007 -1356 1602 1380 -1397 -1702 1608 2242 -1805 -2307 2791 2409 -3261 -1592 4117 1291 -3974
$$ packed form
969D604r994J709J0553m249r959O540Q721q266p030R433N294j0011l743J0388
983C990K188j0660p59J0934r59j1022K953J0520n107r280O833P401q155n043Q295
998B129K835p764j124O608L1n415K42M413p6l966m9L745Ql523P4L340k14l005
1016a711K30K638K23k429q72K757J640l617j953M947J674o372n06P473j098p804
1032d780K999P376m450o590N706N496o440m460O885L630p340k901P856J978q486
1047c521q35R055r07r088K688Q393m432p217N549N572o094l953N843K754n419
1062a612j977M824J644m433j608M391J486m660r17M740L70m599L16M149o75l446
1078b007O51K958k22k777l05L310O34m047n02N098l82n670J669N709k826n265
$$ plain form
1094 -3974 -81 4263 -65 -3712 901 3897 -852 -3493 1399 3843 -1700 -3766 2553 3696 -3184
1109 -3184 -3262 3887 2395 -4444 -1609 4266 472 -4346 -130 3628 -578 -3576 280 3007 -775
1124 -775 -3460 471 3164 -1222 -3461 1391 3025 -2235 -2927 2389 2153 -2583 -1713 2459 1421 -2093
1140 -2093 -1233 2071 1576 -1903 -1545 2606 1834 -2651 -1224 3587 1011 -3313 -29 3636 -204 -3075
1156 -3075 866 3060 -727 -2639 991 2705 -870 -2843 1212 2968 -1696 -3094 2277 2640 -3086
1171 -3086 -2299 3236 1284 -3539 -1039 2987 317 -3082 -482 2501 37 -2906 -349 2835 -248
1186 -248 -3427 468 3287 -1230 -3343 1741 2800 -2241 -2304 2522 1793 -2259 -1278 2372 1407 -2022
1202 -2022 -1190 2509 1545 -2449 -1052 3225 1112 -3123 -74 3454 -240 -3037 1028 2818 -969
$$ packed form
1094c974L893M344m328l647M613K996m749k641M892K444n543k066O319J143o880
1109c184p8P149j492o839K835N875l794m818M216L758m206k998L856K727l782
1124g75k685L931K693m386k239M852J634n260o92N316k36m736Q70M172j038l514
1140b093Q60L304m95l479L58M151p72m485J427M811k576m324L284L665l840k871
1156c075L941K194l787j912L630J714l575j973M055J756m664j398N371L63n726
1171c086P87N535j952m823K500M026k670l399K600K983k464k943K557L184l083
1186b48l179L895K819m517k113N084J059n041o3M826p29m052R81L650r65l429
1202b022Q32L699r64l994J397M277k113m235L049L528l694k797M065J790l787
$$ plain form
1217 -969 -2239 1098 2065 -933 -2035 903 2174 -1141 -2417 1457 2282 -2152 -2312 2292 1579 -2829
1233 -2829 -1345 2522 550 -2635 -722 2085 355 -2340 -696 2268 467 -2771 -364 3058 -177
1248 -177 -3313 926 3221 -1442 -2741 2064 2462 -2001 -1735 2263 1716 -1953 -1268 2302 1538 -2213
1264 -2213 -1135 2820 1239 -2850 -342 3381 0 -3001 844 2873 -1141 -2308 1420 1859 -1306
1279 -1306 -1677 1053 1460 -1073 -1754 966 1675 -1542 -1912 1621 1468 -2259 -1311 2013 578 -2250 -519
1296 -519 1621 232 -1785 -636 1571 613 -1880 -849 2269 597 -2699 -189 3045 -334 -2798
1311 -2798 1111 2812 -1316 -2182 1776 2153 -1533 -1635 1876 1922 -1635 -1601 2254 1797 -2432 -1259 3127
1328 3127 923 -3158 -43 3184 -499 -2813 1061 2273 -1297 -1918 1164 1478 -1213 -1648 900 1414
$$ packed form
1217i69j270L337R67k998j102K938J271l315j276L874Q25m434j60M604p13m408
1233b829J484L867j972l185J913K807j730k695J644K964j801l238K407L422l235
1248a77l136M239K295m663j299M805L98m463K66L998n47l669O85L570p64l751
1264b213J078L955j581m089K508L723l381l001L845K029m014j167L728M39l165
1279a306l71K730M07k533o81K720P09l217l70L533j53l727R48L324j435k828J731
1296e19K140j389k017J149K207r58k493J031L118j672l296K510L234l379k464
1311b798L909J701m128q66L958L77l686j02L511M6l557L4L855m57m229J173M386
1328C127k204m081L115L227l683k314L874J212l570o21L082L14k691m35K548N14
$$ plain form
1344 1414 -1377 -1801 1312 1404 -1908 -1391 1804 575 -2111 -491 1635 -31 -1502 -180 1158 265
1360 265 -1197 -635 1361 755 -1741 -567 2260 373 -2283 254 2632 -567 -2130 1161 2075 -984
1376 -984 -1668 1338 1927 -1069 -1685 1481 2034 -1689 -1736 2378 1644 -2680 -995 3081 314 -3011 327
1393 327 2732 -839 -2357 920 1826 -1098 -1796 853 1471 -1171 -1801 1115 1521 -1754 -1590 1691 942
1410 942 -2094 -680 1832 55 -1676 -9 1249 -58 -927 -181 828 509 -1001 -555 1427 632
1426 632 -1563 -143 2061 48 -1709 614 1877 -511 -1400 879 1641 -511 -1389 861 1869 -817
1442 -817 -1825 1442 1929 -1890 -1671 2438 1088 -2728 -522 2678 -200 -2640 444 2085 -972 -2131
1458 -2131 719 1585 -996 -1842 784 1650 -1391 -1864 1446 1253 -1975 -1067 2010 417 -1992 18
$$ packed form
1344A414k791m24L113R2l312N17L195j229k686J620K126j666j471J322J338q93
1360B65j462N62J996o06k496J174K827j887k656K537K378l199j563L291R14l059
1376i84o84L006N89k996o16L166N53l723m7M114p34m324J685M076k767l325L338
1393C27K405l571j518L277R06k924o98K649O18k642o30K916M06l275J64L281p49
1410I42l036J414K512j777j731J667J258j307q69P46J009l19j510M46J982p95
1426F32k195J420K204k013j757K323J263k388q89K279P62k152q78K250J008k686
1442h17j008L267M87l819K19M109j350l816K206L200k878k440L084J641l057j159
1458b131K850Q66k581q46K626Q66l041m73L310j93l228R08L077j593k409K010
$$ plain form
1474 18 1622 -243 -1155 237 954 42 -753 -176 1037 548 -1095 -263 1549 186 -1346 287 1617
1491 1617 -204 -1109 592 1233 -292 -853 378 1278 -123 -1383 543 1821 -841 -1809 1422 1586
1507 1586 -1993 -1309 2153 653 -2388 -314 2051 -267 -2044 194 1656 -488 -1893 338 1705
1522 1705 -832 -2116 960 1791 -1600 -1718 1828 1070 -2091 -538 2096 54 -1755 329 1415 -169
1538 -169 -978 252 1153 120 -922 175 1327 9 -1154 503 1409 -480 -887 884 844 -554 -413
1555 -413 485 575 -156 -692 127 1029 -174 -1371 462 1369 -942 -1386 1231 985 -1762 -796 1502 263
1573 263 -1712 -362 1298 9 -1600 -289 1528 -64 -1989 178 1953 -861 -2116 1161 1736
1588 1736 -1742 -1316 1992 771 -1940 -273 1828 99 -1379 152 1411 93 -1118 188 1490
$$ packed form
1474A8J604j865r12J392P17r12p95N77J213m89j643Q32J812j363j532J633J330
1491A617j821r05J701O41j525n61J231R00j401j260J926J278k662r68L231J64
1507A586l579O84L462j500l041K074K365k318j777K238J462k144j405K231J367
1522A705k537j284L076Q31l391j18L546p58l161J553K634k042j809K084J086j584
1538a69q09J230R01j033j042J097J152j318j163J657R06j889m07J771m0j398J41
1555d13Q98R0p31n36Q19R02j203j197J833R07k311m44K617k46k747R66K298j239
1573B63j975J350J660j289j609J311J817j592j925K167J775k814j255L277N75
1588A736l478M26L308j221k711J667K101j729j478J531J259j318j211J306J302
$$ plain form
1603 1490 -42 -1354 547 1637 -609 -1114 1118 1004 -948 -448 996 346 -663 -102 340 301 -153
1620 -153 -691 140 829 -461 -1125 660 854 -1186 -851 1050 337 -1297 -452 910 138 -1111 -449 977
1638 977 308 -1467 -402 1600 57 -2000 384 2023 -990 -1800 1386 1441 -1588 -838 1806 686
1654 686 -1468 -208 1638 294 -1185 -46 1611 269 -1329 258 1710 -352 -1446 939 1356
1669 1356 -1141 -863 1257 453 -1124 -170 746 12 -516 -128 230 282 -320 -598 316 532 -825 -672 696
1688 696 244 -1028 -316 677 67 -756 -291 481 230 -773 -572 930 483 -1467 -315 1677 -154 -1828
1706 -1828 666 1741 -965 -1237 1397 1059 -1299 -625 1442 608 -1095 -321 1378 556 -1249 -232
1722 -232 1655 160 -1583 390 1779 -708 -1356 1117 957 -1138 -513 1132 149 -892 -170 502 98
$$ packed form
1603A490j532j312J901J090k246n05K232j14j952N00J444o50j009N61M42l9m54
1620a53n38Q31O89j290o64J785J94k040L35J901p13j634Q45J362p72j249O62J426
1638I77o69j775J065K002j543k057K384J639l013q10L186N5l029P50K644j120
1654F86k154J260J846j344j479J139J657j342j598J587J452k062j094K385M17
1669A356k497K78K120q04j577R54R16p34n28L88L58N2o02k78R14K16j357J53J368
1688F96m52j272P12R93o10q23M65P72k51j003K01J502m47j950J152J992j831j674
1706a828K494J075k706k72K634l38k358O74K067q34j703P74J699q22j805J017
1722b32J887j495j743J973J389k487o48K473j60k095O25J645r83j041P22O72m04
$$ plain form
1739 98 -478 -424 287 337 -654 -630 634 187 -888 -256 620 -127 -664 -10 306 22 -346 -374 376 449 -793
1760 -793 -546 1161 401 -1343 40 1614 -382 -1377 944 1258 -916 -741 1184 746 -849 -449 1196
1777 1196 721 -894 -468 1368 521 -1461 -79 1695 -177 -1580 698 1436 -979 -1070 1020 536 -1059
1794 -1059 -391 741 171 -713 -429 412 248 -704 -529 564 246 -931 -326 745 -94 -836 105 511
1812 511 -251 -390 -15 208 201 -311 -397 652 486 -842 -213 1268 91 -1204 491 1280 -585 -835 902
1831 902 801 -603 -332 726 605 -497 -538 872 731 -979 -555 1340 290 -1528 93 1470 -563
1848 -563 -1335 715 943 -956 -779 679 359 -767 -442 437 297 -600 -661 530 411 -929 -477 871
1866 871 69 -1071 -8 808 -337 -609 272 398 -74 -313 21 457 246 -457 -135 872 163 -881
$$ packed form
1739I8n76N4P11N0r91K4J264m47j075O32Q76p47n37O54L16k84l68k8P50P3j242
1760g93K47J707p60j744J383J574j996r95K321L14k174J75J925m38j595M00J645
1777A196m75j615M26J836q47j982J382J774j872j403K278P38k415r1K090m84j595
1794a059O68J132n70q84K84Q41j64r52J75J093l18j177O05J071q39p42R41M06
1812E11p62j39L75K23pn12q6J049j66j328O29J481j177j295J695P89j865k50J737
1831I02j01j404K71J058j21j102m1J410j41j710M24J895j050j818J621J377k033
1848e63p72K050K28j899J77J458l20j126L25Q79j40q97o1J191j19j340M52J348
1866H71q02j140J063Q16j145k72Q81J26m72k39L34M36k11p03L22J007p09j044
$$ plain form
1884 -881 278 1076 -285 -694 780 657 -521 -303 689 428 -356 -401 490 621 -501 -615 837 650
1902 650 -1039 -377 1202 35 -1308 156 1028 -612 -891 482 505 -628 -606 289 384 -405 -770 288
1920 288 638 -725 -759 790 470 -1065 -269 1015 -46 -904 239 700 -262 -414 265 409 78 -346
1938 -346 29 678 112 -657 173 948 -215 -677 648 678 -516 -193 693 310 -374 -53 352 257 -165 -427
1958 -427 314 521 -620 -591 738 276 -1008 -192 951 -246 -970 198 616 -414 -648 111 350 -302
1976 -302 -665 44 603 -384 -816 473 749 -842 -613 921 349 -998 9 935 -149 -621 233 555
1994 555 -78 -379 44 611 119 -533 139 851 -155 -671 568 739 -554 -317 819 238 -537 8 417
2013 417 25 -250 -126 172 244 -344 -491 382 296 -724 -346 694 -65 -832 101 592 -348 -575 105 298
$$ packed form
1884h81J159P98j361m09J474j23j178K18R92k61p84m5Q91J31j122j14J452j87
1902F50j689O62J579j167j343J464Q72j640k79J373K3j133K2Q95R5p89l65J058
1920B88L50j363l4J549l20j535P96J284j061q58J143M61r62j52O79J44l31m24
1938c46L75O49n66p69Q30P75j163m62J325L0j194L23Q86l83o84L21M05r5m22k62
1958d27P41K07j141K9J329m62j284Q16J143j197p24J168M18j030k34P59K39o52
1976c02l63P09N59r87m32J289K76j591K29J534n72j347J007R26j084m72Q54L22
1994E55o33l01M23N67m92o52O72P12j006n16J239J71j293K37J136n81p75N45M09
2013D17l92k75J24K98P2n88j47Q73q6j020L78J040p59p67R33M91r40k27O80J93
$$ plain form
2033 298 -239 -504 -34 393 -37 -723 162 750 -520 -823 723 626 -869 -313 993 177 -771 117 741
2052 741 -42 -447 172 661 109 -484 149 827 -84 -680 367 830 -509 -521 832 415 -687 -29 586
2071 586 -100 -422 41 201 -10 -173 -329 169 229 -511 -351 477 72 -747 -40 523 -344 -555 125 204 -276
2092 -276 -307 18 190 38 -450 -96 647 -57 -742 379 791 -540 -547 814 423 -718 -58 781 65 -500
2112 -500 118 637 146 -373 62 613 139 -713 133 915 -259 -638 617 621 -755 -384 752 97 -654
2131 -654 87 414 -87 -363 -127 247 89 -407 -306 315 -54 -620 -92 525 -275 -511 229 201 -333 -150
2151 -150 89 -19 5 -190 -163 331 156 -467 95 739 -180 -584 538 561 -526 -237 702 190 -444 9
2171 9 493 169 -279 -81 548 303 -587 -151 778 -48 -796 319 797 -607 -691 693 300 -731 -197 520
$$ packed form
2033B98n37k65M70M27m30o86Q85N88j270l03J546r7j495N56J306q16r48Q88O24
2052G41p83m05O19M89n52n93O33O78r11n96J047M63j339j2J353m17j102O58O15
2071E86o86l22M63J60k11j63j56M98O0p40J60Q28m05q19P07N63q67k11O80P9m80
2092b76l1L25J72j52m88L54P43p04o85J121M12j331pJ361l91j141O60Q39p16n65
2112e00O18N19m91n19M35N51m74q52Q46P82j174l79J255Mj376L71J136o55p51
2131f54P41L27n01k76K36L74j58m96J01O21l69n66N28O17q00k36P40k8n34J83
2151a50K39j08K4j95K7M94j75o23N62O44r19m04J122K3j087K89R39n12o34M53
2171IM84l24m48J98O29k45q90M36R29q26p48J115M78j404q4J384l93j031N34P17
$$ plain form
2191 520 -7 -504 -64 307 -15 -455 -221 340 -21 -600 -145 537 -174 -751 270 294 -458 -288 289 14
2211 14 -240 28 61 59 110 -195 -40 423 49 -432 282 541 -305 -235 549 288 -386 9 470 109 -123 -77
2233 -77 315 317 -290 -169 516 240 -693 -16 799 -226 -837 398 557 -645 -474 444 76 -555 -129 293
2253 293 15 -370 -261 235 211 -543 -287 516 -12 -732 99 599 -441 -527 507 251 -416 -55 243 18
2273 18 -58 -72 70 225 60 -306 215 535 -212 -294 463 310 -377 -13 435 34 -127 56 170 205 -57 -180
2295 -180 302 330 -434 -271 605 70 -746 73 565 -364 -616 419 296 -531 -247 273 45 -342 -266 168
2315 168 211 -365 -350 454 218 -688 -166 630 -112 -645 309 452 -422 -309 414 168 -164 14 230 223 -10
2336 -10 -139 172 408 -134 -298 459 366 -357 1 507 -10 -298 235 230 -76 -52 -49 43 187 -178 -310 259 167
$$ packed form
2191E20n27m97M40L71l22m40K34N61l61n79M55O82p11n77J021K4p52J70N77k75
2211A4k54K68L3kN1l05J55M63l74m81P14K59q46P0P84k61o74L95M61l61k32M6
2233g7L92Ko07J21O85k76r33O77Q15j025o11J235J59j202J71R18l68o31M26M22
2253B93k78l85J09M96k4p54K56Q03n28p20Q31N00j040q6J034k56o67L61K98k25
2273A8p6j4J42J55j65l66N21L20p47q2P57j53o87L64M48m01j61J83J14L5k62j23
2295a80M82K8p64J63Q76n35q16Q19M92r29k52J035j23q27K84N20k28l87P6M34
2315A68M3n76J5Q04k36r06N22P96p42n33R54J43q74J13P23k46l32J78K16pk33
2336a0j29L11K36n42j64P57r3p23L58N06n17k88N33nl06K4LR2J44l65j32N69r2
$$ plain form
2359 167 -539 -171 504 -192 -600 247 261 -448 -369 207 114 -326 -244 90 183 -213 -385 284 409 -463 -336 607
2381 607 106 -674 57 658 -299 -440 447 305 -234 -90 299 153 -88 -66 168 352 -98 -232 394 335 -308
2402 -308 -85 487 48 -383 192 257 -154 -96 137 -3 18 -13 -179 59 121 -297 -265 356 -113 -535 54 308
2424 308 -383 -316 124 53 -297 -146 32 105 -53 -354 45 298 -185 -450 433 387 -589 -176 696 -5 -496
2445 -496 265 441 -243 -227 323 261 -89 -56 191 322 -43 -221 277 466 -305 -225 530 185 -483 22 497
2466 497 -151 -291 212 142 -228 -54 -31 -10 24 -193 -236 209 58 -401 -67 215 -248 -361 218 77 -338 -63
2488 -63 65 -42 8 -144 -83 174 36 -334 185 434 -318 -266 528 215 -441 50 551 -21 -276 341 273 -63
2510 -63 -67 143 297 -5 -229 119 456 -132 -399 410 329 -465 -176 532 -42 -493 157 237 -190 -255 108 80
$$ packed form
2359A67p06L68O75o96m08Q47J4p09P9N76r3m40Q2L34R3l96j72O69J25q72J27R43
2381F07n01p80P31O01r57j41Q87j42n39J44L89j46k41K2K34J84m50j34O26n9o43
2402c08K23N72m39m31N75O5m11N8K33j40K1l1j66K38O2m18L2O21m69m22N89K54
2424C08o91O7M40p1l50J51J78P3j58l01L99K53m83k65Q83m6r76M13Q72p01m91
2445d96P61J76o84J6N50o2l50L3K47J31l65j78M98J89p71Q0P55l45o68N05M75
2466D97o48j40N03p0l70J74K3K1L4k17m3M45j51m59L34K82m63j13N79j41m15K75
2488f3J28j07N0j52O1K57j38l70N19K49p52N2P94l13o56M91N01n72k55O17o8l36
2510f3mK10J54l02k24L48L37n88k67Q09q1p94K89P08n74m51O50Q0m27o5L63k8
$$ plain form
2532 80 -100 -154 -185 108 -43 -315 -45 252 -180 -400 200 111 -406 -107 191 -126 -181 -37 2 42 94 -139 79
2555 79 332 -92 -358 332 357 -245 -8 501 29 -263 195 350 -93 -83 85 227 92 -181 -39 361 59
2576 59 -335 134 458 -286 -298 486 179 -517 -40 471 -179 -330 145 119 -181 -233 -140 69 -16 -336 -187 254
2598 254 -127 -439 131 267 -390 -238 300 34 -266 75 141 -78 1 -18 16 177 55 -210 199 324 -242
2619 -242 -140 509 114 -302 211 388 -75 -99 215 111 -2 3 24 187 169 -232 -101 388 -82 -382 215 311
2641 311 -420 -222 320 -82 -385 -38 174 -162 -137 -139 3 26 -309 -212 156 4 -441 -30 308 -309 -381 314
2663 314 122 -321 -48 324 -31 -131 89 106 63 53 -48 110 259 -76 -80 426 190 -350 73 398 -71 -44
2685 -44 216 120 -31 72 71 18 125 -75 -84 230 37 -375 43 329 -241 -323 304 76 -390 -55 194 -207 -205
$$ packed form
2532H0j80n4l1K93j51k72K70K97m32k20O00q9n17K99K98l17n5J44L9M0N2k33K18
2555G9K53m24k66O90K5o02K37N09m72k92M58J55m43J0J68J42j35k73J42M00l02
2576E9l94M69L24p44j2P84l07o96M77N11o50j51M75k6l00n2R3K09q5l20J49M41
2598B54l81l12N70J36o57J52N38k66l00L41O6k19P9j9L4J61j22k65M09J25n66
2619b42J02O49l95m16N13J77m63k4L14j04j13NK1J63j8m01J31M89m70l00N97R6
2641C11p31J98N42m02l03L47K12l36K5kJ42K3l35R7L68j52m45M11L38o17p2O95
2663C14j92m43K73L72l55j00K20J7m3j0j01J58J49l35mN06k36n40M23L25m69K7
2685d4K60r6j51J03jn3J07k00rL14j93m12M18K86n70q2O27k28m66L35K49m01K
$$ plain form
2708 -205 -30 25 -59 -147 -173 88 89 -329 -171 308 -101 -430 157 404 -266 -122 334 35 -215 130 181 46
2730 46 3 43 123 206 -58 -168 242 231 -294 8 465 -11 -194 268 240 -226 -11 175 -14 4 26 -39 71
2753 71 166 -215 26 274 -127 -300 118 130 -350 -166 215 -71 -202 -22 45 -36 -87 -82 -20 160 -258 -258 273 143
2777 143 -435 39 383 -181 -336 334 201 -290 46 195 53 -23 68 133 163 22 -113 237 247 -236 -94 359
2799 359 45 -357 203 360 -188 -131 303 -7 -120 115 14 -102 -10 -98 -122 97 14 -254 59 182 -216 -189
2821 -189 192 -35 -297 12 35 -129 -101 -89 -88 27 -36 -248 133 219 -287 -116 373 -79 -373 239 332 -220 -147
2844 -147 341 86 -131 51 104 153 44 -4 156 276 -175 -216 378 112 -371 79 439 -183 -231 299 78 -198
2866 -198 -32 205 -100 -75 -11 -189 -12 -27 -243 -79 207 -169 -261 177 -28 -270 -17 89 -177 -108 53 -76
$$ packed form
2708b05J75N5q4q8k6K61Jm18J58M79m09l29N87K47o70J44M56k99k50L45N1j35
2730D6m3M0Q0Q3k64j10M10j1n25L02M57m76j83M62k8m66K15J86j89J8K2o5J10
2753G1R5l81K41K48m01j73M18J2m80J84L81k86j31J80O7q1n1NO2J80m18%N31j30
2777A43n78M74L44n64j55O70j33m91L36J49j42p6R1O5L0j41j35L50J0m83J42M53
2799C59l14m02N60J57n48N7M34l10j13K35j01j16R2q8k4K19q3k68L13J23l98K7
2821a89L81k27k62L09K3j64K8J2JJ15o3k12L81Q6n06J71M89m52k94O12R3n52P3
2844a47M88k55k17J82N3M9j09m8J60J20m51m1N94k66m83M50L60o22m8N30k21k76
2866a98J66K37l05K5O4j78J77j5k16J64K86l76r2M38k05k42K53J06k66O9J61j29
$$ plain form
2888 -76 -21 80 -159 -28 283 -132 -287 299 101 -309 94 378 -111 -261 325 162 -185 72 209 102 11
2909 11 -64 9 203 -53 -152 266 256 -355 -76 408 -73 -393 217 255 -314 -104 263 -25 -152 81 -22 -75
2931 -75 -7 -180 -83 83 -93 -178 89 106 -299 -66 179 -85 -192 45 81 -157 109 -54 -61 175 -5 -123 188
2954 188 266 -214 -46 430 9 -258 275 291 -136 -65 226 86 -27 109 115 121 94 -135 144 217 -229 -183 302
2977 302 56 -381 88 334 -196 -222 254 49 -283 10 21 -90 -37 -35 -125 32 -13 -289 53 143 -191 -161 218
3000 218 -10 -245 131 60 -108 21 71 -82 46 91 -97 91 249 -97 -126 318 121 -261 169 369 -153
3021 -153 -88 236 59 -126 54 49 10 36 -52 17 183 -54 -227 165 145 -313 -101 297 -119 -289 91 140 -187
3044 -187 -93 139 -78 -116 -21 -103 21 -2 -184 -81 226 -108 -286 210 111 -266 -44 213 -116 -122 102 -35 -35
$$ packed form
2888g6N5J01k39J31L11m15j55N86j98m10M03K84m89j50N86j63l47K57J37j07r1
2909A1p5P3J94k56r9M18j0o11K79M84m81l20O10L8n69K10L67k88j27K33j03n3
2931g5O8j73R7J66j76q5K67J7m05K33K45k64j07K37L6k38K66j63pK36j80j18L11
2954A88P8m80J68M76m21k67N33J6m27P1K91j40j13J36OOk7k29K79P3m46M6M85
2977C02k46m37M69K46n30k6M76k05l32K93J1j11N3Kr0J57m5k76L42R0l34L0L79
3000B18k28k35L76p1j68J29N0j53J28M5j88J88J58l46k9M44j97l82M30K00n22
3021a53O5L24j77j85J80nl9K6q8O9J66k37j73L92k0m58K12L98m16j70L80M9l27
3044a87R4K32k17l8R5q2J24k3j82J03L07l34j78M96r9l77K22K57l29oK24j37%
$$ plain form
3067 -35 72 18 -62 198 45 -164 198 182 -215 24 315 -93 -172 260 192 -161 45 146 -91 -6 10 -9 66
3090 66 45 -193 -16 88 -288 -219 189 -33 -300 68 196 -244 -157 172 -93 -171 -3 -35 -92 -26 -120 -114 139 12
3114 12 -241 110 181 -177 -26 225 -27 -107 146 93 -40 67 94 -27 133 80 -85 140 228 -139 -85 322 -34
3137 -34 -237 178 221 -182 -15 218 9 -112 7 -11 -11 87 -129 -34 91 -166 -239 80 35 -331 17 210 -194
3160 -194 -297 104 25 -238 -70 58 -160 -4 -14 -137 58 71 -138 -58 175 -154 -153 208 121 -219 91 198
3182 198 -165 -33 130 -6 -3 59 18 44 172 -13 -82 322 138 -264 129 277 -197 -82 223 63 -185 74
3204 74 60 -48 -20 -88 -97 24 -57 -185 7 109 -232 -139 184 -99 -291 90 54 -241 -94 75 -100 -73 44
3227 44 -97 11 102 -104 -112 212 54 -156 226 172 -166 7 242 -36 -74 196 57 -77 87 70 -31 114
$$ packed form
3067c5J07n4q0K60j53k09L62j6l97K39K91m08p9M32o8l53K06J01k37Q5J6j9P5
3090F6k1k38J77J04l76O9M08k22k67L68J28m40Q7L29k65p8J68l2n7O6r4OK53j27
3114A2k53L51P1l58J51K51k52q0K53n3j33J07K7j21J60n3j65K25Q8l67N4M07l56
3137c4k03M15M3m03J67K33k09j21J19j8%R8k16R5J25k57p3L19m5l66L48J93m04
3160a94j03M01p9k63J68J28k18J56j0j23J95J3k09Q0K33l29JL61q7l40L10J07
3182A98l63J32J63j36LO2m1K6J28j85o9M04j84m02L93J48m74J15L05j60k48K59
3204G4j4j08K8o8rJ21q1j28J92J02l41R3L23k83j92L81l6k95J47J69j75K7J17
3227D4j41J08R1k06qL24j58k10L82n4l38J73K35k78l8K70j39j34J64j7j01J45
$$ plain form
3249 114 36 -82 91 185 -237 -69 312 -94 -197 154 88 -226 -64 162 -112 -91 33 -80 -35 -37 -176 -25
3271 -25 104 -201 -197 146 -24 -269 13 204 -270 -210 137 24 -183 62 78 -90 55 40 -56 88 49 -129 31
3294 31 223 -118 -50 274 78 -104 84 146 -11 54 203 59 126 60 -91 74 161 -115 -146 220 16 -209 142
3317 142 226 -209 -83 228 -60 -171 24 -1 -113 -29 -111 -79 65 -133 -211 70 83 -285 -118 200 -91 -299
3339 -299 168 88 -154 101 156 -69 -29 111 -56 57 142 -53 62 218 -35 -140 190 194 -145 98 254 -23
3361 -23 -20 186 12 -15 133 36 -44 159 -38 -122 131 110 -155 34 193 -104 -212 112 82 -203 -23 28 -159
3384 -159 -53 -20 -127 -18 -8 -171 -29 113 -191 -156 185 30 -253 98 219 -143 -32 155 22 -94 117
3405 117 36 -57 79 9 -12 171 33 -84 183 190 -125 -54 194 8 -99 142 24 -119 72 52 -82 86 46
$$ packed form
3249A14p8j18J73R4m22J68L81m06j03L51o6l14J62K26k74K1J24j13M5kj39J51
3271b5J29l05ML43j70k45K82J91m74O0L47j13k07K45J6j68J45j5r6J44l9j78J60
3294C1J92l41O8L24j96j82J88O2j57O5J49j44O7o6j51J65Q7k76l1L66k04k25L51
3317A42Q4m35J26L11k88j11J95k5j12Q4q2L2J44j98p8K81J3l68J67L18k91k08
3339b99M67q0k42K55N5k25M0J40j67J13Q5j95J15J56k53j05L30Ml39K43J56k77
3361b3LK06j74k7J48r7q0K03j97q4K53k1k65J89J59k97j08L24l0k85J80N1j87
3384a59J06L3j07J09J0j63J42J42l04L5L41j55k83L51J21l62J11J87j33j16K11
3405A17q1r3J36p0k1J83j38j17K67Pl15P1K48j86j07K41j18j43J91k0j34J68m0
$$ plain form
3428 46 -153 18 130 -201 -69 144 -66 -271 81 59 -163 -80 114 -66 -97 23 -101 -93 5 -175 -26 150
3450 150 -39 -278 171 92 -295 27 233 -115 -173 189 55 -94 90 101 17 44 54 64 52 68 -15 54 200 -66
3474 -66 -25 195 56 -127 103 225 -116 -13 73 -13 -33 113 -41 -40 41 -12 -159 54 32 -197 -58 77 -104
3497 -104 -135 100 -24 -123 31 -18 -62 -10 -4 -105 62 22 -203 12 77 -180 -93 161 15 -189 141 192 -77 -42
3521 -42 218 16 15 63 14 86 166 -83 -26 201 -19 -96 176 69 -208 74 165 -27 -87 188 -24 -132 69 48
3545 48 -139 1 -39 -109 -4 20 -241 -68 83 -122 -150 98 -36 -171 -59 89 -119 -69 41 -149 -61 156
3567 156 -77 -80 133 -12 -134 154 38 -246 -9 280 -34 -41 191 74 -41 73 92 11 45 13 -2 138 46
3590 46 -88 72 149 -122 -113 218 63 -177 66 111 -114 -27 71 -110 -49 64 -79 -79 26 -91 -121 146 -4 -188
$$ packed form
3428D6j99J71J12l31J32K13k10k05L52k2k22Q3J94j80l1J20j24QR8j80J49J76
3450A50j89k39M49p9l87L22K06l48n8L62j34j49J84J1q4K7J0J0j2J6q3O9J46k66
3474f6M1K20j39j83K30J22l41J03Q6q6k0J46j54JQ1n3j47K13k2k29J39J35j81
3497a04l1K35j24r9J54m9m4N2Oj01J67m0k25K15O5k57Q7K54j46k04L30N1k69L5
3521d2K60k02jM8m9P2Q0k49N7K27k20p7K72j07k77K82R1j92o0K75k12j08K01k1
3545D8j87J40m0p0J05K4k61J73J51k05k8K48j34j35J12J48k08N0J10j90Q8K17
3567A56k33lK13j45j22K88j16k84K37K89l14pK32j17j15J14J9q1L4l2j5J40r2
3590D6j34J60P7k71RL31j55k40K43M5k25Q7R8j81O1J13j43%J05j17l0K67j50j84
$$ plain form
3614 -188 26 41 -152 -58 134 -37 -150 48 -62 -111 61 -5 -72 62 55 -132 48 174 -69 -27 208 -17 -120
3637 -120 184 87 -47 78 213 -13 22 94 9 24 77 -99 25 195 -53 -107 136 77 -246 49 153 -169 -99
3660 -99 133 -79 -91 58 -20 -23 -4 -95 -155 53 -14 -228 -51 149 -81 -145 62 -9 -165 34 114 -70 14 82 -32
3685 -32 21 119 -135 66 137 -15 -64 206 77 -149 79 173 -73 -40 213 20 -66 116 11 44 114 -68 -30 148
3709 148 2 -94 82 164 -245 -105 122 -117 -177 115 14 -102 12 19 -155 -21 34 -115 -20 60 -50 -61 143
3732 143 -15 -195 166 20 -148 57 57 -92 27 68 -113 4 85 -16 -24 164 -20 -56 107 152 -115 5 267
3755 267 -19 -94 217 74 -55 67 124 -53 -50 -46 -74 92 22 -47 41 162 -153 -108 90 -20 -243 69 73 -160
3779 -160 -41 48 -113 -136 82 -122 -99 39 7 -141 74 24 -108 61 153 -127 -65 149 -23 -20 107 26 -15 72
$$ packed form
3614a88K14J5j93R4J92j71j13J98j10m9J72o6o7J34pj87J80J26k43M2K35k25j03
3637a20L04r7j34J25J35k26L5P2q5J5N3j76J24J70k48n4K43n9l23K95J04l22P0
3660i9K32k12j2J49p8lJ9r1o0K08o7k14J77K00k30o4K07p1j56J99Q0j84Q4O8j14
3685c2N3R8k54K01P1j52m9K70j29k26K28R4k46L3K53j93q6J82j05L3P0j82L8J78
3709A48j46r6J76Q2m09J40K27k39o0K92j01j16J14Pj74J34N5j49R5Q0j10j1K04
3732A43j58j80L61j46j68K05%j49J19M1j81J17Q1j01qJ88j84l6J63M5k67J20K62
3755B67k86p5L11j43j29J22N7j77LMk8J66p0o9Q8J21l15M5J98j10k23L12Mk33
3779a60J19Q9j61k3K18k04K3J38l2j48K15n0j32J69R2k80O2K14j72LJ27q1m1Q7
$$ plain form
3803 72 107 -3 87 87 -143 26 211 -65 -77 223 37 -144 155 203 -119 43 61 -87 -60 33 10 -53 66 -80
3827 -80 -119 71 -58 -136 181 33 -257 -59 121 -126 -101 91 23 -134 -47 8 -170 -30 38 -64 -14 53 -157
3850 -157 -69 135 -18 -64 145 70 -109 125 130 -44 1 69 -24 69 143 -38 -32 170 8 -18 128 76 -110 28 131
3875 131 -53 -73 144 27 -81 -13 -24 -39 -7 -10 -109 50 -46 -169 -12 35 -156 -74 152 -46 -196 60 79 -159
3899 -159 -36 85 -102 -31 125 -95 -39 136 -115 -44 127 63 -50 82 142 -39 37 123 -38 -13 61 37 25 139
3923 139 5 8 129 36 -79 40 104 -119 -20 229 -92 -69 115 37 -118 -85 87 -116 -64 16 -78 20 10 -109
3947 -109 -93 87 -143 -117 68 17 -159 14 80 -121 -82 75 -11 -102 95 -32 -36 63 18 -31 62 104 -106 18 138
3972 138 -61 20 118 18 -62 109 111 -81 83 66 -37 34 80 -104 11 153 -47 -100 124 37 -107 58 86 -75
$$ packed form
3803G2L5j10R0%k30J69J85k76j2L00j86j81K99M8l22J62J8j48K7R3k3o3J19j46
3827h0l9J90j29p8L17j48k90J98J80k47K5J92o8j57Q7N5j78J40O8j02N0O7k10
3850a57Q8K04j53m6K09p5j79K34Nj74M5O8r3R3P4j81OK02j62k6J46n2j86J38J03
3875A31j84k0K17j17j08O8j1j5L2lr9J59r6j23J57M7j91Q2K26j98j50K56J9k38
3899a59J23J21j87P1J56k20N6J75k51P1J71o4j13J32O0j81P6Q6j61K5P4k4j2J14
3923A39j34LJ21r3j15J19O4k23R9K49l21K3J84p8j55L3J72k03N2Q0r4R8j0j19
3947a09J6J80k30K6J85n1j76J73O6k01L9J57q6r1J97j27mR9m5m9R3M2k10J24J20
3972A38j99Q1R8j00q0J71Kj92J64j7j03P1M6j84J15J42k00n3K24q7j44J65K8j61
$$ plain form
3996 -75 -56 100 -74 -97 46 -24 -148 53 -100 -111 84 -83 -225 -4 55 -177 -33 109 -54 -150 80 29 -172
4019 -172 53 59 -83 -5 108 -63 24 79 -15 -6 158 93 -79 73 78 -17 68 87 -73 9 106 10 -75 93 -36 -27 155
4046 155 38 -142 28 74 -126 -33 76 -40 -105 66 -27 -141 12 -16 -129 35 -53 -138 -32 -32 -98 -38 69 -104
4070 -104 -137 108 34 -156 56 77 -135 -21 136 12 -73 76 -10 19 52 30 -18 90 87 -63 79 106 -16 18
4094 18 153 19 -72 87 24 -17 73 106 -61 10 36 -77 28 84 -92 -81 141 -27 -82 67 34 -92 -40 63
4118 63 -124 -71 17 -69 25 93 -124 -165 69 -85 -113 22 71 -104 60 116 -98 -103 140 43 -97 45 57 -20 25
4143 25 76 -12 71 100 -120 43 183 -35 -52 122 131 -86 65 79 -81 15 93 -68 -62 73 -106 -113 52 -8 -138
4168 -138 42 23 -165 -24 87 -100 -45 79 -60 -77 40 -27 -102 -9 -57 -57 -70 -12 -153 21 173 -110 -54 152
$$ packed form
3996g5J9J56j74k3J43p0j24K01j53j1J95j67j42K21N9k32J44J42j63r6K30n1k01
4019a72K25Oj42P8J13j71Q7N5r4RJ64o5j72J52Nr5Q5J9j60Q2R7r6q5J68j29RJ82
4046A55j17j80J70M6k00R3J09j16o5J71r3j14J53k8j13J64q8q5J06%o6O0J07j73
4070a04l3K45p4j90K12K1k12J14J57j24q5J49q6K9L3k2m8J08lj50J42K7j22L4
4094A8J35j34r1J59o3m1R0L3j67P1K6j13J05N6j76J1K22j68n5J49l3j26N2J03
4118F3j87N3Q8q6R4O8k17m1K34j54k8J35M9j75J64N6k14nK43r7j40J42J2p7M5
4143B5N1q8Q3K9k20J63J40k18j7J74Rk17J51J4j60R6P8j61OJ35j79pJ65o0j30
4168a38J80j9j88J41J11j87N5J24j39j7J17o7p5R3m8%j3N8j41J74J52k83N6K06
$$ plain form
4192 152 -3 -111 89 58 -76 3 127 -36 -53 72 -14 -15 90 39 -25 122 28 -30 82 92 -117 26 82 -74
4216 -74 -41 58 -1 -84 123 -32 -54 79 6 -199 -4 75 -118 -87 79 -35 -192 37 12 -213 -28 29 -96 13
4240 13 -57 -83 -43 57 -13 -94 50 -50 -47 107 83 -195 24 155 -73 -78 115 2 -46 99 9 -7 92 43 -61
4265 -61 98 141 -49 35 93 -103 -90 165 -22 -63 35 44 -36 -23 59 -148 -72 93 -80 -105 59 -99 -87 107 55
4290 55 -133 36 133 -124 -112 106 -31 -92 0 21 -72 16 -47 -75 50 7 -163 38 164 -138 58 138 82 -62
4314 -62 128 129 -23 89 110 -14 77 137 -85 7 73 -82 -64 132 30 -123 117 91 -106 24 36 -8 -16 54 16
4339 16 -75 32 -15 -70 66 -9 -193 96 46 -161 -85 101 -68 -104 13 -21 -118 9 105 -64 54 60 -71 48
4363 48 61 -85 37 133 -94 -32 61 13 -175 6 193 -65 33 163 15 -25 109 -44 -38 39 -5 -69 49 51 -95
$$ packed form
4192A52j55j08K00l1j34P9J24j63j7J25q6jJ05n1o4J47r4n8J12J0k09J43N6j56
4216g4L3R9n9q3K07j55k2J33p3k05J95P9j93L1J66j14j57K29k5k25J85N7j25J09
4240A3p0k6M0J00p0q1J44j00LJ54k4k78K19J31k28nJ93j13m8J45r0j6R9m9j04
4265f1J59M3j90Q4N8j96J3K55j87m1R8Rq0J3Q2k07P6J65j73k5J64j58J2J94n2
4290E5j88J69R7k57J2K18j37o1R2K1r3Q8o3k8J25m3j70K01J26l02J96Q0n6j44
4314f2J90Jj52J12K1j24R1O0k22R2O6j55J8J96j02j53K40k6j97J30J2m4qP0l8
4339A6r1J07m7n5J36p5j84K89n0k07P6J86j69l6J17l4r7J27R6j69J18Oj31J19
4363D8J3j46J22R6k27O2R3m8j88J81J87k58R8J30j48m0J34j53OP7m4o4J18Kj46
$$ plain form
4388 -95 64 54 -69 -82 110 -81 -115 91 6 -156 10 54 -132 -24 86 -141 -89 63 -127 -160 82 -47 -65
4411 -65 83 85 -111 13 56 -53 2 6 -67 -41 91 1 -30 127 -4 -48 88 70 -82 8 161 5 -125 111 42
4436 42 -78 9 65 -8 16 27 24 50 89 -115 -32 87 -73 -91 76 78 -158 39 -27 -114 -33 57 -8 -65 29 -127 -105
4463 -105 32 -50 -169 52 28 -207 -4 98 -107 -74 67 -48 -60 -7 29 -55 21 51 -102 39 122 -43 64
4486 64 104 -45 -25 138 47 -120 89 78 -51 22 98 8 -1 134 -47 -94 63 -71 -89 116 61 -132 43 82 -143
4511 -143 -43 23 -76 -124 64 -56 -147 59 5 -112 43 -14 -113 -54 90 -92 -99 101 -4 -75 58 14 -67 14 41
4536 41 -69 -9 59 -106 -18 74 -49 -31 87 33 -64 70 89 -120 56 104 -57 -50 102 -37 -46 29 -7 -109 82
4561 82 17 -123 70 32 -33 -59 86 -62 -139 63 -20 -111 0 39 -92 -3 102 -147 -76 35 -15 -31 96 -30
$$ packed form
4388i5J59j0j23j3J92j91l4K06q5j62J66M4j86J08J10k27N2J52j90l3K42j29j8
4411f5J48Kj96J24M3j09N5Mp3K6J32r0l1J57j31m4J36j8j52R0J53j56j30K36o9
4436D2j20Q7N6p3K4J1lK6L9k04Q3J19j60j8J67Kk36J97o6q7Q1R0o5n7R4j56K2
4463a05J37q2j19K21k4k35K03J02k05L3J41j15j2N3L6q4P6L0j53J41Q3j65J07
4486F4M0j49K0J63r1j67K09j1j29P3P6r0rJ35j81m7J57j34j8K05n5j93J75L9k25
4511a43J00O6r9m8J88j20r1K06n4j17J55n7r9N9J44j82pK00j05p1J33m4q1Q1K7
4536D1j10O0O8j65Q8R2j23J8J18n4r7J34J9k09J76M8j61PJ52j39rP5l6j02J91
4561H2o5j40J93l8o5k6J45j48p7K02q3r1J11L9j31Q9J05k49P1J11n0j6J27j26
$$ plain form
4585 -30 -51 34 -50 -135 76 119 -15 31 69 -29 -78 157 15 -37 118 100 -6 56 100 -88 47 160 -100 -86 114
4610 114 -2 -34 9 -13 -126 2 56 -44 -20 -11 -78 -27 43 -95 -83 57 -41 -148 24 47 -173 -109 53 -72 -58
4635 -58 70 -17 -99 49 -22 -53 2 53 -60 62 94 -39 -47 66 42 -29 165 53 -39 110 130 -82 65 140 -55
4660 -55 77 83 -56 -28 164 -4 -66 116 86 -62 -6 90 -68 -35 38 13 -5 67 -10 -74 40 -12 -123 44 66 -96
4686 -96 40 73 -138 -73 134 -88 -90 94 38 -150 38 61 -55 -36 82 -45 -30 70 -73 -22 115 71 -129 110
4710 110 72 -63 84 148 -35 63 129 -12 5 105 -69 -83 22 -24 -159 51 7 -73 36 108 -62 -125 89 -28
4734 -28 -106 57 17 -43 -87 58 -133 -49 29 -92 -79 77 -74 -144 58 -2 -160 -2 84 -170 -5 73 -82 -18
4758 -18 53 -2 -88 43 23 -67 77 120 -5 46 163 -40 18 113 -39 7 42 73 -78 80 61 -82 33 80 -119
$$ packed form
4585c0k1Q5q4q5K11M3j34M6L8r8m9K35j42n2J55j8j06O2M4j88J35J13k60J4K00
4610A14j16l2M3k2j13J28N4j00K4Ro7N1P0j38J2J40r8j07J72K3k20O4J62j25J4
4635e8J28q7q2J48p1l1N5N1j13J22L2j33qJ13k4p1J94j12r2J49K0k12J47P5j95
4660e5J32Oj39K8J92j68o2J82l0j48N6R6j58L3P3k5j8P2p7o4J14n2j11J67K2j62
4686i6J36L3k11O5K07k22kJ84n6j88J88K3j16J9J18j27J5J00j43N1J37m4k00K39
4710A10l8j35J47O4j83R8O6j41J7J00j74j4J05m6j35K10m4q0J09P2j70o3K14j17
4734b8p8J63m0o0m4J45j91Q4P8j21J3J56j51p0K02o0j58J58Q6k54J65P8j55O4
4758a8P1n5q6J31k0r0J44M3j25N1J17k03N8R5j52M6L5L1j51J58j9j43J15M7j99
$$ plain form
4783 -119 -43 93 -51 -100 55 -14 -123 29 20 -133 -90 34 2 -43 30 -86 -31 40 -50 -105 39 -1 -102 18 -35
4808 -35 -151 -104 105 -103 -18 68 35 -73 -33 105 -40 -13 21 -4 42 165 -19 -27 106 52 -40 32 21 -36 56 105
4834 105 -64 38 159 -100 -119 18 -55 11 39 22 -119 75 73 -147 -1 70 -35 -83 18 -43 -108 -28 20 -82
4858 -82 32 -52 -165 49 82 -107 -69 89 -91 -52 110 12 -58 26 113 -8 2 103 -15 -19 150 -13 -16 47 48 -53
4884 -53 44 99 -38 73 125 -51 -6 66 -22 -70 50 -26 -38 40 -4 -94 66 6 -105 -23 49 -99 -170 30 26 -122
4910 -122 6 40 -137 -62 17 -119 -14 68 -88 -40 3 -29 -70 84 36 -93 70 53 -110 -7 144 10 51 57
4934 57 53 -54 80 35 -84 70 -2 -12 104 66 -20 25 137 29 -76 129 21 14 98 54 -31 19 26 -98 -38 -8
4960 -8 -25 -67 32 -35 -132 24 -37 -106 32 47 -85 -88 39 -41 -47 28 -8 -5 72 21 -86 88 18 -42 48 87 -40 -24 98
$$ packed form
4783a19P6J36j44m9J55o9j09J52rj53M3J24l2m5P3j16N5P1r0n5J44m0j01J20n3
4808c5j16M7K09k08Q5Q6l3j08M0J38j45K7L4k5M6J23j84qJ33n4r2P2j1n7R2M9
4834A05j69J02J21k59j9J37p3O6K8j7j41J94kk20J46P1j05m8J01o1o5Q0M8j02
4858h2J14q4j13K14L3j89L8J58j80L9J62r8p0Q4Q7j21J0J01j18mJ69j63lO3Jj01
4884e3R7N5j37J11N2j76M5P2q8m8J20p6j2P8m4r0J60o0j11Q2P2j48p1K00mj48
4910a22J28L4j77P5P9j36J05Q2j56M8M3l2m1J54m8j29J63j7j63J03J51j34M1O
4934E7mj07J34m5j19J54p2j0J16l8q6M5J12j08j05K05j08pQ4m4q5N0Pj24O0L0
4960hj7m2R9o7r7J56o1o9J38J5j32lJ27q0oP5l6LP7n1j07J74p0o0R0L9j27J6J22
$$ plain form
4989 98 16 -111 126 64 -41 61 168 -2 -21 69 -24 6 77 -12 -34 160 41 -39 40 14 -68 -7 71 -71 -27 47
5015 47 -74 -69 55 -39 -15 52 -30 -109 21 28 -130 -141 61 -133 -69 -66 -59 -122 -5 -3 -122 24 34 -106 -54 37 -12 -6
5043 -6 61 -37 -50 44 122 -28 92 81 -117 45 136 -26 -16 141 21 -38 113 64 -33 -42 91 -48 -25 108 -65
5068 -65 -47 87 -49 -104 11 12 -55 -28 -31 -68 61 -39 -100 -80 104 -111 -88 55 24 -104 -48 38 -129 8 91 -40
5094 -40 -3 53 38 -35 38 37 -108 89 56 -26 41 81 -61 14 157 4 -78 71 54 -29 36 32 -19 -32 45 -67 -41 97
5122 97 -83 29 73 8 -134 84 34 -67 8 17 -85 -22 6 -105 -106 83 -95 -12 19 -50 -122 22 61 -165 -73 43
5148 43 -79 -62 110 23 -40 33 74 -45 -3 24 -58 73 56 6 -10 88 54 -97 77 13 -123 54 89 -48 8 140
5174 140 -35 43 104 -15 -65 92 -10 -76 67 -15 -88 -34 30 -81 -56 -35 -96 -12 37 10 -83 27 -57 -92 30 -7
$$ packed form
4989I8q2j27K37o2j05J02J07j70j9R0r3L0P1q9k2J94j19q0P9k6q2O1P8j42M4P4
5015D7j21NJ24r4K4O7q2p9J30Pj58j1K02j94O4LPo3J17Kj19J46J0j40N2R1m9O
5043fO7r8j3R4P8j50J20j1j98J62R1j62J0J57j20n9J51m9r7rJ33j39K3J33j73
5068f5J8J34j36n5J15Jo7K7ll7J29j00o1K0J84k15K3J43l1j28N6Q6j67J37Q3j31
5094d0L7N6j5p3P3jj45J97l3q2O7M0j42P5J43j53q2J49j7q3O5mn1j3P7j12K6J38
5122I7j80J12M4o5j42K18n0j01P5Rj02O3K8j11jJ89j78Q3L1o9p2J44L9k26R2J16
5148D3j22J7J72q7o3P3M1j19M2K7q2J31j7n0j6R8l4j51J74o4j36J77L5j37N6J32
5174A40j75P8O1j19n0J57j02o6J43q2p3N4O4j11K5K1o1Q4M9k7r3J10q4l5J22l7
$$ plain form
5200 -7 -158 28 139 -74 -74 57 -10 -59 109 43 -78 12 22 -65 36 68 -26 -16 141 58 -24 118 47 -26 68 62 -73
5227 -73 41 60 -20 -85 74 23 -100 26 40 -57 18 -4 -29 -34 66 -62 -92 7 -10 -34 69 -18 -75 24 55 -124 -12
5254 -12 21 -41 -27 -14 -118 -99 -6 -66 -91 17 53 4 -12 29 -25 15 74 24 -9 69 -1 2 106 28 -93 80 112 -82
5282 -82 10 89 -88 -57 104 -2 6 39 66 -25 38 -4 -19 31 60 -57 -40 60 -14 -81 54 4 -139 54 21 -91
5308 -91 -51 66 -127 -39 63 -24 -50 36 -57 -44 37 49 -28 -17 14 -131 -59 91 2 -38 32 23 -57 -34 79 -45 53
5335 53 95 -38 69 92 -39 -10 50 42 -53 113 5 -100 36 53 -73 -26 23 -10 -100 37 19 -59 50 12 -136
5360 -136 47 36 -113 -4 19 -23 -72 129 -73 -79 -7 30 -111 5 47 -113 -2 11 -77 -45 93 35 -13 95 -29
5385 -29 -60 48 35 -46 3 58 20 -28 129 17 -71 132 76 -55 70 28 -65 22 92 -24 -45 44 8 0 46 30 -91
$$ packed form
5200gj51J86J11k13%J31o7m9J68o6j21R0J0q7J01L2r4J0J57q3q2J42p1p3R4oj35
5227g3J14J9q0o5J59n1j23J26J4r7P5k2k5nJ00j28l0R9j7k4J03q7n7R9L1j79J12
5254a2L3o2J4J3j04J9R3o0k5J08L6m9j6M1n4M0N9n0l3P8p0LJ04p8j21J73L2j94
5282h2R2P9j77L1J61j06QL3K7r1O3m2j5N0K9j17J7J00p4o7J35n0j43J93l3j12
5308i1M0J17j93Q8J02q7k6Q6r3J3Q1J2p7J1L1j45P2J50q9m0P0rq0K3J13j24R8
5335E3M2j33J07K3j31K9O0qr5J66j08j05J36J7j26M7M9l3r0J37j8p8J09l8j48
5360a36J83j1j49J09K3m2m9K01k02oP2L7j41J16M2j60J11J3q8L2J38n8m8J08j24
5385b9l1J08j3q1M9N5l8m8J57j12q8K03n6j31J25m2r3Q7P0j16k1Q9l6qM6j6j21
$$ plain form
5412 -91 -46 -34 -48 -38 -28 -89 -64 39 -132 -89 -16 -14 -113 45 55 -62 -51 30 -71 -39 63 -29 -51 25 -12 31 64 52
5440 52 -74 36 65 -57 -8 50 -19 -22 120 29 -23 101 55 -46 39 35 -49 52 83 -47 -35 66 -12 -38 62 11
5466 11 -53 14 116 -102 -42 52 -41 -24 1 -31 -51 30 4 -87 51 3 -90 73 40 -63 -50 70 17 -65 7 25 -46
5493 -46 86 37 -10 131 -27 -36 54 57 17 -22 103 4 -39 79 83 -43 46 70 -34 5 140 -41 -13 65 -16 -53 37
5520 37 6 -112 49 46 -104 32 63 -40 -31 123 -30 -42 4 -20 -12 12 29 -90 1 2 -117 -76 64 -26 -43 41 -10
5547 -10 -22 -24 65 -20 28 92 -39 -19 51 -90 -75 114 9 -50 69 76 -2 -10 74 -32 -30 85 -32 10 64 -1 -20 116
5575 116 92 -48 19 22 -54 -5 19 -65 -73 34 -43 -43 84 -4 -58 -27 41 -85 1 -2 -41 -24 46 -72 -55 -20 -8 -85 71
5604 71 34 -116 -62 46 23 -90 118 46 -16 46 22 -21 103 29 -63 1 102 -40 47 62 -16 -12 75 -14 -38 28 -35
$$ packed form
5412i1M5J2j4J0J0o1K5J03j71M3P3Kr9J58J0j17J1Q1j01L2J02r2k2P6l7M3L3j2
5440E2j26J10K9j22M9N8o9lJ42r1n2J24m6j01Q5mq4J01L1j30J2J01p8k6J00n1
5466A1o4O7J02k18O0R4r3J7K5l2k0Q1k6r1J38m8r3J63l3j03J3J20n3q2P2J8p1
5493d6J32m9m7J41j58rR0Lm0l9J25r9m3J18Mj26Q9K4j04L9J35j81K8P8q1l7R0
5520C7l1j18J61lj50J36L1j03RJ54j53j2M6k4QK4J7j19R1Jj19M1J40r0j7Q4n1
5547a0j2kQ9q5M8O4j31K0P0j41J5J89j05n9J19Pp8qQ4j06KJ15j17M2N4o5j9J36
5575A16k4j40O7Lp6M9K4q4qJ07p7%J27q8n4L1O8j26Q6ll9J7P0j18J7L5J2p7J56
5604G1l7j50N4J08k3j13K08p2o2O2k4m3J24p4r2O4J01j42Q7J5p8MQ7q9k4O6o3
$$ plain form
5631 -35 -77 -40 29 -56 20 38 -35 -33 59 -48 -78 -10 -2 -113 -11 51 -22 -58 36 -28 -59 -12 -85 -61 44 -71 -63 78 72
$$ packed form
5631c5m2L7O9q5P6J8p3KR2j07l0O8Qj11J02O2p3l6R4o4l1M7p3K4J05j15QJ41o
$$ [...]
8191e9
##END NTUPLES=NMR FID
##END=
