##TITLE=1H_CA-8602-2
 DMSO, 8 sc, 
 31.5.2019
##JCAMPDX= 6.0         $$ Bruker NMR JCAMP-DX V2.0
##DATA TYPE= NMR FID
##DATA CLASS= NTUPLES
##ORIGIN= UXNMR, Bruker Analytische Messtechnik GmbH
##OWNER= root
$$ XWIN-NMR		Version 3.5
$$ Fri May 31 14:10:38 2019 Russian Standard Time (UT+4h)  she@DPX200
##.OBSERVE FREQUENCY= 200.13155
##.OBSERVE NUCLEUS= ^1H
##.DELAY= (6, 6)
##.ACQUISITION MODE= SIMULTANEOUS
##.ACQUISITION SCHEME= undefined
##.AVERAGES= 8
##.DIGITISER RES= 18
##SPECTROMETER/DATA SYSTEM= spect
##.PULSE SEQUENCE= zg30
##.SOLVENT NAME= DMSO
##.SHIFT REFERENCE= (INTERNAL, DMSO, 0, 15.7039)
##AUDIT TRAIL= $$ (NUMBER, WHEN, WHO, WHERE, WHAT)
$$ ##TITLE= Audit trail, XWIN-NMR		Version 3.5
$$ ##JCAMPDX= 5.01
$$ ##ORIGIN= Bruker BioSpin GmbH
$$ ##OWNER= she
$$ F:/spectra/data/she/nmr/H-F/1/audita.txt
$$ ##AUDIT TRAIL=  $$ (NUMBER, WHEN, WHO, WHERE, WHAT)
(   1,<2019-05-31 14:09:23.25 +0400>,<she>,<DPX200>,
      <created by zg, POWCHK disabled, PULCHK disabled
       configuration hash MD5:
       00 E9 B6 7A A2 85 ED C7 34 08 36 98 17 FE 4E 26
       data hash MD5: 16K
       0E A2 07 D8 9D FD DF 41 94 F2 B4 7B E7 F9 1C B1>)
$$ ##END=
$$ 
$$ hash MD5
$$ 2C E2 4E 72 5E A0 7D 17 C9 D9 60 C9 5A E1 11 25
##$RELAX= 
##$RELAX= 
##$RELAX= 
##$RELAX= 
##$RELAX= 
##$RELAX= 
$$ Bruker specific parameters
$$ --------------------------
##$DU= <F:/spectra>
##$EXPNO= 1
##$NAME= <H-F>
##$PROCNO= 1
##$TYPE= <nmr>
##$USER= <she>
##$AMP= (0..31)
100 100 100 100 100 100 100 100 100 100 100 100 100 100 100 100 100 100 
100 100 100 100 100 100 100 100 100 100 100 100 100 100 
##$AQSEQ= 0
##$AQ_mod= 1
##$AUNM= <au_zg>
##$AUTOPOS= <>
##$BF1= 200.13
##$BF2= 200.13
##$BF3= 200.13
##$BF4= 200.13
##$BF5= 200.13
##$BF6= 200.13
##$BF7= 200.13
##$BF8= 200.13
##$BYTORDA= 1
##$CFDGTYP= 0
##$CFRGTYP= 5
##$CHEMSTR= <none>
##$CNST= (0..31)
1 1 145 1 1 1 1 1 1 1 1 1 1 1 1 1 1 1 1 1 1 1 1 1 1 1 1 1 1 1 1 1 
##$CPDPRG= <>
##$CPDPRG1= <>
##$CPDPRG2= <>
##$CPDPRG3= <>
##$CPDPRG4= <mlev>
##$CPDPRG5= <mlev>
##$CPDPRG6= <mlev>
##$CPDPRG7= <mlev>
##$CPDPRG8= <mlev>
##$CPDPRGB= <>
##$CPDPRGT= <>
##$D= (0..31)
0 1.2 0 0 0 0 0 0 0 0 0 0.03 0 0 0 0 0 0 0 0 0 0 0 0 0 0 0 0 0 0 0 0 
##$DATE= 1559297362
##$DBL= (0..7)
120 120 120 120 120 120 120 120 
##$DBP= (0..7)
150 150 150 150 150 150 150 150 
##$DBP07= 0
##$DBPNAM0= <>
##$DBPNAM1= <>
##$DBPNAM2= <>
##$DBPNAM3= <>
##$DBPNAM4= <>
##$DBPNAM5= <>
##$DBPNAM6= <>
##$DBPNAM7= <>
##$DBPOAL= (0..7)
0.5 0.5 0.5 0.5 0.5 0.5 0.5 0.5 
##$DBPOFFS= (0..7)
0 0 0 0 0 0 0 0 
##$DE= 6
##$DECBNUC= <off>
##$DECIM= 24
##$DECNUC= <off>
##$DECSTAT= 4
##$DIGMOD= 1
##$DIGTYP= 9
##$DL= (0..7)
0 120 120 120 120 120 120 120 
##$DP= (0..7)
150 150 150 150 150 150 150 150 
##$DP07= 0
##$DPNAME0= <>
##$DPNAME1= <>
##$DPNAME2= <>
##$DPNAME3= <>
##$DPNAME4= <>
##$DPNAME5= <>
##$DPNAME6= <>
##$DPNAME7= <>
##$DPOAL= (0..7)
0.5 0.5 0.5 0.5 0.5 0.5 0.5 0.5 
##$DPOFFS= (0..7)
0 0 0 0 0 0 0 0 
##$DQDMODE= 0
##$DR= 18
##$DS= 0
##$DSLIST= <SSSSSSSSSSSSSSS>
##$DSPFIRM= 0
$$ [...]
##$SUBNAM2= <"">
##$SUBNAM3= <"">
##$SUBNAM4= <"">
##$SUBNAM5= <"">
##$SUBNAM6= <"">
##$SUBNAM7= <"">
##$SUBNAM8= <"">
##$SUBNAM9= <"">
##$SW= 24.9336996594482
##$SWIBOX= (0..15)
0 0 2 0 0 0 0 0 0 0 0 0 0 0 0 0 
##$SW_h= 4990.01996007984
##$TD= 16384
##$TD0= 1
##$TE= 0
##$TE2= 300
##$TE3= 300
##$TEG= 300
##$TL= (0..7)
0 120 120 120 120 120 120 120 
##$TP= (0..7)
150 150 150 150 150 150 150 150 
##$TP07= 0
##$TPNAME0= <>
##$TPNAME1= <>
##$TPNAME2= <>
##$TPNAME3= <>
##$TPNAME4= <>
##$TPNAME5= <>
##$TPNAME6= <>
##$TPNAME7= <>
##$TPOAL= (0..7)
0.5 0.5 0.5 0.5 0.5 0.5 0.5 0.5 
##$TPOFFS= (0..7)
0 0 0 0 0 0 0 0 
##$TUNHIN= 0
##$TUNHOUT= 0
##$TUNXOUT= 0
##$USERA1= <user>
##$USERA2= <user>
##$USERA3= <user>
##$USERA4= <user>
##$USERA5= <user>
##$V9= 5
##$VALIST= <valist>
##$VCLIST= <CCCCCCCCCCCCCCC>
##$VD= 0
##$VDLIST= <DDDDDDDDDDDDDDD>
##$VPLIST= <PPPPPPPPPPPPPPP>
##$VTLIST= <TTTTTTTTTTTTTTT>
##$WBST= 1024
##$WBSW= 4
##$XGAIN= (0..3)
0 0 0 0 
##$XL= 0
##$YL= 0
##$YMAX_a= 237893
##$YMIN_a= -400756
##$ZGOPTNS= <>
##$ZL1= 120
##$ZL2= 120
##$ZL3= 120
##$ZL4= 120
##$ABSF1= 10
##$ABSF2= 0
##$ABSG= 5
##$ABSL= 3
##$ALPHA= 0
##$AQORDER= 0
##$ASSFAC= 0
##$ASSFACI= 0
##$ASSFACX= 0
##$ASSWID= 0
##$AUNMP= <proc_1d>
##$AZFE= 0.1
##$AZFW= 0.1
##$BCFW= 1
##$BC_mod= 2
##$BYTORDP= 1
##$COROFFS= 0
##$CY= 11.3945322036743
##$DATMOD= 1
##$DC= 2
##$DFILT= <>
##$DTYPP= 0
##$F1P= 18.9103706918063
##$F2P= -1.10871071338519
##$FCOR= 0.5
##$FTSIZE= 0
##$FT_mod= 4
##$GAMMA= 1
##$GB= 0.15
##$INTBC= 1
##$INTSCL= 1
##$ISEN= 128
##$LB= 0.24
##$LEV0= 0
##$LPBIN= 0
##$MAXI= 10000
##$MC2= 0
##$MEAN= 0
##$ME_mod= 0
##$MI= 1.114404
##$NCOEF= 0
##$NC_proc= 0
##$NLEV= 6
##$NOISF1= 3.799351
##$NOISF2= 2.8
##$NSP= 1
##$NTH_PI= 0
##$NZP= 0
##$OFFSET= 15.70392
##$PC= 1
##$PHC0= -8508.377
##$PHC1= 23.60023
##$PH_mod= 1
##$PKNL= yes
##$PPARMOD= 0
##$PSCAL= 0
##$PSIGN= 0
##$REVERSE= no
##$SF= 200.130013532006
##$SI= 16384
##$SIGF1= 3
##$SIGF2= 2
##$SINO= 400
##$SIOLD= 16384
##$SREGLST= <1H.CDCl3>
##$SSB= 0
##$STSI= 0
##$STSR= 0
##$SW_p= 3612.71676300578
##$SYMM= 0
##$S_DEV= 0
##$TDeff= 0
##$TDoff= 0
##$TI= <>
##$TILT= no
##$TM1= 0
##$TM2= 0
##$TOPLEV= 0
##$USERP1= <user>
##$USERP2= <user>
##$USERP3= <user>
##$USERP4= <user>
##$USERP5= <user>
##$WDW= 1
##$XDIM= 8192
##$YMAX_p= 0
##$YMIN_p= 0
$$ End of Bruker specific parameters
$$ ---------------------------------
##NTUPLES= NMR FID
##VAR_NAME=  TIME,          FID/REAL,        FID/IMAG
##SYMBOL=    X,             R,               I
##VAR_TYPE=  INDEPENDENT,   DEPENDENT,       DEPENDENT
##VAR_FORM=  AFFN,          ASDF,            ASDF
##VAR_DIM=   8192,          8192,            8192
##UNITS=     SECONDS,       ARBITRARY UNITS, ARBITRARY UNITS
##FACTOR=    0.0002004,     1,               1
##FIRST=     0,             0,               0
##LAST=      1.6414764,     0,               0
##MIN=       0,             -400756,         0
##MAX=       1.6414764,     237893,          0
$$ Real data points
##PAGE= N=1
##DATA TABLE= (X++(R..R)), XYDATA
$$ [...]
2532A881j995k098J675L469j294m185l48M315J903l636l165K266L876j527l733
2547b596O48L412N89l123j387K725K195k296l099J579L715m76l313j117K520K413
2563B389j400k359k19K084J353j662j064j8J103K68j80o13K31m26o5Q88P96o82
2581D24j537m13K089J602j508k751L50L076J232k849j925J922K768j160k779K93
2597a166K569J32k566n90K936J244l424k147K713L441j729m239J34M262R96l447
2613h81k393L348K825k944l196J825M136p65m370k85M381J534l709k994K545M051
2629C108j169l570l80K517J179j514j003Q69M96r87k23J391P51k031j290J914
2645E8K219q62k892p54K970K136j464l587L17K956J351k047k045M84K551N0k257
$$ plain form
2532 1881 -114 -2212 -537 2932 1638 -2547 -2895 1420 3323 -313 -3478 -1212 2664 1137 -2596
2547 -2596 -1948 1464 2053 -1070 -2457 268 2463 167 -2932 -1353 2362 1886 -1427 -2544 -24 2389
2563 2389 989 -1370 -1589 495 1848 186 -878 -896 207 475 295 -318 -87 -513 -578 310 1106 424
2581 424 -1113 -1526 563 2165 657 -2094 -1744 1332 2564 -285 -2210 -288 2480 1320 -1459 -1166
2597 -1166 1403 1535 -1031 -1621 1315 2559 -865 -3012 -299 3142 1413 -2826 -2692 1570 2566 -881
2613 -881 -3274 74 2899 -45 -3241 -1416 2720 1955 -2415 -2700 1681 3215 -494 -3488 -943 3108
2629 3108 1939 -1631 -2011 506 1685 171 -832 37 533 -454 -677 714 1465 -566 -1856 58
2645 58 2277 1415 -1477 -2231 739 2875 1411 -2176 -1859 1097 2448 401 -1644 -1160 1391 1441 -816
2662h16n40K070R50k053j448J514J922j041k483L26L283N04l240j790K872K482
2678B512j548k724O02K706l51k456o1K524R22l125j373L236K208k806l258J623
2694a369M154l64m318j516L774K610k562k950J249K212p28j510R11J630j098k176
2710b051P10L626j73m077j586M152L212k334m465J87M720J876l477l680J748L785
2726B173k2k700j270J629J632j336j300N68J245k89j246k62J625O61j535j232
2742a659J553J608m00k213m07K061R97j621p55Q46J045j044j272J349K107j826
2758C69k531R67L379J31l577j637K797L336j842l807M52L704N58k836j050K079
2774D92P77j506j053J959J580k299k400J556L743r37m091q05M206K200l129l206
$$ plain form
2662 -816 -1356 714 1664 -389 -1837 -323 1599 558 -1925 -1599 1684 2188 -1052 -2842 30 2512
2678 2512 964 -1760 -1158 1548 1197 -1259 -1320 1204 2126 -999 -2372 864 3072 266 -2992 -1369
2694 -1369 2785 2421 -1897 -3413 361 2971 409 -2541 -1292 920 192 -1318 -407 1223 125 -2051
2710 -2051 -1341 2285 2112 -1965 -3551 601 3813 1479 -2986 -2799 1921 3797 320 -3360 -1612 2173
2726 2173 2151 -549 -1819 -190 1442 106 -1194 -626 619 330 -916 -1178 447 1108 -427 -1659
2742 -1659 -106 1502 1102 -1111 -1518 543 1540 -81 -836 10 1055 11 -1261 88 2195 369
2758 369 -2162 -1195 2184 2315 -1262 -2899 -102 3234 1392 -2415 -1963 1741 2299 -537 -1587 492
2774 492 1269 -237 -1290 669 2249 -50 -2450 -894 2849 1912 -2179 -2984 1222 3422 293 -2913
2790b913J428L443J63l566p52K700J112j685j333J313J296n42j323j76J622O22
2806A409j762o28J205J059r95j094M32P14%q30J2J104n3j433n51J569J483j405
2824B36k471M76K852J238k616k718J701L674k39l406j452K944K190j327k783N09
2840a192K238J71j693k15J885k90k064l70K823R63k733k345K058L454p57m041
2856b108m23K945K003j927k487J157J962m96j254K59J243o30j616Q39K125j51
2872A441k538j151K419J887j313k536N66K295L22j908p00J312O01r18q08J076
2888D7Q82q30j834Q23K657L97k845k026K140L106n9l663j621K462L295o87l669
2905a425p20K676J451j222j919K82J463m27r03J035O52j026j880J109K710l57
$$ plain form
2790 -2913 -1485 1958 2121 -1445 -2197 503 1615 -70 -1403 -90 1206 664 -659 -835 787 1409
2806 1409 -353 -981 224 1283 288 -806 -374 340 340 -490 -478 626 573 -860 -1411 158 1641 236
2824 236 -2235 -1759 1093 2331 -285 -3003 -1302 2372 2133 -1273 -2725 219 2409 1082 -1701 -1192
2840 -1192 1046 1217 -476 -691 1194 904 -1160 -1530 1293 2256 -477 -2822 -764 2690 1933 -2108
2856 -2108 -2531 414 2417 490 -1997 -840 1122 626 -628 -369 874 244 -1372 -533 1592 1441
2872 1441 -1097 -2248 171 2058 745 -1791 -1225 1070 1392 -516 -1216 96 697 -221 -1029 47
2888 47 929 99 -1735 -912 1745 2142 -703 -2729 -589 2517 2458 -1205 -2826 -364 2931 2244 -1425
2905 -1425 -2145 531 1982 760 -1159 -877 586 159 -744 291 943 -83 -1963 -854 1856 1499
2921A499k859j362L057K440k067l235O72L450L58k748j243K333J470j781j636
2936a652J547J844j273k209Q94K582j30k760n96K420J343j847j892J200K298q41
2952I28k082J61K244qk188n21J995J567j723k804P91L316M76k956j658J953K448
2969A939p27k260q88J830J765j607p04K1P89Q6m86M64M86r22j152J043J831J0
2987A518k452j242K125K317j320k865J97K839J086k690j618K044J959j545k390
3002b037J287K833r69l127k30L761J631l328l199K337L751r81l608j52K771J355
3018B095k039j610J529J092j354j151J977J596j841k613J150L538L02l909j940
3033c178K648L330j121l361p79K742J735j507j512j8J044L40k45K23M9j086n48
$$ plain form
2921 1499 -1360 -2722 335 2775 708 -2527 -1855 1595 1953 -795 -2038 295 1765 -16 -1652
2936 -1652 -105 1739 466 -1743 -849 1733 1603 -1157 -1753 667 2010 163 -1729 -529 1769 928
2952 928 -1154 -993 1251 1243 -945 -1466 529 2096 373 -2431 -1640 1676 2152 -804 -2462 -509 1939
2969 1939 1212 -1048 -1936 -106 1659 52 -652 -631 158 244 -242 222 708 -214 -1366 -323 1508 1518
2987 1518 -934 -2176 -51 2266 946 -1919 -1722 1117 2203 -487 -2105 -61 1898 353 -2037
3002 -2037 -750 2083 1114 -2013 -2243 1518 3149 -179 -3378 -1041 2710 1729 -1879 -2031 740 2095
3018 2095 56 -1554 -25 1067 -287 -1438 539 2135 294 -2319 -1169 2369 2671 -1238 -3178
3033 -3178 -530 2800 1679 -1682 -2461 281 2016 509 -1003 -1021 23 363 118 341 390 -696 -1244
3050a244J421J636q22k452m75K595J941j982k489O7L027J110k512j747J668J870
3066A612o47j796j5J944K61k152n96K258J359k335k235J491L042l62l280j049
3082b500K847J962j849k190P92K152m28j887J97J825p7k355P0K773N50k766j799
3099b683K491L095j319l910rL473J559k721k055J432J947k58k011M48J175oj365
3116g17K87J603p4k056q90K142J743j296k432K26K393J215k042j997J235K181
3132A521o16j384o14J530N81j447k68M71J495j040j666P58J751J76j980j121J444
3149d09J597m23j593l86J383N64q26l66P39M00j623m8J540J069j615k360J352
3166a005L226p8l574j079K905K411j623k739m2K791M19k054o92J566N14j308n95
$$ plain form
3050 -1244 177 1813 991 -1461 -1936 659 2600 618 -1871 -1804 1223 2333 -179 -1926 -258 1612
3066 1612 965 -831 -846 1098 1359 -793 -1389 869 2228 -107 -2342 -851 2191 1829 -1451 -2500
3082 -2500 347 2309 460 -1730 -938 1214 786 -1101 -904 921 844 -1511 -1441 1332 1882 -884 -2683
3099 -2683 -192 2903 1584 -2326 -2335 1138 2697 -24 -2079 -647 1300 1042 -969 -521 654 648 -717
3116 -717 -430 1173 1099 -957 -1847 295 2038 742 -1690 -1464 929 2144 102 -1895 -660 1521
3132 1521 905 -479 -1093 437 1018 -429 -697 -226 1269 229 -1437 -679 1072 1248 -732 -1853 -409
3149 -409 1188 765 -828 -1214 169 733 -93 -459 280 680 -943 -991 549 1618 3 -2357 -1005
3166 -1005 2221 2143 -1431 -2510 395 2806 1183 -1556 -1598 1193 1612 -442 -1134 432 946 -362 -957
3183i57J470J047j588j943J738K263n10k987o94K663J829j725k420M26K152O30
3199A394j694q50J085J004q76o21N33R89m13j501J73J466O69j724j219J095J930
3216A440k22j831p62J103J330o31r04Q3N78j43n01Q04O13j034j534Q85K287K50
3234A811k574j962K427K949q04l638r23L193K080j723k784P75J803N58j414l50
3250e76J004n9j325J75J825j62k098r75K645J995j689k702L17K986P13k394j446
3267a766J560J495r56j453L63J610j35j688j47J790M31j902r95J454K005q10k008
3284a152m23K023J189r39j655N73J135J7r07J7O78o8j127K75J491N16j814j731
3302a902J521K297k66k994q81K217K355j620k732R9K644Q87k028q90J178R75j039
$$ plain form
3183 -957 513 1560 -28 -1971 -233 2030 1520 -1467 -2161 502 2331 606 -1814 -1388 764 1394
3199 1394 -300 -1150 -65 939 63 -558 -25 964 551 -950 -777 689 1358 -366 -1585 -490 1440
3216 1440 1218 -613 -1375 -272 1058 427 -477 -394 184 41 -460 344 957 -77 -1611 -726 1561 1811
3234 1811 -763 -2725 -298 2651 1847 -1791 -2714 479 2559 836 -1948 -1173 630 1188 -226 -576
3250 -576 428 369 -956 -781 1044 882 -1216 -2191 454 2449 760 -1942 -1625 1361 2074 -320 -1766
3267 -1766 -206 1289 333 -1120 -757 853 718 -970 -1117 673 1104 -798 -1793 -339 1666 856 -1152
3284 -1152 -1575 448 1637 698 -957 -384 751 768 -139 -122 556 488 -639 -364 1127 1643 -171 -1902
3302 -1902 -381 1916 1650 -1344 -2225 -8 2347 727 -2005 -1906 738 1625 -403 -1293 -115 860 -179
3319a79j007J108J268j008j331N89K110o31j854p44K362J400j992j698Q74K034
3335A301m26j752k56J705M06j841m47J648J400j720k030R55K722l89k297q03K114
3352B90J282j092j681K99J401K25j047P2Q05m33j112K87J507L27j657j792J611
3369g08K388j72l063j144K788K229j236k597l73K342J298j306j799Q34J121n69
3385C3m02M45J088j023j383N79K203j25k267j198J838K250j376k301k16K436J154
3402A735k049j232J458R79p68j224J018J572r93j954P63K112L53k121j614J952
3418a3K348j196k589kJ916J044j314r68O57N13m61p40J220M62j383j216J198K075
3436A551m43k501n34K410J615j193k645M18K391Q52j826j473Q53J394r5o34l92
$$ plain form
3319 -179 -1186 -78 1190 182 -1149 -560 1550 919 -935 -1679 683 2083 91 -1607 -733 1301
3335 1301 875 -877 -1133 572 978 -863 -1310 338 1738 18 -2012 -1057 1665 1276 -1021 -1824 290
3352 290 1572 480 -1201 -902 499 724 -323 -251 554 121 -991 -704 803 1130 -527 -2319 -708
3369 -708 1680 1508 -1555 -2699 89 2318 1082 -1515 -1888 454 1752 446 -1353 -519 602 33
3385 33 -369 76 1164 141 -1242 -663 1540 1415 -852 -2050 -212 2038 662 -1639 -1855 581 1735
3402 1735 -314 -1546 -88 891 123 -1101 -83 1489 496 -1458 -695 1417 1770 -351 -1965 -13
3418 -13 2335 1139 -1450 -1452 464 1508 194 -774 -117 396 -65 -805 415 877 -506 -1722 -524 1551
3436 1551 1108 -1393 -1927 483 2098 905 -1740 -1322 1069 1921 95 -1378 -525 869 774 140 -252
3453b52N47j62q41N69J056l7j914k39J352J700j387j884K84K275N97k123j279
3470a738J380J882q12j768K47J605K19j958m79J894J090j677j588P26K441n1k398
3487i85r14J995J370j202j610O25J310k41j104N37R68n11j123L70J492P43k294
3504e74j292K042J925p26k450n29K046J564j915j371L59J766j44j283J9O67K03
3521C07r03J28R64J82j061r53J037J369l12j679j2J305O72r41r73L41J385q9j267
3540e00L1J094J27j240m75J395P20j259j224M81K283K61k331j207J655J901q43
3557H69j955M0J508M40j049p02Q47L13q08n9J240M42j582j199J257K425n42k981
3575a496o56K683J791k104k164O22K273N67j767j203J234J045o66p40O12L07n80
$$ plain form
3453 -252 295 133 -708 -139 917 880 -1034 -1273 79 1779 392 -1492 -1208 1067 1664 -459 -1738
3470 -1738 -358 1524 712 -1056 -809 796 1015 -943 -1422 472 1562 -115 -1703 -977 1464 1413 -985
3487 -985 -1899 96 1466 264 -1346 -721 589 348 -756 -219 749 238 -885 -515 977 1720 -574
3504 -574 -1866 176 2101 1375 -1075 -1604 442 2006 91 -1280 -921 845 701 -582 -563 104 307
3521 307 -596 -468 496 678 -383 -1336 -299 1070 758 -921 -933 372 1044 103 -870 -529 856 767 -500
3540 -500 -469 625 752 -488 -963 432 1152 -107 -1331 -850 1433 1694 -637 -1844 -189 1712 869
3557 869 -1086 -1046 462 902 -147 -849 -2 311 -497 -556 684 1126 -456 -1655 -398 2027 1485 -1496
3575 -1496 -2152 531 2322 218 -1946 -1324 949 1516 -251 -1454 -220 825 159 -581 31 338 -242
3592b42n54Q38J130j00j861l95J605R97j044j625M13J579K33j423m43R53L24j25
3610B60p52M66Q83p96j023N72J165K0j540p02J095J960p10k095p7J510Q51p82
3628C05j225N96P05j91m93J61Q37p20r10O48J593l92j843o75J783J666j152k320
3646a627K75K153Q57j781j268Q76J510n21j260j8J212J23j231k48J527J89j432
3663f64n39J372J245q34j512r0J608O09j609p31J152R70o86j088M00J087J43j759
3681i26j59J526P96j343j113Q14J590k15j580j058J655J040o60j228P9J398l06
3698C10n74j55P76K3j001K5J042N43j459q43R97J788j87k085m38J623J342j229
3716D98j675N59J434J50j178m11O72M00q15l21R31O61r86r59O22J892n27j820
$$ plain form
3592 -242 -796 42 1172 1072 -789 -1184 421 1418 374 -1251 -838 741 974 -449 -892 61 385 260
3610 260 -492 -26 857 61 -962 -390 775 795 -745 -1447 -352 1608 898 -1197 -1274 236 1087 305
3628 305 -920 -324 381 190 -303 -142 695 -25 -935 -287 1306 914 -929 -1604 179 1845 693 -1627
3646 -1627 -1352 801 1658 -123 -1391 -515 995 474 -786 -804 408 531 -700 -948 579 768 -664
3663 -664 -1203 169 1414 580 -932 -1022 586 1195 -414 -1145 7 977 291 -797 -397 690 833 -926
3681 -926 -1085 441 1237 -106 -1219 -405 1185 970 -610 -1668 -13 1027 367 -861 -782 616 310
3698 310 -264 -419 357 380 -621 -596 446 989 -470 -1313 -316 1472 1285 -800 -1238 385 1727 498
3716 498 -1177 -618 816 966 -212 -623 49 449 -366 -687 244 905 -81 -1040 -418 1474 947 -873
3734h73n30J695J051j230j330P78J378l30j202k19J775n23j280k51J307J021j237
3751@j649P56K470j63k257p57J619J392o10j743o5J383M11p48p50Q82J01n31r3
3770c52R08K40j036j040O64J772l05k077n12K005J520j195k180M31J805R84k003
3787c71j122J130J450p13j025O38N84k27r46K72R33K76j566k81J178J108r56j589
3805a227L98J732J03j446n54J144R12j284r98J106J210j025j346O74J598J76j725
3822e52r36J462J628r31j813Q6J793K77q92p48O78N97l67p69N80N31o15r97N20
3841d68J537m8j915n86J714J157r02j790K45K081K45j689o39Q31J289o57j041
3858f36l0J271L1j097k38J119P38j180r17O84J178k46j434j31J630M54j231p51
$$ plain form
3734 -873 -1403 292 1343 113 -1217 -439 939 609 -593 -812 963 440 -840 -1091 216 1237 0
3751 0 -1649 -893 1577 1414 -843 -1600 19 1411 801 -942 -1007 376 787 39 -711 171 272 -259 -352
3770 -352 556 796 -240 -1280 -616 1156 851 -1226 -1738 267 1787 592 -1588 -1157 648 1632 -371
3787 -371 -1493 -363 1087 374 -651 -13 571 344 -602 -330 603 879 -687 -968 210 1318 362 -1227
3805 -1227 -829 903 1006 -440 -994 150 1062 -222 -1220 -114 1096 71 -1275 -601 997 1173 -552
3822 -552 -1488 -26 1602 671 -1142 -1056 737 1014 122 -626 52 649 282 -487 93 624 9 -988 -468
3841 -468 1069 1021 -894 -1480 234 1391 489 -1301 -1056 1025 1270 -419 -1058 -227 1062 405 -636
3858 -636 -666 605 636 -461 -699 420 1158 -22 -939 -255 923 677 -757 -888 742 1196 -35 -786
3876g86Q49O92o86j004P25J170j89j597m23J757Q70j507j501J047J711M6j783
3893f09q11J631J123q83j150K08J085l83o81L04O34m34r58L24J398j10j334m50
3911a096J149J207n68j773mJ325J039j196j443N21J589j67j312L1P40L11o25m47
3929g19J098N87q68r78L90J621o86j036l96J533O31r85j203L83J455j88j131j71
3947f63J299m1r82k01P51O91p35j164N46J569K52j695j019J408J556r00j747K13
3965h62J260Q35j306p83Q56L59n21k40M78M74o94p85N67J076o6j596l26J604R67
3984A297q60j657L14J386M02j009r49J086J000p10p60K24R99m90q33r5J230K55
4002H30r45r23J178P64q63q63K50J060K12j113l93J011M77p85p84Q96J064p91
$$ plain form
3876 -786 63 755 69 -935 -210 960 771 -826 -1249 508 1378 -129 -1630 -583 1128 1174 -609
3893 -609 -1420 211 1334 451 -699 -491 594 211 -470 -166 468 34 -924 -600 798 688 -646 -1096
3911 -1096 53 1260 692 -1081 -1085 240 1279 83 -1360 -839 750 583 -729 -698 42 353 -272 -719
3929 -719 379 966 98 -880 -490 1131 445 -591 -987 546 1177 192 -1011 -628 827 639 -492 -663
3947 -663 636 595 -387 -588 163 854 119 -1045 -499 1070 1322 -373 -1392 16 1572 672 -1075 -862
3965 -862 398 1233 -73 -856 0 359 -162 -402 76 550 -144 -929 -362 714 648 -948 -1274 330 1297
3984 1297 437 -1220 -906 480 882 -127 -1076 10 1010 300 -460 -236 763 273 -560 -655 575 830
4002 830 -115 -1038 140 904 41 -822 -572 488 700 -413 -806 205 682 -103 -887 9 1073 282
4020B82j246K49J727K26j645q01Q91J479j97j544m63J554L93p36j157Q21P46l43
4038B36j052O78P25m25j168L32J438J64j397p60J081J346m75j765j73J874N61
4055A220j653p33R18J350n83j199o0J265J84j357m37J185R28q93j010N19J419
4072A063m40j211l47J066Q32q57p83P33O28l94p99L71R79o49o38j71J162O91j422
4091a86j216J054J478k03j651m98J146R28o69r75K27R58oo56j60R31l56m46k46
4110e46J328L58j289q94J019J515m47k007j15J661P09j195j361P27J564m93j122
4127e88m52J515J25j059l75J121M09m70j137M84J287J24j697k73J212P97p36r29
4145f42L76R64j21r85q6J081n1j164k48J255O61q22j604P37J738j06j546o88J330
$$ plain form
4020 282 -964 -715 1012 1238 -407 -1208 -317 1162 965 -579 -1042 512 905 169 -988 -167 579 236
4038 236 -816 -138 587 162 -1006 -674 764 928 -469 -1229 -148 1198 723 -1042 -1215 659 1220
4055 1220 -433 -1166 -248 1102 519 -680 -740 525 709 -648 -1085 100 1028 135 -875 -356 1063
4072 1063 623 -588 -935 131 963 106 -677 56 684 290 -509 -138 841 192 -446 -617 545 1236 -186
4091 -186 -1402 -348 1130 927 -724 -1222 -76 852 183 -792 -565 393 387 -269 -429 502 146 -300 -546
4110 -546 782 1140 -149 -1043 -24 1491 1044 -963 -1078 583 1292 97 -1264 -537 1027 534 -588
4127 -588 -1040 475 600 -459 -834 287 696 226 -911 -427 860 984 -713 -986 226 1023 287 -642
4145 -642 -266 698 577 -408 -494 587 536 -628 -876 379 1040 218 -1386 -649 1089 983 -563 -1251 79
4164G9J098p79j261K59J004M27r87n98Q11Q64r69m20N11M30n53q05O46R99j3j530
4184g87k51J596L45p82j141M01J507l56j071j71R61N94o98r96N91J092n43r10
4202f19L39Q82J90q84m53P19N78m42j026K92Q92P1r30j77J024K29r46n58R61P31
4222H73o72j366N27J612K49j832n88J113J098m73j314M1R82M88o69m80N80L63
4240E32m21o44K88Q97k33q97J48J185j00j169p21J259J029n80j347O4J141N71
4258A002j092p75R98O00n32r28N63Q86j93j010k54J071L52q51n17N54O94k0j038
4277d90r7O23O06n05o07O05K86m45k23L31N85n08q89L52Q33N42j085j032R10J257
4297A049m3j588j35Q03Q26q81q89M91Q69j62n76Q7N76p8n81j76P30J56p00o28
$$ plain form
4164 79 1177 398 -863 -604 400 827 -160 -758 53 917 -52 -472 39 469 -84 -889 -243 756 743 -787
4184 -787 -1038 558 903 121 -1020 -619 888 532 -539 -710 251 845 147 -849 -258 834 291 -619
4202 -619 -280 602 792 -92 -545 174 752 310 -716 -424 468 539 -391 -568 456 685 -261 -819 142 873
4222 873 201 -1165 -638 974 1223 -609 -1197 -84 1014 541 -773 -732 250 738 69 -411 169 532
4240 532 111 -533 -245 652 419 -478 -330 855 755 -414 -1135 124 1153 573 -774 -710 431 1002
4258 1002 -90 -865 133 733 201 -727 -164 722 529 -481 -735 336 688 -163 -680 -126 568 548 -490
4277 -490 -587 36 642 137 -470 135 421 -24 -247 84 669 161 -728 -376 457 999 -86 -1118 -208 1049
4297 1049 1006 -582 -717 86 912 31 -858 -367 502 340 -236 -149 427 349 -232 -408 322 478 -222 -850
4317h50P57J210n49j494K23J040P53j221p01P74R03k94j113Q8R78K77r37n80R44
4336B08O97n35j238M65J091J44r93n92Q65P00n64p87J6R88j32p90N6Q24J89r36
4356c24l01P58P06p08j119M79J158J64j160n82J064Q69o36j119M06P93K74q14
4374i2k65N42N20q35l94N45M59m50o24K86P45K08j270j32R12M82q29n52M50P46
4394D52j27o18j92J059J44q00p11N48J181m76j040k1J141K96j023q03P74J266
4412A050m94r32M3O47J72o84l46O88om56m10O51P78n67j147M87J184L84j324q87
4432a169R56J125m37j253k63J133P46q62l70M06N72l75p36N69O59k21q70mP33
4451C39K97q30p23Q60R26o33q04n2J008K66o33q93R59M77k88q92M64J027o57o64
$$ plain form
4317 -850 -93 1117 568 -926 -703 337 1090 -131 -832 -58 845 551 -562 -474 504 781 -156 -736 208
4336 208 905 370 -868 -403 688 832 -161 -753 112 812 248 -539 -523 465 333 -457 -401 423 612 -324
4356 -324 -625 133 839 131 -988 -509 649 813 -347 -929 135 1004 368 -751 -345 448 722 -92
4374 -92 -357 185 705 -130 -524 21 480 30 -594 -308 437 645 -625 -757 155 637 -192 -744 -294 452
4394 452 325 -293 -485 574 718 -82 -793 -245 936 460 -580 -601 540 836 -187 -990 -216 1050
4412 1050 556 -376 -333 314 486 -198 -544 144 138 -318 -728 -77 701 134 -1013 -526 658 1042 -282 -1169
4432 -1169 -213 912 475 -778 -1041 92 838 -24 -394 12 584 209 -527 42 701 480 -390 -394 339
4451 339 636 -194 -917 -57 869 236 -568 -620 388 654 21 -872 87 564 276 -616 -152 875 218 -446
4471d46j39J028L85q37j105Q85Q59n8r64l55R52L05p00l52N87N49n88m68N56M49
4491E43j75j176K91J111L41j258n83P38J011m8j477m2Q24P26q42p22L12J187m72
4510B89r85M95R43k41q14j36O89J33m46p34M27J043k26r18j51J171L5m13o83J74
4530c48R37j05j165L15Q44k7o40m40Q34O43o27q06j88J332J97j078k41O11N51
4549E99m17m68l0O92j62m91j16O66j46o07p5R71M13p27r75M39J012J20j156n89
4569a047J005Q03m67j043N17N48Ln11l92P66K80o72j40O94K87p33o92O00P10Q
4589E24j042j58Q75N24o14o46K32J005l40r66J43R61N7p86n04P61R64q42p82L3
4609f01J213j32o83o63P61M74j17m56j21M66L34l87m02N38K19n70l54P95M68m95
$$ plain form
4471 -446 -585 443 828 -9 -1114 -229 630 572 -392 -747 205 510 -190 -542 45 594 6 -462 94 543
4491 543 368 -808 -517 594 935 -323 -906 -168 843 795 -682 -724 100 826 -16 -738 -426 761 289
4510 289 -696 -201 742 501 -313 -449 240 373 -73 -807 -380 663 437 -481 -632 539 574 161 -522 -348
4530 -348 589 484 -681 -366 478 451 -189 -629 205 848 221 -585 -773 559 756 -322 -563 48 599
4549 599 182 -286 -316 376 214 -277 -393 273 127 -480 -555 416 829 102 -873 -434 578 698 -458 -1047
4569 -1047 -42 761 294 -749 -232 316 319 -192 -584 182 462 -210 -350 344 631 -102 -794 -194 516 524
4589 524 -518 -676 199 723 109 -537 -305 700 360 -606 -463 498 555 -231 -735 26 990 148 -634 -601
4609 -601 612 480 -203 -866 -105 369 252 -204 -325 141 475 88 -314 224 443 -127 -481 314 782 287
4629B87j057J46J486J58j359n94Q26J093k88j310J08R07M15q55l11J20O30n54
4647a52%Q5M15Lp85J61J081l07q98l65P32P80m69o96K46M98j13l10k88P33J75
4668E26p19l52N15N33l22p87o0J091K78j077k93M69Q73j03q95n4N62R9l20k10
4688b46N45Ol96m02N17N10l82o86J25R68k3o41p41O74R03j28j143n1O77O83q16
4709d7n32L65L61J32p42J28P51Pp60j79Q05L58n79r41O51Q39m9r58j39P94K62
4730E27p56l79N15M11q5p14J23O93K2p55l15R29K70n12p71K08J115J75r37m09
4750f45O35P03n55j95o4M26k63k86J12N27j58m52J3N52J61o92p24M25J170k56
4770D34p95k36N65O35m37n58M2O85j57j53k93N15M1k19m90N54N69o25r38N76P41
$$ plain form
4629 287 -770 -624 862 1020 -339 -933 -107 986 698 -612 -504 403 818 -37 -348 -228 402 -152
4647 -152 -152 -67 348 351 -434 -273 808 501 -397 -762 -30 750 281 -415 -169 329 216 -94 -382 351 526
4668 526 -193 -545 -30 503 181 -606 -666 425 703 -374 -667 -198 675 572 -323 -377 185 284 -36 -246
4688 -246 299 305 -91 -493 24 534 152 -534 -409 559 536 -105 -846 -172 731 603 -540 -591 86 769 -47
4709 -47 -579 -214 147 279 -463 -335 416 423 -337 -516 289 647 68 -873 -222 617 568 -390 -529 265 527
4730 527 -229 -608 -93 318 233 -481 -358 335 357 -398 -713 216 486 -26 -797 -589 526 701 -236 -645
4750 -645 -10 693 138 -57 -121 305 42 -244 -132 395 237 -215 -202 350 511 -181 -905 -480 690 434
4770 434 -361 -597 -32 603 166 -392 -350 335 178 25 -268 247 288 69 -421 133 702 77 -861 -285 456
4791D56K18q24m70M38Q34n06n57M0N74K10q34J33O26j2n00m04N22J125q84q14
4811f29j5J135K32q50r66Q10Q25O7j051j94Q62J93l34l92M30J93n44l9P47J03
4831E83n78n70L10O84K83j077m57R29N07j8j043j39P48K75o01k50L35L19j06l39
4851b05k6L30L87q91Q1N22N87j006m52P15O42l83p13K42L38L76q62r9N48L33l60
4872A04o76N10Q44n00r10j89J019P48p31j153O89J006k40j071j58J030J45m40
4890B7k63k07P83m36l71N57N18l50o45N9P50K38q47o81P07J011m06r60N7O94K83
4911E18m04o89M19P09l86p61M88M40p6q47J34Q21J36j96r82N82M75n7p81j05O56
4932I4M12m96q6k37O68q2o66N62L14j34q21j33P74M39o03o27M60P90R1r08m96
$$ plain form
4791 456 674 -150 -620 -182 652 146 -411 -371 203 413 -421 -288 338 326 -174 -578 -56 1069 185 -629
4811 -629 -644 491 723 -127 -1093 -283 542 609 -442 -636 226 419 85 -307 123 316 -228 -267 480 583
4831 583 5 -565 -255 429 712 -365 -822 107 614 596 -447 -586 162 437 -164 -414 -79 240 134 -205
4851 -205 -231 99 486 -405 -324 198 785 -221 -673 42 684 301 -412 -170 168 544 -318 -417 131 464 104
4872 104 -572 -62 782 282 -628 -817 202 950 219 -934 -245 761 521 -550 -708 322 467 27
4890 27 -236 -443 340 -96 -467 90 608 258 -387 -328 422 660 -187 -868 -161 850 444 -516 -459 235 518
4911 518 114 -575 -156 553 167 -594 -106 334 258 -589 -455 366 502 306 -676 -94 381 324 -457 -562 94
4932 94 506 10 -76 -313 355 273 -393 169 483 349 -472 -605 169 608 5 -622 -162 628 719 -189 -685
4953f85P18L61n4n87o4M17O4m70K32M87l06n92q1P82M48o21r78Q05Q56l69p95
4974d32k87J119L06o33o38M30O50k44m71m9M58J82n23j59N68L03n91n98L32O97
4994D20l3p18l51Q35M34o01l06J91L55J49m85j40N42j35m01l6N19L64n51n11K9
5015d30R33O2r18j5K55P50l83p04n0M87N69m96j40r4P1j51l5M96J46l25o03M58
5037a17O14q0p84k76O91N48k44j031L29O54o5m06l34K61L97j07m11K25N67n00
5057f9k60j43R68j01o14l96N28N68l08m46J72L25K61n95k92R36l16m68j36M11
5077B5K09k82n64M33N12K31p52k24M50M19j64o36p0K54M58l29l2k18L95j09m41
5098d35N03K21k84k88J30M62K98m50q16O26N50K31j039l45P45L38l63n93K00O89
$$ plain form
4953 -685 33 394 340 -247 -311 106 170 -300 -68 419 113 -479 -560 222 670 49 -929 -124 732 363 -432
4974 -432 -719 400 706 73 -565 -135 515 271 -200 -249 209 391 -132 -291 277 580 -11 -609 -277 420
4994 420 387 -331 -682 153 587 -14 -320 -129 226 375 -110 -250 292 157 -244 -280 239 603 52 -459 -430
5015 -430 503 565 -353 -368 -113 637 254 -450 -500 -13 556 60 -80 -174 -103 -254 -289 207 353 28 -575 -117
5037 -117 497 417 -367 -643 48 596 352 -679 -350 304 239 -167 -501 -240 157 50 -361 -136 431 -69
5057 -69 -329 -472 496 395 -219 -615 -87 481 173 -273 -101 224 485 -110 -402 534 218 -250 -386 25
5077 25 234 -48 -612 -179 333 564 -188 -412 38 457 293 -343 -413 -159 299 -30 -62 -280 115 6 -435
5098 -435 68 289 5 -283 -153 309 607 157 -659 -33 517 748 -291 -636 109 447 84 -509 -309 380
5118C80j56m47J99K3J27k96l15N13N74o63n67L43O13Lm98l73Q11Q7k49m35N31
5139B05m2j29k65n5O30l57n56J87O15L56p12o16N26P76q5q39j24M76K76k24n82
5160e39M07K25j87k7j84K20L04l84j52N18J97n84m18M17N74%p82k35Q77K57k97
5181B07o01m7O74J92o44l4N82q9l62l83O44M46m87l76R7O01L54q63m77N45N79
5202E58m36p44N02L11j6n51L02K95O4o17K9L04O72o57o51K63Q71J58o94o04O35
5223fN53l03o40p2P53N8l63m7N7N43r15M23J90O6l40m58L54M76J95p62k05M20
5245b3L73p2p17O1P35r6k95j6L02j43J97p46M69L43l89m74K57P05j79n69n12P24
5267f5P07l90m61j10M99P9m58o6K57M46l74n33K72O08n3o67k26O90L70n16p18
$$ plain form
5118 380 224 -223 -24 -1 126 -170 -485 28 602 -61 -628 -285 328 331 -167 -540 271 358 109 -326 205
5139 205 163 34 -231 -286 344 -13 -569 -382 233 589 -123 -739 -213 563 478 -361 -485 -9 267 43 -539
5160 -539 -132 93 -94 -121 -305 -85 219 -165 -317 201 398 -186 -604 -187 387 387 -395 -630 247 504 207
5181 207 -394 -441 233 425 -219 -253 329 240 -122 -505 139 585 98 -278 -181 420 774 -89 -566 -21 558
5202 558 122 -622 -120 191 175 -376 -74 221 285 -332 -303 1 673 16 -635 -372 499 657 -37 -641 -6
5223 -6 547 244 -396 -468 285 343 -20 -67 -10 533 -382 41 231 297 -43 -501 -147 329 524 -238 -443 -23
5245 -23 350 278 -439 -378 357 261 -34 -50 252 109 306 -440 29 372 -17 -491 -234 471 292 -277 -789 -65
5267 -65 642 252 -209 -319 180 259 -199 -265 -8 438 64 -469 -197 411 358 -309 -535 155 525 9 -709
5288g09N90P55j41j001P1M97M74o14k13L99o0J06l35J82L15k32n56J86Q63r6p58
5309b77k52O78N26l76o85J15M62J22l64q2J83J55k74j43K62L46l51j70j28P03
5329D50P4q19j69M57K21Q4n50k20O01L77m20o1O7K35l36k68M62Q0k47m39rM84
5351E4N61q19m26P89M92k74j033K6P72N78n57o50M21J51K2j29m0L50l4q63J86
5372d23P73J02o06l72N86M92k42q74K05O13L76q80l18N95J60q1m17J98N48k52
5392A83m36J78J14K44m77j73L58M54m1m88j78K96K70k52n65K94J89J59j71K7K18
5413B03J0m07p1M43O2j81n98L40N63L44r49l05L66P13k35p50p0P61K66o55n2K71
5435F9K7j82r1L95J82m25k91L05N73j10p51l40O27P02n56n26O2O41J0n31k25P65
$$ plain form
5288 -709 -119 636 495 -506 -435 62 536 -78 -291 108 48 154 -181 1 316 84 -472 -286 577 481 -277
5309 -277 -529 149 675 299 -386 -271 191 313 -51 -133 50 205 -69 -212 50 396 45 -125 -253 450
5329 450 524 -295 -464 -7 214 298 -252 -472 129 506 86 25 92 327 -9 -277 185 265 18 -421 -430 54
5351 54 615 -204 -630 159 651 377 -656 -630 142 720 163 -487 -66 85 107 -22 -62 288 254 -609 -423
5372 -423 350 452 -154 -526 60 552 310 -564 -359 254 630 -250 -568 27 187 106 -311 -113 435 183
5392 183 -253 -75 39 283 -194 -367 -9 445 404 -84 -262 34 304 52 -513 -219 -30 129 -42 -15 203
5413 203 213 -194 -265 178 240 59 -539 -199 364 708 -241 -546 -180 533 298 -452 -522 239 505 -150 -202 69
5435 69 96 -86 -177 218 400 -25 -316 -11 562 452 -299 -639 -12 690 134 -392 -330 311 321 -210 -435 330
5457C30M9n46j51L71O62o57n67K50O86j06n21k17M43M35l76k61J42K56M0k89n4
5478h1K43k30j18o4K73K70m54k80L31N12j30n65o0L37O15k58m75k65N49M72m51
5499A71l73j45N18j32j67J09K39r3l88M1O41k58k87j10L58K63l95j50k52M59L43
5520C92o45O6J09M11j54n12J97M85k59m03n8N67K69n93m68P09L82k60o89kQ76
5541D20m1m72o2J60K12k2j78L5K45k73j45O2K98O1o48%L74M17j18n75r0N70K56
5564D86l23m48L07R1j77J30m85K49M56k53l11N99K0j84o22M89L60j18n55J72O6
5585e1L93n12j81L82K09J2n65J04L54Q4l83o0K44J21k10l29K03O90m20l52j77
5606d44N67L69l52m71K49L43k16j79n2N05k13k12j79M72K09p15M1K83O32m12l18
$$ plain form
5457 330 379 -167 -318 53 715 58 -509 -259 427 321 -200 -417 26 461 85 -176 -34 222 262 -27 -81
5478 -81 162 -68 -186 -250 23 293 -161 -441 -110 402 272 -293 -353 -16 599 341 -134 -399 150 622 171
5499 171 -202 -347 171 39 -128 -19 220 127 -261 -220 421 163 -124 -234 124 387 -8 -158 -410 49 392
5520 392 -253 -187 -78 333 179 -333 -136 349 90 -313 -371 196 465 -128 -596 113 495 235 -454 -456 420
5541 420 379 -93 -155 5 217 195 17 52 297 24 -121 -59 239 300 -348 -348 26 443 325 -250 -340 230 486
5564 486 163 -285 22 113 -64 66 -419 -170 286 33 -278 321 341 157 -465 24 384 266 -289 -117 -51
5585 -51 342 -170 -351 31 240 252 -313 -209 145 229 -154 -214 30 151 -59 -388 -185 505 85 -267 -444
5606 -444 123 492 140 -331 -82 261 45 -134 -186 319 106 -106 -285 187 396 -319 -278 5 637 225 -93
5627i3k40N20J04k74l11j27N25Q0m95m1M74n4j7j51K93J00l94l56L23L35O5m26
5649a60K9R2M82k94o08J79M31Ll90m8N11N8k80l55M31L07j33p32J94N51K04p34
5671b62j8L45K82m3j016N26L29P2l00l0j0L04j46m21M21J76j88l59J70N56J7m55
5693e0k86L84L71j82o49K2O13J82n64k59M14K83j85j52rJ30o5l77L80K24r0m81
5715c46R7N00K92p41p7J04J99K10n87J26K00M30m31J1K42R2m82k5QL00L35o06
5737a49l7J44N56l50k37l97L00M28l38j46M16K91m00l22j7K80K0p9k84M67J78
5758C24p11J43R6P94n15k91j69P70q2j46n42J78M87j69m85K64J72rm15KN69J87
5780D52n12l18J86L19l34nJ28K78J56m72kQ5M61n32k31K37M17j35k49M1J94j01
$$ plain form
5627 -93 -333 187 291 17 -294 -421 104 184 -311 -352 122 68 51 -100 193 293 -101 -457 -134 201 266 -160
5649 -160 -131 -39 443 149 -459 -280 151 154 -236 -284 227 285 5 -350 81 388 255 -477 -283 268 472 -262
5671 -262 -280 65 347 304 -712 -186 143 215 -85 -115 -125 179 33 -388 33 209 21 -338 -168 388 405 -50
5693 -50 -336 48 419 237 -412 -390 223 405 -159 -418 -4 279 94 -58 -67 63 -2 -379 1 225 135 -346
5715 -346 -249 251 543 -198 -275 -171 28 238 -349 -223 -23 407 -24 -13 229 321 -161 -186 -178 122 457 -149
5737 -149 -186 -42 514 164 -73 -470 -170 258 -80 -226 190 481 81 -241 -258 22 42 -37 -321 146 324
5758 324 -387 -244 -148 646 131 -160 -329 441 359 213 -329 -151 336 167 -318 -54 118 109 -306 -304 265 452
5780 452 -60 -378 -192 127 -207 -212 -84 194 350 -122 -124 -39 422 -110 -341 -104 313 178 -71 -30 164 63
5802F3j85J4j02M80n0m61P2K12J67J1k78j79K22L24o57J10M71k32J4j34L22P1
5824B75k80l06N58Q4r9m34l51O06M19n55J06j8M36k59l79j0P8M10l13m77O41j14
5846A8n1k78J38M64O4q00L09K96K32l93m36L95N39l77l57R3L72J21n38JK16L83
5868D11k42o79N01J31J03m17j37L35N13m29m01J30L68l0k55M3j36L01k27J15J15
5889A13J91n44j25L26J24Rl53L0L31M36n70k20k3O18k6l21m61K02N65k17m49M41
5911G7K31k06m23P1N14J14n51j9L49K28j29n21J29L40Q5n54m8M02N35p96J67K50
5933B45N8j40j97J73r9K68m08k92J81O20k40l38R1J36K3k94P7P3K15J3j56M9j56
5956i8K47k74j5L65Q1m14k53M58J99j60k93j0J19M21l36n64M19J08J21j28M8k
$$ plain form
5802 63 -122 -108 -210 270 220 -241 -169 43 210 221 -57 -236 -14 310 -347 -237 234 2 16 -118 204 275
5824 275 -5 -311 247 331 232 -202 -553 53 472 -83 23 5 441 182 -197 -207 -129 281 -32 -509 132 18
5846 18 -33 -311 -173 291 355 -445 -136 160 392 -1 -437 -42 497 120 -237 -144 228 349 -189 -188 28 411
5868 411 169 -510 -9 122 225 -192 -329 6 519 90 -311 -181 187 157 -98 -55 -191 110 -117 -2 113
5889 113 304 -240 -365 -39 85 94 -259 -229 102 538 -32 -252 -275 343 317 -4 -465 -263 302 85 -364 77
5911 77 308 102 -321 -250 264 378 -173 -192 157 385 256 -265 -136 204 289 -265 -313 89 624 -172 -5 245
5933 245 303 163 -34 139 40 308 -100 -392 -211 409 169 -169 -78 58 81 -213 -136 -63 152 165 9 58 -98
5956 -98 149 -125 -140 225 306 -108 -361 97 296 136 -157 -167 -48 373 37 -527 -108 0 121 -7 41 39
5978C9J38k78k22N14J08j69l38K38P7K72n99l1N02kj36m67K52K85K3o06K82M02
6000B84K52q24j70M46K29l67k43N44L35k48m11m5K40K43l44n13M63L88p9n02L57
6021C5L64j89r9l83M99J06m95l48P66K96n38l43K56L04J12k22m88M23O7M2k83
6042a18j2M07j61m62L03R3K44k83j99j83O52k07m28K08J67N8j98l38N02J12J85
6063C42l82j18L83J41l64l43K19L13k29k68J31K06K84m48j49M24K22l27m70K05
6083b28M68m0m17J75R0J02k33j31K79K54m39k29N59K9l53j19r4L87K13j81m70
6104c78J50M34k47j93j01J93L61o11J87L39k7k22k19M1M13j6m68J32J59K33k40
6125h0j70M50M2k51j40K27Q8j69l5j68K05J81r0m56J14K14L43l08k0n6M04k11
$$ plain form
5978 39 177 -101 -323 191 299 130 -208 30 107 379 -220 -251 251 249 113 -354 -102 183 206 -400 -118 284
6000 284 536 -288 -458 -12 217 -150 -393 151 486 238 -173 -218 22 265 -79 -592 -129 259 180 -322 35
6021 35 399 210 111 -272 227 333 -162 -510 256 552 14 -329 -73 231 343 121 -367 56 123 165 -118
6042 -118 -130 277 116 -346 -43 50 294 11 -188 -371 281 74 -354 -146 21 79 -119 -457 45 157 342
6063 342 -40 -158 225 366 2 -341 -122 191 -38 -306 -175 31 315 -133 -282 142 364 37 -433 -228
6083 -228 240 200 -217 -42 48 150 -83 -214 65 319 -120 -349 210 239 -114 -233 -327 60 273 92 -378
6104 -378 -228 206 -41 -234 -335 -142 219 -392 -205 134 107 -115 -334 -293 120 104 -364 -232 -73 160 -80
6125 -80 -250 200 242 -9 -149 78 166 -3 -38 -206 -1 180 90 -366 -252 -38 305 -3 -23 -79 325 114
6147A14k25kK93N4m75l5K27K12j59p2m1M8L39m44r1L38k13J27k45L06K6K44m74
6170a48N9K45N3j04l46K99K24l6m58K18K43k21k33J40L20r3j05n97M37L93l87
6191i7p4O9L22q6k29l14N80m5n3q6J31j20J71l38L75J0L5j25l92J28K70R3j48
6214G7k80K09J93j70j52M1K32Q8k93Q3K10j03k51Q0n9K66J6k73J87J64l06k71
6236c12P6J44M46m63k72K89L92L9o31J98O3K58p0n13N43M6k4k64p5N23J3m10j62
6259a66N66j31o15K83j19M88l07p2L0J33K78o24J00J58K94r4m89K96Mml9j94J85
6282c9L47m14j04J50K21o2l50J49K14N3k08R4J81j03j15n1J57l4K52l02k27L05
6304A14J36l44n11N49L70j04l64k15M33J07j52k00k8M42ro78M11K76R8m22j04
$$ plain form
6147 114 -111 -113 180 234 -241 -276 -49 163 4 -68 -109 -61 278 -166 -257 81 -132 -5 -250 56 82 326 -148
6170 -148 -89 156 209 105 -241 58 282 246 -212 6 249 28 -205 -65 255 162 57 -540 -103 290 -97
6191 -97 -171 -102 220 134 -95 -409 171 126 73 -13 118 -2 169 -169 206 216 251 126 -266 -138 132 225 77
6214 77 -203 6 199 29 -123 -82 150 238 -55 28 238 135 -116 -36 -95 171 187 -86 101 265 -41 -312
6236 -312 -236 -92 354 -109 -381 -92 300 339 -292 -94 -31 227 157 -356 187 233 209 -55 -130 393 406 -4 -166
6259 -166 400 269 -346 -63 -182 306 -1 -73 -43 90 368 -256 -156 2 296 202 -287 9 13 9 -30 -224 -39
6282 -39 308 -106 -210 -60 161 99 -251 -102 112 165 -43 51 232 129 14 -37 120 86 338 36 -191 114
6304 114 250 -94 -605 -56 314 210 -154 -369 64 171 19 -181 -209 233 224 -454 -43 233 331 -91 -195
6325a95M99j03o9o97L73K23K59k13j94L96k47k9l96P15j68j91k67J72M37j00m30
6346b25Q6J35J78l03O3N8K05k14j64L59n9J86l08M1J06K8j31k21J82O06n73K9
6368F4l71J48J59J22l08J40M23m40j56O9L09P4j40l13L17n0q6J9j99L35M4j94
6390c4j30L19M4l49Rj18K50K62l82J84J8M5L4m29J09K78m55J70N9M89j11l29m29
6413d96N36K21k26k43J01K41m3m5k50J38L86j78k63j35L44P6l75O7M96k77j82
6434a07n1J61K05j71j86QJ99k18J14k04K66J84j42j48Q4J03L5j64l13N06j89j7
6456d5j21L0L49j88m6m3K23J69m01p9r1M20k44r3J57K02J1l02j07K00J82j95k66
6479b78J05M47Mm23l3K41J43j4m98L87L01l02o19K40M88k8m00j51M21J42m1k60
$$ plain form
6325 -195 304 201 132 -565 -192 31 290 77 -117 279 32 3 -393 322 154 -37 -304 -132 305 205 -225
6346 -225 -139 -4 174 -129 -66 -8 197 -17 -181 178 119 305 -3 38 144 172 41 -180 2 608 35 64
6368 64 -307 -159 0 122 -186 -46 377 -63 -219 -150 159 233 93 -220 97 47 -39 -20 -219 116 160 -34
6390 -34 -164 155 199 -150 -141 -259 -9 253 -129 55 73 118 152 -277 -168 110 -345 -175 -116 373 262 -67 -496
6413 -496 40 261 35 -208 -107 134 91 46 -204 -66 320 142 -121 -256 88 164 -211 -144 352 75 -107
6434 -107 -158 3 208 37 -149 -141 58 -160 -46 -250 16 200 58 -90 -6 97 132 -32 -345 161 -28 -45
6456 -45 -166 -136 213 25 -21 -64 159 328 -73 -152 -243 177 -67 -160 -3 199 210 -92 -199 1 183 -12 -278
6479 -278 -173 274 278 -145 -178 63 206 192 -306 81 382 80 -539 -299 189 161 -239 -390 31 173 132 -128
6501a28K62K44j93l54k0L96M7m53l4K71J19l41r6J06K83j10Ml41M59J8lk60J7
6524a07J89j50R9l74L66K26j55k91j16M65j48k68L0N33k99n9q5K95J08j77l32
6545b50J47J57K36l21l10L74L75j04n61N5N70j20o42K40P4J31O1k30K23jK1n32
6567d07N19L5jn5l81N59K15m94j41J45K09k22k28N3M37l62J4J9L97O7m01j21j5
6590a59K71j6m8m9k32N79m07m7JK02qj73L3K74j82k21o9K43JL13m20J55J80k26
6614ej84K7L77O9k43k42J67J95j74j65J0L9M26j76k79J77R5J50j98m8J4M26p22
6637b64j60J50N04K9m39J33L14k55Nj08J36o2M4K1R8K26k94k19j44J91K72j85
6659gl00L68k7J50k86o7q8L71j84j42J15L95m56PJ80nJ0Qk11L87J56m37k36L96
$$ plain form
6501 -128 134 378 185 -169 -189 207 254 -199 -233 38 157 -184 -280 -174 109 -1 3 -338 121 139 136 -124 -107
6524 -107 82 -68 31 -343 23 249 94 -197 -313 152 4 -264 -234 299 0 -59 -144 151 259 82 -250
6545 -250 -103 54 290 -31 -341 33 408 304 -257 -202 368 248 -394 -154 -80 51 112 -118 105 104 125 -407
6567 -407 112 147 146 91 -290 269 484 -10 -151 -6 203 -19 -247 -194 243 -119 -105 -86 311 378 -23 -144 -159
6590 -159 112 96 48 -1 -233 346 -61 -108 -107 95 87 -86 -53 221 39 -182 -251 -8 -7 306 -114 41 221 -5
6614 -5 -189 -162 215 284 41 -201 -34 161 -13 -178 -168 -129 297 121 -158 19 114 264 66 18 32 458 -264
6637 -264 -424 -274 230 259 -180 -47 267 12 17 -91 45 -17 27 48 146 372 78 -141 -285 -94 178 -7
6659 -7 -307 61 34 184 -102 -169 -257 114 -70 -212 -97 298 -158 -151 29 24 34 42 -169 218 374 -63 -299 97
6683I7R8j59j00j00K17L02j86j87J07l4j13p5oL48q8k63j74M94j2j84j84K05K86
6706B89j16l17j01J72M23m27j24J42K69N4k52R2J77k47j13k20M66J21j08m60J5
6727b65O70k2n57k33N40K95m20j80L82j51L8q3j65M17j22l28Q3m3M20m59j33K06
6749a10K53M3l53J51K27K5j56l95J77L13K3l11j0P4K50l39K58k99L60q6j08k00
6771b13L54J73l32k69L80J20j70j26k64N96m3l51J7K3K52l76j41L82K4J1l02o
6793b61K51M21n16j33K53L88j54l98r3L12J59j57j03J22J29j88l13L8M81l7p23
6814e22L25N54Jn86k15L41O44n69L8k59M98j97j16q6J52K43l74j47M34j01j90
6835a32mn6M00m7P7l27P9L48k78j11l53M78j6k05m2J43n4M4N4l7K63j33p3m4N7
$$ plain form
6683 97 195 36 -64 -164 53 355 169 -18 89 55 -58 -133 -139 209 121 -142 -316 178 166 -18 -202 3 289
6706 289 173 -144 -245 -73 350 -77 -201 -59 210 264 12 104 281 34 -79 -299 167 288 180 -280 -265
6727 -265 405 383 -174 -407 133 428 8 -172 210 59 97 14 -151 266 144 -184 -101 -144 276 -183 -316 -110
6749 -110 143 186 -167 -16 211 236 80 -315 -138 175 198 -113 -123 -49 201 -138 120 -179 181 95 -13 -213
6771 -213 141 314 -18 -287 93 213 43 -83 -347 249 206 -145 -128 -105 147 -229 -370 12 36 47 -255 -261
6793 -261 -10 411 -105 -238 15 403 249 -149 -242 70 229 72 -31 91 220 32 -281 -243 238 201 -522
6814 -522 -197 357 358 -228 -443 -102 542 -27 11 -248 250 53 -63 -149 3 246 -128 -275 159 58 -132
6835 -132 -136 -192 208 161 238 -89 -10 338 60 -51 -404 74 58 -147 -189 -46 -100 -56 -2 -39 224 91 18 -26 31
6860C1J78J58n71J93K04M6m63l2M91P2k62k06K0L12n3j55K75m0o1k55j65N75N5
6883C47l49m22L58N23m52m47K56O08k16j5n11K71M98m21j23j49M02P2m83J27K37
6904A11J14l44q5L13O2J2l43J62K19J31l63k41L28J28j32k31P3J55l3k11KJ75
6926BJ37j01r6N0J47j12k16R3J82J43l44J50k56K93LJ33k45p8L58l20j2L38k56
6949gk2l47K19L32o6o3j35N2K29J16k16k29L10j9k28q7L04j33l4j8Q3o2K08n48
6973c61M97j24J82n02J64L56pj92k80K81J35O0l25oJ57M08p05N2K38K39k80k94
6995c07M14m3o7p8l01M60O1j58pp7J35K45l36L4j20K59j76k2J05oR5k83l3K27
7019B1K23k85l06M76m2O6Q3n78L69J98k82j65K44J15r6k13J44q2J9O0j00J73P
$$ plain form
6860 31 209 367 -204 -11 193 239 -224 -256 235 307 45 -161 -141 171 118 -37 238 198 137 -118 -283 292 347
6883 347 -2 -424 -66 457 5 -442 -186 422 206 191 -320 -49 449 28 -95 -244 158 230 -253 -126 111
6904 111 225 -119 -204 109 171 183 -160 2 221 352 -11 -252 76 204 72 -159 -86 69 36 -175 -173 2
6926 2 139 38 -58 -8 139 27 -189 -96 86 229 -115 35 -221 72 75 208 -37 -115 243 -77 -89 249 -7
6949 -7 -29 -376 -157 175 109 46 -89 -37 192 308 92 -137 173 154 -74 -161 143 10 -24 -42 41 -21 187 -361
6973 -361 136 12 194 -308 -144 212 205 13 -267 14 149 209 -116 -122 35 443 -262 -210 28 267 -13 -307
6995 -307 107 64 -3 -81 -382 78 139 -19 -26 -103 32 277 -59 -25 -145 114 -62 -84 21 15 110 -173 -206 21
7019 21 244 -41 -347 129 87 153 236 -342 27 225 -57 -222 22 137 41 -172 -28 -110 -91 -31 -131 42 49
7042D9j28l25L95L82l77k72O0N15k11k98r2K08J26m9j26P8L07k26j43n7L76J22
7064C14m45k34M16J70J01n36J60K07K01k14k84J75L27l03k81K13K31k15k37qM81
7085B39j35q0j7p8J24P4m45K99J37p4k38j18J83m7K45l04N4KK83m66R0N8L58l06
7109a62k77K29M68j15l83r3K81N48l53l80L9K72N5l16J09J62n5k85J25L4M12l87
7131g2m12M80L62l63k92n6N85P3m36j04R5J52K25l92J92J53j96k59P6J93mo8k16
7154b84K72j56J47j6J2L50l1q3m48J57K42j2k17J43r2K00j72k34K07K47k05l84
7176c57K15J73j90j38l9L95J20m9k11j6L03j3m92K94o3q0qj72L97k8Pj08n0J39
7200B9J13j91j60J49N12m11l05J90K06q3k38J96r7j6q9J62QM1j38k46M11O0l6
$$ plain form
7042 49 -79 -404 -9 373 -4 -276 -216 299 88 -210 -302 -94 32 -17 -143 -65 242 16 -127 -184 192 314
7064 314 -131 -365 51 221 322 -214 -54 153 354 140 -144 31 358 55 -226 -13 218 3 -234 -242 239
7085 239 104 24 7 -71 53 127 -318 -19 118 44 -194 -312 -129 -176 69 -235 -181 -179 104 -362 -272 -214 144 -162
7109 -162 -439 -210 258 143 -240 -333 -52 496 143 -237 -198 74 129 -187 -78 84 29 -256 -131 -97 315 -72
7131 -72 -484 -4 358 -5 -297 -353 232 305 -131 -235 -140 12 237 -155 37 190 -6 -265 -189 4 0 -68 -284
7154 -284 -12 -168 -21 -37 -25 325 294 211 -237 -80 162 150 -67 76 -16 184 12 -222 -15 232 27 -357
7176 -357 -142 31 -159 -297 -336 59 179 130 -81 -97 206 193 -299 -5 -68 -148 -156 -328 69 41 48 -60 -110 29
7200 29 142 -49 -209 -60 452 41 -264 -74 132 49 -189 7 -90 -106 -195 -33 -25 16 -122 -368 43 103 67
7223F7k93qM06O1l52J1o6L89j17k34O2K6K11o3j54O2j68J75l9k8K05O2l61rL03
7248A48QJ76k73Q3R0j8l08j39J19L37k64l5J70Q7j6k40j43M46K45p37J06K26K36
7271C04r6m45J02K90Q4k58k15Q8K83k06j93L04o7J57j60k87L39O4j55k18N33J43
7293C91m20j67J03J19J88k88j17K49J00k72L5K0L03l9l41o4K76L1N8k46J78R6
7315A93J07l17j80K98l4m4k70L03J92l92M1k5K34P2j74j69J68j08k75L46J76K20
7337C62m55P1j04J94J73l64Q4j00K21J19k52q2L13M0j46k20K66p6R4l27K32n8
7359a5J02r7k86L22J87j8l68J73K00m1l66K90l14M17k79j21K25K80m56o6J96K06
7381A71k71j03M0L43o8k11j90L43J03k95K41j29J75q9K5j93N7L32j6n00K17K13
$$ plain form
7223 67 -226 -234 172 233 -119 -108 -174 215 98 -136 -74 -48 163 100 -54 8 -160 15 -24 -52 153 215 -146 -155 148
7248 148 156 332 59 142 232 214 -94 -233 -114 223 -41 -76 94 181 165 -75 -218 228 473 -264 -158 68 304
7271 304 208 -237 -135 155 239 -19 -234 -146 137 -69 -262 42 -25 132 -28 -315 24 88 -67 -285 248 391
7293 391 -29 -196 -93 26 214 -74 -191 58 158 -114 -79 -59 244 205 -136 -200 76 107 165 -81 97 193
7315 193 300 -17 -197 101 67 23 -247 56 248 -144 -103 -128 106 178 4 -165 3 -105 -380 -34 142 362
7337 362 -93 -22 -126 68 241 -123 -39 -139 82 201 -51 -133 180 220 74 -146 120 44 138 -189 43 -15
7359 -15 87 -10 -296 26 213 195 -173 0 200 159 -207 83 -231 186 -93 -214 11 291 -165 -231 -35 171
7381 171 -100 -203 -163 180 112 -99 -289 54 157 -138 103 -26 149 60 85 -108 -51 281 265 -235 -18 195
7403A95Kl63P1J77J23no30L63m8N8P6n7P0K44k53j16J17J70k81l41M00PJ98l29
7427a52m9N54Jl66p2j26L35J53k94j83K24L2n6j87K72N0j22k01J38K71Rn22j8
7450c09M66l9j97l20K85nL74n29L8L26j6N9j38RN4k24K22j26J79N8k34k31L82
7473H4J95l21J08k21K66o5k22P1K47p0K72n69j05K06K13k05J57J44j05l50mM67
7495A93j42J00l36O7J07J85j37k68K33J81k8k85j70J45K63j70k2J44L54m13k84
7516b83J66J38j0m22K47L81o9m69K91q4K22j33J26j78k8K17j34k1N6L13n79J54
7538i9K15r0r6k65P3N94l21J17k43J64m1j1O7k49J89k8l0k02L40Jj34k20K12L15
7562B58k14Lq0N8l5O9p6l6J08K44l52PR5Ml2J9k76L55rn68J32M33j56Lm0J92J12
$$ plain form
7403 195 197 -166 -95 82 205 200 -430 -67 -115 -57 19 -38 32 276 23 -93 24 194 -87 -428 -28 -21 177 -152
7427 -152 -201 353 354 -12 -84 -210 125 278 -16 -199 25 57 1 -186 86 136 14 -187 -49 222 231 -291 -309
7450 -309 157 118 -79 -399 -114 -119 255 -274 -236 90 74 133 -5 4 58 -166 56 -70 109 167 -67 -298 84
7473 84 279 -42 66 -155 111 46 -176 -105 142 72 344 -225 -330 -124 89 -116 41 185 80 -270 -274 193
7495 193 51 151 -185 -118 -11 174 37 -231 2 183 155 -130 -300 -155 108 -62 -84 60 414 1 -283
7516 -283 -117 21 11 -411 -164 217 148 -321 -30 -114 108 -25 101 -77 -105 112 -22 -43 13 326 -253 -99
7538 -99 116 26 -70 -335 -262 332 11 128 -115 49 8 -3 64 -185 4 -24 -54 -256 84 85 -49 -269 -57 258
7562 258 44 47 -33 25 -10 59 -17 -53 55 299 -53 -46 49 53 21 40 -236 119 110 -458 -326 107 -49 -46 -86 106 218
7589B18j27k38J12K43k07oP4K6J39j41k57J84M3o5p3J14K63k50Mk30L34Jj15k64
7613b18K88K86l05j28n4J61p1j0%L07m6k53n1p9N59q6m38j72M68L1l39o1K18K29
7637B36Jl69J05J31nk01o0M2J53J14m18L73J77j74n8l19L43J44l4k76m7K46J09
7660B13j44j92q6K44Q5k69M7L19j44j77p3K28J91l14o5K58L30m49k58J44O9L40
7682B97m42k8M05j08k35r4P2P1J3p7K79j28J02k57j87J75L20j60j07m7L67j64
7704F7k64j57M16J10M9k37K7J03k18Q9j3j35L46j77k07J08L58k15j03K65J67j79
7726B00p18O13k33K16r5k05K94j0nl12J09J43j47J23j25R3K45l25k00J23J15L24
7748B23k06j03J72j13l7J14j27O2K12l03K37qL3j29k15K80j4p4j37k30N43j41
$$ plain form
7589 218 91 -147 -35 208 1 -5 69 95 234 93 -164 20 63 -2 -75 39 302 52 56 -174 160 161 46 -218
7613 -218 70 356 51 -77 -131 30 -41 -51 -51 256 210 -43 -94 -173 386 300 -138 -310 158 189 -150 -211 7 236
7637 236 237 -132 -27 104 99 -102 -162 -120 33 147 -271 102 279 105 47 -272 71 215 181 -95 -142 104 213
7660 213 69 -123 -209 35 120 -149 -102 217 73 -104 -177 51 242 -72 -137 121 451 2 -256 -112 -43 297
7682 297 -145 -173 232 124 -111 -205 -133 -62 -49 -126 153 25 127 -130 -317 -142 178 18 -89 -136 231 67
7704 67 -197 -354 62 172 221 -16 11 114 -104 -15 -28 -163 183 6 -201 -93 265 50 -53 212 379 200
7726 200 -518 95 -138 78 -17 -222 72 62 57 -255 -146 -3 -150 -27 -152 -59 186 -139 -339 -216 -101 223
7748 223 17 -86 86 -27 -64 50 -77 -15 197 -106 131 123 156 27 -188 92 78 4 -133 -363 180 39
7770C9r1j02L25J36l59j28K77N9j53J28j99R2R6o8M5q3J67j25k69J96R0O2j70
7793c5j64J29L1O3k8k0j1K41k22k57O01n2k41j34K17O5j05j07KM7K06j86j63Q7
7817c6J60J41l64J31Q6j35P7k64m0M58j68q1k78N13q9l29J51J28L00l83j99J99
7839b2K88j5l19j91M53l2l21J38J99k39J53k94rM42l04mJ02O4L68n08j27P4K34
7862A30p1m20L67J6L1k7J4p4j07J1Q6J87J15n9j34k46L15J18k88j08K13l6J81
7885B14m83J46P8K88n07OL38r3N2j19L5J29R1j92n5J11L11k10l69J28O2J61m49
7908c27J25MN38l51p3K00l0J10l97J75J42L9k41j92L90L7Q8l26J16J80Q1m49M8
7931a13J88J04l68J78J50o8P8l02oK58k3n4k5MJ13l3m09J99J43J72k51lR2J28
$$ plain form
7770 39 -52 -154 171 307 -52 -180 97 156 3 131 -68 24 120 52 97 14 181 56 -213 -17 73 135 -35
7793 -35 -199 -70 -39 24 -4 -24 -35 206 -16 -273 328 276 35 -99 118 183 78 -29 -27 20 226 40 -123 -36
7817 -36 124 265 -99 32 118 -17 60 -204 -244 214 46 -35 -313 200 111 -218 -67 61 361 -22 -221 -22
7839 -22 266 251 -68 -259 194 162 -159 -21 178 -61 92 -202 -211 231 -73 -77 25 89 457 -51 -178 -104 130
7862 130 59 -361 6 22 53 26 40 -34 -141 -130 -44 143 258 199 65 -181 134 252 -36 -144 69 33 214
7885 214 -269 -123 -45 243 -264 -258 80 -13 39 -80 -45 84 175 -17 -72 39 350 140 -229 -101 -39 122 -327
7908 -327 -202 -198 340 -11 -84 116 86 196 -201 -26 116 155 -86 -278 112 149 237 -89 27 207 288 -161 -113
7931 -113 75 179 -189 -11 139 71 149 -153 -159 99 76 22 -3 1 114 81 -328 -129 14 186 -65 -68 24 152
7955A52k28j07M08k44J24p3n7K51L8n67R9M6K19J63k12J4M8J02j86k07L6K62r4
7978a3k27Q2J89J22l43K35J58L4j88j43M0L65j96l12J98J33jm14N3K5M56k25n4
8001b6l2J76n0p2J5K14k6j44j76J57K8N2l95l8N57l27J69j62K5J15M6l44J71L04
8025B37Ol47P3LK72j14m09L04k9L0j02oJ59L7j63j59L47q5M9j34j19J71J39o9
8049I1k47K74J89l11m1R9j16R6k16J52P4o2L2k06O2K81j48j70j05M19K27m97n2
8072a75L1K16L68m67j78K44Q0j42j2P8J43l88O4N3K96k65m5M8N8J52j00k76L10
8095I3J04j27k92J60L45l12p0j25K45J53k60J69j22K8K22m69L1L15Mk54K27l6
8117B9P3l2j95R8J49j30O4r1K27j4j6j62r0M7J61l40Q3J78J09k57M9J18L72m49
$$ plain form
7955 152 -76 -183 225 -19 105 32 -25 226 264 -303 -204 -158 61 224 12 26 74 176 -10 -217 -181 81 -13
7978 -13 -240 -158 31 153 -190 45 203 237 49 -94 -54 311 115 -197 1 134 133 -281 -228 -203 253 28 -26
8001 -26 -58 118 68 -4 11 225 199 55 -121 36 64 116 -279 -317 240 -87 82 -80 -55 60 106 -238 -67 237
8025 237 243 -104 -31 -28 244 130 -279 25 -4 26 -76 -82 77 114 -49 -208 139 54 103 -31 -150 21 160 91
8049 91 -156 118 307 -4 -45 54 -62 34 -182 -30 44 -18 14 -192 -130 151 3 -167 -272 147 374 -123 -175
8072 -175 -144 72 440 -27 -205 39 119 -23 -35 43 186 -202 -138 -85 211 -54 -99 -51 7 159 59 -217 93
8095 93 197 70 -222 -62 283 -29 -99 -224 21 174 -86 83 -39 -11 211 -258 -227 88 92 -162 65 29
8117 29 102 70 -125 -27 122 -8 56 -35 192 178 162 0 -90 -43 118 -222 -139 39 148 -109 -60 58 430 -19
8141a9j01k7L03l4j77q7K32J10j19N2n19L22K64j93l4q2L40j94j98k0M94j34m86
8164c07L2L29O2R9n04J31Q8R1j7k46J61K71l44j36L75j7O1l61M17k8j44m8j04
8187a39K12L5k78O9
$$ plain form
8141 -19 -120 -147 156 122 -55 -142 90 200 81 133 -386 -64 200 7 -27 -109 231 37 -161 -181 313 179 -307
8164 -307 -275 54 116 215 -289 -158 -70 21 4 -242 -81 190 -154 -290 85 68 129 -232 185 157 13 -35 -139
8187 -139 73 108 -170 -101
8191a01
$$ Imaginary data points
##PAGE= N=2
##DATA TABLE= (X++(I..I)), XYDATA
0@%%%%%%qJ6j6J6j6K4l2L2m0N6o4P2q8J04j20J40j64J90k18K49k86L25l68M16
30B20m70N29n90O61p40Q21r13J018j130J252j385J532j697J879k082K310k567
47a352K860l195L584m045M600n278O130p245Q772j0995J4549k1155L7505j50458
61a25723k75033K81337L02741j9301k57007j03812P1060Q7600K3352L8259n737
72A7736r9533p9768J05678J60906k2223j83134o2915J39366J38493l5861j15768
83c7023m8272K5470L6746N9028O3928k9635j41247q0461J04247J63807J7238j25546
95H280r6360K4797P6539M4264K931k6230n3095l1903M5542P4271l898p9806m2504
108e7172M6746O1869L748m0785m0481k3269J3529O9410O7569m1566j31756n1632
$$ plain form
0 0 0 0 0 0 0 0 -8 8 -8 8 -8 16 -16 16 -24 32 -32 40 -48 56 -64 76 -88 102 -116 133 -153 172 -196 220
30 220 -250 279 -311 350 -390 431 -482 536 -594 658 -727 805 -892 987 -1095 1215 -1352
47 -1352 1508 -1687 1897 -2148 2452 -2826 3304 -3941 4831 -6164 8385 -12770 24735 -125723
61 -125723 -400756 -119419 183322 164021 -92986 -196798 -125738 -38138 -14786 23473 17736
72 17736 -81797 -161565 -55887 105019 82796 -100338 -163253 -23887 114606 78745 -37023
83 -37023 -85295 -59825 -23079 35949 99877 70242 -71005 -151466 -47219 116588 133826 8280
95 8280 -88080 -63283 13256 57520 60451 34221 -18874 -50777 -5235 69036 65138 -14668 -57172
108 -57172 -10426 51443 55191 14406 -26075 -49344 -35815 33595 101164 59598 -72158 -123790
120a23790J07725J23457j8387j06865m5780L4219K5958L948L5155L0545o3508
131B677j02216K3219J42436N2224j25081j18375O1087J41852K0117j04857p0362
142g7279K9498N4022L1171K6223j1374q8884p6410O5772J50502L3078j33303j17453
154a14437M3918J16026L0102n0745l2986l182j6609R0N7896M7506n3108r5062
166g0591L861J11575O5904p4406j14115p208R7265Q0565j4867q7254p7585N880
178h0976Q9657Q2834j8989j05547p4225L6202R4238M2628m0468o5620l2042K0839
190e1469N9358M5110k8805q1468k7878P5446Q5403k3533j02185l9919P2469P9556
202F2085p625n7707l2336J488J5703L3514L7932r559o5923m3528M2017P0508L195
$$ plain form
120 -123790 -16065 107392 89005 -17860 -63640 -29421 -3463 485 35640 66185 2677
131 2677 -99539 -76320 66116 118340 -6741 -125116 -64029 77823 97940 -6917 -77279
142 -77279 -47781 6241 37412 63635 52261 -36623 -113033 -47261 103241 136319 3016 -114437
154 -114437 -70519 45507 75609 24864 -8122 -11304 -27913 -27823 30073 77579 24471 -70591
166 -70591 -66730 44845 110749 36343 -77772 -84980 12285 92850 77983 -9271 -86856 -80976
178 -80976 8681 91515 72526 -33021 -107246 -71044 23194 65822 25354 -40266 -72308 -51469
190 -51469 7889 52999 24194 -57274 -85152 -9706 75697 52164 -50021 -89940 -17471 62085
202 62085 54460 -3247 -35583 -34095 -18392 15122 53054 43495 -22428 -65956 -23939 46569 49764
215D9764n2027k1066K1846M225j5709J7561L7251j6055o3947j0284P4070M7597
227G3226o0351q1038K2836Q8687K1361o3296m6261K0075L0232Q36K245J8904j0178
240A7278n2570k4201N3830O5679j0684o8181l7479K6726M8481K2326j6137l7422
252a2354k7001J4502M9083K8141l6282n9303k767N8232M5608j8362n6896l4338
264e1737J9794N7057M0024k1934p1326m4225M1081Q3627K3347o3951o6197O510
276d7930N4230L4624q233l1339l0248o450L2967M6722j418o3143m3129M5418P4670
289E6741k234p2034l5983L8627M3901m767k0277K738l255l1369o818N4148M6674
302F6092m1713q0178m343P4770M6927l8263n7604k050L7141J9053p236r691j0474
$$ plain form
215 49764 -2263 -23329 -1483 2742 -12967 4594 41845 25790 -38157 -48441 25629 73226
227 73226 12875 -68163 -45327 43360 64721 1425 -44836 -24761 5471 6307 8552 27456 17278
240 17278 -35292 -59493 -5663 60016 49332 -18849 -56328 -29602 18879 41205 25068 -12354
252 -12354 -39355 -24853 24230 52371 16089 -43214 -45981 12251 57859 39497 -17399 -51737
264 -51737 -31943 25114 65138 43204 -28122 -72347 -31266 52361 75708 11757 -54440 -47930
276 -47930 6300 40924 32691 1352 -28896 -35346 -2379 44343 42925 -20218 -63347 -17929 56741
289 56741 54507 -17527 -53510 -14883 29018 24251 3974 6712 3457 -27912 -34730 19418 66092
302 66092 24379 -55799 -60142 14628 61555 23292 -34312 -36362 779 19832 12596 2905 -7569
315g569j3931P609L3095J4671l2856l8246J1343M5351J5475k9599k5854Q224J4570
328B283k506q1J4091K891k4032k2152J3247L5426J2960k5656l2531k042K7905
341a97K7118l885l2114k3059J6545L5201P545k6287k2710M756J7563R979L404
354A3859j713j8434k5317P356M7987K6650m2153n7091R077O0605K6251l7029l7944
367b7896R451K4985j43o587J3050K332l1182j9749L6168M5554j7505o1244j6821
380d9587N0968M3840j8537m3959j2180J6079J5845J5356J0575k0380m4208q699
392d4887N3809M9962k8143p1816j5913O1019M7239k6284n1017o879L1070K0220
404A8380n840j1216n882o586k306J5516K0463n192k9061j5368J7415K7884O874
$$ plain form
315 -7569 -21500 -13891 19204 33875 1019 -37227 -25884 19467 34942 5343 -20511 -12287 2283
328 2283 -223 -304 13787 16678 -7354 -29506 -16259 19167 32127 6471 -26060 -28102 -197
341 -197 26921 23036 -9078 -32137 -15592 19609 27154 867 -21843 -17087 476 10455 13859
354 13859 12146 -6288 -31605 -24249 23738 50388 8235 -48856 -39779 20826 47077 10048 -27896
367 -27896 -18445 6540 6397 -190 12860 15192 -15990 -35739 429 45983 28478 -32766 -49587
380 -49587 1381 45221 26684 -17275 -29455 -13376 2469 17825 28400 8020 -36188 -44887
392 -44887 8922 58884 30741 -41075 -56988 4031 51270 24986 -26031 -32910 -1840 18380
404 18380 12540 1324 -4558 -11144 -13450 2066 22529 17337 -11724 -27092 -9677 18207 25081
417B5081j9302k3308l225J9626J9748n81j9438j5479O209J7199N446p369n775
430a168k160l951K137J3659P480j4632j9676N659K4667P836k0426j4859J1062
443d372J2605p795o132J3576P159k1646j9617J9404L5026l330l9757j6232K8689
456b422K5794j1210j9416K258O685q765j553K2858J3650k9464l5987J7176N3636
469C3240J1091n1053l9877K5698N0449P411l5498k7712O362K1678J3915J485j1795
482E394k1688r253K0973K8456k386l0916j9245J4399K6632O205j6410j6531q39
495a5209R745J1357N803p566j5579o224J0846J5985N306j1034j7280o643J3951
508f542K1711N369k1259k4888M799L0620J4957j9270k3149K836J6948N793m233
$$ plain form
417 25081 5779 -17529 -20754 -1128 18620 18039 -1399 -16878 -10669 6530 11976 4607 -1168
430 -1168 -3328 -7279 -5142 8517 15997 1365 -18311 -12652 12015 19851 -575 -15434 -4372
443 -4372 8233 438 -5694 7882 15041 -6605 -26222 -6818 28208 24878 -14879 -31111 -2422
456 -2422 23372 12162 -7254 -4996 1689 -7076 -8629 14229 27879 -1585 -37572 -20396 33240
469 33240 44331 -6722 -46599 -20901 29548 36959 1461 -26251 -19889 1789 15704 17189 5394
482 5394 -16294 -25547 -4574 23882 21496 -9420 -28665 -14266 12366 18571 2161 -14370 -15209
495 -15209 -5464 5893 11696 4130 -11449 -17673 -6827 9158 14464 3430 -13850 -20493 -6542
508 -6542 15169 20538 -721 -25609 -20810 9810 24767 5497 -17652 -14816 2132 7925 3692
521C692l43j182j1268o397J9213K3366j2470l7143m388L8265K3432k5213l2643
534b3079Q058K9749L049k1577l778J7353M83k1272k610K5255J1653k2983k2493
547b2192J2162K5126K6j9536o155J0832K666o393N024J0364p525j8685J618K4327
561A1659J1521j9243k2119P447K3574M584j4957q111N539L660k437O77P083J176
575A0053j1055r767N866J6655O205j2416j8228k869J8344J9772n010k6979j4755
588b4184J7783K6550K156k2817j8056N021J7643J1261j681j3195j8484l557K4048
601B488K5490j0938l8509j3695L1302L2412j1546l6371q046K4935J6192j0552
613C162j0644L261O72p222M362J7529K612k2769j5787J8643K5844n658k6000m408
$$ plain form
521 3692 3349 2167 -9101 -15498 3715 27081 14611 -22532 -26920 11345 34777 9564 -23079
534 -23079 -15021 14728 17777 -3800 -7578 9775 10258 -11014 -13624 11631 23284 301 -22192
547 -22192 -10030 15096 15122 -4414 -10569 263 2929 -3464 1560 11924 4399 -14286 -12668 11659
561 11659 23180 3937 -18182 -10735 12839 17423 2466 -5645 -106 3554 1117 1794 8877 10053
575 10053 -1002 -10769 -4903 11752 17957 5541 -12687 -15556 2788 22560 17550 -9429 -24184
588 -24184 -6401 20149 22305 -512 -18568 -13547 4096 15357 13676 481 -18003 -21560 2488
601 2488 27978 17040 -21469 -35164 -3862 28550 17004 -19367 -27413 -2478 13714 3162
613 3162 -7482 -4221 -3549 -10771 -6409 11120 13732 -9037 -24824 -6181 19663 14005 -11995 -16403
627a6403J8074P079j1704l427J1510K210j7395p989J9361J7840j3568k5938J552
640a8798K5042J0128j5747j5796M972J3760L271o159l580J430M8l08L676M037
654E976j245m126m109k5N653P178q45r809q241M430J2049L884r205r232O49M891
670b127L927L258j83j0453r803Q253K0194L494k1986j7270J4677K6736q71k3374
684e528q881J4934R922o595l780O981L99j4089m211J9371J4026j7304k4601P146
698a2210K5453L605k0988r669J2389Q008r999m862J2354N644j8127j3927J7964
711d365K4880p953l0076p982K3946K0265r029k0158m100J0351P121J514k56n237
725a079r355j033J3571J1292p584j7692m411J5448J4497m300j5542p068P782J2722
$$ plain form
627 -16403 1671 8750 -2954 -6381 5129 7339 -10056 -18045 1316 19156 5588 -20350 -18798
640 -18798 6244 16372 625 -15171 -10199 3561 6832 673 -2907 -1477 -1429 -1737 1939 5976
654 5976 4731 605 -3504 -3529 2124 9302 8457 -1352 -9593 -5163 6886 10770 1565 -7667 -7018 -2127
670 -2127 1800 5058 4875 -5578 -15381 -7128 13066 16560 -5426 -22696 -8019 18717 17846 -5528
684 -5528 -14409 525 10447 3852 72 7053 7452 -6637 -10848 8523 22549 5245 -19356 -12210
698 -12210 13243 16848 -4140 -13809 -1420 6588 -3411 -8273 4081 9725 -8402 -22329 -4365
711 -4365 20515 12562 -17514 -25496 -1550 18715 9686 -10472 -14572 -4221 2900 4414 4158 -1079
725 -1079 -10434 -11467 2104 13396 5812 -11880 -16291 -843 13654 9354 -6188 -13256 -5474 7248
739G248M005q650r960J228Q769L437l482k178K055p21o047k58J0204O109j1433
754C26j3673O527J6537qj5647o169J1604P795q490o584P290O328j0073q300J3219
769F82J4812j0485k0805K693K3151P384j8563j1926J2354J2233r131j0751J0027
782A675J2449j0486j7583N312K1361K114j9673j0840J3338J3894o284j1453J680
795d496N878k935k080Q376M955j1428j3539P860K2563M187k1712j6632J1197K1898
809A4092L318j5834j2452L705J2709N398o654q445r53N005L754j044k948j499
823a848p34j810J585O983J899r757r135O303J3514J368j1792o563P027O316m509
838a153k740P839K426j3349p792J4934J6759r350k3723k22K4797J0614k0148j7633
$$ plain form
739 7248 11253 2603 -7357 -6129 2640 6077 2595 417 2472 1751 -4296 -4554 5650 11759 326
754 326 -13347 -6820 9717 9709 -5938 -12107 -503 7292 -1198 -7782 -492 5836 -4237 -12537 682
769 682 15494 5009 -15796 -13103 10048 17432 -1131 -13057 -703 11530 2399 -8352 1675
782 1675 14124 3638 -13945 -8633 12728 14842 -4831 -15671 -2333 11561 5277 -6176 -4496
795 -4496 1382 -1553 -3633 4743 9698 -1730 -15269 -7409 15154 19341 -2371 -19003 -7806 14092
809 14092 17410 1576 -10876 -7171 5538 10936 4282 -4163 -5116 -111 3643 2599 -349 -1848
823 -1848 -2582 -4392 -2807 4176 6075 -3682 -12817 -6514 7000 8368 -3424 -9987 -2960 3356 -1153
838 -1153 -3893 3946 6372 -6977 -14769 165 16924 7574 -16149 -16371 8426 19040 -1108 -18741
852a8741J2292J8947m133j5517R65J0844j593j0221L534J4516j384j8096n050
865a3637J7801J1133j2709j3021P673J1822o150j1484N035J4332l184j8066k588
878a3043J8327Q767j4627j4767P387J6134M27j3154o207O442P496n48k904j001
892a271j448j544L217N316L25m627l805J383M631K682k150l024o31J753K447q74
908B380l261R13M485j281p008n93J0130M000j1173j0943R086J7563j389k0980
922h071q803J7346J5694q166j5809M48J0034J599n065J841N656o079j0926N468
936d833J6648O09j9592q900J6927J5485r723j8259J373J5728L175j1257l091Q728
950C018J191j0418j688J2661P035j1409j2469N282J4064J703j0585m949N526L849
$$ plain form
852 -18741 -6449 12498 8365 -7152 -6187 4657 3064 -7157 -3623 10893 9509 -8587 -13637
865 -13637 4164 15297 2588 -10433 -2760 9062 2912 -8572 -3537 10795 7611 -10455 -13043
878 -13043 5284 14051 -576 -15343 -7956 8178 8605 -4549 -10756 -4314 3182 2634 -270 -1271
892 -1271 -2719 -4263 -1046 4270 4595 -32 -3837 -2454 2177 4859 2709 -315 -946 807 3254 2380
908 2380 -881 32 4517 3236 -3772 -4365 5765 9765 -1408 -12351 -3265 14298 12909 -8071
922 -8071 -16874 472 16166 8000 -7809 -7361 2673 4272 -793 1048 6704 625 -10301 -4833
936 -4833 11815 12424 -7168 -16068 859 16344 6621 -11638 -10265 5463 8638 -2619 -5710 3018
950 3018 4209 -6209 -7897 4764 11799 390 -12079 -6797 7267 8970 -1615 -6564 -1038 2811
964B811k320p95K157j080m132O52O016K012o248o054L588P858J345n655n338L50
980d833M868M562j337n659k540M318L887l164l930L009N558k617q716K33J0924
995D563L967j0216p260O886R283l857r163J805Q248q82q030J743R246k159j2798
1010h624l9J6528O357j6830j3749J1145J9343l271j8803l365J4518O447j0956
1023a299o189Q591O592p860q004O534J0032m192j0955J332J0686P34q947k399
1037e344P115K512o243k326O559M252p602q046N705J1212M90j0830o858N085R630
1052E311K377o576p464N34O866N097k440o786k387M721M455n67l329j135j100
1067b423J99L939M430k821q811k519R350Q556n593j1252J018J0406P79q359r73
$$ plain form
964 2811 491 -304 1853 773 -3359 -2707 3309 5321 -927 -6981 -3393 4465 5810 155 -5183 -4833
980 -4833 35 4597 3260 -2399 -4939 -621 3266 102 -3828 -819 4739 2122 -6594 -6361 4563
995 4563 8530 -1686 -8946 -2060 7223 3366 -5797 -3992 4256 3374 -4656 -2913 6333 4174 -8624
1010 -8624 -8663 7865 14222 -2608 -16357 -5212 14131 10860 -7943 -11308 3210 9657 -1299
1023 -1299 -7488 1103 7695 -165 -8169 -1635 8397 4205 -6750 -5418 5268 6002 -2945 -5344
1037 -5344 1771 4283 -1960 -4286 2273 6525 -1077 -9123 -3418 7794 8284 -2546 -9404 -4319 5311
1052 5311 7688 1112 -6352 -5818 1048 6145 3705 -3081 -5468 -747 3708 3141 -188 -1323 -2423
1067 -2423 -2224 1715 6145 3324 -5487 -8006 1344 9900 4307 -6945 -5927 4479 5258 -3101 -4074
1082d074Q563Q82j0428l605J2470Q306j1781j4135P818J8393j743j8609n036J5166
1096B187R430r705j0059N434Q492m190p359N508Q558n838j1204L878J3169N9j3194
1111d834l965J1879P752j0160j0754P266J3130k922j3568k219J1518O408o880
1124B651q743J530P987K534m187m497r7K548K945J279k497m110r97L244L671J171
1140D432l737m746n05N016N540k154q035k697O997O812m426q354J733P834K47
1155C957p783j093Q286K664r834n797J0444J0949q017j5063K663J5625L634j2127
1169a492o999P475O668m895m350N748M210r047o901J0783J1836q167j7022K262
1183i891J8539N596j5877j1974J0276J3846m497j2316J129R678j02q788k22R094
$$ plain form
1082 -4074 4489 5371 -5057 -8662 3808 12114 333 -13802 -5984 12409 10666 -7943 -12979 2187
1096 2187 11617 1912 -8147 -2713 5779 1589 -5770 -262 8296 2458 -8746 -4868 8301 8360 -4834
1111 -4834 -8799 3080 10832 672 -10082 -2816 10314 7392 -6176 -8395 3123 9531 2651
1124 2651 -6092 -4562 3425 5959 1772 -2725 -2822 -274 2671 3950 1453 -2657 -3654 -410 3261 4432
1140 4432 695 -4051 -4556 460 6000 3846 -4189 -6886 111 6923 2497 -5857 -4124 3710 3957
1155 3957 -3826 -4919 3367 6031 -3803 -9600 844 11793 3776 -11287 -8624 7001 10635 -1492
1169 -1492 -8491 -1016 5652 757 -3593 2155 6365 -2682 -9583 1200 13036 4869 -12153 -9891
1183 -9891 8648 14244 -1633 -13607 -3331 10515 6018 -6298 -5169 4509 4407 -4381 -4603 4491
1197D491K122r318n441Q159P620m945q061J528O449R27m392j445K920J119l160
1212a427q65L597K191l784l886K037N314J375l999n173J110O641L130n190o419
1227e348K523P365J542p329m275O272N962m389p470K349P104j6o911j437N725
1242A667J520n385j582N733J395p714l232R249O552q946j1433N734J4817M09j5048
1257f264o367J1673J0055o164r861K084P546j073n134K494N361l538q343K234
1271e297J1880J472j2560o832R535R958l871j0154j084P489K787m049k009L054
1285C19N32m442k82N774L263n050o291J388P269L963m439p088n62O483N217j820
1301D234p436l147N043O252j369n771j681K822J888n27M57L45l117k894L313P465
$$ plain form
1197 4491 6613 -2705 -8146 13 7633 2688 -5373 -3845 2604 3531 -861 -2306 614 1733 -1427
1212 -1427 -2292 1305 3496 -288 -4174 -2137 3177 4552 553 -4620 -3510 3131 6261 1071 -5348
1227 -5348 -2825 4540 6082 -1247 -5522 750 6712 2323 -5147 -2798 4306 4290 -2621 -4058 1667
1242 1667 3187 -2198 -3780 1953 3348 -4366 -7598 1651 8203 -743 -12176 -6442 8375 8784 -6264
1257 -6264 -12631 -958 9097 2933 -6928 -4844 2702 1629 -3505 -1011 4350 812 -7531 -5297
1271 -5297 6583 8055 -4505 -11337 -1802 8156 4285 -5869 -6953 536 3323 -726 -2735 319
1285 319 851 -3591 -3873 1901 5164 114 -6177 -4789 2480 6443 2004 -5084 -5646 837 6054 4234
1301 4234 -3202 -6349 -1306 4946 3577 -2194 -3875 -1053 835 308 765 1110 -2007 -4901 -1588 5877
1317E877j411r791l132J0605P242p577j0826L532J2241R11j1679l882R612O223
1331G945p359o964N239P277l602o958K454O492j151p393R65Q766J47r504k679
1346f325R949N414q037p730N061R235k079q932p31Q193K064p518l335O302M417
1361E948n393n437K598O057K29o287k920L786L496n83k511j679J94J312K167R14
1377A891j898k384r51K478M039M28l978m257J430O916L837n742q949J464J0940
1392E264M172r034q637M397R745j77q222k125O466J650n951j549O996K745q158
1407b418n402P015Q655l966j0467J76R860L127q292l588O058L262n509k642O634
1422B503L506p531o941O491J0839l234j3133k022J1864P181p967r241K468Q373
$$ plain form
1317 5877 4466 -5325 -8457 2148 9390 1813 -9013 -5481 6760 7671 -4008 -7890 1722 7945
1331 7945 586 -6378 -1139 6138 2536 -4422 -1968 4524 3373 -4020 -3055 5711 5858 -3646 -6325
1346 -6325 3624 9038 1001 -6729 -1668 7567 5488 -3444 -4175 4018 6082 -1436 -4771 1531 5948
1361 5948 555 -4882 -2284 3773 4002 -2285 -5205 -1419 2077 1494 -1017 -2696 -2502 -1190 977 1891
1377 1891 -7 -2391 -3342 -864 3175 3603 -375 -4632 -3202 3714 7551 1809 -7140 -5676 5264
1392 5264 9436 402 -8235 -3838 5907 5730 -2492 -4617 1849 3499 -2452 -4001 2995 5740 -2418
1407 -2418 -7820 -805 7850 3884 -6583 -6407 3453 6580 -1712 -5300 758 4020 -1489 -4131 2503
1422 2503 6009 -1522 -8463 -1972 8867 5633 -7500 -9522 2342 9523 1556 -7685 -5217 3156
1436C156J504n254k438J912J517n10Q24J196k330l285K234N330O12n803l939L694
1452a580O681l04o362l914L693O343O23n838m921L278P023P36o656l809L920N380
1468D293j344m709j54L551M1l519J268M770j209p100o14Q138M310p618p912M355
1484c453R991j097r754j799P843K441o260k477O427K609p788m635Q084Q867o046
1499B953j2477J775J3824L977j1443p871O750Q964j948o935q69M805k18k881K152
1514E58L809l172o333J714Q011J942p769o003M763Q028p86p164k647M506L555
1529C012j082l225o51J754J093m33o37RO0p6p03P80J553j90k580j435K531L614
1547C394j692m517P1M275J652l884k372K983L215k651m287L184N214l276o523
$$ plain form
1436 3156 4660 -594 -3032 -1120 397 -113 711 1907 -423 -3708 -1474 3856 4468 -1335 -5274 -1580
1452 -1580 5101 4797 -1565 -5479 -1786 4557 5180 -658 -5579 -2301 4722 5458 -1198 -5007 -1087 4293
1468 4293 2949 -1760 -1914 1637 1678 -1841 -573 4197 2988 -4112 -4726 3412 7722 104 -7808 -3453
1484 -3453 6538 5441 -4313 -6112 1731 4172 -2088 -4565 1862 4471 -3317 -7952 132 8999 2953
1499 2953 -9524 -7749 6075 10052 -1391 -9262 -2512 6452 4504 -2431 -3300 1505 1287 -1594 558
1514 558 4367 1195 -5138 -3424 4587 6529 -1240 -7243 -2480 5548 4762 -2402 -5049 -543 3012
1529 3012 1930 -1295 -1946 -192 901 468 -169 -160 -100 -176 -879 -99 1454 1264 -1316 -2751 -220 3394
1547 3394 1702 -2815 -2744 1531 3183 -701 -3073 -90 3125 474 -3813 -629 4585 1309 -5214
1562e214K084Q658M41r687m128Q936Q256o338j0873K320J0892J241q594l446N600
1577A48L709l972k972M059K228n174l325O478N948o237q953L315J1255J482j0529
1592b540o374O929R245k396q457j350N605K564k515j601O39O38j502L02K342J058
1608B587l248k746K169L558K67l070k573P81L385J765k171l281K94K634J443j363
1624D31j391O13M24j409P2L619Q07n289l600N052P439k653r572k193R574O805
1640H729o249r402K080Q745Q21n907k069M017O44l016M67M532p94o713j337Q826
1656C374M995r013r003O128J1677q83j1804m054R509O246n489p147L107O289j963
1671A969m878J296M771j140n186M77N409J773n950l502M433M936j958m911m88
$$ plain form
1562 -5214 -3130 5528 5969 -3718 -7846 1090 9346 3008 -7865 -5545 5347 6588 -2006 -5452 148
1577 148 3857 -115 -3087 972 3200 -1974 -5299 1179 7127 890 -8063 -4748 6507 7989 -2540
1592 -2540 -8914 -1985 7260 4864 -3593 -4943 662 3226 711 -890 -251 387 -1115 -813 1529 2587
1608 2587 -661 -3407 -1238 2320 2587 -483 -3056 -2275 1110 2875 704 -2577 -2283 351 1794 431
1624 431 -960 -347 77 -1332 -1260 2359 3166 -2123 -5723 -671 6768 4115 -5457 -7650 1924 8729
1640 8729 2480 -6922 -4842 3903 4724 -1183 -3252 765 1409 -1607 -1140 3392 2598 -4115 -5452 3374
1656 3374 8369 -644 -9647 -3519 8158 7275 -4529 -8583 926 7172 1683 -5464 -2357 3932 1969
1671 1969 -2909 -1613 3158 2018 -3168 -2691 2718 4491 -1459 -4961 -528 4408 2450 -2461 -2949
1686b949L320J792j452j316O42j50q37N6J940R17k097k214L82L196K261j986n054
1703c549p96N694M409l575p226j69P210M559m959o786J795N696Q36l387j061J396
1719H7n68j376K432L526k206o538J31Q233L313p891o690N335Q611k039q547r75
1735e162P103L006n871l329N090L330m738m264M411N503l354o438J132O423J739
1750D581o241l169M534L990l188l148K294K403j853k592J665L970j239m714m92
1765c199M677L133l600m661Q25M761K277l232m712O28M654K542k726m403k14M011
1781G61K573j989l259K7K462J61q83J110M19l050j662L879M163k908o829k5Q051
1798C001M139p559o784M287P865j038o518j410N318J130l912q22M938R26o390
$$ plain form
1686 -2949 371 2163 711 -605 37 -113 -950 -894 1046 1963 -134 -2348 -1966 1230 3491 1505 -3549
1703 -3549 -4345 1349 5758 2183 -5043 -5212 1998 6557 1598 -5188 -3393 2303 3139 -248 -1309 87
1719 87 -481 -1857 575 4101 1895 -4643 -4512 3721 7034 -857 -7547 -2212 6399 4360 -4187 -5162
1735 -5162 1941 4947 -924 -4253 837 4167 -571 -4835 -424 5079 1725 -4713 -3581 2842 4581
1750 4581 -1660 -4829 -295 3695 507 -2641 -347 2056 203 -2389 -724 3246 2007 -2707 -3199
1765 -3199 1478 4611 1011 -3650 -2825 1936 4213 981 -3731 -3103 1551 4093 1367 -3036 -3250 761
1781 761 3334 1345 -1914 -1887 575 736 -147 963 1382 -1668 -3330 549 4712 1804 -5025 -5050 3001
1798 3001 7140 -419 -7203 -2916 4949 3911 -2607 -4017 1301 2431 -1481 -2303 2635 3561 -2829
1813b829k717O579N660m959p550J579Q222J490p130l307M870L609l234k462L003
1828H24J336l694j937M342M889l873p716O48Q706L166o823o299L314O802R88n233
1844e60l302J951L752N62j636j833q16O84K040J455j157k543j199J797L142J024
1860C361l909l766J711N839J466n263m872K979O962N72p428l090N144M917l154
1875A469n058J484M550l85m780N87M964K9n718j379O308L072n499m832L714O609
1891E135k199o469kN996J188n849j082N343J991n890l123N505N831m427p596J201
1907d447Q616J834p613m475M755N257j594m521m57K812N89j069K69J680j927k697
1923b988J612M529J23m759k779L498M524n47m331k574L335L412q01l499r88K400
$$ plain form
1813 -2829 -5546 1033 6693 1734 -5816 -4237 3985 5475 -1655 -4962 -92 3517 283 -2179 824
1828 824 2160 -1534 -3471 871 5760 1887 -5829 -5181 3525 6691 -132 -6431 -3117 3685 4673 -560
1844 -560 -3862 -1911 1841 2403 767 -1066 -1882 -1198 842 2297 1140 -1403 -2602 -805 2337 3361
1860 3361 -548 -4314 -2603 3236 4702 -561 -5433 -2454 4508 5080 -2348 -5438 -294 4623 1469
1875 1469 -3589 -2105 2445 2060 -2720 -2133 2831 2860 -2858 -4237 2071 5143 -356 -5188 -1474 5135
1891 5135 2936 -3533 -3535 2461 3649 -2200 -3282 2061 4052 -1838 -4961 544 6375 1948 -5648 -4447
1907 -4447 4169 6003 -1610 -6085 -1330 3927 2333 -2188 -2645 167 756 -313 -44 1636 -291 -2988
1923 -2988 -1376 3153 3276 -1483 -4262 -764 3760 3213 -1118 -3692 -357 3055 2254 -1245 -2233 167
1939A67K231j241k615O08K457o04k955N17L706P83m296l236L703N401j873o291
1955c538p93O009K356m181l478K719L191j958k848K571L190l518m637L756O814
1970E655j467r497j375R085O005o795r032L045R754Q44q261l323N194M218k758
1985A292k954J237J802k245j409L752K527m397m730L028O786l26p113k804N204
2000c50M992k496n614K25M361J520k505j646Q62Q39k09o47J360M92j692j524R09
2017a123L036N50k692k673J185L596R85k606l299J379L822P5k979r88J739J062
2033A069j463m00K053L04l709j528M609M257l866o806J207P786K487o524n466
2048e990L993O744j411o338l63M570J157l367n45L279K49m030j038N232K757m960
$$ plain form
1939 167 2398 1157 -1458 -850 1607 1003 -1952 -1435 2271 3054 -1242 -4478 -775 4626 2753 -3538
1955 -3538 -4331 1678 4034 -147 -3625 -906 2285 327 -2521 50 3240 -278 -4915 -1159 5655
1970 5655 4188 -5309 -6684 2401 8406 1611 -7421 -4376 5378 6222 -2039 -5362 -168 4050 1292
1985 1292 -1662 -425 1377 -868 -2277 1475 4002 -395 -5125 -2097 4689 4363 -2750 -5554 -350
2000 -350 4642 2146 -3468 -3243 1118 2638 133 -1513 -651 188 -21 -668 692 1184 -508 -2032 -1123
2017 -1123 1913 2463 -229 -2902 -1717 1879 2864 258 -3041 -1662 2160 2235 -744 -1732 7 1069
2033 1069 -394 -794 1259 1563 -2146 -3674 935 5192 1326 -5480 -4273 3513 6000 -524 -5990
2048 -5990 -1997 4747 3336 -3002 -3365 1205 2362 -1005 -1550 1729 1978 -2052 -3090 2142 4899 -61
2064f1n271L854O528j267o778j395N626L162m083l648K127L774j117l407N16L084
2080A644N8l218m35K560J518j897k653J053K654K76k106r52Q76J097M20r66m68
2097e39K02N94m48L2P81K91j357j167J862K409q43m040j064M182L743l243n578
2114d183R77N788J587m538l514K803L783j332l196Q97K243j307k340K223K838
2129B729k048n000R48O594J703o638m442M980O579k454o922J76O107J334m606
2144i60k648M119K873l367l398K832M469k361m991L13N343J589m059l420K366
2159a300L371m48k270n52J291m0q47J090J246j225j886r7K774J786k762l278N87
2176b560M374K106l313m187O86N009K157l636m298J574M122J055l463j759J675
$$ plain form
2064 -61 -5332 -1478 5050 3783 -2995 -4390 1236 4398 315 -3333 -1206 2568 1451 -1956 -1440 1644
2080 1644 1702 -1516 -1951 609 2127 230 -2423 -1370 1284 1560 -546 -1498 -622 475 895 -71 -539
2097 -539 -337 257 -191 -159 622 913 -444 -1611 251 2660 1817 -2223 -3287 895 4638 1395 -4183
2114 -4183 -3206 2582 4169 -369 -3883 -1080 2703 1371 -1825 -928 1315 8 -2332 -109 2729
2129 2729 681 -4319 -3371 3223 4926 -1712 -6154 -1174 5405 2951 -3971 -3795 2312 3646 -960
2144 -960 -3608 511 3384 17 -3381 -549 3920 1559 -3432 -3119 2224 3813 -246 -3666 -1300
2159 -1300 2071 1623 -647 -1199 92 52 -795 295 1541 316 -1570 -1667 1107 2893 131 -3147 -2560
2176 -2560 1814 3920 607 -3580 -2894 2115 4272 636 -3662 -2088 2034 3089 -374 -2133 -458
2191d58K022j238j071J474M11k379p94L113K420l525m162K033N610M58o049k833
2207d968N079M530l769m720J754M922o08m764q4M882R78m680k271M622L456l884
2223D75m712K194N441k36n100j122L538K116k595j746K049J332k464j331K588
2238D27K575k347l964J151M879J100n059l457L478M954m95m825k535L279L964
2253C125n52m145r48K566J730j479j455N91J288m46j213P13J652p13l009K86L643
2270A634J163l283l398K472M508q56m506n98M445J414l958k093L509L131k897
2285F87l935J689M682l11n234j012M886K366m126k973K816L486j984l122J117
2300i68L299j480l682J424M632m94n527j137N276L765m763n061K085O106K58n583
$$ plain form
2191 -458 1564 326 -745 729 1140 -1239 -2033 1080 3500 -25 -4187 -2154 3456 3914 -2135 -4968
2207 -4968 111 4641 872 -3848 -2094 2828 2220 -2544 -2628 2254 3232 -1448 -3719 903 4359 475
2223 475 -4237 -2043 3398 3162 -1938 -3060 478 2594 -1 -1747 302 1634 -830 -2161 427
2238 427 3002 655 -3309 -2158 2721 3821 -1238 -4695 -1217 3737 3242 -1583 -4118 -839 3125
2253 3125 2573 -1572 -2520 46 1776 297 -1158 -567 721 275 -938 -225 1427 714 -2295 -2009 1634
2270 1634 2797 -486 -3884 -1412 3096 2240 -2266 -2864 1581 2995 -963 -3056 453 3584 687
2285 687 -3248 -1559 3123 2812 -2422 -3434 1452 3818 -308 -3281 -465 3021 1037 -2085 -968
2300 -968 2331 851 -2831 -1407 3225 2731 -2796 -3933 1343 5108 345 -4716 -2631 3475 3733 -1850
2316a850k237M026L343k094l149N01K473m5k012L99J558K0k051n07K278J261j882
2333C2k107Q71K384J034k588k248J689L059k22k994j004J991J702j139j416N05
2349d51J944q10k774J282L255k79l825j470M085L026k846m698J078N234J036m755
2365i68k377L159K345j590j940J549J458k202k773L402L733k005n911L54O292
2380B526K354n483m915L892O006r29n577j717M056K707j955k333Q31J117o07l36
2396c63J349P15k216j541J837K637j090l047l06K959J767k500k661J110K749L43
2412A742k431r42J570J568j029j980K85K327L24k271j568K047K680j211l147K43
2428a793K838J473k921k246J924K907j032l157N55K917j84k856m96L419J391l533
$$ plain form
2316 -1850 -4087 -61 3282 1188 -1961 -1460 1013 968 -1044 -645 913 933 -1118 -1625 653 1914 32
2333 32 -2075 -1204 1180 2214 -374 -2622 -933 2126 1904 -1090 -2094 -103 1599 460 -956 -451
2349 -451 1493 683 -2091 -809 2446 2167 -1658 -3128 957 3983 1137 -3561 -2483 2751 3787 -968
2365 -968 -3345 -186 2159 569 -1371 178 1636 -566 -3339 63 3796 1791 -4120 -3766 2526
2380 2526 4880 -603 -5518 -1626 4380 3451 -2126 -3843 213 2920 965 -1368 -537 580 -27 -363
2396 -363 986 1701 -515 -2056 -219 2418 1328 -1719 -2025 934 2701 201 -2460 -1350 1399 1742
2412 1742 -689 -1631 -61 1507 478 -1502 -1217 1110 1434 -837 -2405 -358 2322 1111 -2036 -1793
2428 -1793 1045 2518 -403 -2649 -725 2182 1150 -2007 -1452 1465 1281 -1575 -2071 1348 2739 -794
2444g94k845L167M285k111n331O61N190J472m778k929L139M376j803m011O69L209
2460A566j73k381j29K328K78k605p21K598J809k552k581J890L085j275l159O28
2476a394K966L64k869j105K575J781k343k329J737L173p53l851j063L498K729
2491C116j400l701q66L343K304j677k935KK168J554j170j831L92J005K74k83K12
2508E07K91j749n27J768K524j368l923n51M148K889l069m310J331M521L51m095
2524a262j438L059K085k193k127J770J564j471k240K055K894j548m069M96M233
2539A808J113l832k810L022L773j858l998R68L694J76l540q40K958J770k537k435
2555b568J773L539j243l564l01L121J912k132k488M97K370P49j750j416O84J175
$$ plain form
2444 -794 -3639 -472 3813 1702 -3629 -2968 2222 3694 -1084 -4013 -874 3502 1699 -2312 -1643 1566
2460 1566 1393 -988 -1117 1211 1489 -1116 -1837 761 2570 18 -2563 -673 2412 1137 -2022 -1394
2476 -1394 1572 1936 -933 -2038 537 2318 -25 -2354 -617 2556 1803 -2048 -3111 387 3116
2491 3116 1716 -1985 -2851 492 2796 1119 -1816 -1814 354 1908 738 -1093 -701 304 578 295 507
2508 507 798 -951 -1478 290 2814 1446 -2477 -3028 1120 4009 940 -3370 -2039 2482 2833 -1262
2524 -1262 -2700 359 2444 251 -1876 -106 1458 -13 -2253 -198 2696 1148 -2921 -2425 1808
2539 1808 2921 -911 -3721 -699 3074 1216 -2782 -1814 1880 2056 -1484 -2324 634 2404 -133 -2568
2555 -2568 -795 2744 1501 -2063 -2364 757 2669 537 -1951 -1454 916 1665 -85 -1501 -817 358
2571C58K59p61o8j86M2L93L31M41l71j781J29K072J245j794k439R06K520Q56k967
2590h15j682K379K712j700k648N67K470K39k669o68K838Q85k988j916K964L144
2606C112k240l936P32M494O13l945j761L706K240l041l014K584L500j281m296
2621b533N08M153J067m225k203L326L265j857l881L73L101J162k297j250J355
2636F4O02r48j08Q73M40j705p46J829K002j493k735k8K991J740k672k856Q85L432
2654A567P64k794k130J699K540m24k417l92J886R79k083j148J943J540j053k412
2670a935Q67K899K75l268j273K856K215k137k745J101K582j80k472j18K721K90
2686A678l054j017L290J869l342k822K429L643p37m551l26M051J876l032k694
$$ plain form
2571 358 617 -144 -212 -398 -356 37 368 809 438 -1343 -1214 858 2103 309 -2130 -1224 1296 2152 -815
2590 -815 -2497 -118 2594 894 -1754 -1187 1283 1522 -1147 -1815 1023 1908 -1080 -2996 -32 3112
2606 3112 872 -3064 -2332 2162 2775 -1170 -2931 775 3015 -26 -3040 -456 3044 1763 -2533
2621 -2533 -2025 2128 3195 -1030 -3233 93 3358 1501 -2380 -2007 1094 2256 -41 -1291 64
2636 64 666 -282 -390 483 923 -782 -1528 301 2303 810 -1925 -1953 1038 2778 106 -2750 -1865 1567
2654 1567 2331 -463 -2593 -894 1646 1222 -1195 -1587 299 1278 -805 -1953 -10 1530 477 -1935
2670 -1935 -1068 1831 2106 -1162 -2435 421 2636 499 -2246 -1145 1437 1257 -1215 -1333 1388 1678
2686 1678 -1376 -2393 897 2766 -576 -3398 -969 2674 1937 -2614 -2940 1111 2987 -45 -2739
2701b739J750K713r77j883Q57J620j075j678J002K953q67l640p46M449K165l421
2717D83l974J444M799P94m203k982K682L873r28l250q85K238J592j444j552O32
2733f81J680l19j680K61J806l4j842n89J546J759r06k249p3K193Q15j896p44R38
2751a5J018j169q95J459J197j425k156Q67L342j94l570j349L579K486k650l446
2767b921R73L938N07l398j275K532J098j724j405K070J482k401k181K144L141
2782B580j524l856K9M478J108l444k612K355L600j083l065n32K586J239k029j423
2798a593J967R77q80j754N56J641L38j763o29J247R90r98r97M71Q60k2r68L7M70
2817e0K67q71n35J790R50j495k172J247K606O51l092k168K421L250p49l962l81
$$ plain form
2701 -2739 -989 1724 747 -1136 -279 1341 266 -1412 -410 2543 1676 -1964 -2710 1739 3904 483
2717 483 -3491 -2047 2752 3546 -657 -3639 -957 2916 1988 -1262 -2147 91 1683 239 -1313 -681
2733 -681 999 680 -1000 -739 1067 1033 -809 -1398 148 1907 1001 -1248 -1321 872 1687 -209 -953 -15
2751 -15 1003 -166 -1061 398 1595 170 -1986 -1119 2223 2029 -1541 -2890 689 3175 525 -2921
2767 -2921 -1948 1990 2497 -901 -2176 356 1454 -270 -1675 395 1877 -524 -2705 -561 2580
2782 2580 1056 -2800 -2771 1707 2815 -629 -3241 -886 2714 1631 -1434 -1966 620 1859 -170 -1593
2798 -1593 374 1351 471 -1283 -727 914 1252 -511 -1140 107 1097 99 -898 -427 433 411 -557 -520 -50
2817 -50 217 -654 -1189 601 1551 56 -2116 -869 1737 2388 -704 -2872 -451 2799 2050 -1912 -2293
2834b293L088K167k219k755R88K433p6k083k87J823L2k079J22K563N25k804j712
2851b567K208L146j446l649j05M062J192k996j941J430K106o01j823O06J178n67
2867B33j454O54K152o99k491k01K544J585k121k231R48K268k1j771p12J235P40
2884F58o17o22R31O15j024j234J089K002p3l115j043K538K714j217l265j189L256
2901D04K851k065l484mL322J271k111j803Q76J397l0j390O48Q25j044j038R50
2918d25K094m48l192j52L031J657k202l007J518L416l59l092o61K450J346j968
2934Fj525J680J853j451k253R64K552l52k940r7K627J023k345j638J708K155j160
2951H07k431M44K469l47k032l99K133J385k221k127J408L015l12l241j107K412
$$ plain form
2834 -2293 795 2962 743 -2012 -1024 1409 1333 -750 -1037 786 818 -1261 -1139 1424 1949 -855 -2567
2851 -2567 -359 2787 1341 -2308 -2413 1649 2841 -155 -2096 -666 1440 839 -984 -378 800 233
2867 233 -1221 -567 1585 886 -1605 -1806 738 2323 202 -2029 -1081 1187 1166 -605 -1317 -82 658
2884 658 41 -581 350 965 -59 -1293 -204 1798 1725 -1390 -2433 105 2819 1602 -1663 -2852 404
2901 404 3255 1190 -2294 -2298 1024 2295 184 -1619 -743 654 624 -766 -118 707 -337 -1375 -425
2918 -425 1669 1221 -1971 -2123 908 2565 363 -2644 -1126 2290 1931 -1161 -1822 628 1974 6
2934 6 -1519 161 2014 563 -1690 -726 1826 1474 -1466 -1563 1064 2087 -258 -1896 -188 1967 807
2951 807 -1624 -1180 1289 942 -1090 -1489 644 2029 -192 -2319 -911 2104 1792 -1449 -2556 -144
2967a44K221j017k783j10K275J208j198j667Q60Q62o9m69P2N65j036o70R02J639
2985A441m71k180n16K163J978j903k740P82K864N06k824j332K336J776j729k172
3001b021J883K018j014k890L06L485P52l384k146K584L422j634l803M54L348O50
3017B010k273j058J225J515j513j185J692J518k224k019J686L043m73l709j486
3032c251L530K882j721l699J81L038J094j691j986O27J620N6o38K88k46m58m58
3049h32J605R21j289k093K99K640J120j983k401J012K895R7k584j375J803K038
3065A873j063k110J02K368K2k334l90K239N18j922j793J869K667q09l342j20K882
3082F57J826k521k139J404K251p87j879N37J520r7j697J75K024L66k944j402L255
$$ plain form
2967 -144 2077 1060 -1723 -1833 442 1650 452 -1215 -355 507 438 -31 41 606 -430 -1100 -198 1441
2985 1441 970 -1210 -1726 437 2415 512 -2228 -1446 1418 1924 -900 -2232 104 1880 151 -2021
3001 -2021 -138 1880 866 -2024 -1718 1767 2519 -865 -3011 -427 2995 1361 -2442 -1988 1360 2010
3017 2010 -263 -1321 -96 1419 -94 -1279 413 1931 -293 -2312 -626 2417 1944 -1765 -3251
3032 -3251 279 3161 1440 -2259 -2078 960 2054 363 -1623 -996 624 680 42 330 84 -374 -832
3049 -832 773 1694 405 -1688 -1389 1251 2371 388 -2013 -1001 1894 1991 -593 -1968 -165 1873
3065 1873 810 -1300 -1198 1170 1192 -1142 -1532 707 1225 -697 -2490 -621 2046 1237 -2105 -2225 657
3082 657 2483 -38 -2177 -773 1478 691 -1188 -651 869 772 -925 -750 1274 1640 -1304 -2706 549
3099E49K288j767l482K97L816Q51l067k098K273K004p15j785P8J414l3j153r6
3116f26J707l21j732n28K287J562j984k570J013K793K82k382j554J605K204p96
3132I60k073L3J704N14j564o63J091J042p66j642O32K077k35j907q18J742J426
3149A553r26j824J44J519N75j096m14J111k33j275K15J653N42j938j568J758K860
3166B656j011l489m97L321J976k449k737Q81K754j6k210o93J765O87j414n64J756
3183G16M83j879j179J883J953j304k512m5K913J459k645k173J147K507J2k246
3199i10m52J438Q90j036q08Q28R07p12j082M04J205L70j724q47J421J576n66k203
3217a301k40J596J126p97j050J36Q16L34q32L94L51p84r87J038J720k40k653r80
$$ plain form
3099 549 2837 1070 -2412 -2115 1701 2552 -515 -2613 -340 1664 949 -836 -758 656 623 -530 -626
3116 -626 1081 760 -972 -1500 787 2349 365 -2205 -1192 1601 1883 -499 -2053 -448 1756 960
3132 960 -1113 -1080 624 1138 -426 -1089 2 1044 278 -1364 -732 1345 1110 -797 -1615 127 1553
3149 1553 627 -1197 -1053 466 1041 -55 -469 642 409 -866 -651 1002 1544 -394 -1962 -204 2656
3166 2656 1645 -1844 -2341 980 2956 507 -2230 -1349 1405 1389 -821 -1514 251 938 -476 -1040 716
3183 716 1199 -680 -1859 24 1977 673 -1839 -1884 1029 2488 -157 -2330 -1183 1324 1336 -910
3199 -910 -1362 76 966 -70 -878 -50 857 145 -937 -533 672 1042 -682 -1529 -108 1468 902 -1301
3217 -1301 -1541 55 1181 384 -666 -530 286 620 -212 182 533 -251 -1238 -200 1520 1280 -1373 -2353
3235b353K531K512j595l367q8L424J452k495k350J097K456n0j619j90J027p7j022
3252g07N79J180k37k127k04K290J540j955k612Q67L104M45k878j330K090J549
3268A594j314j400O64J446m06j257oJ631K25j839q47J948J487j279j805J63K061
3285A066Q97j523j410O17J461n76p32j11R06j77j118J03J426K23j839j157J798
3302a46J968j083k592l84K966J745k305k463P20K823O46k642p50J516J070q97
3318A92j212R44J161j014j135P22J907p80j914K5J876J082j922j790J346K012
3334A500o28k325N20J575L92j815o02K010O97j602j719J528K317o72k538l38K283
3351E83J290j792j527M70J807k50j115J9R25l17p86K48J347j15j677p56J549J948
$$ plain form
3235 -2353 178 2690 1095 -2272 -2360 1064 2516 21 -2329 -1232 1224 1174 -445 -635 392 315 -707
3252 -707 -128 1052 815 -1312 -1516 774 2314 359 -2253 -1386 1718 2163 -715 -2045 45 1594
3268 1594 280 -1120 -456 990 584 -673 -679 952 1177 -662 -1509 439 1926 647 -1158 -995 1066
3285 1066 1963 440 -970 -353 1108 532 -200 -311 595 418 -700 -597 829 1052 -787 -1944 -146
3302 -146 1822 739 -1853 -2237 729 2474 169 -2294 -1574 1249 1895 -747 -1497 19 1089 192
3318 192 -1020 -76 1085 71 -1064 -342 1565 785 -1129 -1104 772 1854 -68 -1858 -512 1500
3334 1500 872 -1453 -933 642 1034 -781 -1383 627 1324 -278 -1997 -469 1848 1176 -1362 -1700 583
3351 583 1873 81 -1446 -976 831 581 -534 -515 410 93 -693 -445 902 787 -890 -1646 -97 1851
3369A851o70k783n47L070J401j609k728N74K596N09j685j581J282J342q18p49
3385e45K84R65q47r31P53J416q7k111o98K046J871j754k272O38K543M71k030j281
3403a569J629J518j320j325J254J193j139j775Q58K162j07k453q25K258J738j475
3419F22k548M12K578K46j767r42Q91J109n62q41P44P88j083j066J332J483n24
3436H72k240k95K412J632k147k401J112K658J10j890j215J063J407o56j001kP96
3453B15M3r99L31J094l29j339mJ418R92j167j802N56K358P6k073j005J492J807
3471A664j223j670L79J891k01j539o37J797Q58j657j424J285K141o88k403k33
3487a660K250Q65j509j481J106J558m05j345N27Q24m26r73L40J638j91k011p41
$$ plain form
3369 1851 1181 -1602 -2149 921 2322 713 -2015 -1441 1155 1664 -21 -1602 -320 1022 204 -545
3385 -545 -261 704 -143 -1074 -321 1095 1008 -1103 -1801 245 2116 362 -1910 -1272 1271 1742 -288 -1569
3403 -1569 60 1578 258 -1067 187 1380 241 -1534 -676 1486 1379 -1074 -1899 359 2097 622
3419 622 -1926 -1514 1064 1310 -457 -1399 -508 601 39 -802 -58 730 -353 -1419 -87 1396 872
3436 872 -1368 -1663 749 2381 234 -2167 -1055 1603 1713 -177 -1392 -329 1078 422 -579 -581 215
3453 215 258 -741 -410 684 355 -984 -988 430 1422 255 -1547 -991 1367 1443 -630 -1635 -143 1664
3471 1664 441 -1229 -850 1041 840 -699 -1336 461 1319 -338 -1762 -477 1664 976 -1427 -1660
3487 -1660 590 1455 -54 -1535 -429 1129 724 -621 -94 730 304 -669 -329 1309 1118 -893 -1634
3504a634K014J592j278k567O37K332R00k029j680R91J884m04j428j12N71M93o94
3521d12j63P74L36r97l91J309J146j139j387J49J502O79j594q34Q40J381o53j114
3539e68o0J146l2j173jJ221P39j406j199P04K175n58k080p28J866J676j400j722
3557a400L92J585M67j152r07J219L63j108J34O44O08j468q21J526J851j059k795
3574a921J6L008Q41j851k156Q55K641N9k200r20J768J209j030j084P01M94k91
3591A39r03J058O03n03j559N4J831O91j418j302O09J687l55j182n93J136O73m75
3609A91j070Q50P58o86p49M47J126j31j393r16J732J283r71j625k5J797M57j070
3627Ej019N24J150k56o41J07M42l22r58Q15J143k87j842j67J945J116j719j962
$$ plain form
3504 -1634 380 1972 694 -1873 -1236 1096 1996 -33 -1713 -722 1162 758 -670 -782 -211 282 -412
3521 -412 -575 199 535 -462 -853 456 1602 463 -924 -775 727 1406 -188 -1022 -182 1199 546 -568
3539 -568 -628 518 486 -687 -688 533 1272 -134 -1333 -629 1546 988 -1092 -1820 46 1722 322 -1400
3557 -1400 -1008 577 1044 -108 -1015 204 567 -541 -407 237 845 -623 -1444 82 1933 874 -1921
3574 -1921 -1905 1103 1944 93 -2063 -1208 1433 1492 -708 -1628 140 1349 319 -765 -64 430 139
3591 139 -764 294 897 394 -1165 -1111 720 1411 -7 -1309 -700 987 632 -550 -1143 -7 666 191
3609 191 -879 -29 729 43 -706 -259 867 736 -657 -1573 159 1442 471 -1154 -1179 618 1075 5
3627 5 -1014 -490 660 404 -237 -130 312 -10 -968 -153 990 703 -1139 -1306 639 1755 36 -1926
3645a926J051K256O3j812j131J495J339p83j509M65J061K5j035q4J508k79j113
3662d09n61J507R59j271j332L04J859M31j917q71J484Q17q77j130N33J271k68
3679E29j295j21J576J85j183j021Q94J692o66j706q9J429J095j138j014K85J309
3696G61l86p38k54R42J51q08K02P65J35j164q27J377J395q82j981N8J913J175
3714A834j561j688P42J804p2j812j30J174M76j033n28J015M42q95r57J014J151
3731I76n79j579k47J951P91j443j511J278J290k15j473pJ564j24j444L8J313N19
3749A098j405j278J335J990o84k164n67K016J273j216j560L64J546K93j116m54
3765e29P14J01n17j84P09K53j064n10R28J394p70j803o6K144J099j797j716R76
$$ plain form
3645 -1926 -875 1381 1444 -368 -1499 -4 1335 552 -957 -492 569 594 -441 -525 983 704 -409
3662 -409 -970 537 1496 225 -1107 -803 1056 1487 -430 -1301 183 1000 123 -1007 -474 797 529
3679 529 -766 -887 689 874 -309 -1330 -436 1256 590 -1116 -1205 224 1319 181 -833 -548 761
3696 761 375 -363 -617 325 476 -332 -130 635 770 -394 -1221 156 1551 669 -1312 -1254 659 1834
3714 1834 273 -1415 -673 1131 1059 -753 -883 291 767 -266 -794 221 663 -232 -1189 -175 976
3731 976 397 -1182 -1429 522 1313 -130 -1641 -363 927 712 -761 -768 796 672 -772 -734 579 1098
3749 1098 -307 -1585 -250 1740 1056 -1108 -1675 341 1614 398 -1162 -798 748 1041 -75 -529
3765 -529 185 286 -231 -415 294 547 -517 -1027 -99 1295 525 -1278 -1344 800 1899 102 -1614 -638
3783f38J881K42j907r31J253J118m14j225J97R32Q9j083J62J072j79j321j31J197
3801C14P98r69j625J008J309Q4j535l83J267Q37j050q70O84J272r10j040R3J725
3819A009Mj583m82J104J540j167j739N14J671Q8j368o48J080O13o17o82O87N41
3837E65m36j259P96J291m29j229m27J535J105j081j949P63J923n8j777o46J405
3854I2R60p83j039K95J325m80r39j5J039O49j207r13J126Q89m89j454P7J337N65
3873A035j123j008J059P89n79r27O36O77k19j303J67J686L93j790j042J432J582
3890A465p88j676j44J565J117j390j099L95J326l55o98j6P30m68m63L12Q12N5
3908F80j530k77J265J042q35j387R5J789K83j183j216J152J274m03j271n4J025
$$ plain form
3783 -638 1243 1485 -422 -1353 -100 1018 604 -621 -424 508 597 -486 -324 748 569 -752 -883 314
3801 314 1112 143 -1482 -474 835 919 -616 -999 268 1105 55 -815 -131 1141 231 -809 -716 1009
3819 1009 1013 -570 -1052 52 1592 425 -1314 -800 871 959 -409 -1057 23 636 19 -663 24 565
3837 565 129 -1130 -334 957 528 -701 -1128 407 1512 431 -1518 -755 1168 1110 -667 -1313 92
3854 92 1052 269 -770 -475 850 370 -569 -584 455 1104 -103 -1016 110 999 510 -944 -867 470 1035
3873 1035 -88 -1096 -37 752 173 -754 -118 559 340 -963 -796 890 1283 -507 -1549 -117 1465
3890 1465 677 -999 -1143 422 1539 149 -950 -555 771 416 -282 -298 432 -36 -499 -187 625 680
3908 680 -850 -1127 138 1180 345 -1042 -947 842 1125 -58 -1274 -122 1152 749 -522 -576 449
3925D49M27j298K24M50N68r55m24P00Q98n76j470K25J454L08j121q27O98J355
3943A085k33j547J34J063L85j289m29R16N88m72j278P18J481j91j717m93J697
3960D18J045j392j264O74R22M82j224n70N55Q08p64r9M22L63l59o67N28J122m20
3979E80j230l84J540R29j388j275O57J650n5j379q18J293P29n46p72J50Q34k93
3997B22j076L98J042j97p20o12Q48R79q57r49M14J058l32j100K66Q57M66r74m61
4016g28R61Q14p39j288N49J605l65j136j040J366J022o36j287j43J557O54j464
4033b98o42N03P85k52n80K99O09j23j031J77J510L5j638l91J316J068j000j383
4051a036L36J698J35j491o77J080J254r20j448N59J041N6r16m65J174P13j102
$$ plain form
3925 449 876 -422 -198 252 820 -135 -559 141 1039 463 -1007 -782 672 980 -141 -968 -270 1085
3943 1085 852 -695 -561 502 887 -402 -831 85 673 201 -1077 -359 1122 931 -786 -1279 418
3960 418 1463 71 -1193 -519 403 885 -339 -909 -354 454 -310 -409 13 376 17 -650 -122 1000 580
3979 580 -650 -1034 506 1435 47 -1228 -571 1079 1024 -355 -1173 120 849 303 -469 -319 515 222
3997 222 -854 -456 586 389 -331 -943 -95 884 27 -922 -508 550 218 -882 -616 241 707 -267 -728
4016 -728 233 1047 308 -980 -431 1174 809 -327 -1367 -1 1021 385 -902 -1045 512 1166 -298
4033 -298 -940 -437 348 96 -484 -185 424 301 -730 -553 957 992 -646 -1037 279 1347 347 -1036
4051 -1036 -700 998 1133 -358 -1035 45 1299 379 -1069 -510 531 587 -329 -794 380 1093 -9
4068iq97P11J227n08j294J76J357J09r97p33O92Q39m55q90K61J149o75j020J97
4087g60J400L15j326j105J014J853j057j283l41J706R82j288j037O56R57j46j023
4104d83J16P76o4p03J39Q21o7r93m79J052J197q93j641M61J383N24j351q55R57
4123a03J120p24j149K53R92J17q44n20J343N84j161p94O24J070J1j500k49J520
4141E90M62j004r62O13J107l76r77P5J036J59j100l89J115N46j084q68P90J314
4159A047m4j969r2J370J238j198j511O12J407m0j244n11R23R39r75m97O19L32
4177D06m89o60M09R70j69j097l66J423O89r94j137Q11R32k20j211k01J455K53
4195H04r59n39L85J188n99j048M72J056l26q24m77R51O54p51p27K34J060k64p14
$$ plain form
4068 -9 -906 -195 1032 524 -770 -594 763 872 -125 -858 -166 673 218 -672 -411 738 63 -957 -760
4087 -760 640 955 -371 -1476 -462 1391 334 -949 -1290 416 1398 110 -927 -271 686 540 -483
4104 -483 -367 409 345 -358 -219 602 535 -458 -937 115 1312 419 -1222 -761 622 1146 -205 -1060 -103
4123 -103 1017 293 -856 -603 389 506 -338 -858 485 1069 -92 -886 -262 808 819 -681 -930 590
4141 590 1052 48 -914 -301 806 430 -547 -472 564 723 -377 -766 349 895 -189 -1057 -267 1047
4159 1047 1003 -966 -1058 312 1550 352 -1159 -547 860 820 -424 -935 -12 927 -48 -545 74 406
4177 406 -83 -743 -334 636 467 -630 -996 427 1116 122 -1015 -204 728 508 -703 -904 551 804
4195 804 -155 -694 -309 879 280 -768 -296 760 434 -390 -867 84 738 -13 -740 -506 554 290 -424
4214d24k80J098O2j072m5R24N10p25r28L00J582j8j683k55J136J035r24j334L4
4233a007J575J29p96o01J036K74m57m46L55L98l43q90L77J310k59j222l76J061
4251A18J177j015j372L58J282J41r72p27R21Q45r41l86M05O75j76q20L0P30O47
4270I20j031q44P34R57m88p41qO98N74q90l19M81N10m79m15O39M71o05o90J91
4290c35R43L34j341p41J193R15o55j185R7J067O87r96j181Q12Q65k06n42k40Q35
4309C26j66l35p1N31J40q34n58J166P19p04j118K35J446J81j094n62N58J179n02
4328E37j127o2J230Q7j107k06Q70M70o52r92P82Q41q3j101m14J189M81q30n79
4347f66L61P93q0r32J83Q57Q9j129l29J066O02q08r73O07J378k89j253l20J232
$$ plain form
4214 -424 -704 394 456 -616 -661 263 773 48 -880 -580 1002 984 -699 -954 182 1217 293 -1041 -1007
4233 -1007 568 697 -99 -700 336 610 153 -293 62 460 117 -773 -396 914 655 -567 -943 118
4251 118 1295 280 -1092 -734 548 689 -283 -1010 -89 756 -185 -571 -166 509 333 -487 -457 273 920
4270 920 -111 -955 -221 736 248 -493 -501 197 771 -119 -438 43 553 74 -341 298 769 164 -526 -335
4290 -335 608 942 -399 -1140 53 968 313 -872 -775 292 979 -17 -1198 -386 479 273 -269 -509 326
4309 326 160 -175 -246 285 425 -409 -967 199 918 214 -904 -669 777 958 -136 -698 -140 1039 537
4328 537 -590 -652 578 665 -442 -648 222 692 40 -952 -170 671 588 -513 -927 262 743 -87 -666
4347 -666 -305 488 408 -524 -341 516 605 -524 -853 213 815 7 -966 -359 1019 730 -523 -843 389
4366C89N53p35j086M14J164j1j163j81N20N30o39p7K26P00o41o32J86J167n02
4385A82p84q0P69M67m96q05N65J144m92r11l0Q59J00m30n53Q02P27p38j126L95
4405d35J146J78j165n63P20R68m21j295L88Q85P8q91P1L11M44p69k24R70K14o13
4425cj022O45J452j87j278m72J060Q25n89j218J54J192L12q80p91O03P81n95m20
4444d31L10M98j04r05K82P30kp27n31R97P62p74j099M00J058J50q94l51O00M81
4464D50p66l97M11O69o9p26j08J029K73q65q01N10J241m29o38k80P18L62q07j28
4484c51K90N47m95l20M21O02o20o63N26P38J37j161o84J054J198p42j404J0J369
4503D52K72r81m91N06P72k49r43L58O84j17l45j78O83J3q57m71R20O99l93j015
$$ plain form
4366 389 942 207 -879 -465 699 688 -475 -656 -136 394 -245 -322 -96 604 -37 -669 -483 684 182
4385 182 -602 -682 87 554 58 -747 -182 962 470 -441 -471 388 488 58 -495 307 1034 296 -830 -435
4405 -435 711 889 -276 -839 -119 849 428 -867 -479 406 484 -407 -336 -25 419 -350 -574 396 610 -3
4425 -3 -1025 -380 1072 885 -393 -865 195 1020 431 -787 -633 559 871 -9 -800 -197 584 -11 -431
4444 -431 -121 377 273 -632 -350 380 378 -349 -880 117 879 105 -994 -594 464 614 -280 -631 -31 450
4464 450 -316 -713 -302 367 298 -428 -536 493 766 -99 -900 -390 851 422 -216 -496 222 584 -223 -351
4484 -351 -61 486 -9 -329 92 694 74 -589 -63 675 812 -349 -1033 21 1219 477 -927 -917 452
4503 452 724 -257 -748 -242 530 281 -662 -304 380 263 -82 -260 423 436 -421 -892 28 727 334 -681
4523f81J91R17K63q51m17N72Q02m35r34K82Q09j26j010k05J170L38n82q33L63
4542c67J065P4j177m57Q70O32o10n81K21O32K7o83J09Q18j55o45k85R92J37p27
4562a10p48L73J411m53j174k22J154N70p25q53M93P30K18j131J49L93L04o02k97
4581e20P61K19l31p59O46O78k57j041J93Q70K17p54n02N06O09j54j030M40O24
4600D15j58m94k49N87O27r32o63L76J094J36q11o13N54R67n13p34k01R57j8m55
4620a28o5N60m0o87J19M49L61n96r70M99J438n51j119k95J210Q14n56j175J0R72
4640B50M37p81m92M93P09o48k20K75L50m37l37K04P72j19r01k86Q34M84n88n81
$$ plain form
4523 -681 -490 427 690 -161 -578 -6 796 361 -573 -291 518 392 -618 -823 347 685 103 -730 -367
4542 -367 698 772 -405 -862 8 640 30 -551 -330 302 329 -354 -245 573 418 -227 -512 480 617 -110
4562 -110 -858 -485 926 473 -701 -923 231 801 76 -777 -284 446 664 -467 -318 75 379 -223 -520
4581 -520 241 460 129 -630 16 694 437 -604 -411 459 676 -78 -580 -74 535 381 -649 -209 415
4600 415 257 -237 -486 101 728 -204 -867 -491 603 739 -72 -685 -131 836 323 -411 -612 345 327 -128
4620 -128 -193 367 327 -360 -241 208 569 -27 -997 -498 940 389 -730 -1025 185 999 443 -732 -722 250
4640 250 687 -94 -586 -93 616 -32 -252 23 373 -64 -401 -197 575 456 -445 -731 103 587 -1 -582
$$ [...]
8191E3
##END NTUPLES=NMR FID
##END=
