##TITLE=1H_CA-8602-11
 DMSO, 8 sc, 
 31.5.2019
##JCAMPDX= 6.0         $$ Bruker NMR JCAMP-DX V2.0
##DATA TYPE= NMR FID
##DATA CLASS= NTUPLES
##ORIGIN= UXNMR, Bruker Analytische Messtechnik GmbH
##OWNER= root
$$ XWIN-NMR		Version 3.5
$$ Fri May 31 16:19:43 2019 Russian Standard Time (UT+4h)  she@DPX200
##.OBSERVE FREQUENCY= 200.13155
##.OBSERVE NUCLEUS= ^1H
##.DELAY= (6, 6)
##.ACQUISITION MODE= SIMULTANEOUS
##.ACQUISITION SCHEME= undefined
##.AVERAGES= 8
##.DIGITISER RES= 18
##SPECTROMETER/DATA SYSTEM= spect
##.PULSE SEQUENCE= zg30
##.SOLVENT NAME= CDCl3
##.SHIFT REFERENCE= (INTERNAL, CDCl3, 0, 15.7039)
##AUDIT TRAIL= $$ (NUMBER, WHEN, WHO, WHERE, WHAT)
$$ ##TITLE= Audit trail, XWIN-NMR		Version 3.5
$$ ##JCAMPDX= 5.01
$$ ##ORIGIN= Bruker BioSpin GmbH
$$ ##OWNER= she
$$ F:/spectra/data/she/nmr/H-F/1/audita.txt
$$ ##AUDIT TRAIL=  $$ (NUMBER, WHEN, WHO, WHERE, WHAT)
(   1,<2019-05-31 16:18:30.01 +0400>,<she>,<DPX200>,
      <created by zg, POWCHK disabled, PULCHK disabled
       configuration hash MD5:
       00 E9 B6 7A A2 85 ED C7 34 08 36 98 17 FE 4E 26
       data hash MD5: 16K
       F6 11 1F DD 5E D0 1D 49 92 C4 7D FC 47 AA EF 85>)
$$ ##END=
$$ 
$$ hash MD5
$$ 45 7D 2F 19 C0 96 B4 8D E4 CD 75 E9 EC 6A C0 8A
##$RELAX= 
##$RELAX= 
##$RELAX= 
##$RELAX= 
##$RELAX= 
##$RELAX= 
$$ Bruker specific parameters
$$ --------------------------
##$DU= <F:/spectra>
##$EXPNO= 1
##$NAME= <H-F>
##$PROCNO= 1
##$TYPE= <nmr>
##$USER= <she>
##$AMP= (0..31)
100 100 100 100 100 100 100 100 100 100 100 100 100 100 100 100 100 100 
100 100 100 100 100 100 100 100 100 100 100 100 100 100 
##$AQSEQ= 0
##$AQ_mod= 1
##$AUNM= <au_zg>
##$AUTOPOS= <>
##$BF1= 200.13
##$BF2= 200.13
##$BF3= 200.13
##$BF4= 200.13
##$BF5= 200.13
##$BF6= 200.13
##$BF7= 200.13
##$BF8= 200.13
##$BYTORDA= 1
##$CFDGTYP= 0
##$CFRGTYP= 5
##$CHEMSTR= <none>
##$CNST= (0..31)
1 1 145 1 1 1 1 1 1 1 1 1 1 1 1 1 1 1 1 1 1 1 1 1 1 1 1 1 1 1 1 1 
##$CPDPRG= <>
##$CPDPRG1= <>
##$CPDPRG2= <>
##$CPDPRG3= <>
##$CPDPRG4= <mlev>
##$CPDPRG5= <mlev>
##$CPDPRG6= <mlev>
##$CPDPRG7= <mlev>
##$CPDPRG8= <mlev>
##$CPDPRGB= <>
##$CPDPRGT= <>
##$D= (0..31)
0 1.2 0 0 0 0 0 0 0 0 0 0.03 0 0 0 0 0 0 0 0 0 0 0 0 0 0 0 0 0 0 0 0 
##$DATE= 1559305109
##$DBL= (0..7)
120 120 120 120 120 120 120 120 
##$DBP= (0..7)
150 150 150 150 150 150 150 150 
##$DBP07= 0
##$DBPNAM0= <>
##$DBPNAM1= <>
##$DBPNAM2= <>
##$DBPNAM3= <>
##$DBPNAM4= <>
##$DBPNAM5= <>
##$DBPNAM6= <>
##$DBPNAM7= <>
##$DBPOAL= (0..7)
0.5 0.5 0.5 0.5 0.5 0.5 0.5 0.5 
##$DBPOFFS= (0..7)
0 0 0 0 0 0 0 0 
##$DE= 6
##$DECBNUC= <off>
##$DECIM= 24
##$DECNUC= <off>
##$DECSTAT= 4
##$DIGMOD= 1
##$DIGTYP= 9
##$DL= (0..7)
0 120 120 120 120 120 120 120 
##$DP= (0..7)
150 150 150 150 150 150 150 150 
##$DP07= 0
##$DPNAME0= <>
##$DPNAME1= <>
##$DPNAME2= <>
##$DPNAME3= <>
##$DPNAME4= <>
##$DPNAME5= <>
##$DPNAME6= <>
##$DPNAME7= <>
##$DPOAL= (0..7)
0.5 0.5 0.5 0.5 0.5 0.5 0.5 0.5 
##$DPOFFS= (0..7)
0 0 0 0 0 0 0 0 
##$DQDMODE= 0
##$DR= 18
##$DS= 0
##$DSLIST= <SSSSSSSSSSSSSSS>
##$DSPFIRM= 0
$$ [...]
##$SUBNAM2= <"">
##$SUBNAM3= <"">
##$SUBNAM4= <"">
##$SUBNAM5= <"">
##$SUBNAM6= <"">
##$SUBNAM7= <"">
##$SUBNAM8= <"">
##$SUBNAM9= <"">
##$SW= 24.9336996594482
##$SWIBOX= (0..15)
0 0 2 0 0 0 0 0 0 0 0 0 0 0 0 0 
##$SW_h= 4990.01996007984
##$TD= 16384
##$TD0= 1
##$TE= 0
##$TE2= 300
##$TE3= 300
##$TEG= 300
##$TL= (0..7)
0 120 120 120 120 120 120 120 
##$TP= (0..7)
150 150 150 150 150 150 150 150 
##$TP07= 0
##$TPNAME0= <>
##$TPNAME1= <>
##$TPNAME2= <>
##$TPNAME3= <>
##$TPNAME4= <>
##$TPNAME5= <>
##$TPNAME6= <>
##$TPNAME7= <>
##$TPOAL= (0..7)
0.5 0.5 0.5 0.5 0.5 0.5 0.5 0.5 
##$TPOFFS= (0..7)
0 0 0 0 0 0 0 0 
##$TUNHIN= 0
##$TUNHOUT= 0
##$TUNXOUT= 0
##$USERA1= <user>
##$USERA2= <user>
##$USERA3= <user>
##$USERA4= <user>
##$USERA5= <user>
##$V9= 5
##$VALIST= <valist>
##$VCLIST= <CCCCCCCCCCCCCCC>
##$VD= 0
##$VDLIST= <DDDDDDDDDDDDDDD>
##$VPLIST= <PPPPPPPPPPPPPPP>
##$VTLIST= <TTTTTTTTTTTTTTT>
##$WBST= 1024
##$WBSW= 4
##$XGAIN= (0..3)
0 0 0 0 
##$XL= 0
##$YL= 0
##$YMAX_a= 242889
##$YMIN_a= -395074
##$ZGOPTNS= <>
##$ZL1= 120
##$ZL2= 120
##$ZL3= 120
##$ZL4= 120
##$ABSF1= 10
##$ABSF2= 0
##$ABSG= 5
##$ABSL= 3
##$ALPHA= 0
##$AQORDER= 0
##$ASSFAC= 0
##$ASSFACI= 0
##$ASSFACX= 0
##$ASSWID= 0
##$AUNMP= <proc_1d>
##$AZFE= 0.1
##$AZFW= 0.1
##$BCFW= 1
##$BC_mod= 2
##$BYTORDP= 1
##$COROFFS= 0
##$CY= 11.3945322036743
##$DATMOD= 1
##$DC= 2
##$DFILT= <>
##$DTYPP= 0
##$F1P= 18.9103706918063
##$F2P= -1.10871071338519
##$FCOR= 0.5
##$FTSIZE= 0
##$FT_mod= 4
##$GAMMA= 1
##$GB= 0.15
##$INTBC= 1
##$INTSCL= 1
##$ISEN= 128
##$LB= 0.24
##$LEV0= 0
##$LPBIN= 0
##$MAXI= 10000
##$MC2= 0
##$MEAN= 0
##$ME_mod= 0
##$MI= 1.114404
##$NCOEF= 0
##$NC_proc= 0
##$NLEV= 6
##$NOISF1= 3.799351
##$NOISF2= 2.8
##$NSP= 1
##$NTH_PI= 0
##$NZP= 0
##$OFFSET= 15.70392
##$PC= 1
##$PHC0= -8518.75
##$PHC1= 39.40022
##$PH_mod= 1
##$PKNL= yes
##$PPARMOD= 0
##$PSCAL= 0
##$PSIGN= 0
##$REVERSE= no
##$SF= 200.130013532006
##$SI= 16384
##$SIGF1= 3
##$SIGF2= 2
##$SINO= 400
##$SIOLD= 16384
##$SREGLST= <1H.CDCl3>
##$SSB= 0
##$STSI= 0
##$STSR= 0
##$SW_p= 3612.71676300578
##$SYMM= 0
##$S_DEV= 0
##$TDeff= 0
##$TDoff= 0
##$TI= <>
##$TILT= no
##$TM1= 0
##$TM2= 0
##$TOPLEV= 0
##$USERP1= <user>
##$USERP2= <user>
##$USERP3= <user>
##$USERP4= <user>
##$USERP5= <user>
##$WDW= 1
##$XDIM= 8192
##$YMAX_p= 0
##$YMIN_p= 0
$$ End of Bruker specific parameters
$$ ---------------------------------
##NTUPLES= NMR FID
##VAR_NAME=  TIME,          FID/REAL,        FID/IMAG
##SYMBOL=    X,             R,               I
##VAR_TYPE=  INDEPENDENT,   DEPENDENT,       DEPENDENT
##VAR_FORM=  AFFN,          ASDF,            ASDF
##VAR_DIM=   8192,          8192,            8192
##UNITS=     SECONDS,       ARBITRARY UNITS, ARBITRARY UNITS
##FACTOR=    0.0002004,     1,               1
##FIRST=     0,             0,               0
##LAST=      1.6414764,     0,               0
##MIN=       0,             -395074,         0
##MAX=       1.6414764,     242889,          0
$$ Real data points
##PAGE= N=1
##DATA TABLE= (X++(R..R)), XYDATA
0 0 0 0 0 0 8 0 8 -8 8 -12 16 -24 24 -32 40 -48 56 -67 80 -96 112 -129 150 -174 199 -226 260 -295 335
29 335 -380 425 -480 538 -601 671 -749 831 -924 1025 -1138 1258 -1394 1545 -1708 1893
45 1893 -2101 2335 -2599 2901 -3254 3672 -4167 4773 -5539 6532 -7883 9837 -12935 18603
59 18603 -32414 136909 45507 -313878 -167466 114358 242889 98433 -29838 -77010 -43710
70 -43710 6737 95286 93107 -26099 -121229 -5780 158572 117273 -106844 -192304 -30874
81 -30874 163931 154697 3313 -115874 -126010 -61495 60899 160525 105922 -88492 -189903
92 -189903 -67117 110081 114594 -11420 -69329 -13623 22525 -13747 -32844 7370 29332 5150
104 5150 2094 27030 1541 -64814 -60282 35249 98528 50258 -32917 -56595 -41423 -27215 22322
117 22322 102232 93907 -43201 -142929 -63849 81094 99356 6864 -36763 -2772 -4475 -54312
129 -54312 -34220 62858 80838 -23512 -85317 -12990 56098 1885 -73358 -30891 66793 64588
141 64588 -29308 -77141 -44395 -12771 5253 55130 80932 -11854 -142918 -123806 46028 150972
153 150972 64657 -82449 -110264 -33456 25291 36905 37351 7472 -59011 -72414 15321 86865
165 86865 18930 -103223 -90673 60337 141265 30096 -131828 -143451 -3254 127539 127308
176 127308 2545 -134765 -151004 -13041 141387 135785 -27861 -154583 -98511 51306 104472
187 104472 23931 -66399 -72863 -14524 45550 54896 -11937 -99541 -93892 33166 136764 63943
199 63943 -117753 -177618 -35380 125399 115578 -19990 -113326 -94107 -15599 52316 66748
210 66748 12396 -68293 -83767 -4310 66349 26200 -60651 -57229 27728 58912 -4155 -57961
222 -57961 -33981 12488 18775 11092 24250 15542 -42639 -71353 -3017 83369 67803 -24368 -67904
235 -67904 -24924 25504 26831 13471 19037 14462 -20537 -37114 257 41442 31678 -4721 -14522
248 -14522 -150 8717 4744 2085 3258 2857 7291 21258 19351 -15392 -41816 -11717 45353 56768
262 56768 9966 -38318 -43913 -11500 28614 50730 36527 -13727 -58070 -40041 29021 67081
274 67081 29537 -30747 -43893 -8753 30178 37434 10031 -28763 -37744 6116 62743 51672
286 51672 -37355 -93151 -24481 91093 101126 -9689 -100747 -68569 33397 87143 54001
297 54001 -15156 -61751 -55772 6183 77319 71008 -23273 -92797 -41257 68325 91451 -2461
309 -2461 -89007 -57527 46098 91018 33049 -54373 -81252 -24413 62328 91306 23038 -75170
321 -75170 -92068 -2610 90340 77144 -22088 -83462 -41330 38202 60586 15601 -35475 -40709
333 -40709 -2061 35578 32761 -7014 -40482 -29404 17498 47164 23595 -26824 -47362 -18990
345 -18990 26498 45108 17648 -28255 -43652 -11408 28650 30522 -1701 -22918 -10458 7849
357 7849 2462 -9397 1366 16232 4183 -18892 -14774 11013 17913 -4898 -20881 -3803 18373
370 18373 11491 -10954 -15428 -4694 2056 5725 13410 10342 -12820 -31211 -13639 25431 35892
383 35892 1943 -31803 -25946 2597 18706 16953 6779 -10418 -25240 -16107 16527 35359 8596
396 8596 -35655 -35810 13390 46170 18589 -33272 -44333 -4125 39679 38241 -3952 -41617 -37514
409 -37514 2757 42561 41337 -5382 -51120 -44144 12321 57263 39957 -25049 -64730 -29966
421 -29966 41867 64002 9159 -57640 -56582 12833 67179 40374 -34344 -67462 -24135 43471
433 43471 62200 13834 -50601 -61548 -5662 57829 58061 -8130 -67087 -47842 27343 66402
445 66402 24674 -40555 -52458 -5313 40803 37513 -3639 -36978 -31205 6092 39359 32680 -14000
458 -14000 -49905 -26346 31812 52454 9162 -42798 -39319 10443 40622 18978 -17323 -23133
470 -23133 -3645 10887 10448 3721 -2062 -5690 -5642 1085 9604 7170 -5221 -9936 -455 8693 5887
485 5887 -2295 -4673 -1756 643 -175 818 5507 5172 -5803 -12962 -4844 10738 14341 1338 -14629
500 -14629 -15118 -18 13104 11943 -325 -12162 -15189 -3386 14349 18077 -633 -22202 -19441
513 -19441 8983 28535 12282 -21396 -27750 342 26037 20765 -4933 -22241 -15380 5068 20781
526 20781 20832 2544 -23326 -27201 4681 39887 31691 -14876 -43607 -17494 33681 47058 6951
539 6951 -36486 -32257 9938 41058 30454 -9561 -38018 -23135 21145 47797 24395 -28099
551 -28099 -49285 -10436 45940 50469 -3216 -50476 -36364 19358 52087 25804 -26099 -44535
563 -44535 -13091 30945 41456 8162 -34067 -38981 1598 42269 34806 -13869 -47579 -24982
575 -24982 28619 47766 8539 -38293 -36564 6522 37066 22760 -14000 -29190 -11571 13338
587 13338 20128 8003 -9732 -18019 -7977 11354 18861 4012 -16047 -17029 3525 19166 8722
600 8722 -11913 -14808 865 10497 4117 -5153 -4713 386 -260 -4527 -2598 3752 2849 -4309 -7085
615 -7085 -4166 -1113 243 1778 1088 -5308 -12212 -8865 5802 12541 -1717 -20147 -16536 5554
629 5554 16740 2989 -17219 -18848 -1417 12817 8545 -5186 -14017 -12828 -2290 11274 14099
642 14099 -1277 -20451 -20161 4047 25520 16515 -15090 -30169 -9619 20898 25921 1776 -22598
655 -22598 -20904 3200 22903 18541 -4019 -23001 -18751 8303 29968 18754 -16203 -34949 -13052
668 -13052 26683 36229 1753 -36060 -31689 7937 34690 20551 -15992 -35336 -18597 15185
680 15185 30625 10580 -24495 -38071 -11116 28755 32376 -8352 -44203 -29719 17140 38838
692 38838 9400 -33318 -37467 -2314 27641 21491 -8304 -28388 -21645 4282 23304 15771 -10941
705 -10941 -28190 -15054 15621 26883 3531 -24050 -20758 7614 23617 10488 -13007 -17215
717 -17215 -485 14287 11798 -42 -7465 -5779 1831 9143 8637 1617 -4237 -2961 3878 8136
731 8136 3781 -2053 -167 5826 5020 -2048 -3373 3739 10301 6261 -5063 -7518 3175 12145 6689
746 6689 -4872 -6944 1188 8492 7398 783 -4098 -4064 -103 7930 12731 4164 -11435 -13068 5495
761 5495 22521 14518 -9906 -20181 -2964 19108 19314 942 -11952 -8983 2907 13674 14732
774 14732 3353 -11618 -13015 4919 24085 17895 -9954 -24306 -5145 23989 26301 602 -22150
787 -22150 -17045 7446 24332 17531 -4644 -21040 -15898 8354 27441 16436 -14191 -29234 -9026
800 -9026 23076 27916 -1522 -29161 -21853 10996 28892 12167 -18223 -28436 -7619 19980 23597
813 23597 806 -23524 -23740 128 23287 20079 -6732 -27906 -17917 12265 26741 8668 -20447
826 -20447 -24325 1782 23478 14236 -10899 -20282 -5577 13235 15200 1224 -11323 -11356 -1357 10942
840 10942 13895 1417 -13637 -12259 5031 15644 5969 -9977 -10196 3832 9717 196 -8130 -2597
854 -2597 6128 4384 -3516 -5443 -153 2354 759 -747 -162 -1392 -4156 -1431 3742 1804 -6438
869 -6438 -6993 2238 8458 330 -11926 -11100 3736 12610 3852 -10643 -13492 -3536 7270 8941 1028
884 1028 -8958 -11264 -3805 6696 9903 688 -11924 -12140 1397 13036 8297 -8254 -17023 -5536
898 -5536 12622 15196 -898 -17002 -13806 3589 15858 10974 -5501 -16528 -11737 4504 17634
911 17634 12737 -7869 -22659 -11159 14828 22851 2026 -21376 -18347 6712 22028 9498 -12560
924 -12560 -18617 -5037 12325 17046 4999 -13930 -20653 -4611 19244 22698 -1925 -26663 -19239
937 -19239 11679 26836 8754 -17410 -20447 -237 17085 13511 -3715 -14433 -9367 4823 15365
950 15365 9761 -8317 -18155 -6144 14832 18823 380 -18023 -13735 6961 18352 7569 -9025
963 -9025 -12057 -1316 8916 8082 -889 -6013 -2942 3280 5165 1573 -3226 -4092 716 5780 4513
978 4513 -1751 -6128 -2718 5242 7049 -30 -6878 -2827 5682 5571 -2924 -6941 89 8748 5796
993 5796 -4931 -8806 -1604 6676 6690 1578 -3751 -6237 -3472 4155 9644 4987 -7365 -11893 -362
1008 -362 13098 8672 -7132 -13141 -1338 10956 8863 -3284 -10394 -5553 3514 8211 6870 -917
1022 -917 -10786 -10688 2678 15488 10365 -8136 -17928 -6284 12649 15289 -426 -13867 -10569 3408
1036 3408 11938 7647 -4919 -12438 -7113 6659 13924 5726 -10804 -17021 -3089 15928 16718 -2431
1050 -2431 -19378 -14589 7028 19960 9774 -11543 -18086 -4170 12670 14045 549 -13035 -11505
1063 -11505 2374 13100 9646 -5061 -15480 -8316 10425 18194 3007 -16262 -15554 3877 17946
1076 17946 10089 -8982 -15002 -3649 8767 9236 1329 -6046 -7179 -1588 6125 7272 -458 -8976
1090 -8976 -6442 5610 10963 557 -10817 -7446 5648 9868 969 -7927 -5575 2680 4750 308
1104 308 -2655 -1231 142 507 259 -287 -1957 -1510 1475 4199 1152 -5757 -6481 1987 9215 4321
1120 4321 -6426 -9526 -549 8500 6709 -3483 -8630 -3224 5386 6667 655 -5909 -5962 506 6886
1135 6886 5966 -1271 -8424 -7178 2630 11173 7309 -6155 -12995 -4363 9641 11750 -134 -11071
1149 -11071 -8494 3372 9327 4974 -3163 -7673 -4860 2994 9189 5589 -5562 -12349 -4613 10862
1163 10862 13867 -899 -15417 -10561 6041 14390 5541 -8092 -12106 -3249 7202 10116 3231
1176 3231 -7395 -11679 -2675 11032 11985 -2391 -14890 -9134 8338 15523 3172 -12848 -12499 2210
1190 2210 12481 8295 -3882 -10906 -6356 4810 10690 5379 -5560 -10932 -3564 8783 10776 -28
1204 -28 -10591 -6973 5054 10924 3479 -7976 -8210 1856 8836 4632 -3550 -6549 -1667 4258 4878
1219 4878 601 -2737 -2988 -453 3278 3809 -240 -4665 -2125 3757 4993 -792 -5939 -2478 5559
1234 5559 6381 -1960 -7143 -1829 5469 5494 -978 -4906 -2381 2394 3940 2013 -722 -2983 -2475 2710
1250 2710 6561 3113 -5184 -7366 1436 10018 6720 -4821 -9503 -1291 8632 7962 -738 -6309 -4297
1265 -4297 1752 6886 5491 -792 -6083 -4926 2840 9371 5542 -5511 -9787 -1355 9084 9025 -1764
1280 -1764 -9976 -6315 4729 9357 3785 -5035 -8226 -3348 4758 7836 2529 -6494 -9391 -2071 8087
1295 8087 9044 -2023 -11885 -8001 5198 11201 3185 -8646 -10514 -540 8761 6840 -2046 -8369
1309 -8369 -6442 1653 8256 5792 -3849 -10220 -5165 6693 10955 1136 -10330 -9098 3409 11037
1323 11037 4401 -6667 -8518 -465 6686 5389 -1229 -5133 -3749 883 5056 4590 -1630 -7075 -3488
1338 -3488 4687 7035 92 -7198 -5308 3422 6613 122 -5840 -3877 2288 4149 402 -3687 -3098
1353 -3098 387 2341 1171 -1487 -2895 -2445 865 3268 591 -3847 -4833 -107 4845 3207 -4020
1368 -4020 -6849 -1075 5612 4434 -2708 -6633 -3076 3843 5453 305 -4801 -4440 -122 3844 4400
1383 4400 -144 -5403 -5291 1279 6677 4773 -4116 -8704 -1862 7226 7005 -1973 -7886 -4280 3564
1398 3564 6191 2010 -3766 -5411 -2379 2560 5725 2986 -4571 -8253 -2040 7314 7567 -2204 -9670
1413 -9670 -5566 4890 8396 1313 -6276 -6224 -521 4962 5321 145 -5550 -6127 176 7159 6470 -2679
1429 -2679 -9064 -4438 5948 9148 1345 -7559 -6708 2082 8094 4870 -3233 -6402 -2364 3760 6348
1444 6348 2532 -4109 -5520 -193 6184 6295 -555 -6668 -4056 4007 7933 2447 -5447 -5900 1463
1459 1463 6765 3731 -3342 -4777 67 4171 2961 -499 -2506 -1597 1180 2729 2151 -893 -3626
1474 -3626 -1470 3455 4620 -963 -5552 -2180 4117 4697 -1354 -5507 -1695 3871 3903 -1115 -3795 -1271
1490 -1271 1473 2919 1946 -674 -3204 -2645 2124 5434 2461 -4269 -5666 718 7102 4176 -3686
1505 -3686 -6280 -701 5170 4619 -1091 -4644 -2972 1458 4380 3084 -1562 -5091 -3158 2856 6301
1520 6301 2364 -4157 -6474 -1055 5890 5576 -1423 -6360 -4053 2647 5961 1928 -4146 -5163 -289
1535 -289 4034 3805 -168 -4352 -4381 245 5157 4630 -1586 -7040 -4787 3995 7820 1964 -6292 -6447
1551 -6447 1013 6252 3492 -2496 -4556 -2023 1408 3643 2385 -1640 -5308 -2769 4203 6511 247
1566 247 -7134 -5512 3316 7572 2256 -5521 -5402 544 4269 2899 -763 -2791 -2612 333 3176 2844
1582 2844 -1525 -4297 -1703 3912 4419 -1355 -5580 -1906 3609 4571 -116 -4329 -3015 1314 3530
1597 3530 1179 -1910 -2698 -607 1832 2103 -697 -2364 -1163 1729 2746 404 -3019 -2847 460 4117
1613 4117 2568 -2048 -4868 -1697 3834 4570 -459 -5106 -2604 2735 4028 191 -3269 -2506 1139
1628 1139 2599 1895 -671 -2734 -3107 684 5107 3357 -3186 -6680 -1447 6011 5871 -1524 -6185 -2646
1644 -2646 2980 3949 596 -2120 -2565 -993 1416 3025 1708 -2912 -4954 -211 5761 4558 -2660
1659 -2660 -6413 -2045 4538 5431 101 -4153 -3682 71 3384 3346 217 -3361 -3619 351 4544 2999
1675 2999 -2145 -4801 -1343 3816 4464 -262 -4947 -3468 1854 5123 2685 -2969 -5120 -1489 3676
1690 3676 4149 365 -3315 -3007 67 3117 2535 -478 -3283 -2508 1589 3992 1103 -3779 -3951 1628
1706 1628 5119 1749 -3633 -4107 832 3765 1874 -940 -1793 -1309 -24 1590 1931 -18 -2515 -1558
1722 -1558 2153 3176 -654 -3983 -1623 3654 3790 -1804 -4578 -1422 3107 3068 -86 -2286 -1801 141
1738 141 1439 1748 271 -2155 -2586 1054 3669 1426 -3144 -3561 946 4532 2289 -2968 -4655 -858
1754 -858 3761 3584 -48 -3737 -3502 548 3567 2291 -1194 -3364 -1910 1966 3131 541 -2726 -3323
1770 -3323 -5 3740 3115 -1247 -4652 -2479 3242 4730 759 -4009 -4048 499 3580 2498 -608 -2395
1786 -2395 -2198 -384 2563 3048 -370 -4137 -2730 2697 4516 174 -4638 -3149 2274 4209 1163
1801 1163 -2750 -3062 -761 1523 2800 1706 -1492 -3579 -1763 3042 4704 182 -4696 -3124 2305
1816 2305 4096 529 -3368 -2647 1004 2988 1266 -1446 -2473 -1061 1119 2520 1490 -1944 -3377
1831 -3377 -717 2687 2835 -562 -3278 -1729 1672 2880 171 -2340 -1763 1162 2353 420 -2320
1846 -2320 -2320 658 2582 1575 -1150 -2163 -964 1019 2033 1120 -1207 -2171 -546 2192 2451 -697
1862 -697 -3313 -1034 3042 2914 -929 -4021 -1762 2973 3497 -52 -3013 -2286 293 2076 2193 351
1878 351 -1954 -2624 -40 3408 2542 -1780 -4186 -717 4001 3269 -1711 -4070 -1122 2837 2912 183
1894 183 -2200 -2274 -435 1642 2741 840 -2511 -3562 -285 3523 2963 -1411 -3902 -1299 2698 3148
1910 3148 -393 -2918 -1856 939 2550 1450 -1312 -2416 -1194 1363 2886 1286 -1775 -3155 -720
1925 -720 2740 3093 -57 -3039 -2650 998 3509 1241 -1858 -2613 4 2108 1499 -609 -1827 -1121
1941 -1121 697 1741 1688 -543 -2854 -1630 1688 3343 575 -2942 -3047 1074 3425 793 -2315 -1870
1957 -1870 619 1692 671 -910 -1131 -669 401 1099 901 -951 -2360 -900 2284 2482 -860 -3134
1973 -3134 -1474 2149 2716 -441 -2658 -1115 1763 1958 -86 -1552 -1170 467 1503 1169 -446 -1967
1989 -1967 -1362 1051 2514 1062 -2066 -2789 -107 2787 2096 -954 -2766 -1225 2222 2714 -81 -2812
2005 -2812 -1819 939 2533 1091 -1402 -2438 -971 1583 2305 654 -2160 -2894 -280 2913 2412 -892
2021 -892 -3553 -1585 1793 3227 48 -2571 -1734 892 2048 964 -847 -1489 -1118 499 2097 1528
2037 1528 -1046 -3106 -1078 2577 3126 -409 -3140 -2288 1474 2711 630 -1671 -1545 -232 1018 983
2053 983 622 -1131 -1669 -83 1932 1810 -348 -2633 -1397 1613 2709 306 -2375 -1942 593 1967
2069 1967 864 -894 -1416 -599 651 1110 274 -767 -1612 -210 1549 1372 -336 -2198 -852 1364
2085 1364 2344 123 -2574 -1506 1023 2111 528 -1462 -1715 188 1398 785 -710 -909 -384 746
2101 746 919 369 -776 -1476 -72 1844 1628 -767 -2540 -1076 2195 2449 -362 -2249 -1107 1171
2117 1171 2005 234 -1236 -1095 173 1203 1222 -128 -1526 -1536 648 2245 1304 -1450 -2866 -540 2435
2134 2435 2430 -1045 -2631 -1182 1572 2070 315 -1575 -1738 -80 1277 1444 82 -1361 -1624 200 2225
2151 2225 1525 -1451 -2707 -862 2056 2391 -315 -2457 -1506 731 2093 864 -1133 -1467 -421 1007
2167 1007 1157 343 -1100 -1413 -211 1404 1432 -438 -2006 -1163 1314 2161 345 -1894 -1658 546 1785
2184 1785 1157 -521 -965 -440 149 958 1139 -511 -1671 -936 1020 1713 -35 -1674 -1205 1291 1992
2201 1992 117 -1946 -1298 782 1344 307 -903 -931 -487 321 397 512 -456 -995 -416 1115 1192 -502
2219 -502 -1764 -657 1500 1654 -570 -1967 -896 978 1639 304 -1307 -1109 185 1143 726 -174 -1140
2236 -1140 -695 697 1265 686 -1303 -1810 194 1761 1166 -892 -2189 -590 1821 1923 -343 -1775
2252 -1775 -1319 932 1512 608 -748 -897 -491 621 1357 333 -1144 -1388 85 1591 1587 -996 -2343
2269 -2343 -564 1902 1973 -528 -2190 -1192 1171 1719 562 -726 -1184 -620 391 1182 806 -745 -2026
2286 -2026 -45 1746 1432 -677 -1924 -796 1238 1610 -159 -1367 -1150 191 1155 626 -195 -812 -1035
2303 -1035 -194 1174 1326 -818 -1322 -764 1121 1433 -144 -1521 -889 758 1416 124 -1082 -808 398
2320 398 1086 485 -415 -926 -476 227 949 815 -252 -1308 -669 845 1075 -47 -1242 -985 903 1583
2338 1583 -129 -1186 -763 696 1121 236 -774 -875 -87 626 783 187 -651 -1027 -167 1233 1071 -784
2356 -784 -1335 -156 1572 1253 -632 -1503 -422 1234 1156 -231 -1192 -713 25 983 1110 84 -1076 -1088
2374 -1088 360 1641 1109 -1336 -1831 1 1885 1319 -766 -1919 -404 1555 1433 -278 -1602 -941
2390 -941 349 1343 988 -595 -1327 -876 498 1364 939 -949 -1659 -146 1415 1306 -207 -1274 -815
2407 -815 912 1275 9 -1282 -774 67 982 778 -96 -1315 -841 302 1246 1092 -442 -1670 -432
2424 -432 1222 1336 -34 -1471 -584 683 997 -64 -768 -535 200 417 367 271 -440 -919 -211 778 917
2443 917 -34 -1474 -669 610 1206 108 -1117 -788 420 776 87 -714 -560 69 416 590 -91 -779
2461 -779 -523 265 934 608 -677 -1007 -436 952 1079 -299 -917 -369 715 892 -61 -703 -513 89 756
2480 756 264 -458 -588 -254 380 727 301 -861 -1152 -176 1419 1060 -429 -1466 -335 1342 1146 -249
2498 -249 -1392 -479 840 1010 299 -659 -598 122 746 758 157 -836 -1280 292 1198 759 -651 -1444 -320
2517 -320 1344 1179 -372 -1157 -579 773 924 176 -727 -723 -455 796 926 314 -808 -989 39 1199
2535 1199 711 -499 -1053 -423 925 905 17 -692 -433 311 656 158 -63 -589 -139 -23 369 143 -397
2554 -397 -791 2 792 770 -389 -1031 -428 698 904 73 -859 -673 220 647 407 -324 -323 -87 213 177 48
2575 48 -76 -576 -22 731 728 -153 -724 -340 925 745 -10 -877 -357 422 517 231 -197 -172 -20 213 326
2596 326 138 -536 -569 127 942 710 -426 -1088 -137 1106 837 -219 -1064 -415 818 600 57 -758 -534
2615 -534 193 246 20 -207 -502 -417 107 687 275 -764 -965 -51 899 744 -374 -1003 -497 952 888 144
2635 144 -895 -519 297 651 417 -146 -944 -4 546 766 -68 -1138 -838 114 782 615 -474 -1066 -368
2654 -368 883 682 -203 -498 -348 213 421 325 -181 -273 -303 109 575 284 -404 -745 -129 725 648 -112 -819
2675 -819 -202 552 756 -294 -504 -366 303 350 251 -57 -46 -135 144 131 344 -188 -406 -185 449 550 -161
2696 -161 -603 -408 516 418 -38 -291 -19 44 178 170 -33 -262 -147 120 347 487 -497 -610 -4 712 368
2717 368 -648 -649 -129 557 617 -257 -692 -384 334 297 -36 -418 -281 78 145 399 77 -477 -355 241 512
2738 512 364 -472 -639 -301 615 652 -236 -873 -331 399 586 -281 -624 -315 184 314 427 -66 -626 -357
2758 -357 299 792 153 -575 -559 298 680 605 -236 -666 -43 549 516 -82 -298 -411 -119 413 369 -40 -416
2779 -416 -315 84 734 219 -503 -587 73 588 16 -231 -381 -42 399 504 -267 -554 -350 108 170 320 180
2800 180 -226 -231 52 276 257 -143 -426 -34 395 434 -282 -232 -111 239 537 -114 -273 -266 56 20 276 86 -249
2823 -249 -403 69 311 341 -453 -389 -69 530 303 -234 -393 110 284 196 -210 -284 -149 -26 391 166 53
2844 53 -64 -195 154 349 41 -616 -296 -46 391 83 -229 -604 -10 316 406 -207 -536 -188 186 219 385
2865 385 -255 -304 -418 315 318 -149 -550 -347 65 215 34 -310 -364 -14 365 192 -219 -541 -48 441 397 -45
2887 -45 -361 -437 -218 213 215 -182 -386 -279 48 649 180 -281 -748 118 469 395 -200 -313 85 360 142 -41
2909 -41 -112 -307 137 88 261 301 -375 -23 240 553 326 -203 -407 56 117 239 -46 -445 -200 -40 225 -23
2931 -23 15 -86 -33 229 -5 47 -85 -488 197 339 92 -231 -294 96 413 16 -163 -366 -140 145 -198 11
2953 11 -17 -247 6 -61 234 -44 -308 -370 146 308 -101 -439 -309 158 326 258 -177 -569 183 299 93 -214
2975 -214 -125 -57 125 79 61 106 -540 -227 268 99 292 -454 -143 274 378 31 -344 -548 90 229 198 -224
2997 -224 -180 -6 230 329 123 42 -502 -194 306 244 89 -505 -419 108 511 123 -467 -108 120 61 168 -161
3019 -161 -311 -69 179 174 -127 -186 -381 -84 291 492 113 -80 -126 203 481 182 -397 -298 43 249 220 -38
3041 -38 -189 -253 98 316 -22 -217 -50 239 137 58 -120 -422 69 162 305 27 -526 -217 24 266 -157
3062 -157 -103 -73 85 189 322 99 40 105 28 -27 -123 -171 -233 119 338 360 173 -180 -260 75 211 183 -173 -77
3086 -77 144 234 165 -358 -233 -115 -61 -51 198 49 -254 -19 -19 266 -160 16 -31 155 67 40 -305 -224 5 44
3110 44 128 -70 -67 -302 79 117 100 -232 -393 -41 179 261 -250 -484 -116 236 499 31 -349 -205 181 63
3132 63 107 -366 -242 -32 213 292 85 19 -166 -54 349 194 -7 -372 -63 326 261 -200 -258 -212 9 116
3154 116 92 -23 -207 -319 225 52 38 -294 1 -27 322 125 -150 -262 -161 259 -99 -118 -421 -266 267
3175 267 -21 98 -98 -130 41 55 465 73 -151 89 64 317 175 -257 -343 87 244 -46 131 -140 -263
3196 -263 62 282 46 -184 -124 -4 205 31 -41 143 -75 69 -15 89 197 -103 100 161 323 -110 -210
3217 -210 56 277 71 -78 -295 -83 286 28 33 -97 64 -247 88 -9 299 -215 -136 -91 92 51 -264 -370
3239 -370 52 323 212 -29 -353 -54 -96 -135 105 -181 -20 -56 -8 278 48 -67 -243 353 163 -206 -299 -343
3261 -343 183 277 250 -125 -201 -125 602 277 171 -184 -166 -205 -49 135 140 -173 -200 90 266 313 -58 -293 9
3284 9 355 163 -241 -298 -51 86 99 -79 -251 -337 -35 126 435 -4 -46 -243 -270 247 12 -380 -301 241 423
3307 423 -27 -184 -270 77 147 199 -16 -69 -6 -8 52 179 155 -286 -54 -63 55 208 -286 -256 188 263 114 -22
3331 -22 -236 258 310 -22 64 -25 -204 -113 175 112 50 65 -146 33 30 -97 -338 9 5 312 182 -318 -170 193
3355 193 385 253 -208 -194 -188 -184 397 37 -71 -399 -234 132 265 -40 -316 -446 133 423 39 -137 -430 220
3377 220 415 263 -361 -262 19 116 424 294 122 -392 -160 161 403 -314 -34 -155 270 265 212 -271 -257 -87
3399 -87 225 311 -199 -44 -161 83 470 259 -60 -236 -253 349 342 157 -239 47 150 223 147 -179 -198 72 191
3422 191 119 -241 -130 57 -44 575 105 -103 -197 -28 280 168 -50 -298 -147 145 -44 55 -491 -126 143
3443 143 202 174 -9 -5 142 265 104 -58 -66 171 -62 39 275 106 -155 -105 78 454 187 -447 -28 153
3465 153 292 -185 -382 -167 67 189 -145 4 -36 -18 73 178 246 -122 -336 -89 144 347 -147 -152 -349 271
3487 271 563 4 -321 -404 -21 224 291 103 -227 -169 72 586 311 -120 -267 -27 254 421 2 -484 -265
3508 -265 156 386 160 -314 -350 113 306 314 -235 -254 -45 170 132 -400 -403 -300 -100 185 195 -226 -419 -336 274
3531 274 228 137 -316 -205 21 341 16 -68 -15 94 -27 253 98 -175 -315 -52 117 347 -77 -348 -155
3552 -155 199 446 -12 -173 -228 172 279 228 -85 -52 339 -71 116 22 -80 -399 -147 272 435 1 -434
3573 -434 -134 139 661 -83 -320 -142 156 367 98 -293 -161 64 241 44 -122 15 -263 158 178 132 -52
3594 -52 -453 -127 428 168 39 -424 -69 283 283 45 -214 -64 -84 25 147 225 -152 -156 -12 428 276 -193
3616 -193 -163 -9 493 388 -49 -245 -311 160 343 -33 -83 -268 78 78 -24 94 -138 -354 -295 418 195 -184
3638 -184 -257 -115 275 353 -222 -498 -248 51 254 33 -251 -493 -162 335 -97 -81 -84 -99 63 360 267 -247
3660 -247 -317 124 364 441 -183 -611 -82 299 429 -108 -227 -133 156 31 176 -39 -144 -227 188 454 371 -167
3682 -167 -237 -42 477 486 -77 -330 -89 408 303 23 -349 84 151 270 72 -191 -210 -210 161 312 254 -247 -454
3705 -454 44 418 111 -280 -393 -228 122 187 -168 -278 -231 358 83 -52 -20 199 -143 123 275 -199 -283
3726 -283 -357 10 351 199 -93 -353 -11 292 329 -32 -440 -337 -21 324 74 -265 -123 86 23 286 257
3747 257 -223 -475 94 179 409 -198 -479 -37 483 616 -266 -690 -199 339 440 -12 -212 -201 57 302 146
3768 146 22 -126 -194 165 428 438 -126 -389 -241 457 413 -31 -492 -168 17 411 70 -258 -277 -151 106
3789 106 282 -156 -22 -62 107 433 421 -36 -496 -12 306 468 -115 -465 -127 517 130 164 -96 -91 -107 65
3811 65 -39 3 -212 242 194 193 87 -103 -339 -142 271 190 -106 -305 -77 496 415 -88 19 -349 21 377
3833 377 -62 301 -116 -225 -10 358 129 -82 -230 -336 469 248 -283 -422 -147 241 320 -63 -475 -57
3853 -57 171 253 345 154 -124 -171 111 357 456 -231 -390 -68 518 98 -279 -478 26 391 632 -210 -138 -305
3875 -305 75 163 5 48 -215 -59 102 573 181 -309 -462 -76 254 408 -40 -161 -348 416 330 133 -328
3896 -328 -465 279 228 -148 -273 -180 -337 85 217 142 -334 -401 22 546 385 -339 -513 -190 372 316 -106 -372
3918 -372 -17 129 264 -279 30 -261 45 563 386 34 -414 -558 -363 502 505 -104 -490 -47 345 592 -166
3939 -166 -487 -85 407 316 -246 -395 -35 28 67 321 134 -192 -246 136 259 289 -288 -408 -159 392 275 -356
3961 -356 -507 -9 83 203 54 -105 -190 -163 76 405 88 -311 -154 -13 311 -61 -241 -286 -55 354 361 -136
3983 -136 -466 -215 352 424 148 -436 -222 7 144 179 -5 -464 -432 -67 531 203 -225 -518 -78 616 264
4004 264 -153 -338 -85 219 53 -46 -237 -185 -12 65 364 -92 -253 -219 51 523 448 -287 -658 -124 320 345
4026 345 -291 -477 -123 462 192 -24 -226 -174 176 264 157 -144 -414 -199 244 414 183 -169 -459 97 507
4047 507 169 -194 -409 -126 325 178 -198 -549 -78 65 229 156 -151 -159 -78 362 367 -113 -470 -550 -25 489
4069 489 259 -156 -419 -150 203 238 72 -246 -125 -34 224 -88 25 -277 58 388 238 213 -165 -102 -59 335
4091 335 397 -312 -519 -110 547 392 -93 -237 -159 282 -122 97 -50 -281 -56 98 294 205 -360 -546 -79
4112 -79 636 484 -35 -665 -331 330 294 -82 -261 -280 169 200 243 -133 -63 -157 98 349 63 -367 -481 22
4134 22 559 341 -65 -710 -339 545 608 -107 -338 -224 399 262 -154 -201 -243 70 59 351 88 -406 -201 143
4156 143 615 224 -503 -537 -86 430 606 -238 -745 -178 311 473 66 -94 -274 -156 106 286 -34 -114 -362
4177 -362 161 526 487 -136 -634 -92 718 432 -87 -465 62 171 320 90 -68 0 2 7 223 -236 -212 -269 -101
4200 -101 316 255 -416 -239 130 549 281 -339 -453 -111 314 340 3 -227 119 -152 168 90 -146 -56 55
4221 55 326 333 200 -180 -523 -63 495 213 36 -390 161 593 386 133 -289 -300 -152 259 -174 47 -404
4242 -404 -152 -100 269 26 -316 -779 -128 518 304 -282 -385 -207 305 574 -153 -361 81 23 182 0 85
4263 85 -231 -283 174 241 83 -551 -427 -7 674 417 -296 -530 38 237 355 -127 -295 -136 265 344 276 -22
4285 -22 -271 -230 -78 338 11 -47 -394 101 255 366 -323 -363 11 319 237 -225 -530 -248 247 448 206 -283
4307 -283 -170 -181 138 229 254 -190 -313 18 325 191 -412 -481 30 719 318 -7 -394 -38 310 263 -96 -398
4329 -398 -373 -64 121 275 122 -487 -257 122 453 90 -215 -371 110 444 175 -244 -489 -136 385 233
4349 233 52 -385 -257 59 83 354 286 -457 -331 65 461 418 -333 -211 5 594 309 -256 -445 -301 264
4370 264 227 45 -281 -142 32 -55 167 -66 -285 -350 47 309 283 -495 -627 148 317 300 -200 -690 -135 388
4392 388 428 -28 -201 -142 -86 158 243 -11 -195 -333 60 562 297 -286 -418 -213 292 596 -268 -373 -166
4413 -166 155 292 -117 -375 -361 74 204 195 110 -286 -364 54 342 171 -262 -518 115 417 159 -280 -45 142
4435 142 171 223 -57 -93 -153 39 192 180 -399 -155 -135 251 385 158 -390 -470 78 438 302 -251 -398 47
4457 47 388 54 -280 -329 -310 167 116 147 -83 -407 -43 200 467 -2 -369 -430 132 607 240 -313 -421 -131
4479 -131 544 464 -242 -445 -6 270 58 -82 -72 -7 148 -21 343 78 -275 -379 194 583 186 -255 -613
4500 -613 -60 245 263 -40 -167 105 351 236 167 -38 -44 -256 153 411 142 -321 -513 48 519 160 -206
4521 -206 -364 169 429 400 -71 -244 38 301 218 -14 -463 -247 -57 303 368 410 -181 -487 50 426 355 -602
4543 -602 -492 -207 348 286 -79 -554 21 421 196 108 -206 -219 -144 89 312 -23 -386 -189 -69 365 254
4564 254 -405 -251 130 639 215 -184 -364 -147 360 331 -91 -275 -107 -5 370 178 1 -202 -259 305 501
4585 501 87 -408 -337 198 377 433 -261 -369 143 36 112 -64 -205 -141 84 91 37 91 -246 -8 71 473 137
4608 137 -341 -5 -256 536 137 -121 -243 -223 273 270 -186 -195 -246 -264 319 192 -79 -300 -85 229 189 195 -311
4631 -311 -354 -60 503 74 -203 -601 -198 351 190 -125 -427 19 94 64 89 49 -259 -263 158 487 1 -473
4653 -473 -424 70 413 406 -503 -485 -25 275 137 -67 -212 -223 11 -80 151 -95 -171 -136 89 487 -134 -269 -342
4676 -342 111 262 235 -360 -621 223 341 312 -81 -278 -173 -62 101 14 -194 45 124 228 175 144 -388 -48
4698 -48 27 565 142 -275 -399 190 623 315 -360 -293 -49 329 191 113 -306 17 179 157 357 72 -290 -309
4720 -309 190 501 352 -331 -179 60 422 236 26 -396 110 -66 -32 -81 96 -181 -10 265 333 170 -412
4741 -412 -431 41 262 331 -307 -579 311 562 618 -308 -280 -309 229 121 68 6 -222 -189 281 154 158 -436 -222
4764 -222 -207 486 273 -284 -331 13 806 233 -171 -213 -17 379 22 18 -261 -268 -98 225 331 -40 -66 -251 131
4787 131 602 377 -200 -574 57 458 160 79 -185 2 63 153 158 -230 -158 12 14 20 100 -180 -287 -5 426 163
4811 163 -397 -386 303 316 285 -356 -555 -45 334 365 -95 9 -203 140 131 93 84 -422 -259 124 336 98 -405
4834 -405 -322 404 451 24 -227 -213 -35 352 205 -141 -219 -95 23 224 76 -29 -376 -413 -23 193 121 -262
4856 -262 -458 132 453 -20 -189 -411 -97 202 20 118 -71 -40 -8 110 160 57 -333 -173 6 281 439
4877 439 -295 -238 98 496 324 -418 -366 -23 587 -41 -46 -239 -313 132 417 230 -242 -173 -212 97 318 39
4899 39 -129 -228 313 621 -47 -203 -418 64 461 209 -182 -405 41 206 106 129 -21 -308 -348 228 392
4920 392 295 -178 -305 -16 469 415 -209 -358 39 264 397 -186 -312 -236 -23 221 81 -280 -146 -220 158
4941 158 95 -106 -52 -74 -18 405 253 -262 -188 -100 608 62 -222 -260 -32 56 170 -186 -176 -237 118 401 264
4964 264 180 -74 -48 86 309 7 -372 -90 44 466 518 -167 -437 -223 140 21 -114 -373 -349 61 127 388
4986 388 -78 -508 -403 109 365 295 -242 -227 236 517 168 -137 -477 -234 272 184 26 -91 -226 -104 292
5007 292 286 1 -353 -248 302 253 284 -401 -404 44 342 184 -181 -229 50 320 3 -118 -13 -71 32 170 176
5030 176 -14 -450 -161 -70 418 444 -394 -318 -41 286 359 -475 -323 111 280 195 -38 -268 -177 406 103 139
5052 139 195 -303 -448 206 323 319 -432 -334 173 328 15 -367 -294 -134 316 219 23 -271 40 121 221 115
5074 115 -145 -195 -198 70 504 87 -281 -148 166 249 52 -357 -432 65 267 125 -244 -260 18 41 30 29 -294
5097 -294 -9 -41 152 196 146 -161 -405 329 602 178 -449 -447 -231 541 74 -239 -292 2 89 85 25 -166 -240 -139
5121 -139 125 366 -113 -248 -289 -42 434 288 -203 -282 147 285 144 -131 83 -143 -101 81 93 -117 -347
5142 -347 -278 -134 375 -135 -199 -199 -80 312 95 -292 -341 -35 461 93 -239 -210 -51 84 41 -151 -186 -26 -114
5165 -114 96 52 -77 -472 -287 -2 658 340 -403 -317 143 245 48 -286 -528 -112 265 335 114 -320 -235
5186 -235 -200 190 340 -182 -254 -130 43 533 265 -153 -175 62 295 261 -391 -240 62 159 295 105 -57 -223
5208 -223 141 290 189 200 27 -292 173 226 239 -286 -509 -13 375 15 -199 -165 73 235 215 28 -410 -99
5230 -99 -39 -7 321 -246 -225 -214 175 286 258 -306 -310 -203 360 -35 -50 -15 -57 86 306 -89 -250 -98 85 280
5254 280 68 -2 -148 -254 240 400 215 -313 -227 -23 224 224 -366 -415 44 342 151 -211 -298 37 173 -30
5276 -30 73 248 -290 -199 251 340 84 -158 -372 190 168 362 -467 -156 158 426 121 -279 -271 -42 250 293
5298 293 -163 -159 116 138 -124 552 -92 -429 -37 18 462 62 -263 -324 197 291 254 -107 -147 -42 175 149 79
5321 79 -155 -143 -169 113 388 246 -241 -108 137 403 154 -530 24 128 490 -50 -291 -235 -190 9 98 -157
5343 -157 -125 -425 -79 42 227 -134 -262 92 202 279 -32 -360 -131 140 315 190 -333 -145 -27 -13 172
5364 172 -138 -192 -177 -30 119 190 -33 -170 -311 -63 567 163 -258 -192 203 173 -195 -138 -71 -87 36 4 237
5387 237 113 -219 -170 168 434 136 -224 -131 127 304 120 -352 -379 93 543 131 -234 -378 -181 171 62
5408 62 -342 54 -123 -127 95 93 202 -346 -153 60 219 156 -273 -270 -13 335 -242 -280 -154 -49 100 322 -48
5431 -48 -362 -105 -109 22 212 205 -378 0 230 352 211 -330 -104 260 472 197 -148 -468 210 255 210 80
5453 80 -217 -17 -28 64 219 54 -158 -127 226 455 -109 -417 -194 37 360 -180 -270 -369 196 484 259 -319
5475 -319 -172 -71 -132 218 204 -98 -360 -140 179 184 54 -151 -253 -30 407 125 -373 -112 5 249 59
5496 59 -141 -64 73 -92 197 -179 -30 -173 -137 10 380 45 -262 -264 115 385 -48 -148 -278 214 220 -57
5518 -57 -105 -87 -109 282 -74 29 -203 -369 -168 -29 248 -65 -210 -275 439 506 114 -268 -499 178 258 116
5540 116 -403 -212 5 -84 67 172 -258 -134 -197 191 19 -186 -71 -298 81 258 97 -288 -171 -13 386
5561 386 153 -302 -137 -25 259 183 82 -33 -48 -147 151 238 -52 -266 -283 287 357 -214 -379 -394 153 117 -260
5584 -260 -397 -379 -8 -102 186 109 -180 -171 3 187 62 156 -430 -121 -46 258 146 -495 -344 211 445 113
5606 113 -270 -415 10 191 195 28 -10 9 53 138 322 -83 -263 -101 -27 189 -28 -257 -320 141 252 197 -347
5629 -347 -384 -188 225 44 -247 -199 183 -41 -26 261 22 -190 -273 333 429 75 -218 -114 66 367 123 -427
5651 -427 -36 -7 69 -51 -60 -16 -75 89 49 156 -314 -198 -226 -267 351 -58 -318 -53 76 265 220 -186 -191 33
5675 33 339 -121 -136 -82 152 143 -14 321 -43 -198 -46 103 372 128 -344 -111 135 347 376 -215 -173 363
5697 363 337 -61 -125 -151 -12 42 215 163 -224 -362 -106 349 194 -98 -257 -395 144 489 -56 -311 -202 144
5719 144 333 7 -241 -173 41 -17 175 -55 -171 -120 -140 213 190 91 -310 -352 210 441 -174 -508 -336 -122
5741 -122 110 342 -90 -312 120 157 183 242 -6 -109 -358 243 90 -70 -256 -196 61 233 -38 -201 -240 46
5763 46 445 86 2 -179 35 -71 279 89 5 -15 19 -31 140 49 -278 -278 178 424 82 -140 -1 -138 322
5786 322 93 -127 -76 130 89 60 201 -201 -290 -127 44 338 -147 -48 -430 159 299 -62 -160 -459 205 321
5808 321 -30 -344 -183 -220 200 67 -74 -119 -102 -19 162 234 -150 -457 -371 -61 329 88 -228 -235 161 438 85
5831 85 -271 -91 213 -32 26 26 51 59 -99 -41 224 -5 -193 -293 68 23 18 -245 -352 139 211 90 -272 -197
5855 -197 136 205 -112 -270 -153 66 -57 7 -120 41 -23 -200 183 405 91 -193 -77 418 107 -70 -459
5876 -459 -135 127 340 -41 -115 -203 62 182 51 -126 145 -286 173 281 96 135 -256 -172 102 274 154
5897 154 -126 32 35 211 248 -48 -157 -18 -3 -9 40 -41 5 -182 55 548 86 -156 26 113 264 108 -395
5920 -395 -268 80 -75 196 80 45 -139 154 -84 72 -142 -191 -283 221 326 6 -222 -322 277 375 -82
5941 -82 -359 -253 -43 200 -106 -286 -10 -161 297 255 106 -119 -4 42 393 241 -11 -272 -242 5 270
5962 270 -91 -162 -241 -111 318 87 -331 -113 -250 56 161 -83 -265 -259 -70 508 405 147 -62 -459 33
5983 33 209 131 -249 -228 265 363 195 -174 24 281 223 102 100 125 105 -78 200 143 118 -398 -264 189 278 -9
6007 -9 -202 -234 260 129 163 -264 -163 -1 181 348 -429 -123 26 -181 73 50 90 -214 -87 123 312 24
6029 24 -67 -298 235 398 89 -56 -46 316 200 41 -88 14 -109 49 301 66 5 -21 -307 170 278 92
6051 92 -129 -385 202 236 61 -397 -202 -57 50 -208 113 -36 78 -4 334 227 -182 -117 -73 67 120 80
6073 80 -474 -221 0 244 219 -175 -309 -30 242 24 -168 -229 3 12 96 172 -174 -385 -11 152 260 215 -245
6096 -245 -316 394 313 -271 -123 -243 135 357 -88 -12 -195 -103 143 380 -27 -84 57 -86 155 243 12 -140
6118 -140 -116 10 396 -45 -188 -145 35 205 187 -215 73 -124 116 24 -49 -36 -226 -210 150 93 -50 -220 -343
6141 -343 87 160 253 -221 126 378 217 -44 -103 -75 191 76 61 76 -93 -373 305 67 149 85 -228 -72 128
6164 128 152 40 -333 -390 161 157 77 -209 133 -131 23 45 88 25 -199 -62 -68 191 38 -315 -156 248 300 -14
6188 -14 -146 -108 -7 342 150 -211 -100 -121 68 207 8 27 -123 -77 151 346 -16 -144 -23 107 430 162
6210 162 102 -372 282 136 -32 -152 16 297 385 -240 34 -36 130 93 93 95 13 -268 -312 274 148 -55 -136 -139
6234 -139 93 188 26 -207 -318 49 50 181 16 -237 -149 -62 43 320 97 -268 -279 237 321 -196 -328 -201
6256 -201 350 169 -30 7 -63 -90 353 -45 13 133 -19 -63 103 24 96 -184 -159 99 128 -55 -324 -190 188
6279 188 294 155 -139 -113 19 115 40 250 -147 52 -122 215 -62 9 -112 -129 164 -5 -29 -272 -69 186
6301 186 301 24 5 -50 0 219 203 0 57 -28 11 107 -4 -55 20 -158 -139 166 -225 -369 -224 67 165 -82
6325 -82 46 -412 250 199 93 -148 -66 -87 47 49 -20 19 -166 -68 65 51 -67 -37 -116 189 295 25 83 -161
6349 -161 86 335 28 16 -226 88 -83 -295 -5 174 -98 -253 27 159 20 -333 -114 185 428 -98
6369 -98 -294 -220 44 148 105 -85 -198 -223 -52 -74 -309 -329 -266 -89 178 274 -139 -300 -220 245 229 -64 -219
6392 -219 -285 138 -132 -49 52 -247 65 13 -99 -150 -311 -349 19 -18 161 29 4 -46 126 413 302 -251 -450
6415 -450 -29 205 -264 -9 -118 -70 -79 147 108 33 -75 -62 156 49 170 -129 -439 286 345 180 -242 -401
6437 -401 207 348 -109 -302 -183 163 9 -17 32 -32 -353 -28 -32 213 65 -153 -347 114 290 -326 -231 -93
6459 -93 44 188 155 -275 -259 425 52 158 -77 -197 -81 -126 200 148 -135 -127 -247 191 306 73 -191 35
6481 35 171 213 -104 -97 -1 221 351 -58 -57 11 259 73 71 38 -162 -353 -90 20 253 -152 -430 -238 353 354
6505 354 110 12 18 -49 166 -14 -28 -191 -52 235 175 161 29 24 -412 145 33 -38 -18 121 96 464 148 -408
6529 -408 67 -174 4 66 -385 -65 36 -2 -136 -11 -199 -343 104 105 336 39 -26 -106 -168 -103 -88 8 -7 176
6553 176 57 -34 -105 -48 150 128 113 -107 -118 -122 -147 77 248 -89 -332 -68 11 89 -147 -241 -177 10 128 202 -86
6578 -86 -208 -61 8 177 -88 -144 -292 -52 164 -47 12 -189 -199 257 436 26 -184 -181 89 222 38 -3 -75
6601 -75 -82 96 212 -216 -22 60 11 5 -210 100 -113 -132 194 115 125 -321 -139 115 87 88 -234 -86 182 -46
6625 -46 -31 101 243 100 -183 -256 -18 7 -312 -184 162 300 36 -183 8 -149 117 91 -138 -87 57 137
6647 137 -119 186 -70 -33 -122 66 -146 -261 -69 -43 20 122 -20 -149 -284 289 174 20 -109 -40 167 255
6669 255 64 -243 -113 -128 93 22 -5 -142 -117 -108 -257 209 242 -284 69 57 80 219 -33 -88 243 217 -161 180
6693 180 -25 91 211 87 -62 -112 -249 -86 -25 204 190 -198 -174 105 214 -107 -237 -87 177 129 237 180
6715 180 -164 -186 -253 107 169 -325 94 116 112 518 12 -369 -31 147 303 46 -68 -198 132 -99 -64 -195
6737 -195 -90 96 196 -4 177 -79 -401 -188 -77 -38 -336 -151 52 84 229 -9 -227 -159 86 143 90 -12
6759 -12 -254 -65 -70 166 10 -55 -68 62 261 81 -1 -168 -36 138 121 -169 -115 -335 20 -36 69 -360 -41
6782 -41 260 160 -54 82 163 173 -9 -37 90 84 -131 89 101 266 4 -35 148 -71 200 138 -41 -343 -247
6805 -247 77 90 388 -70 -206 -114 158 339 40 110 -126 136 220 42 -24 -52 -70 101 231 -85 -118 -41 65
6828 65 400 28 30 -211 103 42 87 236 40 -116 147 73 26 -1 -41 -9 254 136 -187 13 26 18 105 10 -28
6853 -28 58 -10 -94 66 116 -180 -54 197 17 1 -212 -306 -69 78 113 -224 -131 -14 79 307 -112 118 142 5
6877 5 57 188 232 28 -140 156 198 43 -148 72 -99 89 -99 -246 -45 -146 284 -29 -133 43 -448 -114
6899 -114 24 -95 -124 226 -379 52 140 1 -40 -172 13 126 49 -234 -193 170 -67 99 -190 71 -93 53
6921 53 -118 135 85 -136 65 63 69 101 -115 -392 -21 71 2 -41 -111 166 71 67 209 -93 208 277 -30 -102 82
6946 82 -72 -203 39 159 -34 -233 -195 138 -15 370 -186 -325 -150 227 -24 24 -87 -54 -135 92 164 89
6968 89 0 -240 63 169 -43 -355 -201 3 217 -199 -55 -79 -76 -23 36 46 153 39 39 -110 -59 -220 -302 -272
6992 -272 -111 31 -52 -14 -126 205 65 -211 -157 212 71 542 205 -61 -135 -233 166 -79 -20 -77 -77 -212 75
7015 75 121 -41 -33 -156 -16 256 140 -239 -68 118 114 180 -173 -70 63 113 1 30 -79 24 -214 155 -9
7038 -9 83 -23 -28 -175 72 108 -79 61 100 -109 -145 -244 155 3 194 90 -58 10 -282 -85 -63 -108 -130 -287
7062 -287 -166 -69 110 136 -140 -184 -5 124 184 121 -272 65 166 176 116 41 -181 18 -67 224 193 -182 -20
7085 -20 -65 149 252 -112 24 -9 277 -89 -314 -192 -126 -12 159 -55 -115 -148 -12 139 52 -89 -54 3 64
7108 64 212 88 -158 -21 87 159 203 45 -78 127 111 35 128 -55 146 30 172 253 156 78 -181 -95 97
7131 97 176 -93 69 56 232 46 158 42 8 227 69 -126 138 -152 -1 161 -115 -200 168 -227 368 206
7153 206 43 74 -113 -92 198 -1 -58 17 133 172 264 -112 -58 -36 -23 -119 -149 50 7 48 127 275 -136 75 129
7178 129 35 -8 -110 -358 -59 -70 206 37 -121 -39 -79 -105 16 4 -137 231 -247 240 84 78 -151 -2 125
7201 125 267 44 -140 -99 160 391 68 135 -27 -30 -176 68 -130 33 -76 40 65 -66 138 -60 -126 175
7223 175 50 23 -139 38 -189 316 231 -72 -263 42 78 -30 -158 85 -102 -191 78 -34 208 -125 -82 92
7245 92 129 -9 33 -38 172 280 -100 -123 -272 -34 76 -114 58 193 83 -134 -108 203 95 -256 -115 -37
7267 -37 32 196 -37 -271 27 -3 -19 49 -186 155 -83 -183 -102 -155 -41 -23 -158 123 229 -174 -197 38 -96
7290 -96 1 164 -62 292 -90 120 -178 -137 -242 158 81 218 34 65 -106 -40 49 183 31 -17 121 -1 -3
7313 -3 -67 67 -55 302 -106 128 5 2 -51 -12 10 -171 -150 -71 220 84 -50 78 -23 91 256 59 -118
7336 -118 -132 88 58 27 113 6 -34 -9 39 -112 -98 -123 281 -191 159 45 -40 -159 204 -71 235 -131 -113 71
7360 71 -150 -117 -118 13 -55 187 -53 -95 -100 -46 68 47 -175 97 -97 91 -305 97 -33 -243 -111 149 127 -139
7384 -139 0 -193 -141 16 -120 -9 -375 103 14 -236 33 21 -207 -21 42 -33 286 -82 -85 -59 202 -65 -135
7407 -135 -135 35 94 4 -283 -33 -64 -32 -21 -11 -156 -70 -189 -130 -76 -11 -188 70 2 29 -74 36 24 -12 176
7432 176 206 75 -94 -131 57 -289 -185 -95 -31 -144 -24 -61 -30 84 49 98 105 -72 -113 -29 -117 151 92 14 20 87
7458 87 -69 -53 -88 57 -115 -43 -82 -18 -69 -197 -14 109 34 -91 -123 -198 250 20 -95 -9 -188 13 197 -112
7482 -112 12 45 71 -179 -31 148 -92 -124 -70 173 150 114 -254 205 27 261 0 -44 -127 27 -115 -214 -273
7505 -273 -116 -135 -224 122 101 80 92 -304 -132 -171 -10 -84 5 111 95 -69 -213 -275 -91 306 -26 -113 188 -32
7529 -32 229 142 -165 167 40 -119 -98 252 45 -218 -74 -105 175 -148 43 -118 -12 -188 -218 6 -190 48
7551 48 73 244 0 104 124 264 -76 34 -96 275 52 -46 -79 -191 -45 -270 168 -134 187 -130 162 -152
7573 -152 -142 -113 114 282 -68 -171 -103 132 -88 12 -36 -80 394 -40 118 -119 63 272 -153 19 -119 -120
7595 -120 -256 -247 -126 43 221 116 132 194 -119 -75 -137 183 104 -117 -34 75 -103 97 -43 -68 -167 -92 -292 313
7619 313 242 203 -8 -33 -62 -92 111 -111 78 102 71 -135 -13 79 55 -179 158 216 -132 125 68 90 151 -244
7643 -244 12 101 297 -80 -12 111 40 -62 147 83 131 -58 -88 15 -210 -34 106 -87 -37 116 37 -147 113
7666 113 119 -4 73 153 -140 -153 245 -61 -29 -282 -118 -13 112 -76 60 -136 -6 196 -101 -114 23 -31 -1
7689 -1 -22 235 72 41 139 186 21 299 -40 -97 -4 -47 -20 -117 -94 -32 -25 54 -142 -18 -130 60 149 24 35 -197
7715 -197 125 44 -58 -2 0 96 -84 -40 -84 4 -323 52 76 -136 175 17 14 -12 16 -46 80 -205 9 96 15
7740 15 -187 -47 47 -316 -73 32 44 41 -61 -8 -133 -193 78 17 91 -115 105 86 -181 133 198 407 150 -9
7764 -9 14 -15 4 -117 -108 -109 17 95 31 50 150 -55 128 100 -94 -174 -6 -94 -98 91 -153 -155 -122 261 116 52 -127
7791 -127 -47 0 -59 306 -21 -48 -41 89 92 -109 64 -164 62 207 -40 74 -154 207 132 28 68 -130 3
7814 3 4 234 -130 73 22 127 -120 -73 -21 45 -36 -57 -47 49 -138 12 -50 59 443 -44 54 112 25 -19 16 -30
7840 -30 154 -66 -137 -71 119 6 -105 43 88 113 -39 -256 78 82 306 -15 -101 -104 218 231 -27 -102 -54 -144 100
7865 100 -94 269 91 23 72 -104 56 -25 17 11 92 -6 -152 -141 -215 -134 37 -4 73 -133 -27 33 216 -42 -114
7890 -114 118 -106 23 136 -78 7 92 34 -58 -106 93 39 -163 31 37 81 -174 -61 150 171 -154 262 12
7913 12 281 50 18 -25 -133 -21 153 -72 -8 -39 -175 -94 -38 107 126 -81 126 140 241 -67 95 -254 117
7936 117 -86 38 -212 -154 73 169 -171 108 -276 -31 107 227 -98 -353 -331 -183 -182 -400 -75 280 68 88
7958 88 121 67 -28 -134 -200 -18 286 -71 -272 -193 -11 -94 -117 -105 -8 -64 -114 -7 340 -24 -34 -72 224 -69 -109
7983 -109 -68 227 16 35 -19 -200 165 1 -88 -18 -75 39 272 -17 76 62 24 -81 -10 -172 -51 4 -92 135
8007 135 -84 140 47 6 121 100 20 18 -73 39 234 -153 -95 -113 212 -49 -230 112 -24 138 34 -203 31
8030 31 117 206 -6 -131 120 155 -76 36 -43 -61 122 -20 -114 160 64 -34 326 104 -78 -12 62 116 121 89 -25
8055 -25 135 -80 32 83 -48 -136 -99 -89 97 -26 -3 72 101 -7 -20 -110 11 -146 162 191 -4 -84 -47 -12 44
8080 44 215 -157 -169 168 5 -264 53 224 13 306 -26 -41 -85 -172 -60 -4 -39 50 -21 251 0 72 -286
8103 -286 202 -239 -69 -61 99 -73 -62 56 62 153 -138 -28 -99 109 117 -55 45 57 48 -131 2 -46 -84 176 200
8128 200 72 -125 -135 150 107 -59 -145 -80 1 -195 -73 -62 -40 200 7 38 47 222 82 -96 197 89 236
8151 236 240 29 132 79 -74 -60 -85 398 -203 -117 102 -47 -289 -93 -265 291 -25 -42 -84 -160 71 -105 42
8174 42 -137 -87 -69 -31 127 -56 66 182 -150 49 -61 -47 -222 38 172 -188 -75
8191g5
$$ Imaginary data points
##PAGE= N=2
##DATA TABLE= (X++(I..I)), XYDATA
0 0 0 0 0 0 0 0 -8 8 -8 8 -8 10 -16 16 -24 26 -32 40 -48 56 -64 72 -85 98 -110 129 -146 166 -188 209
30 209 -238 265 -296 331 -371 413 -457 510 -565 625 -693 768 -848 938 -1041 1158 -1286 1434
48 1434 -1605 1806 -2043 2330 -2688 3145 -3754 4604 -5880 8008 -12217 23741 -121322 -395074
62 -395074 -124805 196576 223591 -15061 -159739 -133994 -38371 21704 61669 25994 -81943
73 -81943 -131185 -4764 123545 39480 -164509 -178836 29702 184182 91919 -100830 -172111
84 -172111 -92935 22646 109655 124005 15645 -150420 -172731 3839 161763 106175 -54840
95 -54840 -98223 -11178 40581 2136 -21638 19136 40188 6366 -9540 9905 -3719 -45623
107 -45623 -21342 66743 95295 14099 -70767 -62802 -5902 27498 52939 81371 37697 -83992
119 -83992 -129845 -9136 126712 99747 -27848 -71527 -15296 8751 -24579 -5584 69208
130 69208 63050 -45159 -88785 845 69798 9679 -60063 -9834 76364 49258 -53093 -79345
142 -79345 -10981 40366 41143 47073 37817 -45938 -123598 -53962 111625 157699 17274 -124541
154 -124541 -100462 21119 78869 51573 15408 -15788 -53614 -40997 41830 84832 2658 -95727
166 -95727 -50970 90580 121109 -21476 -150521 -94106 73827 153857 73480 -75305 -154613
177 -154613 -90189 68190 163500 81479 -96575 -166583 -49207 104004 109232 -13246 -95675
188 -95675 -60797 19786 58269 31300 -39541 -88817 -43520 72591 119342 6631 -146477
199 -146477 -135480 43191 165971 85022 -79794 -132793 -50620 50956 86658 52017 -20689
210 -20689 -76274 -54530 33596 82064 21252 -61336 -40073 48078 62424 -14254 -59247 -14422
222 -14422 40829 36551 8098 4995 -1680 -37448 -41339 29795 90063 41618 -56729 -74437 -3088
235 -3088 51344 35535 1978 -2463 -3502 -24899 -27357 13549 44751 19388 -23283 -26451 -1318
248 -1318 10130 2546 -2620 -333 1075 2287 7397 1631 -23432 -32984 4686 49134 36683 -21809
262 -21809 -56448 -33031 14820 43900 37960 3407 -40038 -54996 -14177 49811 61189 2119
274 2119 -53258 -41876 10329 41242 27362 -9732 -35397 -24007 21974 54741 21757 -55516
286 -55516 -74782 11930 102912 68418 -55647 -110856 -32899 75338 90788 16321 -56815 -67697
298 -67697 -23496 41382 77393 36307 -55002 -88462 -8914 87457 71828 -36929 -95763 -28499
310 -28499 73949 81403 -6652 -80321 -63315 18026 82552 65486 -23255 -93978 -63926 41050
322 41050 101693 45969 -60285 -89334 -13528 64981 57624 -8991 -51271 -32261 16715 41699
334 41699 19342 -23419 -39852 -11394 32678 42321 2844 -42121 -40315 4304 42362 36805 -4895
347 -4895 -42070 -35585 8233 40353 24871 -14633 -29364 -7835 14265 7386 -6602 887 13144
360 13144 211 -18930 -9633 15654 16951 -7942 -19480 577 20533 7866 -15804 -15073 3042
373 3042 10535 7729 6822 496 -16060 -22353 1497 32562 27409 -13011 -37626 -16431 18836 26441
387 26441 10369 -6103 -16749 -18168 -1681 24326 28187 -4655 -37725 -22623 27118 44344
399 44344 2533 -42586 -33227 17128 47489 24282 -24049 -44526 -18173 26788 47111 22389
411 22389 -27069 -51717 -20288 37611 58000 15965 -44925 -56631 -1186 59927 52650 -16714
423 -16714 -65388 -34352 40013 68929 16291 -54741 -57862 7290 63295 49571 -15399 -61940
435 -61940 -40694 27112 68576 36783 -35335 -67929 -20876 52988 64689 1472 -56422 -41550
447 -41550 19608 52380 26263 -22029 -40441 -14136 25616 40841 15385 -28995 -44412 -5381
459 -5381 46150 44451 -11449 -51089 -26454 28691 44525 6867 -29997 -23964 5736 18487 9245
472 9245 -2362 -7246 -6679 -2575 3948 7898 2562 -8698 -10235 1583 8926 2439 -6614 -7289 -1790
487 -1790 1129 -43 -551 1594 -372 -8449 -11370 -86 11654 8386 -7571 -18077 -11195 6488
501 6488 14324 5370 -9516 -15801 -10140 4025 15567 10144 -10231 -23564 -10888 16007 24700
514 24700 64 -28391 -22785 10889 28557 10663 -18227 -25590 -7089 14455 19974 7859 -12674
527 -12674 -26636 -16823 15653 35774 12237 -31904 -42509 -2864 40577 33455 -16623 -48053
539 -48053 -23955 22645 38484 9315 -31099 -41097 -10087 30850 36564 -1980 -45211 -43264 7286
552 7286 49800 30156 -30365 -58650 -21385 35256 46103 1104 -45667 -42196 4070 39361
564 39361 28347 -14669 -44372 -28334 18157 43084 16598 -32665 -46879 -7269 40206 38427
576 38427 -11656 -47746 -26057 22858 39872 9574 -27866 -30117 -425 23280 18458 -2254
588 -2254 -16954 -14947 743 16710 15243 -3981 -19072 -11368 10865 19751 3557 -16275 -12639
601 -12639 6812 13748 2975 -7210 -4627 2466 2482 -1397 -140 5216 3411 -3739 -5059 502 4661
616 4661 4144 2949 1013 -2849 -5442 624 12091 13247 -2392 -15280 -5042 17023 20622 1271
630 1271 -15272 -9048 11686 20687 9256 -6406 -9392 -849 10679 17610 12535 -4457 -15651
643 -15651 -6052 17862 28921 10011 -19135 -22294 6234 31165 22768 -7522 -24480 -10452 16687
656 16687 26540 10391 -13745 -22286 -6735 19009 27679 5764 -25722 -29267 2120 33729 26203
669 26203 -14848 -40872 -19480 23296 35605 6254 -29448 -33109 -3178 26948 26200 -4007 -32126
682 -32126 -28276 6676 35876 22365 -21558 -42580 -12170 33040 37158 -4245 -39322 -26018
694 -26018 16821 36232 14176 -18723 -27322 -7395 19045 26168 7748 -18158 -23606 -1200 25039
707 25039 24085 -5396 -26581 -12362 17686 24964 3051 -18741 -14440 6827 17865 7832 -7002
720 -7002 -10663 -3384 5140 8707 4002 -3990 -7746 -3096 3970 5834 -275 -5689 -2785 2864 1673
735 1673 -5090 -5133 2103 6033 111 -9839 -8419 3633 9437 926 -9819 -8374 1978 7397 2808
750 2808 -5152 -7428 -3598 2261 6381 5950 -3181 -14087 -9249 9596 19134 4103 -18213 -19012 3579
765 3579 21321 12304 -9757 -17575 -6347 8189 12918 6323 -6824 -15257 -9123 9211 19839
778 19839 5948 -19074 -23356 2435 25604 16391 -13539 -27577 -10809 15521 22314 4854 -17428
791 -17428 -22802 -7384 16123 23165 3273 -24454 -26027 2272 27775 19136 -14039 -31798 -11765
804 -11765 21461 27499 586 -26113 -22304 6050 27160 18009 -10395 -25599 -13100 14042 27225
817 27225 12269 -15937 -25482 -4710 23110 25966 -507 -24206 -16907 13256 27329 8825 -16697
830 -16697 -17591 3875 19832 13174 -4710 -13735 -6434 6349 14068 9367 -4600 -14508 -6997 10709
844 10709 15473 1364 -13300 -8977 6460 10606 -1373 -9157 -1676 7049 3017 -5624 -5500 977
858 977 3513 135 -2466 -1535 -1342 -2967 -424 3301 957 -6055 -5144 4143 7230 -2108 -11430 -6442
874 -6442 8190 12242 -447 -13268 -10286 3563 11643 7223 -3851 -10613 -7413 2694 10203 7584
888 7584 -3782 -12187 -7301 7332 13615 3345 -11556 -13482 1566 16184 11156 -7954 -18006
901 -18006 -7015 11407 16555 4010 -12514 -16002 -3506 11964 16595 4494 -14744 -19810 -1802
914 -1802 20192 18138 -6945 -24316 -11700 14716 21559 1437 -19261 -15997 3736 17052 12459
927 12459 -4552 -18297 -14162 5635 22206 14460 -12147 -27557 -9794 20990 25453 -993 -24071
940 -24071 -16356 8656 20607 8136 -11008 -15528 -3422 10913 13858 2439 -13042 -15095 1670
953 1670 18268 13288 -7975 -19897 -7793 13657 17777 1069 -14532 -11080 3578 11195 5573
966 5573 -4637 -7604 -1467 4970 4257 -1003 -4301 -3040 2312 5472 1778 -4530 -5885 -259 5903
981 5903 5485 -2888 -7611 -1677 6420 4224 -4441 -6445 1626 8055 2835 -7704 -8324 1907 8649
996 8649 4312 -3139 -6498 -4844 139 6124 7320 59 -9560 -9132 3832 12927 4628 -11005 -11769
1011 -11769 2851 12633 5629 -8017 -10703 -1539 7469 7911 1646 -5920 -10142 -5326 7872 14464
1025 14464 3528 -13339 -15710 897 16665 11719 -7230 -16215 -5957 8883 12396 2416 -9339
1038 -9339 -11263 -1119 10592 11476 -1004 -14011 -12263 4965 18378 10552 -10228 -20033 -6957
1051 -6957 14740 19281 1608 -17312 -15394 3858 16672 10494 -6528 -14938 -6858 8170 13533
1064 13533 3864 -10298 -13813 -1468 14573 14033 -4276 -18300 -10043 11190 18587 3803 -14389
1077 -14389 -13990 2503 13329 8026 -3580 -8440 -4729 2820 7576 4786 -3524 -8320 -2881 8147
1091 8147 9154 -2602 -11396 -4062 8978 9614 -2059 -9117 -3655 5571 5993 -641 -3621 -621 1848
1106 1848 1033 700 -202 -661 -30 2594 3539 -443 -4883 -3516 5266 9068 1784 -7892 -6945 3934
1122 3934 10243 4856 -5650 -7646 484 8211 5881 -2069 -6318 -2814 4123 7637 3555 -4274 -7461
1137 -7461 -2554 6684 10701 2913 -9390 -10671 1711 13197 9435 -4821 -12341 -4356 8122 10304
1151 10304 1278 -6617 -6836 -893 6305 8141 1338 -8435 -9610 1399 13047 10271 -6643 -15723
1165 -15723 -5197 11858 14085 -80 -12206 -9831 2473 11038 7894 -2135 -9940 -8412 2830
1178 2830 12533 7937 -7706 -14840 -3575 12590 13343 -2989 -15731 -8862 7906 13530 3626 -9325
1192 -9325 -11444 -1589 8467 9355 176 -9343 -9226 796 10176 7534 -5222 -11926 -4173 8326
1206 8326 9333 -1494 -10433 -6729 4489 8921 1156 -7277 -6729 538 5206 3295 -2259 -4970 -2724
1221 -2724 479 3072 2041 -2463 -5316 -1684 3804 3332 -3287 -6073 -1213 5676 3959 -4494 -7439
1236 -7439 -476 6652 3681 -3767 -6010 -1056 3635 3216 -461 -3027 -3295 -863 3358 4800 -119
1251 -119 -6904 -5758 3768 9067 2207 -8219 -9154 1508 9372 4858 -5159 -8543 -2830 4360 5704
1266 5704 1550 -4719 -6792 -2864 4785 7401 768 -8793 -8699 1780 9659 5276 -6483 -10973 -3342
1281 -3342 7208 7920 -940 -8495 -7055 598 6945 6142 -1624 -8549 -6827 2537 9612 6269 -5797
1296 -5797 -11538 -3150 9806 10597 -887 -10622 -7355 5062 10870 4503 -5603 -7978 -1906 6369
1310 6369 8900 3033 -6373 -8258 132 10084 9363 -2441 -10933 -5275 8154 11379 1014 -8793
1324 -8793 -6390 3495 8486 3777 -3665 -5602 -1370 3709 5568 2141 -3729 -5985 -425 6555 5914
1339 5914 -1993 -7441 -2771 5830 6509 -1713 -6445 -2229 4224 4419 -742 -4223 -1938 2202 3281
1354 3281 612 -1745 -2153 -444 2521 3075 -151 -3637 -2803 2517 5324 1471 -4475 -4988 1916 6661
1370 6661 3301 -4619 -5732 -48 5963 4858 -1842 -5319 -2405 2709 4885 2584 -2127 -5375 -2585
1385 -2585 3784 6423 1606 -6038 -7218 1429 8799 4938 -5078 -8461 -1455 6056 5877 -933 -5803
1400 -5803 -4459 668 4340 4185 20 -6284 -6392 1400 8249 4704 -5363 -9707 -2161 7733 7452
1415 7452 -1784 -7792 -4304 3025 6275 3329 -2768 -6071 -3286 3538 7448 3741 -5332 -8474 -981
1430 -981 8469 7845 -2448 -8999 -4477 5388 8267 1732 -5893 -6199 371 5929 5047 -978 -6071 -4593
1446 -4593 2021 6260 3575 -3714 -7075 -2203 5695 6729 -1191 -7276 -4735 3526 6702 744 -5723
1461 -5723 -5210 1091 4457 1567 -2689 -3162 -989 1554 2365 280 -2288 -3367 -398 3881 3107 -2351
1477 -2351 -5193 -929 5201 3613 -3127 -5334 -260 4983 2972 -2484 -3965 -436 3015 2541 310
1492 310 -2150 -2546 -572 3105 4361 267 -5122 -4432 2985 7138 2152 -5603 -5527 1776 5827 3112
1508 3112 -2786 -5136 -1047 3643 4085 999 -3297 -4579 -731 4417 4928 -261 -5838 -4985 2019 6813
1524 6813 3699 -3951 -6502 -1505 4980 5586 -322 -5332 -3909 2114 5250 2615 -2210 -4512 -2246
1539 -2246 2755 5352 2167 -3878 -6364 -1472 6243 7200 -983 -7804 -4539 4083 6835 1760 -4329
1554 -4329 -4398 108 3633 3195 764 -3053 -4276 -418 5272 5033 -2450 -7425 -3018 5699 7120 -363
1570 -363 -7210 -4044 2957 5576 1436 -2597 -3800 -1612 1854 3270 1271 -2524 -3906 -232 4522
1585 4522 3126 -2751 -5328 -400 4596 3750 -2148 -5056 -1851 2819 3605 58 -2889 -2256 318 2422
1601 2422 1537 -1217 -2721 -438 2158 1913 -732 -2892 -1553 1997 3722 714 -3295 -3896 350 4557
1617 4557 3378 -2348 -5272 -1069 4243 3654 -1416 -4173 -1523 2519 2859 471 -1966 -2583 -1277 2098
1633 2098 4686 1071 -4677 -5588 738 7076 3881 -3657 -6581 -784 4915 3645 -942 -3166 -1775
1648 -1775 548 2535 2362 107 -3533 -3192 1487 5583 2493 -4785 -6022 486 6092 4177 -2183
1663 -2183 -5331 -2472 2245 3906 2077 -1783 -3693 -2304 2006 4387 1296 -3813 -4162 211 4640
1678 4640 3029 -2248 -5125 -1680 3771 4779 346 -4295 -4348 602 5036 3465 -1722 -4292 -2126
1693 -2126 1720 3679 1633 -1900 -3381 -887 2489 3510 -455 -4233 -2564 2905 4551 -193 -4795
1708 -4795 -2966 2008 4144 1080 -2400 -2346 -241 1117 1397 1190 -1198 -2494 -791 2387 2546 -1605
1724 -1605 -3856 -412 4162 2481 -3009 -4467 146 4111 2380 -1620 -3065 -1080 1396 2046 891
1739 891 -447 -2013 -1397 1410 2928 -53 -3639 -2688 2169 4473 816 -4190 -4138 1240 4534 2387
1755 2387 -2056 -3989 -1967 2119 3867 1038 -2652 -3194 -316 2852 2711 -464 -3324 -2250 1646
1770 1646 3859 1991 -2821 -4185 -240 4397 4312 -1249 -4799 -2465 2394 4150 1548 -2000 -2771 -1315
1786 -1315 1279 3299 2068 -1566 -3788 -1001 3788 3856 -1280 -4979 -1964 3735 4174 -485 -3823 -2435
1802 -2435 825 2782 2125 -66 -2670 -2837 -161 3951 3672 -1583 -4753 -1807 3550 3933 -717 -4010
1818 -4010 -1707 2509 2900 41 -1978 -1979 170 2098 2180 287 -2476 -2528 471 3200 2102 -1867 -3271
1835 -3271 -538 2824 2313 -843 -2648 -802 1885 2129 -179 -2419 -1386 1856 2455 659 -2103 -2161
1851 -2161 104 2212 1734 -64 -1633 -1822 452 2321 1589 -1601 -2816 -1 3190 2058 -2014 -3792
1867 -3792 -189 3725 2680 -1481 -3344 -1271 1599 2483 1337 -829 -2325 -1456 1212 3296 1536
1882 1536 -2909 -3901 689 4088 1942 -2930 -3855 153 3700 2563 -1366 -3221 -1449 896 2530
1897 2530 1952 -672 -2978 -2229 1623 3615 1565 -2815 -3897 15 3493 2280 -1496 -2931 -1000
1912 -1000 2125 2461 387 -2130 -2250 -93 2399 2134 -71 -2680 -2799 486 3160 2425 -1417 -3360
1928 -3360 -1735 2197 3129 194 -2711 -2086 1038 2734 1010 -1536 -2174 -660 1446 1304 498 -1478
1944 -1478 -2350 -425 2451 2792 -669 -3447 -1773 2220 3455 119 -2893 -1580 1359 1796 33 -1136
1960 -1136 -1049 391 1198 767 83 -1054 -1641 140 2408 1858 -1853 -3050 -247 3068 2109 -1293 -2860
1977 -2860 -672 2463 1613 -902 -2003 -551 1151 1872 346 -1401 -1698 -305 1966 2174 27 -2485
1993 -2485 -2124 1044 3347 1253 -2166 -2922 -44 2823 2169 -1289 -3058 -899 1967 2267 34 -2110
2009 -2110 -1783 366 2363 1604 -656 -2449 -2112 776 3209 1911 -2025 -3116 -189 3029 2453 -1033
2025 -1033 -2794 -1200 1901 2104 103 -1504 -1606 -168 1472 1903 403 -1696 -2447 146 2844 2500
2041 2500 -1138 -3344 -924 2688 2342 -376 -2243 -1326 602 1380 830 -125 -1205 -1251 350 1983 1061
2058 1061 -1307 -2559 -375 2281 2097 -588 -2721 -1187 1497 2383 413 -1475 -1647 -54 1061 932
2074 932 -355 -1097 -1026 655 1508 707 -894 -1715 -272 1989 1539 -585 -2355 -990 1824 1965 100
2091 100 -1969 -1072 1040 1689 569 -956 -887 177 1009 948 -31 -1096 -1127 522 1921 989 -1554 -2079
2109 -2079 35 2621 1913 -1121 -2414 -280 2039 1780 -288 -1617 -1214 773 1176 773 -548 -1514
2125 -1514 -848 1314 1984 424 -1930 -2140 671 2967 1583 -1833 -2651 6 2311 1756 -435 -1965
2141 -1965 -1085 578 1577 701 -625 -1572 -933 1142 2130 554 -1989 -2297 180 2612 1645 -1258 -2681
2158 -2681 -566 1721 2125 -124 -1662 -1254 -191 1370 1042 -336 -1156 -1236 209 1551 1024 -1076 -2166
2175 -2166 -252 1916 1642 -359 -2121 -1168 1152 1960 384 -1259 -1157 42 552 869 343 -888 -1171
2192 -1171 -349 1574 1223 -519 -2131 -742 1879 1664 -678 -1949 -803 1038 1595 298 -1255 -816
2208 -816 293 739 786 35 -696 -1139 116 1232 773 -889 -1341 -65 1434 1086 -897 -1831 -319 1582
2226 1582 1479 -298 -1629 -792 641 1335 438 -897 -914 -253 1045 1231 -176 -1387 -1018 563 1970
2243 1970 625 -1594 -1864 440 2173 1290 -1120 -2116 -312 1617 1288 -386 -1362 -978 267 1071 1249
2260 1249 51 -1254 -956 540 1804 989 -1793 -1963 253 2434 1710 -1308 -2285 -391 1696 1591
2276 1591 -299 -1340 -1114 186 1002 1041 464 -1128 -1298 252 1869 1095 -1267 -1780 -288 1521 1016
2293 1016 -800 -1366 -673 884 1398 315 -894 -840 -434 834 1154 609 -817 -1575 121 1436 978
2310 978 -763 -1483 -91 1124 961 -419 -1445 -642 638 1168 86 -743 -681 -475 619 831 330 -715
2328 -715 -1204 10 1099 973 -201 -1236 -484 1156 1080 -500 -1312 -195 964 1121 -221 -1245 -951
2345 -951 248 674 711 -254 -1095 -714 86 1220 755 -957 -1444 196 1422 912 -1110 -1185 31 1493
2363 1493 801 -966 -1111 -222 729 1237 568 -630 -991 -544 863 1560 409 -1485 -1334 400 2063
2380 2063 771 -1586 -1793 191 1739 1207 -804 -1588 -294 931 1125 219 -1221 -1194 -111 1020 1081
2397 1081 78 -1193 -1250 426 1528 569 -798 -1263 -145 1175 922 -389 -1675 -698 901 731 131
2414 131 -551 -964 -496 629 1419 408 -827 -1284 -170 1440 956 -863 -1403 -195 1077 503 -482
2431 -482 -815 -189 431 380 384 -238 -599 -546 88 1123 733 -581 -1137 -254 1325 897 -496 -1170 -571 1087
2451 1087 769 -160 -844 -411 491 822 237 -300 -811 -246 458 863 265 -890 -710 162 883 591 -464
2470 -464 -1054 53 902 455 -389 -730 -249 726 877 -180 -703 -738 1 852 641 -271 -984 -894 623 1408
2490 1408 293 -1022 -1479 -47 1289 798 -880 -1263 -313 943 992 -542 -938 -438 624 1104 383
2507 383 -267 -904 -681 387 1224 236 -1239 -1539 197 1401 768 -828 -1230 -180 904 785 -367
2524 -367 -886 -671 233 636 553 -293 -933 -425 530 1179 395 -1228 -1130 107 1360 779 -479 -1129 -198
2543 -198 700 427 -366 -457 -349 -176 520 363 -55 -438 -507 -47 1026 641 -732 -1097 -121 876 634 -186
2563 -186 -1001 -591 544 822 -129 -565 -165 79 498 372 -90 -395 -446 122 619 194 -564 -731 -56 687
2583 687 742 -333 -863 -306 571 495 -16 -563 -189 96 198 130 72 -314 -423 241 841 364 -758 -962 228
2604 228 1037 450 -771 -852 -80 870 489 -442 -872 -17 549 237 82 -372 -582 144 355 606 202 -695
2624 -695 -832 289 1012 289 -696 -929 214 1126 921 -192 -837 -360 551 538 -147 -405 -659 7 481
2643 481 823 -130 -967 -368 410 1049 197 -840 -991 218 969 712 -434 -728 -150 510 758 258 -121
2662 -121 -146 -273 258 510 265 -498 -534 57 761 509 -604 -673 283 912 347 -544 -852 -153 304 407 -17
2683 -17 -171 -322 -348 54 457 -4 -550 -459 287 595 338 -302 -555 63 755 338 -66 -437 -117 -6 297
2704 297 90 58 -395 -327 131 315 -43 -348 -631 199 596 218 -422 -550 109 563 261 -398 -638 -65 365
2725 365 202 -315 -446 -332 270 331 358 -71 -380 -224 182 544 140 -446 -707 300 645 433 -392 -654
2745 -654 64 706 448 -142 -604 -409 261 752 97 -196 -346 -52 539 481 132 -611 -651 371 959 67
2765 67 -430 -676 238 639 433 -399 -483 -346 116 324 310 -38 -506 -522 480 569 -277 -361 -711 345 613
2786 613 337 -576 -610 -148 659 224 -395 -558 -355 109 401 186 11 -318 -83 42 333 239 -365 -475 -14
2807 -14 298 272 -301 -233 362 180 364 -212 -152 7 160 178 163 -132 -195 -119 -30 169 -40 -283 -297 212 406
2830 406 373 -294 -303 142 524 431 -226 -160 -35 37 361 19 -124 -255 -81 284 300 128 -483 -185 85 433
2852 433 184 -421 -329 91 540 277 -307 -412 187 494 392 67 -182 -369 276 504 93 -217 -595 -236
2872 -236 507 436 106 -711 -324 359 432 88 -262 -273 174 129 258 -224 -256 -167 118 334 8 -360 -446 -187
2894 -187 459 461 187 -305 -243 504 695 -136 -505 -308 319 354 37 -60 -187 -37 171 337 0 -21 -381 -290
2916 -290 335 379 -10 -443 -442 512 351 44 -351 -94 569 580 -33 -193 -40 -47 -20 20 37 -44 -161 -245 104 329
2940 329 -19 -430 -112 172 292 216 -265 -273 183 19 16 -260 -286 -201 44 219 17 -85 131 -42 361 243
2962 243 86 -310 -194 171 330 -111 -228 -320 54 608 72 -227 -168 8 292 44 179 -139 -161 -202 72
2983 72 278 -381 -507 -213 295 390 -104 -447 -203 379 49 12 -249 -345 217 294 340 -28 -348 -334 -34 288
3005 288 88 -136 -454 5 331 387 -285 -683 -169 -9 283 -16 -367 -104 352 301 196 -225 -211 -83 435
3026 435 219 -122 -139 -322 256 346 276 29 -471 -145 295 184 19 -264 -197 -231 288 131 -235 -297 -196 180
3048 180 27 330 -110 -166 31 78 -9 -311 2 -163 76 386 122 -37 -190 109 163 -88 -95 104 93 125 26
3071 26 -11 -35 -212 -179 141 99 -33 -80 47 150 396 -23 -123 -74 131 -89 -81 -100 -87 225 71 281 53 -123
3095 -123 137 79 260 191 -75 -165 -125 241 299 158 -462 -110 155 154 -93 -284 -88 129 203 247 38 -383 -263
3118 -263 -26 676 303 -336 -333 -11 481 239 153 -437 -196 374 389 103 -34 -205 -93 -25 231 213 -321 -134
3140 -134 -22 243 137 -344 -446 92 229 293 -60 -356 -60 65 73 88 -170 -129 -70 315 159 342 -121 -73
3162 -73 -84 199 19 -246 -292 110 173 107 -298 -428 133 340 355 49 -122 -95 125 100 242 -69 102 119 1
3185 1 228 273 -144 -190 -174 326 269 -189 -192 -68 174 388 4 -221 -19 141 107 54 -67 -157 69 279 99 -100
3209 -100 -142 -324 -33 95 185 -350 -156 92 266 -109 -354 -161 7 47 116 -234 10 -31 18 16 41 -84 -126
3232 -126 13 391 252 215 -360 -224 254 210 -21 -15 -307 56 110 179 -50 38 216 -5 232 194 -208 -241 -28
3255 -28 190 401 -62 -250 -133 125 304 -73 117 -254 -31 285 -53 0 -618 79 72 336 81 -53 -312
3276 -312 1 -38 125 143 -338 -154 3 331 241 -188 -476 -168 130 9 -260 -191 -140 60 271 65 -177 -161
3298 -161 -242 204 198 36 -169 -33 249 274 30 -148 -151 165 156 -126 -100 -168 -56 95 -112 330 21 -62 48 265
3322 265 188 145 -265 -47 326 141 -169 -43 -280 200 278 73 -56 -211 -30 -48 218 -51 -240 -16 36 174
3344 174 209 -177 -214 -287 297 299 -174 -252 -91 -9 321 -170 -10 -273 -211 423 34 23 -356 -102 -20 401 332 -77
3368 -77 -409 -82 310 217 -200 -506 -107 227 640 -132 -248 -424 -89 48 163 -45 -219 -163 66 456 199
3389 199 9 -356 -403 188 288 -143 -262 -40 122 457 -51 -197 -362 118 352 75 86 -29 -202 -44 393
3410 393 76 -242 -512 -37 141 324 -74 -173 -110 85 351 -128 -41 -156 82 189 99 -228 -348 -119 78
3431 78 177 0 -151 -252 13 215 429 55 -211 -190 216 282 58 -361 -70 221 255 28 -271 -240 244 200
3453 200 -81 95 132 -194 -216 72 511 -385 -241 -49 172 104 -159 -244 -166 99 343 44 -159 -39 -41 170
3475 170 206 96 -125 -224 -61 297 481 -85 -410 -121 419 357 -43 -288 33 167 235 99 -163 -235 -130 217
3497 217 92 -23 -8 -328 -204 634 308 -85 -527 -308 366 332 -36 -478 -373 129 413 206 -263 -229 -129
3518 -129 195 181 -256 -376 -186 78 388 209 -131 -404 -118 303 396 -339 -281 -215 365 418 -1 -20 -145 69
3540 69 -36 308 366 -127 -298 -75 600 278 -107 -372 -48 382 462 -234 -451 53 179 156 -55 -248 -72
3561 -72 237 286 159 103 -327 -120 137 387 97 -277 -366 68 465 24 -379 -231 -145 104 -4 -222 -447 4
3583 4 321 12 155 88 -204 -65 46 148 -180 -276 -96 208 320 286 -236 -446 -193 75 476 6 -145 -263
3605 -263 140 333 -11 55 -186 -68 68 326 68 -75 -313 125 592 256 -141 -629 -10 364 453 -109 -317
3626 -317 -303 -4 239 101 -81 -190 -348 320 174 200 -100 -541 -109 481 206 -259 -431 -69 297 292 -55
3647 -55 -307 6 53 343 75 -208 -391 -175 298 321 -198 -108 -327 123 107 153 -232 -329 -174 303 636 -32
3669 -32 -476 -138 481 208 66 98 -225 -91 296 58 -154 -174 -245 228 110 -3 159 -392 39 258 245 -262
3691 -262 -420 -151 344 71 -65 -218 -138 116 261 400 86 -422 -158 212 372 -53 -178 -76 53 410
3711 410 421 -243 -285 -117 413 436 27 -107 2 41 114 162 55 -321 -360 132 436 339 -433 -319 21 558 352
3734 352 -308 -338 -90 257 330 -108 -475 -194 -130 289 206 -193 -176 -335 194 394 399 -121 -521 48 488 311
3756 311 -299 -473 -117 522 170 102 -112 -365 396 223 88 -59 -223 -94 -56 406 349 -128 -322 32 476
3777 476 119 -258 -591 -52 398 128 -263 -224 -421 -50 252 71 -37 -295 -67 77 434 228 -263 -395
3797 -395 -30 287 124 -389 -496 -9 226 3 -201 -633 -69 -18 -44 250 -133 -279 -243 -35 410 197 -208
3818 -208 -311 81 448 99 -338 -327 357 377 44 -31 -422 62 81 314 -4 -53 -177 -240 -96 206 193 -234
3840 -234 -163 -7 654 283 -147 -621 -280 220 192 -407 -330 43 269 339 -55 -210 -283 -116 186 120 347 -356
3862 -356 -420 -37 469 250 -294 -403 44 278 224 -119 -369 -207 420 60 -153 -329 -64 63 167 288 63
3883 63 -182 -204 70 401 274 -204 -453 3 403 278 -205 -472 -104 194 515 142 -230 -53 204 167 236
3904 236 287 -185 -179 225 437 524 -508 -487 97 438 292 -319 -463 -25 332 469 160 -425 -86 69 423
3925 423 362 -102 -283 -92 106 455 120 -275 -474 -82 333 241 -484 -178 214 339 4 -148 -313 -205 4
3946 4 182 -14 -83 -262 -151 119 325 42 -384 -208 10 485 144 -269 -292 21 350 124 -266 -250 -142 29
3968 29 187 259 -68 -239 15 282 441 -84 -523 -285 142 412 435 -421 -639 103 466 115 28 -271 -88
3989 -88 276 188 42 -61 -344 -200 182 356 256 -317 -495 -28 526 231 -426 -728 -202 307 341 -311 -298
4010 -298 -221 147 137 35 -44 -249 -145 130 186 -3 -363 -418 -34 478 56 -454 -544 -223 424 356 -46 -500
4032 -500 -24 96 120 244 -300 -513 -67 135 350 27 -367 -353 123 729 189 -312 -106 -13 173 194 -341
4053 -341 -413 -283 301 332 -56 -49 -76 32 190 -30 184 -473 -359 75 479 102 -370 -435 -50 315 330 -328
4075 -328 -149 -65 109 263 95 -399 -182 128 135 32 22 -135 -271 16 459 275 -231 -306 202 453 285 -220
4097 -220 -277 95 192 308 -84 -202 92 36 58 184 46 -221 -244 325 365 -53 -349 -479 -3 446 349 -340
4119 -340 -325 69 299 154 -77 -173 -152 80 137 388 -228 -595 -116 243 594 66 -495 -573 -134 495 489 -204
4141 -204 -527 -44 279 337 109 -176 -180 100 279 166 29 -435 -193 131 521 -69 -364 -428 101 637 136
4162 136 -134 -355 -96 482 235 -114 -64 -190 -12 110 217 -148 -136 -264 -18 363 -71 -381 -327 213 729
4183 729 243 -597 -615 257 683 221 114 -144 37 190 199 215 -64 -158 2 166 557 214 -625 -379 74 389
4205 389 60 -459 -337 97 454 101 -196 -394 313 176 220 170 -168 101 -163 168 308 -121 -313 -29 -11
4226 -11 584 -135 -580 -453 24 483 229 -225 -138 -114 172 384 39 22 -77 -118 24 223 -111 -266 -273 -4 416
4249 416 -84 -501 -302 127 348 266 -282 -459 163 426 249 29 117 -170 -265 328 443 239 -236 -347 306
4270 306 258 175 -473 -487 45 404 286 98 -431 -44 210 322 207 -316 -193 -160 88 263 -35 -356 -401 273
4292 273 501 181 -284 -430 304 696 208 -314 -473 0 222 298 200 -276 68 213 81 75 -301 -170 -383
4313 -383 141 503 114 -392 -424 278 255 86 -490 -672 137 584 145 -188 -179 -264 -113 -64 367 11 -215 -207 52
4336 52 365 29 -186 -151 226 376 36 -117 -319 188 315 157 69 -386 5 -73 213 164 -203 -144 -407 239
4358 239 262 167 -319 -214 140 570 100 -115 -277 58 297 21 -108 -286 -95 119 214 38 -76 -242 -346
4379 -346 135 305 296 -266 -426 348 171 433 -372 -507 56 412 413 -136 -370 -107 264 370 92 -8 -69 -542
4401 -542 271 663 103 -468 -207 413 491 255 -243 -246 116 719 174 -386 -78 -25 113 122 -10 -30 -287 34
4423 34 76 310 277 -290 -234 90 660 52 -477 -222 32 121 379 -136 -375 107 465 52 272 -92 -66 -51
4445 -51 71 225 58 -377 -260 276 311 -83 -440 -358 169 275 97 -144 -209 116 486 182 -79 -146 -248 -87
4467 -87 277 105 -277 -249 -172 142 480 42 -309 -337 -152 390 181 -352 -528 -89 420 190 33 -130 -111 -133
4489 -133 377 432 -16 -322 -170 52 517 488 -410 -374 178 517 172 -292 -423 -80 348 310 -75 -25 -219 -73
4511 -73 314 295 -1 -291 -177 157 611 116 -528 -304 199 761 200 -177 -179 -86 289 1 123 -150 -207 301
4533 301 242 219 -132 -257 -274 363 620 -8 -403 -260 -158 339 151 -390 -430 160 280 62 -102 -215 28
4554 28 99 305 225 26 -279 -229 340 465 61 -325 -443 197 539 195 -410 -531 200 547 114 -206 -435
4575 -435 29 57 162 43 33 -241 -332 183 646 158 -377 -274 111 495 -50 -289 -84 267 192 238 -215 -197
4597 -197 -131 208 177 36 186 -447 -4 220 334 -88 -268 -222 205 472 132 -346 -205 129 419 -106 -391
4618 -391 -247 -90 52 372 97 -195 -327 -235 337 260 -37 -327 -235 304 698 117 -683 -331 19 382 176
4639 176 -263 -319 8 23 263 -50 117 -176 -264 313 283 -81 -292 -303 479 507 -28 -522 -191 214 269 360 -276
4662 -276 -170 -144 63 -7 42 -2 -424 40 218 220 18 -205 -372 249 259 39 -262 -635 460 224 -15 -378
4684 -378 -461 -36 197 117 -17 -121 -149 -72 233 240 -18 -227 -124 228 519 168 -133 -223 331 440 84 -310
4706 -310 -257 217 254 60 -76 -84 -119 -44 281 404 -143 -338 -540 -11 198 85 -246 -283 193 332 29 -303
4728 -303 -201 -71 264 284 -248 -268 -55 9 227 -10 -237 -372 -295 304 565 46 -492 -229 271 504 213
4749 213 -407 -335 129 380 119 225 -340 -135 22 -42 208 -48 -313 -270 178 432 39 -570 -428 224 250
4770 250 268 -287 -253 290 410 273 -124 -313 -321 -78 164 120 -20 -324 -63 247 212 243 -506 -496 293 501 95
4793 95 -496 -197 219 361 162 -214 -183 -184 112 84 98 -10 -218 -228 188 369 52 -498 -264 77 327 143
4815 143 -472 -634 354 256 -65 9 -340 -127 121 216 299 73 -56 -27 217 258 -17 -404 -222 152 341 99
4837 99 -351 -365 175 260 36 -49 -195 16 160 303 3 -300 -165 -98 582 218 -77 -449 -348 79 329 18
4859 18 -414 -177 -7 456 351 -328 -128 -195 20 150 -126 81 -297 -93 297 117 76 -290 -270 466 501 124
4881 124 -538 -589 -23 497 194 -371 -404 40 354 39 5 -106 -208 -75 176 227 -147 -306 -341 417 358 -97
4903 -97 -285 -224 -103 437 131 -349 -356 40 188 262 -183 12 -128 -130 199 335 -53 -412 -283 448 297 -130
4925 -130 -406 -452 267 327 93 -347 -86 240 397 179 -204 -187 -56 109 116 344 2 -161 -147 257 365 -281
4947 -281 -285 -53 271 325 -104 -593 -194 412 339 72 -182 -198 -110 91 409 81 129 -428 -213 122 597 1
4969 1 -774 -411 245 378 -189 -364 -402 246 297 -49 -113 -306 -156 -129 135 -26 -221 -362 -267 122 328 49
4991 49 -636 -78 223 300 -100 -293 -388 267 599 19 -479 -270 -144 -10 78 30 -113 -394 -139 108 598 98
5013 98 -560 -272 74 448 161 -310 -105 19 130 188 -94 -83 71 298 98 16 -125 -223 -160 310 363 -149
5035 -149 -557 -100 43 459 103 -499 -198 54 288 318 -212 -248 118 -6 -185 262 -144 -192 -70 168 107
5056 107 -292 -251 -198 479 387 110 -319 -354 214 269 137 -296 -232 -7 32 165 70 -264 -186 98 333 301 -192
5079 -192 -480 -183 116 197 49 -509 -170 325 399 4 -235 -16 86 340 88 75 -271 -125 -168 217 259 31
5101 31 -232 -102 102 278 -86 -245 -96 36 262 65 -328 10 146 274 34 -165 76 -98 73 162 181
5122 181 -136 -378 15 -17 582 50 -391 -334 76 274 131 -56 -219 -51 87 130 191 -183 -15 -64 248 343
5144 343 -301 -377 -307 253 361 60 -449 -224 33 356 -12 -423 -226 126 442 273 85 -57 37 132 83 -24
5166 -24 46 -276 -137 139 249 4 -457 -277 254 452 339 -140 -478 146 -143 194 -55 -232 -53 271 160
5187 160 309 42 -151 233 60 200 -51 -331 -187 224 95 -30 -464 -40 203 41 -133 -351 -113 371
5207 371 -31 -37 107 -137 -262 -121 283 319 263 -433 -134 537 536 101 -390 -216 278 254 68 48 0 -284 171
5230 171 1 16 -174 -375 -224 146 197 -66 -356 -306 324 445 -14 -320 -383 269 214 -10 -239 -55 -23 71
5252 71 151 127 -5 -33 39 98 442 32 -162 -4 370 326 116 -538 -276 374 331 52 -236 -308 254 162 211 -4
5276 -4 -54 -35 -144 236 237 -143 -473 -167 389 544 40 -447 -391 109 231 60 -199 94 287 97 121 109 -117
5299 -117 -271 -114 176 145 -45 -477 -110 174 331 -23 -441 -138 293 318 -87 -227 -335 208 219 -53 154
5320 154 -323 -7 79 249 253 61 -355 -28 442 260 -159 -301 -81 251 261 11 -501 -281 427 253 -137
5341 -137 43 -58 -104 178 76 188 -31 -116 -162 185 305 -119 -264 -343 148 344 107 -245 -27 24 112 233
5363 233 -148 -176 19 194 245 149 -98 -79 -128 142 170 -23 -332 -99 375 370 13 -358 -114 181 230 71 -159
5386 -159 -100 -162 155 107 142 -237 -148 -42 23 411 196 -488 -402 83 424 123 -380 -172 4 148 -26 -10 -124
5409 -124 -2 25 209 248 -68 -80 -182 117 387 -15 -118 -21 187 413 223 -180 -213 -77 168 43 -148 -171
5431 -171 -12 -101 226 -48 -211 -194 -202 320 298 12 -455 -255 337 497 -139 -190 -223 191 729 -133 -412 -99
5453 -99 161 255 274 -147 -166 -341 157 0 271 -44 -239 -379 150 264 -234 -448 -440 183 417 76 -453 -120
5475 -120 95 69 1 162 -53 -78 13 99 401 103 -294 -259 42 326 108 -107 -345 330 363 66 -212 -400
5497 -400 239 257 53 93 -170 -240 178 223 207 -11 -149 -192 6 150 -152 -82 -219 366 616 128 -163 13
5519 13 147 221 68 -151 -183 -63 -111 70 108 145 -322 -59 446 289 3 -284 -281 -2 203 273 -221 -14 -61
5542 -61 27 259 20 -48 -98 133 51 123 8 -332 -13 214 244 -208 -214 -333 164 341 244 -341 -199 168 367
5565 367 -72 -55 -82 -266 60 436 99 -39 -265 -5 359 185 -101 -189 -120 175 528 -120 -281 -219 510 389
5587 389 145 -91 -132 -86 1 188 82 -16 -381 258 286 343 -20 -449 -260 -59 298 352 -184 -172 -23 306 -138
5610 -138 -296 57 -105 -88 173 215 81 -21 -95 447 203 -85 -365 -104 -30 242 -144 -496 -130 -19 307
5631 307 -69 -392 -127 7 131 -3 141 -108 -146 83 30 384 -131 -312 -75 339 187 79 58 -209 251
5652 251 180 207 -168 -163 80 79 -173 158 -230 -282 170 231 303 -111 -173 18 289 280 -11 -433 -189 160 205 19
5676 19 -250 -331 -165 -176 275 56 -335 -40 70 78 78 123 -300 -340 323 211 -68 -307 -62 131 213 78 -190
5699 -190 -248 133 282 224 68 -284 -10 210 -34 101 -319 -368 24 173 457 -46 -427 -122 141 374 -134
5720 -134 -169 -390 -47 163 -125 -186 182 -44 -66 324 157 12 -228 -346 148 372 -36 -433 -62 181 329
5741 329 -121 -214 -54 247 72 23 155 -100 -200 -23 85 117 80 -131 -322 8 241 -108 -428 -300 119
5762 119 181 120 -63 -86 114 173 62 150 -178 -144 -139 310 63 -139 -312 -255 358 394 90 -398 -315 162 152 199
5786 199 -134 -262 86 193 2 57 78 22 172 191 249 -53 -231 39 185 383 27 -159 -320 2 509 -174
5808 -174 -382 -32 -122 36 250 -37 -79 -57 258 -152 -163 78 -117 -176 314 259 -78 -363 -131 484 252 16
5830 16 -177 -157 290 302 46 -115 62 -81 112 274 60 -41 -144 -44 192 392 158 -215 -72 265 274 -212
5852 -212 -360 -173 257 -10 -2 -163 -155 201 158 317 195 -18 -74 -54 213 -8 -175 -401 -26 140 133 -82 -133
5875 -133 -65 72 158 158 -190 -104 286 117 183 -9 56 -303 -78 285 232 -43 -162 -34 11 307 -258 -281 -189 154
5899 154 183 1 5 -13 8 -6 384 27 -322 -35 254 77 297 390 -581 -211 270 156 254 -398 22 154 259
5922 259 -90 -147 52 -114 257 -66 -154 -242 111 -243 33 428 124 -230 -207 373 160 3 -393 -326 6 7
5944 7 -75 -445 -242 110 20 166 -45 -227 63 -57 127 -181 -44 -97 -66 -105 155 16 -419 172 190 289 -52
5967 -52 -215 -115 236 224 -220 -157 51 -30 149 -71 267 0 -72 15 243 6 -135 -214 -114 245 197 -213 -214
5990 -214 74 78 181 -43 -61 9 0 69 251 199 -31 -163 -114 388 164 -73 -211 -142 296 516 -23 -434 105
6013 105 288 29 -33 -176 119 -91 172 248 -57 -229 -232 -195 179 272 265 -84 -121 125 450 -121 -114 -279 175 181
6037 181 18 18 -39 -124 125 250 244 -13 -131 184 261 372 -92 -246 -340 381 398 -257 -301 -391 64 214 -138 -269
6061 -269 147 -27 -65 92 234 -60 -149 -84 109 118 -266 -514 130 258 335 -51 -357 -286 62 118 -1 -306 -129
6084 -129 -66 -23 102 -387 -91 -34 -93 290 122 -138 -263 -113 431 114 43 -211 -301 187 134 -114 -160 -122 17
6107 17 42 -103 349 -211 -38 126 290 -20 25 -382 -171 96 316 -189 -317 -185 188 449 150 -28 -152
6128 -152 85 22 53 -94 -158 -215 -172 23 -92 -171 -305 -26 438 241 -223 -214 -106 64 485 114 -124 -295 18
6151 18 186 -16 245 170 -153 -176 380 79 -209 -209 66 273 429 -136 -219 -104 298 149 27 -258 -223 47
6173 47 40 -225 -82 -154 -155 31 141 373 -9 -101 -186 -50 232 -99 -368 -126 26 319 80 -313 -177 -60 178
6196 178 82 -190 -110 -119 12 -211 193 -185 -255 -74 148 217 9 -8 -165 -66 284 -75 -134 -308 187 321 0
6219 0 -173 -155 -104 -85 49 -24 -50 -408 -281 197 174 -44 -367 21 147 271 77 -180 82 128 279 56 -143
6242 -143 -244 167 314 296 -72 11 8 -139 179 268 -119 -323 -194 24 248 -115 -2 -166 285 364 -46 -116
6264 -116 122 50 -71 225 122 -10 75 -87 -28 401 90 -307 -14 314 84 17 -86 13 297 292 -149 -165 -88
6287 -88 -126 231 222 -2 85 -184 -79 -6 211 -215 -220 -218 195 262 -92 -223 -2 -17 354 -3 -227 0 -23 10 -56
6312 -56 5 -89 -235 129 -58 89 31 -364 -142 292 277 -224 -166 -19 181 259 90 -328 -36 -53 167 45 18
6335 18 -225 -392 301 33 301 -86 -547 21 127 122 -189 -257 -291 183 317 -293 22 -158 -19 173 52 -79
6357 -79 -192 -48 -124 184 56 -127 -266 -307 222 96 -182 -423 -52 209 -104 -109 -454 -249 207 66 -49 -413
6379 -413 78 -132 -30 40 115 6 -147 -115 106 239 -98 -223 146 122 105 -599 -264 92 -222 175 -3 40
6401 40 -121 -44 301 131 161 -96 -248 -175 -114 270 82 -145 31 197 64 -69 -284 -183 174 244 83 174
6423 174 -133 -172 85 99 36 6 -148 24 -97 381 58 -209 -163 74 317 -73 -232 -114 154 109 21 -301
6445 -301 -86 -313 -20 90 189 -500 -69 30 115 -23 -79 -223 -39 318 157 226 -205 -159 32 283 126 -273
6467 -273 36 115 302 41 -94 -40 -43 -101 242 305 22 -263 -207 265 74 37 25 43 167 -39 15 -17 -79 -91 89
6492 89 133 118 214 -163 -36 103 211 -300 -241 54 270 215 192 -256 -245 178 270 61 -256 -367 -5 -3 -6 207
6516 207 -187 -142 260 193 -54 -180 -465 25 -128 97 -18 -123 -33 89 219 -174 -159 39 64 -159 118 -47
6538 -47 -64 -179 39 211 126 -174 -121 47 259 454 0 -429 -187 222 70 -165 -183 -138 158 228 13 -2 -105
6561 -105 -289 -67 119 87 -209 -337 -89 -65 72 -50 -69 -135 274 268 -205 -167 -132 158 75 53 -77 -184 3
6584 3 -214 139 55 -269 -14 -112 85 222 27 -102 -27 33 28 -254 -104 68 63 107 45 -38 -62 116 45 69 1 -255
6610 -255 38 -59 62 210 -187 -285 10 -56 117 -9 -103 -43 -48 251 -135 -194 94 -54 28 111 -41 -232 -25
6633 -25 -313 -15 113 -136 -282 123 72 307 -48 -388 -68 47 347 26 -97 -27 166 95 -114 38 9 -196
6655 -196 -148 232 460 -309 -61 151 240 47 -89 -99 85 118 88 165 -233 -173 15 -58 220 47 -163 -89 -12
6678 -12 136 135 -104 -389 -27 348 358 201 -79 115 279 336 -63 -93 -15 122 170 -77 -51 -9 -189 -171 116 117
6702 117 -21 -261 123 186 225 18 -151 -206 72 386 221 90 -123 130 110 143 -94 -182 124 33 186 -56
6724 -56 -36 -87 17 263 1 -107 -49 75 202 257 127 -174 98 50 112 -27 123 275 -201 27 178 147 -167
6747 -167 -173 -148 -49 108 108 -149 -264 80 277 214 -246 174 248 -7 40 -20 -173 -285 -104 114 46 110 1 100
6771 100 260 125 -112 -125 -95 325 103 -160 -112 -96 378 -48 10 -115 -31 -28 -169 -161 176 -67 -91 -33 170 254
6795 254 95 -255 -38 -115 130 95 -315 -19 93 -25 248 -172 -172 -170 95 61 49 -123 -187 -210 154 250 -63 -331
6819 -331 -286 261 283 -46 -118 91 122 128 67 129 -271 -95 -34 116 135 -21 -159 95 94 199 -44 -222 174 251
6843 251 92 -159 -103 -97 268 36 74 1 101 -58 -54 58 -85 -82 -168 -107 292 219 -71 -133 -3 27 62 244 -25
6868 -25 -124 8 161 113 138 296 53 120 -110 83 3 -142 -144 256 210 44 62 -193 -51 8 -56 -160 182 -88
6892 -88 -15 -22 29 186 -1 65 73 -41 -37 -33 22 36 86 -158 -196 -149 -45 93 111 -274 201 91 154 96 -153 -108 30
6919 30 -47 64 71 23 -365 -93 242 -12 -4 -35 -196 190 94 -75 -367 -149 18 137 -15 -218 165 -131 245
6942 245 -26 72 21 -243 -59 306 -22 -43 -176 107 69 84 -111 -150 -148 32 -8 1 30 42 70 146 -56 110 -139
6967 -139 -25 60 157 272 -310 -177 5 218 266 -223 135 30 145 404 63 -38 -152 -160 -57 67 -1 -341
6989 -341 4 189 248 143 30 -127 -205 274 35 -67 -255 -171 195 275 0 -238 -304 86 -44 -296 -208 72
7011 72 -164 246 -101 232 -73 -299 -255 111 349 -49 -127 -41 122 236 50 -111 -100 -3 144 -203 8 -124
7033 -124 171 -34 94 167 -227 -94 -262 100 150 55 -229 -96 -205 143 -13 -189 -123 -13 285 61 -157
7054 -157 -83 119 268 -175 0 -55 -120 80 159 -13 -56 -42 -284 5 190 -69 -72 -85 32 122 155 -228 188 -189
7078 -189 -314 -95 40 -66 -126 -96 -109 -98 -141 -140 -122 189 110 -196 -6 -136 -179 97 195 -73 67 81 35 33 -102
7103 -102 -60 -148 -145 -53 105 169 -38 88 75 186 -140 -175 -22 34 50 -138 -208 -133 237 -256 143 -76 -11 -109 16
7128 16 134 237 -72 -200 -45 -100 142 57 -153 -29 40 -213 24 -35 190 15 -118 -200 27 -306 -180 -41
7150 -41 -55 82 -98 -278 68 -165 36 -27 -297 -31 -147 34 117 -266 -188 85 88 69 54 73 -315 -109 127
7173 127 47 111 237 164 319 286 287 -142 46 128 220 -66 126 79 171 -62 -131 27 -201 -69 -113 66 151 166 -148
7198 -148 21 29 78 -66 -176 71 88 152 -38 49 -240 219 65 -24 -165 6 44 -314 349 79 -90 -333 -73
7221 -73 33 172 -164 -276 21 1 182 74 -154 -53 211 -115 53 2 -38 -16 133 97 -24 155 -121 22
7243 22 170 224 -86 -289 166 7 -52 -223 -115 -296 98 -51 -109 -70 3 119 77 -57 -187 -160 -122 -153 -154 151
7267 151 -154 -119 -239 81 174 -109 -127 -156 237 -83 -7 -156 143 -53 -212 59 134 -217 111 -34 98 221
7289 221 -78 -216 3 -28 -45 -42 -266 99 257 88 -125 -40 -219 -155 -205 -93 -66 -170 164 -269 -107 -40 -19
7312 -19 -110 71 171 155 116 -186 -116 70 59 54 84 -142 115 -14 56 150 43 -41 73 233 11 -126 -274 100
7336 100 83 146 -106 -43 -161 86 53 167 6 -223 -131 25 295 109 69 -93 56 167 238 -312 -137 -24
7358 -24 9 120 61 -209 -123 282 94 24 -158 102 12 121 24 -61 -10 74 -141 206 142 75 -142 -186 263 32
7382 32 -120 -141 22 3 206 -82 -48 -53 -41 141 81 -97 10 8 -165 266 53 -112 -204 -192 372 334 -8 -49 71
7407 71 347 291 67 -135 122 -50 -66 73 -249 119 -208 -19 150 118 0 -46 -8 7 85 86 -76 103 277
7430 277 126 118 -9 251 -24 -37 -152 83 36 -134 -81 -22 -78 51 75 -163 293 -182 -37 -129 13 112 374
7453 374 13 110 -120 -16 123 182 -9 -437 26 217 -12 41 -162 -226 20 194 234 -85 -327 -43 -40 -130 98
7476 98 -115 -1 106 -212 21 -1 -13 25 14 229 -157 329 6 -141 -74 13 -61 -60 139 33 235 84 -209
7499 -209 44 188 144 163 189 -356 43 185 -318 -255 -83 -89 -108 -5 -48 -130 -36 -111 113 143 -211 -127 57 -58
7523 -58 146 -26 86 242 188 -132 252 -91 -261 -1 -84 -5 -56 -72 -95 -230 138 18 48 -174 -92 -71 158
7546 158 3 2 -176 105 41 91 72 -67 34 -113 151 96 -99 11 -49 -205 88 129 -142 121 84 281 151
7569 151 40 -52 61 38 12 -163 65 -47 -37 70 11 21 -526 -2 -3 421 107 104 -50 -59 173 -19 16 168
7593 168 54 -90 193 -97 -93 -53 -199 55 -102 31 -193 -103 95 99 -4 -55 -129 114 106 38 -205 -320 138 -116
7617 -116 28 109 -58 -114 -46 196 232 -95 -181 -29 -81 318 -245 88 -38 243 219 69 -282 101 204 3
7639 3 90 -140 112 13 135 -37 13 -29 -119 153 204 -60 -26 -23 -61 -44 100 -25 -219 -44 -202 -28 -47 -106 -25
7664 -25 -115 -25 301 61 -180 -251 -104 -64 200 -11 87 172 79 -9 46 161 123 39 -56 201 19 -210 62 81 7
7689 7 174 -136 -363 -155 225 160 -63 30 -30 221 -68 143 93 -53 -99 -86 -237 136 35 40 -196 120 -146
7712 -146 93 -69 93 -156 -30 10 -152 88 -197 6 -58 66 -37 133 138 -41 -132 80 9 -123 179 -318
7734 -318 -153 50 -111 -108 151 -14 -184 343 247 106 -122 247 7 -22 35 88 135 -274 54 65 46 338 -198
7757 -198 -8 -75 -121 -44 100 -163 111 100 168 144 -25 -85 -25 -295 -79 -117 -124 77 -31 163 -40 -77 -188 47
7781 47 119 50 209 73 24 204 -65 61 -83 89 -116 -55 107 58 115 -48 173 -252 -198 72 -92 -150 361
7804 361 -15 87 -16 -141 196 122 105 -67 191 -83 -182 -39 -179 -28 -164 144 191 7 10 -72 103 -157
7826 -157 -17 -42 -170 -223 -41 106 -229 84 -156 24 104 -100 14 88 78 107 33 61 150 -257 41 106 -162
7849 -162 96 -52 -87 134 -108 111 -153 -174 -9 232 82 -100 215 145 -82 270 -34 133 -282 -41 -105
7870 -105 -30 22 -98 121 230 157 33 -136 67 96 -51 109 0 -171 154 -51 -114 83 97 64 -205 -63
7892 -63 27 28 46 -38 85 -105 2 -178 53 -68 -35 -3 117 250 159 -204 -36 -132 -24 -103 -12 87 -75 -121 -145
7917 -145 -90 81 143 -260 -62 -244 90 -173 -81 138 110 -43 171 53 -90 120 115 132 -15 74 158 52 -122
7940 -122 88 24 -138 -100 47 -41 -248 149 203 88 95 181 -43 -49 -99 58 40 150 -110 64 -91 -100 111 0
7964 0 -116 -144 -56 41 -145 41 -170 -237 102 -34 95 -45 -224 118 -168 122 145 121 40 -134 132 70 -15 -70
7988 -70 79 22 47 95 274 -133 -152 61 -65 -180 -62 -63 86 71 16 -199 67 79 142 165 -92 88 -6 46 -303
8013 -303 -15 -102 -115 -120 236 78 198 32 42 151 306 -46 -9 45 -53 270 -113 -8 -202 -51 145 134 38
8036 38 -17 -132 -137 -190 61 -43 -84 21 205 34 -15 -50 -138 110 -21 -19 275 21 80 1 53 21 -142 93 73
8061 73 348 -6 -91 -102 171 151 -187 10 347 -225 2 -255 78 -46 39 -48 265 88 -167 -25 -19 -38 120
8084 120 20 -254 -69 -139 -19 -150 127 89 76 133 28 -226 -76 -51 -123 -79 112 -146 -192 -177 -8 -74 -58 3
8108 3 -117 -95 -25 -22 -89 -197 211 -118 -18 20 -3 73 89 144 173 25 -251 10 207 -48 -6 -69 -130 111 208 -70
8134 -70 -105 -64 -26 52 -127 -81 -276 -402 21 137 288 -78 -74 182 179 -70 170 67 337 63 -125 -22 -243
8157 -243 167 -75 -116 -144 -35 217 -258 198 41 164 -44 -172 -263 -90 -33 33 -70 -18 281 34 44 72 -17
8180 -17 -8 178 -29 93 -147 -15 -463 -12 83 2 -142
8191a42
##END NTUPLES=NMR FID
##END=
