##TITLE=1H_CA-8602-1
 DMSO, 8 sc, 
 31.5.2019
##JCAMPDX= 6.0         $$ Bruker NMR JCAMP-DX V2.0
##DATA TYPE= NMR FID
##DATA CLASS= NTUPLES
##ORIGIN= UXNMR, Bruker Analytische Messtechnik GmbH
##OWNER= root
$$ XWIN-NMR		Version 3.5
$$ Fri May 31 13:59:32 2019 Russian Standard Time (UT+4h)  she@DPX200
##.OBSERVE FREQUENCY= 200.13155
##.OBSERVE NUCLEUS= ^1H
##.DELAY= (6, 6)
##.ACQUISITION MODE= SIMULTANEOUS
##.ACQUISITION SCHEME= undefined
##.AVERAGES= 8
##.DIGITISER RES= 18
##SPECTROMETER/DATA SYSTEM= spect
##.PULSE SEQUENCE= zg30
##.SOLVENT NAME= DMSO
##.SHIFT REFERENCE= (INTERNAL, DMSO, 0, 15.7039)
##AUDIT TRAIL= $$ (NUMBER, WHEN, WHO, WHERE, WHAT)
$$ ##TITLE= Audit trail, XWIN-NMR		Version 3.5
$$ ##JCAMPDX= 5.01
$$ ##ORIGIN= Bruker BioSpin GmbH
$$ ##OWNER= she
$$ F:/spectra/data/she/nmr/H-F/1/audita.txt
$$ ##AUDIT TRAIL=  $$ (NUMBER, WHEN, WHO, WHERE, WHAT)
(   1,<2019-05-31 13:58:31.12 +0400>,<she>,<DPX200>,
      <created by zg, POWCHK disabled, PULCHK disabled
       configuration hash MD5:
       00 E9 B6 7A A2 85 ED C7 34 08 36 98 17 FE 4E 26
       data hash MD5: 16K
       39 88 7A 6E 49 44 5A 22 08 B4 6C 50 B2 20 7C 04>)
$$ ##END=
$$ 
$$ hash MD5
$$ 1C 09 32 14 70 1F B7 89 F7 B6 85 1E F9 08 95 97
##$RELAX= 
##$RELAX= 
##$RELAX= 
##$RELAX= 
##$RELAX= 
##$RELAX= 
$$ Bruker specific parameters
$$ --------------------------
##$DU= <F:/spectra>
##$EXPNO= 1
##$NAME= <H-F>
##$PROCNO= 1
##$TYPE= <nmr>
##$USER= <she>
##$AMP= (0..31)
100 100 100 100 100 100 100 100 100 100 100 100 100 100 100 100 100 100 
100 100 100 100 100 100 100 100 100 100 100 100 100 100 
##$AQSEQ= 0
##$AQ_mod= 1
##$AUNM= <au_zg>
##$AUTOPOS= <>
##$BF1= 200.13
##$BF2= 200.13
##$BF3= 200.13
##$BF4= 200.13
##$BF5= 200.13
##$BF6= 200.13
##$BF7= 200.13
##$BF8= 200.13
##$BYTORDA= 1
##$CFDGTYP= 0
##$CFRGTYP= 5
##$CHEMSTR= <none>
##$CNST= (0..31)
1 1 145 1 1 1 1 1 1 1 1 1 1 1 1 1 1 1 1 1 1 1 1 1 1 1 1 1 1 1 1 1 
##$CPDPRG= <>
##$CPDPRG1= <>
##$CPDPRG2= <>
##$CPDPRG3= <>
##$CPDPRG4= <mlev>
##$CPDPRG5= <mlev>
##$CPDPRG6= <mlev>
##$CPDPRG7= <mlev>
##$CPDPRG8= <mlev>
##$CPDPRGB= <>
##$CPDPRGT= <>
##$D= (0..31)
0 1.2 0 0 0 0 0 0 0 0 0 0.03 0 0 0 0 0 0 0 0 0 0 0 0 0 0 0 0 0 0 0 0 
##$DATE= 1559296710
##$DBL= (0..7)
120 120 120 120 120 120 120 120 
##$DBP= (0..7)
150 150 150 150 150 150 150 150 
##$DBP07= 0
##$DBPNAM0= <>
##$DBPNAM1= <>
##$DBPNAM2= <>
##$DBPNAM3= <>
##$DBPNAM4= <>
##$DBPNAM5= <>
##$DBPNAM6= <>
##$DBPNAM7= <>
##$DBPOAL= (0..7)
0.5 0.5 0.5 0.5 0.5 0.5 0.5 0.5 
##$DBPOFFS= (0..7)
0 0 0 0 0 0 0 0 
##$DE= 6
##$DECBNUC= <off>
##$DECIM= 24
##$DECNUC= <off>
##$DECSTAT= 4
##$DIGMOD= 1
##$DIGTYP= 9
##$DL= (0..7)
0 120 120 120 120 120 120 120 
##$DP= (0..7)
150 150 150 150 150 150 150 150 
##$DP07= 0
##$DPNAME0= <>
##$DPNAME1= <>
##$DPNAME2= <>
##$DPNAME3= <>
##$DPNAME4= <>
##$DPNAME5= <>
##$DPNAME6= <>
##$DPNAME7= <>
##$DPOAL= (0..7)
0.5 0.5 0.5 0.5 0.5 0.5 0.5 0.5 
##$DPOFFS= (0..7)
0 0 0 0 0 0 0 0 
##$DQDMODE= 0
##$DR= 18
##$DS= 0
##$DSLIST= <SSSSSSSSSSSSSSS>
##$DSPFIRM= 0
$$ [...]
##$SUBNAM2= <"">
##$SUBNAM3= <"">
##$SUBNAM4= <"">
##$SUBNAM5= <"">
##$SUBNAM6= <"">
##$SUBNAM7= <"">
##$SUBNAM8= <"">
##$SUBNAM9= <"">
##$SW= 24.9336996594482
##$SWIBOX= (0..15)
0 0 2 0 0 0 0 0 0 0 0 0 0 0 0 0 
##$SW_h= 4990.01996007984
##$TD= 16384
##$TD0= 1
##$TE= 0
##$TE2= 300
##$TE3= 300
##$TEG= 300
##$TL= (0..7)
0 120 120 120 120 120 120 120 
##$TP= (0..7)
150 150 150 150 150 150 150 150 
##$TP07= 0
##$TPNAME0= <>
##$TPNAME1= <>
##$TPNAME2= <>
##$TPNAME3= <>
##$TPNAME4= <>
##$TPNAME5= <>
##$TPNAME6= <>
##$TPNAME7= <>
##$TPOAL= (0..7)
0.5 0.5 0.5 0.5 0.5 0.5 0.5 0.5 
##$TPOFFS= (0..7)
0 0 0 0 0 0 0 0 
##$TUNHIN= 0
##$TUNHOUT= 0
##$TUNXOUT= 0
##$USERA1= <user>
##$USERA2= <user>
##$USERA3= <user>
##$USERA4= <user>
##$USERA5= <user>
##$V9= 5
##$VALIST= <valist>
##$VCLIST= <CCCCCCCCCCCCCCC>
##$VD= 0
##$VDLIST= <DDDDDDDDDDDDDDD>
##$VPLIST= <PPPPPPPPPPPPPPP>
##$VTLIST= <TTTTTTTTTTTTTTT>
##$WBST= 1024
##$WBSW= 4
##$XGAIN= (0..3)
0 0 0 0 
##$XL= 0
##$YL= 0
##$YMAX_a= 165624
##$YMIN_a= -225216
##$ZGOPTNS= <>
##$ZL1= 120
##$ZL2= 120
##$ZL3= 120
##$ZL4= 120
##$ABSF1= 10
##$ABSF2= 0
##$ABSG= 5
##$ABSL= 3
##$ALPHA= 0
##$AQORDER= 0
##$ASSFAC= 0
##$ASSFACI= 0
##$ASSFACX= 0
##$ASSWID= 0
##$AUNMP= <proc_1d>
##$AZFE= 0.1
##$AZFW= 0.1
##$BCFW= 1
##$BC_mod= 2
##$BYTORDP= 1
##$COROFFS= 0
##$CY= 11.3945322036743
##$DATMOD= 1
##$DC= 2
##$DFILT= <>
##$DTYPP= 0
##$F1P= 18.9103706918063
##$F2P= -1.10871071338519
##$FCOR= 0.5
##$FTSIZE= 0
##$FT_mod= 4
##$GAMMA= 1
##$GB= 0.15
##$INTBC= 1
##$INTSCL= 1
##$ISEN= 128
##$LB= 0.24
##$LEV0= 0
##$LPBIN= 0
##$MAXI= 10000
##$MC2= 0
##$MEAN= 0
##$ME_mod= 0
##$MI= 1.114404
##$NCOEF= 0
##$NC_proc= 0
##$NLEV= 6
##$NOISF1= 3.799351
##$NOISF2= 2.8
##$NSP= 1
##$NTH_PI= 0
##$NZP= 0
##$OFFSET= 15.70392
##$PC= 1
##$PHC0= -8502.618
##$PHC1= 16.00023
##$PH_mod= 1
##$PKNL= yes
##$PPARMOD= 0
##$PSCAL= 0
##$PSIGN= 0
##$REVERSE= no
##$SF= 200.130013532006
##$SI= 16384
##$SIGF1= 3
##$SIGF2= 2
##$SINO= 400
##$SIOLD= 16384
##$SREGLST= <1H.CDCl3>
##$SSB= 0
##$STSI= 0
##$STSR= 0
##$SW_p= 3612.71676300578
##$SYMM= 0
##$S_DEV= 0
##$TDeff= 0
##$TDoff= 0
##$TI= <>
##$TILT= no
##$TM1= 0
##$TM2= 0
##$TOPLEV= 0
##$USERP1= <user>
##$USERP2= <user>
##$USERP3= <user>
##$USERP4= <user>
##$USERP5= <user>
##$WDW= 1
##$XDIM= 8192
##$YMAX_p= 0
##$YMIN_p= 0
$$ End of Bruker specific parameters
$$ ---------------------------------
##NTUPLES= NMR FID
##VAR_NAME=  TIME,          FID/REAL,        FID/IMAG
##SYMBOL=    X,             R,               I
##VAR_TYPE=  INDEPENDENT,   DEPENDENT,       DEPENDENT
##VAR_FORM=  AFFN,          ASDF,            ASDF
##VAR_DIM=   8192,          8192,            8192
##UNITS=     SECONDS,       ARBITRARY UNITS, ARBITRARY UNITS
##FACTOR=    0.0002004,     1,               1
##FIRST=     0,             0,               0
##LAST=      1.6414764,     0,               0
##MIN=       0,             -225216,         0
##MAX=       1.6414764,     165624,          0
$$ Real data points
##PAGE= N=1
##DATA TABLE= (X++(R..R)), XYDATA
$$ [...]
2380A682k063j081pL89J544K645r19m464k601L807N802j73o223m406L200O298
2396C430J419m444m038M24L105K403N70j987l161j685K845M372J062m582n069
2411e336J558O371K822l787n076l98L835L141m85k642j792m65J032K919J725k642
2427G80l966n80M237L551j287m891j927L386L261m68j980j025l56m5Q90K354Q84
2444B818k790m360J240N803K796m391n555pN307L903k343m380j578K236K567J523
2460B789r02k629k669Q75L959L191k167n805j762M582N460q70n273k951J878L898
2476A604J670j826k760j384Q52K971K323j018m493k303L048N255k12m041l735
2491d049J657M619Q61k631j486N9K51L54J568J274j491l375j010L880L841j255
$$ plain form
2380 1682 -381 -1462 -1469 -1080 464 3109 2190 -2274 -4875 -1068 4734 4561 -1662 -6068 -2868 3430
2396 3430 4849 405 -3633 -3209 -104 2299 2869 882 -2279 -3964 -1119 3253 4315 -267 -5336
2411 -5336 -3778 2593 5415 1628 -3448 -3846 -11 3130 2645 3 -1789 -2254 -1222 1697 3422 780
2427 780 -3186 -3766 471 4022 2735 -2156 -4083 -697 2564 2096 116 -909 -1265 -1310 -420 1934 2818
2444 2818 28 -4332 -3092 2711 5507 1116 -4439 -4446 861 4764 2421 -1959 -3537 -1301 1266 2789
2460 2789 1887 -742 -3411 -2536 1423 4614 2447 -3358 -5120 -538 4922 4052 -1221 -4172 -2294 1604
2476 1604 3274 1448 -1312 -2696 -1844 1127 3450 2432 -2061 -4364 -1316 3939 3727 -314 -4049
2491 -4049 -2392 2227 3088 457 -1029 -970 -719 -365 1203 2477 986 -2389 -3399 481 4322 3067
2507C067n389j944L625M181k83l372k541R56J941J561K33p96k619j724K267M237
2523C400O63m270m488J500N676K677l829m642l28L559K971J74k802k834k97K272
2539e98L526N79l484m468P82N580K828l437m708l52L966K786j228k873n07Q04
2555h04M86K99J984j82k905k466K079M517P34m307l873K096M448J242k938k592
2571b182J22J914J083L80k3j599k478K54L968K711k368n127j107M461M165j070
2587C104m828k285K194L500J116j635k469j897J168L752J964j732m764j729M079
2602d62M683o83n320k314K559L809L27k350j654K22M25O21J634Q02k424l018N40
2619b603M534K439l250m359k81M349L169k275l409n00J552J402L09j66n61j503
$$ plain form
2507 3067 -2322 -4266 -641 3540 3257 -115 -2656 -1700 241 1802 2035 1239 -1380 -3104 -837 3400
2523 3400 4063 -207 -4695 -3195 2481 5158 1329 -3313 -3641 -82 2889 3063 261 -2573 -2870 -598
2539 -598 2928 3507 23 -4445 -3663 1917 4745 1308 -3400 -3752 214 3000 1772 -1101 -1608 -804
2555 -804 -318 -19 1965 1783 -1122 -3588 -1509 3008 3742 -565 -4438 -2342 2106 3348 410 -2182
2571 -2182 -2060 -146 937 1317 1294 -305 -2783 -2529 1439 4150 1782 -3345 -4452 9 4174 3104
2587 3104 -1724 -4009 -1815 1685 2801 1166 -1303 -3200 -2032 1720 3684 1952 -2812 -4541 -462
2602 -462 4221 3538 -1782 -4096 -1537 2272 2599 249 -1405 -1183 -758 -137 1497 2299 -125 -3143 -2603
2619 -2603 1931 4370 1120 -3239 -3520 829 3998 1723 -1686 -2186 -634 768 1077 911 350 -1153
2635a153j019J584L178N30m095k932J746M502J193k926l405J31K710K021r2j630
2651C43k323j094K418L652M40l991l660J317N145K171l486m737O45M212J960j524
2667A488k385r91O93J140J197J003j373l138q92L694L675j524m703j972L390M016
2683C318o22l573j543J661J284K86j52L9r71j465K08L039J755k242l987j96L982
2700H21K733j338l384j501J625K720P02j115k003j584O50L372K126k261m585p40
2716c762L824M018j022m646k093K805L106K85k385j513j98Q74J531J363m56k838
2732a107k333J774M791P50m114l809J697M342J576k947l089M55K287Q81m55l09
2748C90m96j462j73K209K064r80l206j463K380L575n52l032j429O32K038R83k90
$$ plain form
2635 -1153 -2172 -588 2590 3120 -975 -3907 -2161 2341 3534 608 -2797 -2666 44 2065 1973 343
2651 343 -1980 -3074 -656 2996 3436 -555 -4215 -2898 2247 4418 932 -3805 -3160 1052 3012 1488
2667 1488 -897 -1888 -1195 -55 1142 2145 772 -2366 -3258 436 4111 2587 -2116 -4088 -698 3318
2683 3318 2696 -877 -2420 -759 525 811 659 698 -273 -1738 -1530 1509 3264 1022 -2965 -3161 821
2700 821 3554 2216 -1168 -2669 -1044 1676 2378 1263 -740 -2324 -1674 1698 3824 1563 -3022 -3762
2716 -3762 62 4080 3058 -1588 -3681 -876 2230 2515 130 -1383 -1581 -707 824 2187 1731 -1107
2732 -1107 -3440 -1666 3125 3875 -239 -4048 -2351 1991 3567 620 -2469 -2014 273 1154 699 390
2748 390 -106 -1568 -1741 468 2532 1552 -1654 -3117 -737 2838 2286 -746 -2175 -1543 495 1478 1188
2765A188j087j738n58J764K905L06l771k607J626M214J245l419l246P16L086J799
2781B423j339j504j217j09J328K222Q13k503l168M3M128L039k580m869m68M333
2797E72K861j334l691j064K072J784l9o55n40p85q52J069K569L25k702k468J312
2814a566L081J174k166k455O7K121J106J21r59j393j047O02K624J537j941l557
2830b651n06L867K915j723l505j233K142K530k2j449j131p84L83J620K063p01
2846A815l837j617K992M361m02m571l064K561M726K27l141k618O21K674O27k95
2862A059q58p96q03L52K555J017k287l009K31L389K085j551k931m77J757J553
2878A286r9q34o57j049J56J537J734m82k786j729K056L258J79l243j816J255J973
$$ plain form
2765 1188 101 -1637 -2195 -431 2474 2780 -991 -3598 -1972 2242 3487 68 -3178 -2462 624 2423
2781 2423 1084 -420 -1637 -1746 -418 1804 2617 114 -3054 -3011 1117 4156 1576 -3293 -3761 572
2797 572 3433 2099 -1592 -2656 -584 1200 1161 506 -34 -819 -1671 -602 1967 2292 -410 -2878 -1566
2814 -1566 1515 2689 523 -1932 -1865 256 1362 1483 524 -869 -1916 -1314 1310 2847 906 -2651
2830 -2651 -3157 710 3625 1902 -1603 -2836 -694 1836 1814 365 -766 -1550 -1167 453 2516 1815
2846 1815 -2022 -3639 -647 3714 3312 -1259 -4323 -1762 2964 3191 50 -2568 -1947 727 1354 1059
2862 1059 201 -595 -1398 -1046 1509 2526 239 -2770 -2539 850 2935 1384 -1547 -2024 -267 1286
2878 1286 1187 353 -304 -1353 -1197 340 2074 1592 -1194 -2923 -867 2391 2570 -673 -2489 -1234 739
2895G39Q24o25j307m94o29O52K186J293k580l352O96M474K029k868m492J04M196
2912H46K767k126l145m31J557J410M13o90q32j415j07K035K247p70l544j225K300
2929g10L521n82k830j749J289K012M60r82p44l61l47O50J934K80k088k139P10
2946a676K732J590j927k642K38J979J066j93n52j066o61j49J914J885j115l239
2962a816j509L182L674j089m017k253L017L401K39l171j990J267J257R28J88n35
2978G73j742r92J256K615Q88l061k934J144L979J292k726k925N36K252J425o96
2994A084j249m99l74M76J425J014j459k356j30K386K014j043k339j309K329J353
3010A323m40r55k21j64n41Q74J370O87k416k165R94L469J164l149k836O47L601
$$ plain form
2895 739 1563 938 -369 -863 -1492 -840 1346 2639 59 -3293 -2597 1877 3906 1038 -3454 -3350 846
2912 846 3613 1487 -1658 -2089 -532 878 1291 601 -231 -1646 -1753 282 2529 1759 -1785 -3010 -710
2929 -710 2811 2229 -601 -2350 -1061 951 1411 429 -315 -676 -1023 -373 1561 1841 -247 -2386 -1676
2946 -1676 1056 2646 719 -1923 -1685 294 1360 1167 615 -451 -1112 -1261 653 2538 1423 -1816
2962 -1816 -3325 -143 3531 2442 -1575 -3828 -811 2590 2829 -342 -2332 -1065 192 1120 1308 773
2978 773 -969 -1961 -705 1910 2798 -263 -3197 -2053 1926 3218 492 -2433 -1897 355 1780 1084
2994 1084 -165 -664 -1038 -562 863 1877 418 -1938 -2068 318 2332 1289 -1050 -2359 -30 1323
3010 1323 883 -72 -293 -457 -998 -124 1246 1933 -483 -2648 -1654 1815 2979 -170 -3006 -2359 1242
3027A242J102j482j899m59J312P98M8O59j175j995L8K709K197j529l829j069L523
3044A91K695q67l346r46J482J995M19j305r50p65N02J225J568m52k577j494J902
3061g23K751J83k711j562Q73J984M23j213m33K16o26J07J412J147j372k361l67
3078b272K721K651j558l657p81K914J837l87k161j191R44Q58R59N9r3j977j280
3095b414J827L060n7l353k252J618L673R37l033k610R04K237J282q51j023r68
3111a023k23J116J608K07j819k257N30L223J256j981k561M72K084R99r15j071
3127c55l62K45M5O25J315l19k450q17J685K651q8k981j993J862K862l64j571r53
3145i63N6Q05M65P03J07j166j623O9K558J806j976l285L4L023K139j446k494q57
$$ plain form
3027 1242 2344 862 -1037 -1496 -184 614 662 1321 146 -1849 -1811 898 3095 1566 -2263 -3332 191
3044 191 2886 2019 -1327 -2273 -791 1204 1623 318 -632 -1397 -895 330 1898 1446 -1131 -2625 -723
3061 -723 2028 2211 -500 -2062 -1189 795 1218 5 -428 -212 -838 -731 681 1828 456 -1905 -2272
3078 -2272 449 3100 1542 -2115 -2896 18 1855 1468 -693 -1884 -940 -82 877 936 843 -1134 -2414
3095 -2414 -587 2473 2416 -937 -3189 -1571 2102 3039 6 -2604 -1700 537 1819 968 -55 -1023
3111 -1023 -1246 -130 1478 1685 -134 -2391 -1861 1362 2618 637 -1924 -1452 632 1631 716 -355
3127 -355 -717 -472 -427 198 1513 1194 -1256 -2073 -388 2263 2175 -806 -2799 -937 1925 1561 -10 -963
3145 -963 -907 -102 363 1066 1173 7 -1616 -1547 1011 2817 841 -2444 -2410 613 2752 1306 -1188 -2045
3163b045J818J615k98m99j047q10L21J499J544j017k678p66K316K763j255k790
3179a329r57J782K216l37j237k83m36M29m1J298K80j671j727P94K738O59j915
3196B63k339O31K247J162j472j442J63O18J73L58Q91p80j444p38J531K459k83
3213A998l260j516J949K993J0k459j594P31J745Q26o42q28r51n61J278K001k61
3230A459k167j898J524K894N70k354k538P82K798O87j470r56o8K78L00P02N98
3247A141r11j821k02K215J730j317k338p14K390J286l12j975j87Q71r2L43M08
3264E15L18j156j359P75J959O76j920k127P34K602R73j732j570k05J476O22J00
3281F81k47p55j129L1J941J603j654k221m63K406K398j270k473j098J897J951
$$ plain form
3163 -2045 -227 1388 1090 591 -456 -1266 -945 554 2098 1081 -1597 -2363 -47 2716 1461 -1329
3179 -1329 -2286 -504 1712 1375 138 -145 -581 -152 -193 1105 1385 -286 -2013 -1219 1519 2178 263
3196 263 -2076 -1445 802 1964 492 -950 -787 -169 4 362 1253 473 -971 -1709 -178 2281 1998
3213 1998 -1262 -2778 -829 2164 2174 -285 -1879 -1148 597 1423 781 -47 -998 -1559 -281 1720 1459
3230 1459 -708 -2606 -1082 1812 2382 28 -2510 -1728 1070 1757 287 -669 -737 -459 -159 543 1141
3247 1141 230 -1591 -1793 422 2152 835 -1503 -2217 173 1459 1147 -828 -1015 -144 -236 107 515
3264 515 833 -323 -1682 -907 1052 1728 -192 -2319 -1585 1017 1990 258 -1312 -1517 -41 581 681
3281 681 434 -321 -1450 -1419 522 2125 471 -1750 -2213 193 2591 1321 -1152 -2250 -353 1598
3297A598o74j007m79k57K58J068Q56m75j899j129J651K657k34k676j277J247K099
3314A327J97j396j145O14M50N3L03J24l5j563l22J761J443q23k448n68K000K017
3332A989p86k019n56J066O51K97P9p53n19o50J006K184j01k579j797J422K989
3349A923K66k447j805J068J941P88j229j120j64o5R32J049L29j646j528M49K565
3366A306J120j951k513N73K441P89j345j149l3Q23K98J31On9r25p18O71J747J32
3385A344k053j008J031K102K1j500j487J064P69J52Pj31m76p99P4J619J007j386
3403C50k030O5K190J679j361k201O2R81J588l72j074o01NJ08Q21J323o99k122
3421a288m15J589K017k83k448j546J803K345k86j870o74N08N51M39J54j09q31
$$ plain form
3297 1598 924 -83 -562 -819 -561 507 1363 888 -1011 -2140 -489 2168 1934 -742 -2019 -772 1327
3314 1327 1524 128 -1017 -403 47 100 403 527 492 -1071 -1393 368 1811 988 -1460 -2028 -28 1989
3332 1989 1203 -816 -1372 -306 345 642 721 -32 -551 -1201 -195 1989 1888 -691 -2488 -1066 1923
3349 1923 2189 -258 -2063 -995 946 1734 505 -615 -779 -844 88 1137 1466 -180 -1708 -1259 1306
3366 1306 2426 475 -2038 -1465 976 1765 420 -729 -762 61 359 490 496 437 -488 -1206 -535 1212 1344
3385 1344 -709 -1717 -686 1416 1437 -63 -1550 -486 283 435 442 311 -165 -964 -890 729 1736 350
3403 350 -1680 -1615 575 2254 893 -1308 -1246 -265 1323 951 -123 -724 -719 -611 210 1533 834 -1288
3421 -1288 -1703 -114 1903 1620 -828 -2374 -571 1774 1488 -382 -1056 -548 3 442 596 487 -344
3438c44o84J95K065N59j848j725O28J857O68j046j432J43J114Q0J0nj48q08l60
3457a081R79J663n13j910j008J172K045M54k364j134R44J257M52o84m86n23nP01
3475d1J157L50k064j487J015K533O20k209k009O79K242J294j670j436J99P66N44
3492D83m7Mn92p50OJ312J357j037j959n18J755J697j112j483k96J105O61k24j92
3511A70j09k23m85J93J430M03j448j494M32K176O69j499j644M51J392L94n79j60
3529F9k69l89J12R87O46n24j920o20K209J720n13k782n53J703J581l46j466n55
3547i10L73N55M24M54l86r41r75J141J559L28j812j704J094K207J78j613j318
3564a346N03J049M64m28j24j64o09Q0Q67R19o74j632j93J496J164m77j626n48
$$ plain form
3438 -344 -1028 -833 1232 1791 -57 -1782 -1154 703 1371 325 -1107 -964 150 230 240 235 87 -721 -1081
3457 -1081 -102 1561 1048 -862 -1870 -698 1347 1801 -563 -1697 -753 504 956 272 -214 -737 -742 -41
3475 -41 1116 1466 -598 -2085 -1070 1463 2083 -126 -2135 -1456 786 2080 410 -1026 -827 -61 483
3492 483 436 440 -152 -902 -896 416 1773 736 -1223 -1741 14 1711 599 -884 -1180 -75 586 362 170
3511 170 61 -162 -647 -454 976 1379 -69 -1563 -1131 1045 1714 215 -1429 -978 414 808 229 69
3529 69 -200 -589 -477 510 1156 632 -1288 -1908 301 2021 1508 -1274 -1827 -124 1457 1111 -355 -910
3547 -910 -537 18 442 896 510 -431 -1406 -265 1294 1622 -190 -1894 -800 1407 1585 -28 -1346
3564 -1346 -843 206 670 242 118 -46 -655 -575 292 1211 537 -1095 -1288 208 1372 895 -731 -1279
3582a279J060J093l93p35J1l63k38N34J281Q4j581j519J098K393L11k076j537
3599a856R57J764O16j045j356Q3O01O60K19k07n26j261L23J746J117j644j692
3616a501J07J906J378j194j768K4J284O21n11l30J7n44l27P14Q21L37j527q00
3634a293Q51J663k0j599o35P23J162j90n91q3J1l72j18R16O21q00j706j7K105
3653F28J078r45j942j46J706Q49o65p44o23L22N10M50J91j20j272p30J310J709
3671A566j68k245r70J431J798L3j843j120Q98J212k12k63l9m23m45L09J235K14
3689I68r06j426J61J995P55j220j490L59J334L26n98l67k09J36l73M56Q33N2j612
3708h26p32J422J380m38j528n34N63J585qq15m92k80O56L1O39K57r99j355L42
$$ plain form
3582 -1279 -219 874 481 -254 -243 -606 -844 -310 971 1055 -526 -2045 -947 1446 1757 -319 -1856
3599 -1856 -899 865 1481 436 -920 -837 -236 424 643 436 -90 -1351 -1028 718 1835 191 -1501
3616 -1501 -1394 512 1890 696 -1072 -1048 236 857 346 16 33 -511 -838 -124 697 1034 -493 -1293
3634 -1293 -442 1221 1201 -398 -1033 -310 852 662 71 -12 -1 -373 -491 425 1046 246 -1460 -1477 628
3653 628 1706 761 -1181 -1327 379 1228 563 -181 -804 -482 28 478 669 549 -723 -1453 -143 1566
3671 1566 1398 -847 -1817 -386 1412 1445 -398 -1518 -620 592 380 117 78 -345 -790 -481 754 968
3689 968 62 -1364 -1203 792 1547 327 -1163 -804 530 856 258 -109 -318 -182 -555 -99 734 786 -826
3708 -826 -1558 -136 1244 806 -722 -1256 -693 892 884 69 -423 -703 -47 -16 623 880 -119 -1474 -1132
3727a132J973J033j982j688N86K028Q78j449j476K49J203J45N5m67N5o24j56J216
3745D47J008j072j568L7J358J371p92j754l17J344R71p25l38l79K45r7j2P01J64
3764E92o99j136L69J468P43j233j272K41J507O66j123n89R8M0K97L14O38q24r31
3783h34l19J013J663m45k104m48J407J304m00j325n95L71J145J9j47k96l99n18
3801i08P22J557j84j405j121O04K121L61j753j393P85J229M13r36l32j72k03N41
3819g4K87N64l37j141m21J460J047o42j761M5J035Q87n47q83L4M75k41J08P44
3838F39J5r82p56O55J489O24j748j364P14J567M06j043q70o2O69M52J39k85n28
3857b69n81L15R46R44j046j518k05K016J159j070j809j39J450P52m17p97m7M1
$$ plain form
3727 -1132 841 1874 -108 -1796 -1210 818 1696 247 -1229 -980 223 368 423 -44 11 -613 -769 447
3745 447 1455 383 -1185 -1148 210 1581 789 -965 -1282 62 1033 308 -30 -409 -164 -261 -273 428 592
3764 592 -107 -1243 -874 594 1337 104 -1168 -927 580 1246 123 -466 -368 -328 -31 283 921 97 -834
3783 -834 -1153 -140 1523 1078 -1026 -1474 -67 1237 837 -488 -1083 -712 433 452 305 9 -390 -908
3801 -908 -186 1371 1187 -218 -1339 -735 1386 1747 -6 -1399 -614 615 1028 92 -240 -412 -615 -74
3819 -74 213 777 440 -701 -1122 338 1385 743 -1018 -973 62 949 402 -481 -447 28 -213 -105 639
3838 639 654 -328 -1084 -429 1060 1684 -64 -1428 -714 853 1259 216 -654 -716 -47 405 544 259 -269
3857 -269 -850 -535 411 1355 309 -1209 -1414 602 1761 691 -1118 -1257 193 945 528 -269 -316 -275
3875b75n1M32Q74k68j096n00Q58Q89J12j458n13Q73J015l63p42k40N45O1j92L66
3895C27M73n13r86k56J384P93n99j262o23J448R78o99r54k26N09M32p6J86j39
3914A97q05k32R92J009j84j487j010J180J544K4j563r34O60J327j87l31o94K77
3932b17m30M79N95L25r13r58L48J494N76j044j555L57J261O26o91j090K10N66
3950f1K23o8K05k5n68p16P81J045O8j570n38J137J313n96q12l74K77N00l59L14
3970A76L05m74q68J74J353N74r56j514L11J508Q75j035j360j08J142L95k87l59
3988a48q9%n3M51P32n53j240j58J354R78q56r68n21J077J060l86j477L72M98k9
4008D4M2L10J00o50n72K79J092O47j482j205Q58J159L47q94m78K09K53J88j49
$$ plain form
3875 -275 -326 106 980 712 -384 -884 -26 863 975 -483 -996 -123 892 529 -213 -453 92 153 -39 327
3895 327 800 287 -699 -955 429 1222 623 -639 -1262 186 1164 465 -489 -715 -206 226 150 336 197
3914 197 -608 -840 152 1161 977 -510 -1520 -340 1204 1228 -335 -1269 -609 718 531 200 -494 -217
3932 -217 -647 -168 427 752 -161 -1119 -771 723 1299 255 -1300 -943 318 944 253 -837 -627 -61
3950 -61 162 94 299 274 -294 -1010 -229 816 884 -686 -1224 -87 1226 630 -182 -556 -279 221 -138 176
3970 176 481 7 -861 -687 666 1240 284 -1230 -919 589 1464 429 -931 -1039 103 498 211 -148
3988 -148 -237 -237 -290 161 893 340 -900 -1058 296 1274 418 -550 -1071 6 1066 680 -797 -425 73 44
4008 44 86 396 496 -154 -726 -447 645 1292 -190 -1395 -537 622 969 75 -403 -194 59 247 98
4027I8L62k70n98k50P91P84r1j246n88J101J113k51j399n31P70O46N2m99m8j54
4047b08k58J95Q52K25p55j297M22J853J48j449q59M58J030O46r71o28J81N27k38
4066a26N35m9k86p54j47J307N34n73j283k78J599M38m23j144J83M71K26j18p2
4085D0K35m27l53J63Q07L69r78j193Q35J213K29q78p66K48O30L47l36k60R5m01
4105c81P3M67N95l64j118j36J254R13q16j625p6J215P69m29p76m10N76K86J82
4124A99O2J6n66n71O98J216j72j083p70O59R95p6n97o91O14L14l9j94K40j40o35
4145e21N0N72R10n34j280j44J065R73o79r58j85P01O75n22l19K67r8j14k3Q18
4165F54j3r43n99N73J413J25j487r53Q59P78M20p57m70o8L95l2L85K71n91p11
$$ plain form
4027 98 460 190 -408 -658 133 917 826 -420 -1008 93 1206 955 -444 -975 -205 441 493 -6 -54 -208
4047 -208 -466 -271 581 806 51 -1246 -824 1029 1177 -272 -1131 -673 357 1003 32 -596 -415 112 -126
4066 -126 409 360 74 -680 -827 480 1014 441 -842 -1120 479 917 494 -650 -467 4 230 112 40
4085 40 275 -152 -505 -342 465 834 -144 -1337 -502 711 940 62 -704 -456 174 521 185 -75 20 -381
4105 -381 -308 159 754 390 -728 -864 390 1303 487 -1138 -1214 1 770 341 -435 -845 -269 17 199
4124 199 261 277 -289 -860 -162 1054 882 -201 -971 -312 683 607 10 -681 -67 247 208 14 254 114 -521
4145 -521 -471 101 1011 477 -803 -947 118 1091 412 -546 -731 -30 645 123 -196 71 -27 -141 -164 654
4165 654 641 -302 -901 -328 1085 1210 -277 -1230 -371 407 827 70 -400 -468 -73 -105 280 551 -40 -751
4185g51K25J152N30j051j059R3J122O78q49p28K39N84L03m14K9m0o0m49J27Q76
4205E57J39j015o06P89J083l85q55j78K15P11l61p2j06J96m36m4P42L21p03q17
4225h25n7J242O77o58j051q9Q84N65l43q20K75O9J31K01L18l8p97n78P01J435
4245A242o07j235m78J100J166o46n64n69L66N66j6l01K3J8l20Q0P65om08q81J35
4266e70J137M37r55p02J92O74J11l65O9J7q5m94M66N81K19j214k49N76J218l09
4286G54j028m15N86O35K4n98q9q4K0R8L57L62n65o67L5J110N12r66j173P15J010
4307F33L42j006n22L9R05P9k86J27j23m85k11M30O93q6j221m1O41Q77k65r72k03
4328f55Q58M34m71l00J78k27l71J60Q77n4m66p26K30J056N61j047q64K88R31K03
$$ plain form
4185 -751 -526 626 1156 105 -954 -861 261 939 90 -638 -399 185 488 74 103 63 3 -446 -319 557
4205 557 696 -319 -925 -136 947 562 -293 -471 -256 455 94 22 -84 112 -324 -368 374 695 -8 -825
4225 -825 -882 360 1037 379 -672 -761 123 688 345 -475 -200 -131 0 201 519 481 -316 -894 -193 1242
4245 1242 635 -600 -1078 22 1188 542 -22 -591 -225 341 325 24 47 65 -255 -175 590 584 176 -705 -570
4266 -570 567 1004 49 -653 -461 213 324 -41 28 45 -40 -534 -68 513 732 -482 -731 -155 1063 754
4286 754 -274 -689 -103 532 556 -42 -131 -215 -195 -97 260 622 57 -610 -575 535 1047 81 -1092 -377 633
4307 633 975 -31 -553 -514 391 470 184 311 188 -297 -508 -78 615 529 -692 -733 -92 785 520 -452 -655
4328 -655 203 637 166 -134 44 -183 -554 -394 483 429 -37 -763 -533 523 1084 37 -827 -539 392 595
4348E95n32n20K90J71j99L99L42k36n78m76Q62O49k21j112l19Q62P87p3j020j92
4368e21L87N92k59j39O2m13l06N43Q87j35j077l95M87J046j02q76l96M06P51k18
4388C24o08J67j4Kj32M79K25l35n94k77J121M29m74r39k6P56M54m84l80L5L59
4409H8k23R7J54O02q97o73M80J101P3r64o98L96J108jp22n80M49K82Q8j0O9k59
4431d0n58J76O90O31n89j131M0J293L55o72q43j34Q68N43m89l09N3nm9L42J98
4452C70O3o37n93N42R39k32p77j33L33O29l42l03k5K21r4k00L3N70n7q32j25J089
4474D39J10l60q80J46P83J28rq73K14N1L21J08M5O4n81k43M31Q26q7j023m54P53
4496i1Q87l31q57k10N62L53J4m32L0K5k2L6M34J60l74p98J4J246k72n28n37M17
$$ plain form
4348 595 63 -457 -167 4 -195 204 546 310 -268 -744 118 767 546 -566 -885 -23 764 691 -329 -521
4368 -521 -134 458 199 60 122 -291 -597 -54 833 698 -379 -774 -287 759 657 -219 -615 -209 542 324
4388 324 -284 -117 -131 -129 -261 218 443 108 -486 -763 358 787 313 -626 -652 104 558 74 -306 -271 88
4409 88 -135 -38 116 718 -179 -852 -372 729 802 -162 -860 -464 644 643 -79 -659 -210 72 160 150 219 -40
4431 -40 -598 -422 268 899 310 -821 -781 512 867 195 -648 -782 86 629 140 -169 -116 -121 -170 172 370
4452 370 433 -204 -797 -255 684 452 -325 -458 -125 504 162 -141 -166 55 -39 -239 -206 364 307 -525 -650 439
4474 439 549 189 -691 -545 238 366 357 -516 -302 -251 70 178 223 287 -294 -537 -106 720 633 -390 -844 -91
4496 -91 796 465 -392 -602 -40 313 327 -105 -75 -50 -72 -36 398 558 184 -614 -600 646 374 -154 -691 -274
4518b74Q50j09m22l55K86M0m6J40N9J25l86m39O47O35j86j191QO32N48l9o89j96
4540c62K16L78m09J29K89k69l28n4J149K1p81n03j45J246J67p57o32J41N36K26
4560B58l11J81j95k75L23K11L37j68p96l32R77N55n29q43K47N88K20l16k44J67
4580E5J59l88K24K37L8k43m86K4N81N23q63k45N6Q46P8p79k10M59k81K58k5pL39
4603C50p32k26Q34L64r4j025l37P41Q94m24n40o69P18M67k96J53k2l14j41K93
4623fM55L7o61o70O28R58j72p57k20R1Q59j08n61k32N27l2j89k0L84Qn91K3N16
4646B67J69q1j052Q0R14K38n68l07J00M57j93r5K04J17l52l37J15Q62K33r13n90
4667g32M19R35j16n05n85J49P75j96j92l5j04j30R5M61L40l45j058O1P15Q46n86
$$ plain form
4518 -274 576 467 45 -310 -24 16 -30 110 169 294 -92 -531 116 751 565 -626 -618 14 562 523 -166 -362
4540 -362 -146 232 -177 -48 241 -28 -356 -410 739 760 -21 -524 -669 577 744 -13 -645 -504 32 258
4560 258 -53 128 -67 -342 -19 192 529 361 -435 -767 210 765 236 -607 -360 228 448 132 -112 55
4580 55 214 -174 50 287 325 82 -404 -380 201 724 -139 -384 -328 518 596 -183 -393 66 -215 43 18 11 350
4603 350 -382 -608 226 590 496 -529 -866 -125 769 345 -195 -864 -146 321 25 178 156 -158 -299 -6
4623 -6 449 486 -175 -845 -217 741 569 -188 -408 -317 542 434 -127 -359 168 136 -53 -73 311 319 -272 -249 267
4646 267 436 355 -697 -617 297 535 -33 -340 -240 217 24 -71 133 250 -102 -439 -324 538 771 -142 -732
4667 -732 -313 622 506 1 -584 -435 340 144 -48 -83 -187 -317 -222 239 579 234 -824 -763 -48 798 212
4688B12q42J77N64K25l88k62J04J52m4j6K91K39p27k39N42O42r9r08m13M78J048
4709G36k67n34j59LM81l72K06J72k10j76p19Q18N65k95j014L77P36L42o70m48
4729d28J48R6L00l0n2k9R1m32K40M62J16p65l07L69Q12j62p64l27P09L29p3k91
4751A2k38O9K18r3K97R4m21m66K82Q09J37o14r72M09Q20K2m78m35M10L38j41j26
4773f7PJ1l9k55L74L52n8n73l81M13Q04l60m72j35L78M39l67j16N1L9j68k27M63
4796A13K21n02k40o4Q77J24o19n23L15N82J10l1n45M10k65j79K12N7J79n40m03
4817g11P63L77k0j096n3R03K14j49p28L00Q5L52r2j43L14k81j37p1O72j2m74o11
4839e98L53J94N01m38m43L54M28k09l35L99q2k70j29L05M58k0r31j06N02M85J05
$$ plain form
4688 212 -630 -453 111 336 -52 -314 -210 -58 -102 -118 173 412 -315 -554 -12 630 531 -377 -790 -312 736
4709 736 469 -65 -224 -221 260 -112 94 266 56 -120 -839 -21 544 249 -765 -388 348 690 20 -428
4729 -428 -280 -184 116 86 34 5 96 -336 -96 366 482 -283 -590 -221 591 429 -335 -662 47 376 303 12
4751 12 -226 -157 61 -32 265 359 -62 -528 -246 563 700 86 -886 -477 343 365 -113 -548 -138 200 59 -67
4773 -67 -60 -49 -88 -343 31 383 325 -248 -629 -216 588 228 -244 -379 -1 438 71 -45 6 45 -123 -350 113
4796 113 334 -168 -408 -472 405 529 -90 -613 -298 284 394 363 -182 228 -37 -216 -4 53 232 -308 -711
4817 -711 52 429 409 -687 -740 163 377 228 -500 -200 -115 237 145 2 316 35 -102 -173 499 487 13 -598
4839 -598 -245 -51 450 12 -431 -77 351 142 -193 206 124 -146 -275 30 488 468 -463 -569 -67 418 523
4860E23p60j39L89M95k49l57J71J02l65K79L22jp23j73K56M95L93p69o41M85Q37
4881E70k55l36n07M50P6K56k92j89L15M9n70N07K18k44k90k80O49M65o22l91j21
4902e42N55J84j80m79M93j80J3J63L82j4l55l91n5R48j28n42m00N18L32J9l59
4923a8OJ9k30j41M33M50k76n43l8N14N35n58q86J88N87M81k35n66Q2N2K76M1j00
4946G3N9k67j02M6M29Qm03l55N19M28j20l84m10L97K30N6k00j54K99l62j63L26
4968e0L75j09o61J82K80M75l97n63J53M95J75l18j33J82j28j7rK74J54o48l33
4989f21P09J99P2o57l07P95K34j75l11k64K10n8rK01L5Nm00R9M74K75m62o90L21
5012c25P50J24m72n19J30L81J5p6l49L02J10k50L0M35j00l80j71K21L79N0m33
$$ plain form
4860 523 -237 -376 13 508 259 -98 73 175 -190 89 411 410 -313 -486 -230 265 658 -111 -752 -267 570
4881 570 315 -21 -528 -78 -2 254 -38 -227 88 137 -433 74 292 48 -242 -522 127 592 -30 -421 -542
4902 -542 13 197 17 -462 31 -149 -136 27 409 395 40 -351 -406 542 414 -128 -528 -10 322 341 -18
4923 -18 -12 7 -223 -364 69 519 243 -300 -338 176 711 153 -733 -545 42 523 288 -278 -196 -144 132 173 73
4946 73 132 -135 -237 -191 238 246 -157 -512 7 435 315 -69 -479 -82 148 204 4 -150 149 -213 -376 -50
4968 -50 325 216 -445 -263 17 492 95 -468 -315 180 355 37 -96 86 -42 -59 -68 206 360 -288 -621
4989 -621 88 287 359 -298 -605 190 424 249 -62 -326 -116 -174 -183 18 53 58 -342 -243 231 506 44 -646 -325
5012 -325 425 549 77 -442 -312 69 84 8 -341 -39 71 -179 -149 286 186 -194 -365 -144 235 285 -148
5033a48j18J63K50j35M5j30J80L0l60N23j37L3n46J55M87L31n69m89N6O37N5r0
5055B23m45j3J94K4j06L47O1m10k88M40N46j79p91l79M85R55k43n60r1L53P7k14
5077a4r3K80j55J17m33N64J00n35q2M7M94J7l66j81OK97K76l31p4R4om5Q8P4K02
5102C41o37k23J30P76r1n40j38O10j2l3n25M50kj07n8j20L37k40m85L31M37K97
5124D98o18k92L81N12L1m22o06N02J99k38m9J8K67l57j11K89K37j33l24N3J55
5145hL56j62m80j39N76O5o3k95J67J32k30j81L13K41l26l48K65M04J17m23l46
5166c65K62L36J67l84j44J87k03J3N1K79q8l37r6K85M89m36l86J50K93L54m19
5187Hm24K41K33K15m75R4K17k32J94m5L34L21p19m12L14N84j80m85o1K33K68J20
$$ plain form
5033 -148 -266 -103 147 12 57 -73 107 137 -223 300 163 196 -350 -195 292 623 54 -435 -379 258 313 223
5055 223 -222 -235 -41 -17 -123 224 285 -125 -413 27 573 394 -397 -776 -291 664 421 -139 -230 123 200 -14
5077 -14 -107 173 18 135 -298 266 366 -169 -251 -204 290 307 -59 -240 -234 63 339 8 -66 28 22 -23 65 139 341
5102 341 -296 -519 -389 387 296 -244 -382 228 216 183 -342 108 106 -1 -59 -179 158 -82 -567 -236 201 498
5124 498 -120 -412 -31 481 512 90 -516 -14 185 -53 -102 -84 183 -174 -285 4 241 108 -216 -163 -8
5145 -8 348 186 -294 -433 143 208 145 -150 17 149 -81 -262 51 292 -34 -382 -117 287 404 -19 -365
5166 -365 -103 233 400 16 -128 59 -144 -131 -80 199 111 -226 -322 -37 452 16 -370 -220 73 427 8
5187 8 -416 -175 58 273 -202 -108 109 -123 71 26 360 681 -38 -450 -136 448 268 -217 -278 -45 223 343
5209C43l89l7p1J50J34J11O5k11m17lM36J86k91j95q7M00K0l37m1K05K4j97J19
5232h3J15J22j70l87L55O6J82l52m43M39M82K0m32m11N93O0n9k02K97K1n22J72
5254a37K75J79k53j90j91M48J28Mo23MM95R1k59M3M0k05J36J31J16q5k71k31K04
5277a51N60k14m77J38J84R3k36j20ML59k6k56LL87r0l27j26K31L74l14k80N7M35
5300B08K92l80k51J32J05J60r4J0n4j56n39L77M37j19j82m63M03M44J20o87mM04
5322A63J46m68M0K54k9k59K7Q7J69j14l30L90K63J76o60k36J51M82O1l59j61J18
5344h9K88k19K2K24pk75l77L35M32n5n87NL71N27l01m68L5K30j8k11q3K13Q9k21
5368a40K16P0K56m41k67N45j40K38l05m47N67j6l9k46k03M46R7j46J9L56l21k21
$$ plain form
5209 343 -46 -83 -154 -4 130 241 306 95 -322 -325 111 297 6 -189 -276 124 144 -193 -234 -29 -5 -202 -83
5232 -83 32 154 -16 -403 -48 18 200 -152 -595 -156 326 346 -86 -497 96 156 97 -105 192 213 -309 -137
5254 -137 138 317 64 -126 -317 131 259 263 -360 -356 139 230 -29 14 54 -151 -15 116 232 147 -124 -355 -151
5277 -151 409 195 -282 -144 40 133 -103 -223 -219 140 114 -142 -139 248 158 -169 -295 -64 310 -4 -284 -227 208
5300 208 500 120 -131 1 106 266 172 182 128 -28 -567 -190 247 128 -54 -517 -114 330 450 -237 -241 163
5322 163 309 -159 -119 135 106 -153 -126 -39 130 16 -314 76 339 515 -145 -381 -230 252 313 -46 -207 -89
5344 -89 199 -20 2 226 219 -56 -433 -98 334 279 -308 -303 68 595 294 -174 -139 91 73 -138 -221 -8 81 -140
5368 -140 76 146 402 -39 -306 239 99 337 32 -415 152 136 97 -149 -352 94 191 45 64 420 99 -122
5390a22j3N6N81k85m38o2K90L34l36k15p2K39P3N0j01J23o3l28J90L12K22m26
5412Ik58J15M79l09k40O0K82j47J18j88l02O37j37k83K94j21K23n08n1L99J08
5433A80k73L6k06L05n7J40k58L2J08o3r6J79K85m60j07K9K74J51n8p57P85R7q4
5456A82l26N4L00j34Q4l37J18J60j88n5K47J3j80l58K82K3O8J31l75J83N32j78
5478B46k28j70M6J91l98L17L26j88l51j4N8M95k9m85OJ6M76k04p1J9K05m73O3
5501a47R0K65j92o55M37K23J51j02l91N0M37q8l56O2p4M65j03k20K95k59j2M0
5523h4N6K65Q8m83J2L03JJ4l33P7K31Lj50P4p0j5j17j12L69K48r5p53L33K31L47
5548D40m68k48J07J54K73k40j44K0J51j41R7J84K49p52o8M01O07m50l17R1j07
$$ plain form
5390 -122 -135 -79 502 217 -221 -283 7 341 5 -210 -282 -43 30 80 -21 102 39 -289 -99 213 435 9
5412 9 -249 -134 345 36 -204 -144 138 -9 109 -79 -381 256 119 -164 130 9 232 -276 -327 72 180
5433 180 -93 -57 -263 42 -15 125 -133 -101 7 -56 -152 27 312 -148 -255 -226 48 199 141 -616 169 266 182
5456 182 -144 -90 210 76 160 -177 -59 101 -87 -142 105 118 -62 -420 -138 -115 -47 84 -291 -108 424 246
5478 246 18 -152 -106 85 -313 4 330 142 -209 -223 -165 330 301 -184 -178 -162 314 110 39 58 263 -210 -147
5501 -147 -57 208 16 -639 -202 21 172 70 -321 -271 166 78 -278 -216 -290 175 72 -148 147 -112 -124 -84
5523 -84 -28 237 325 -158 -146 157 158 172 -161 -84 147 150 0 74 4 -11 -128 -240 129 377 282 -471 -138 93 440
5548 440 -28 -276 -169 -15 258 18 -126 -106 45 -96 1 185 434 -318 -386 15 622 172 -145 -54 -161
5569a61L47J3j50l45L57r0L03j44K71k94j24j05J81P1q9j20j78M47K8k37k49L71
5591A03r5j3j9n1P9j22j22K87r8K02k60j17K03L87k30k14j75J31K36J08q3k58
5613a21Q4O6Lr7K29k32l50M48L52p4l96k95K15M64n1m14QLK96J27k39J97k49j95
5637b21k18L55M39j05l01k61L27L82k61l51L5K51j6J51l50Q3j5j15J51K02M5k60
5659e3j56J58L84j47k17k47J74N44m36k5J20J34k56p6j3K40j02j77O4M04l48J25
5681I4j20k45K20M07k20k69K0q7K22k9K03q7jk31Q9N14k02l30k35O5L46j94k1
5704i1j75L10j21j60J78j78M00l12J32PK56k03k03k53N21L8n6j26p7K47L7k75
5726a04j18J56O1p0J30j47K79k04l76M18J22k02P6k70J67K28o8j06j56M31j08
$$ plain form
5569 -161 186 199 49 -296 61 -29 274 130 401 107 -17 -122 59 130 41 -79 -257 190 218 -19 -268 103
5591 103 8 -5 -24 -75 4 -118 -240 47 -51 151 -109 -226 -23 364 134 -80 -255 -124 112 220 137 -121
5613 -121 -37 29 32 -65 164 -68 -418 30 382 308 -88 -383 -168 296 245 -169 -161 -158 138 265 26 223 -26 -221
5637 -221 -439 -84 355 250 -51 -312 15 397 136 -215 -180 71 55 206 -144 -61 -76 -191 -40 162 207 -53
5659 -53 -209 -51 333 186 -31 -278 -104 440 4 -21 99 233 -23 -99 -112 128 26 -151 -87 317 -31 94
5681 94 -26 -271 -51 356 136 -133 -113 -200 22 -7 196 109 108 -123 -34 480 278 -52 -287 -222 124 -70 -91
5704 -91 -266 44 -77 -237 -59 -237 163 -149 -17 -10 246 43 -160 -413 108 146 90 -36 -113 134 171 -104
5726 -104 -222 -66 -5 -75 55 -92 187 -17 -393 25 147 -55 21 -249 -82 146 78 -28 -184 247 139
5747A39j56KL5K0k43O5j05M77K0o09j4M88O3rm69O9L67j42j27L44j2n0j05o7J09
5772I0n9j02l16L23K03J33k87l91M17M5j1k99K62K32k84k04K37P6J13m08J72J7
5794d1J38m7j04j23M90j23l67L07o2J07k70N0K49m5k09R7o3K33m4l28M7O4M40
5817C96m97l16M49K2K05k08j14m9J78q8J20n2J59k36k31J69M21r4k86k14J00J17
5839d9O5J43l12kK54j73M9J34l0k02l5J07L28j03m8j83J18p0P4k52R3P0j02j0
5863a36j51N34l55m3n3L21Q3Jk37J48lL7j66l3R9O1Nj60K4K73l17j39L08P3J02
5888B76k24j53O5L37j96k06lJ87J51l05J27Q2j57j53K81m8J16k50k31K38J28J69
5910B31k59j2k02M27K6k57j16Q4k8J00mk35N31o22J99Q4K15O5q0l22J76J91l78
$$ plain form
5747 139 -17 -15 20 40 -203 -138 -243 234 254 -355 -369 119 182 173 -296 -227 140 -2 -129 215 203 153 48 -19 90
5772 90 31 -71 -387 -64 139 272 -15 -406 11 56 45 -254 8 240 -44 -248 -11 65 178 -230 -58 -41
5794 -41 97 50 -54 -177 313 190 -177 130 68 175 -95 -45 204 159 -50 47 -16 217 173 -155 -108 -44 396
5817 396 -101 -417 32 54 259 51 -63 -112 66 -22 98 46 205 -31 -262 -93 328 234 -52 -266 -166 -49
5839 -49 16 159 -153 -155 99 -74 -25 109 79 -123 -158 -51 277 174 126 -57 61 -9 65 -187 -94 -24 -126 -136
5863 -136 -287 247 -108 -151 -204 117 200 201 -36 112 109 146 -20 -53 46 107 112 -48 -24 249 -68 -207 101 174 276
5888 276 52 -101 -36 301 105 -101 -104 83 234 -71 56 138 -19 -172 109 61 177 -73 -304 -66 62 231
5910 231 -28 -40 -242 185 211 -46 -162 -78 -106 -6 -10 -245 286 -336 -137 -53 162 227 147 -175 1 192 -186
5933a86K19j55o7K09q5J69j50J14p5J3j67K88j4j69L4P1L1j01k26K27J0p8J08
5956B0j49P5j3o4Q8J58O8k06k7L23l6j43k54K71k2J2j96j00O3L71l35k2J65J53
5980B00k26k33R5L11j52j4l5J13J65j4k63J66j43J30r7k30K83J85l77R4K75q3
6002A50J0k58j00L26J22k26k15o6J98K57l77K86p2MN2k85K59J97k88j84K29O3
6024H2q2m00K85j26M01k95L1J22J4l5O3j37n2J71j78Q1R5P9k04k6j04K93k72J97
6048Cj8j2P8rk53K2M87l85N5p2K76J43l30k41J31K68j37l12j31M06J4K16k05J45
6072A39L3m28P0L31p7l24K40j23M27n4k75n6K7mK19k82j66J67K67j15k0N2l9j19
6096a10n8L32p2j63r7Q5J1M94j87l17r8K14n3J76l4k99K16k17j76M02J31m41J47
$$ plain form
5933 -186 33 -122 -189 20 -65 104 -46 68 -7 6 -161 127 113 -56 -22 49 80 -21 -247 -20 -10 -88 20
5956 20 -129 -54 -67 -131 -43 115 183 -23 -50 273 237 94 -160 111 89 101 -95 -195 -132 239 -96 -118 47 200
5980 200 -26 -259 -164 147 -5 -19 -54 59 224 210 -53 113 -30 100 3 -227 56 241 -136 -42 233 150
6002 150 160 -98 -198 128 250 24 -191 -257 -59 198 -179 107 35 39 91 -194 65 262 -26 -210 19 82
6024 82 0 -400 -115 -241 160 -135 -104 18 32 -3 60 -77 -129 42 -136 -55 40 119 -85 -111 -215 78 -194 3
6048 3 -15 -27 51 42 -211 -189 298 -87 -32 -104 172 315 -15 -256 -125 143 6 -306 -437 -31 -17 199 -6 139
6072 139 172 -256 -186 145 68 -256 -16 -139 288 234 -41 -97 -70 -74 145 -137 -303 -136 131 16 -4 48 9 -110
6096 -110 -168 164 92 -71 -168 -83 -72 422 235 -82 -180 34 -19 157 123 -176 40 -177 -353 49 180 -261 -114
6119a14j5K30K03q9n17L54p2J8J22k41L24j62j66N1K17l55K08p3J03P8Rl3l2P7
6143A25L1q1j27P5J08K6l63J23K41j71j05K66j52mj43M4J17L75n86L7R5Q3J09
6166A23n3l3L0j11O1M1q0j98L23p1l37K19L39k43jj25L79j16j84J30k01J9k7M11
6190B95k40P8p2l36L63k52N06m46Q7n0P1M1j93M5rJ57k17Q0J95j93J74l24N0M26
6214B36k29j17j7J38J33K5l98K19K8J2L3K7j35J96J92n37J04N08m71k93L86j08
6236f8L80n08N7K00p8qn9k6m7K79l21QL29Ok22J29O0J61L1k92k75M01Q2r0k32
6261a03L24l42K3N1Q7R6k40o7M7J2R2j36J34k56K65n6J34j7j5J03j95J22j87P7
6285d7Nk5L2J53k20R8O3J15j9m5k30L54j46j52k3J46J47r5r3k93L37P5j93k55
$$ plain form
6119 -114 -129 101 304 215 -302 52 -20 -2 120 -121 203 41 -125 -74 143 -212 -4 -77 26 104 113 80 48 125
6143 125 156 75 -52 23 131 157 -206 -83 158 -13 -118 148 -4 -8 -151 -107 10 385 -201 -164 -69 14 123
6166 123 70 37 67 -44 17 58 -22 -220 103 32 -305 -86 253 10 9 -116 263 147 -37 93 -108 -89 -116 295
6190 295 55 133 61 -275 88 -164 342 -104 -17 -67 4 45 -148 -103 -112 45 -172 -92 103 -90 84 -240 -190 236
6214 236 7 -110 -127 11 144 169 -229 -10 18 30 63 90 -45 151 343 -194 -90 418 -53 -346 40 -68
6236 -68 312 -196 -139 61 -17 -25 -84 -110 -157 122 -199 -191 138 144 -78 51 111 272 303 11 -264 137 219 129 -103
6261 -103 221 -121 -98 -47 40 136 -104 -171 -124 -112 -20 -156 -22 -278 -13 -69 65 48 33 136 -59 63 -124 -47
6285 -47 -42 -67 -35 118 -102 -4 59 174 155 110 -120 234 88 -64 -87 59 206 111 18 -275 62 137 -56 -311
6309c11L05k9J68j15j93K09M6n0j9J22Q4j72j83L33j55j07o6J12l5J98l97J35
6331a20O4Q8J02m22L30M4j36J88m11J14K46k40K04k31J79J5J17j97K5K71j31l89
6353b90L58k64K92j24J79P4k28J41k37j2K20O5m82J16K72k6j60J78j50j73K92
6374D1j24p5K84n5l2j27N4Nj96J60J4J61kj29Nn3L72j48k57J51J11k2l21J51L
6399b9K78j80p6p4K85l10M0K69n81N59k03J7K32j12l01L42j03O4l6j11P1K03k13
6422C1j19J18K5%j9q5j48K02J64l19J80l23M0M98k97Kk02K39j24K01K31P0m92
6445a27J57N5Q2n5k58j03J11K08l2j6k5j6k10K40N4R2n4k51%Q5L90j07l95K62
6469H7P8J6k56K63j44j12J91j02N8J15m21K06j83L01R5k45L3n0n0J98Q8j85J60
$$ plain form
6309 -311 -6 -35 133 18 -175 34 80 30 11 133 217 45 -138 195 40 -67 -133 -21 -56 142 -255 -120
6331 -120 -56 32 134 -288 42 86 -50 138 -273 -159 87 -153 51 -180 -1 14 131 -66 -41 230 99 -290
6353 -290 68 -196 96 -28 151 225 -3 138 -99 -111 109 174 -308 -192 80 54 -106 72 -78 -251 41
6374 41 -83 -158 126 71 39 -88 -34 -29 -225 -65 -51 110 108 -21 -16 -69 303 155 -102 49 160 138 -183 -32 -29
6399 -29 249 69 -7 -81 204 -106 -66 203 -378 181 -22 -5 227 115 -186 156 53 117 81 -30 41 244 31
6422 31 -88 30 55 55 36 -49 -197 5 169 -150 30 -293 -253 245 -52 -50 -252 -13 -137 64 295 365 -127
6445 -127 30 85 167 112 -146 -249 -138 70 38 22 -3 -19 -229 11 65 157 103 -148 -148 -63 327 220 -175 87
6469 87 165 181 -75 188 44 -68 123 21 79 194 -227 -21 -204 97 192 -53 -20 -70 -120 78 166 -19 141
6492A41k46K01j11n5J09j40j05M49k01J36k51J25R4j66J6L2o7J8Q5o6O7P0k95
6515a60J47j31O1K27k07k47P9M53j03j77j18J26J80M4k18J16o1J16k11K34J47
6536B97l95J3m1L42k32nj18J9P7J69k17L65k59j70P3J04R6Q0r4m05R6K94Q1k08
6560c8n6L5l8N66r63N13M1Mk51L21l19J92m1m3L13j56r3k20J02J79j45l2J04j9
6584d4J63j67O0k18N63k96j59l50O85j68r8J52j64J97m5j11l7M9J29m4j08mJ45
6607A30j06j06k6J84j43j39R8J90J33k42n0J12j07L16m3k8l79L5K24p6J31R0K8
6630B26m52K44K90l18k7j53J95J65l6l39L54K6l00j22K33J09k0j82oK42N8l53
6652a66L2K2J6J2J21j73N91l76L4k15Q6R9j25K42l81L03M6l5l77J25l6J03k05
$$ plain form
6492 141 -105 96 -15 -70 39 -101 -206 243 42 178 -73 52 146 -20 -4 28 -39 -21 64 -2 65 135 -160
6515 -160 -13 -144 -83 144 -63 -310 -231 222 119 -58 -176 -50 130 174 -44 72 11 127 -84 150 297
6536 297 -98 -85 -126 216 -16 -21 -139 -120 -43 126 -91 274 15 -155 -82 22 118 198 104 -301 -205 89 170 -38
6560 -38 -94 -59 -97 469 -494 19 60 64 -187 134 -185 7 -34 -77 236 80 -13 -233 -131 48 -97 -129 -25 -44
6584 -44 119 -48 12 -206 357 61 -98 -448 237 69 -29 123 -41 156 111 0 -37 12 141 97 -11 -15 130
6607 130 24 -82 -108 76 -67 -206 -108 82 215 -27 -77 35 -72 244 201 173 -206 -171 53 -23 108 198 226
6630 226 -226 18 308 -10 -37 -190 5 170 134 -205 149 175 -125 -247 -14 95 75 -107 -113 129 187 -166
6652 -166 -134 -112 -96 -84 37 -136 455 79 113 -102 -16 83 -42 200 -181 122 168 133 -244 -119 -155 -52 -257
6675b57M3L89J12k25j68R8L53k04l66R1l6K85l85K42Q4k26l8J44j03k9L73l00
6697a23Q0m3K61J8j34Rj34Q9J16k46J82k37P9m8M54j95j62o9r4L1K10k22N9j46
6721b65J90J83o5K11K3k88l8K93j10q3k02nm9K74O1j35L02j91M5j22R5p6k68M0
6745a80R9J77j54O2J31j50J8L10k45P8j99o1J75j66J30J32r2j89K68j30j06K27
6767A35k82J35r1K44k99J37O8j30J13M1k97K18k69L29o1J80m5mk3j04R5k1k05
6790a36J77L6JJ01k07K89k27R8k6J30Jj10j01k54L51ml02P5j59M12p3k83K22O1
6814G2P8k11J59l2q1J35k89J04Q7j33RJ25J65l84K48r1k9k0L91j22l39K67mq4
6838B1k6J78k74j0n4R2K17j16j94J20j8j06L54q6q4M5j14K4R8n8J95k29k04J47
$$ plain form
6675 -257 -214 175 287 62 -106 -8 345 141 -225 -134 -170 115 -270 -28 56 -170 -208 -64 -167 -196 177 -123
6697 -123 -43 -86 175 193 59 68 -66 23 139 -107 75 -162 -83 -131 323 128 -34 -103 -197 -166 44 -178 -119 -265
6721 -265 -75 108 43 254 277 -11 -49 244 134 51 -151 -156 -205 69 130 -5 297 106 151 29 124 48 -220 -180
6745 -180 -81 96 -58 4 135 -15 3 313 68 146 -53 -114 61 -105 25 157 65 -124 144 14 -92 135
6767 135 -147 -12 -103 141 -158 -21 47 -83 30 71 -226 -8 -277 52 -9 171 126 122 99 -5 90 69 -136
6790 -136 41 77 78 179 -28 261 34 132 106 236 237 127 26 -228 123 119 -183 -108 -267 145 72 -211 11 72
6814 72 150 -61 98 66 -15 120 -169 -65 22 -111 -102 23 188 -196 52 -39 -68 -88 303 181 -158 109 105 21
6838 21 -5 173 -101 -111 -165 -73 144 28 -166 -46 -64 -170 184 98 14 59 -55 -31 67 9 204 -25 -229 -82
6862h2J35j16j5j54K82k2j45K14K3J57j38k34J97k51K38k47K47j63Q1o8k3J13
6884B9Q4l8r0j47O4N9J32jP2l01J64P9l3K2l19Oj08K88O1P1j28j70K72R6l08L3
6910a11K38k34J47n6J7k83L46j60o8Lm2K5p3J98J3N5m49L99J05j97k1p9K54L9
6934F6j31N7L9k1l9NL5K8k78K71n0R0M0j18M1O4M7j78k23L97p6m1o7j90K53j67
6960a46J81J3j80J07J53K9k65K07J29k62J33j46J15r0j78n1K53J9l27O04m17K32
6982A13K2k03J17k8J28j49k0j64M22j36q9K17j12l69L21J25k41J49M4j34k79M8
7004b18J91r1n8j2K57j92j04L3L26k17J41j78M47l49O0m3P3l9k28M36k55o1L9
7027d2J09Q8j02J21n4l18J31K55k55J43k88J02K42k58J60q3j28L15k43j54L41
$$ plain form
6862 -82 53 -63 -78 -232 50 28 -117 97 120 277 139 -95 102 -149 89 -158 89 -74 7 -61 -84 29
6884 29 113 75 -15 -162 -98 -39 93 92 164 -137 27 106 73 95 -224 -218 -326 -38 23 94 -34 -204 68 164 -144 -111
6910 -111 127 -107 40 -16 1 -282 64 -96 -164 -161 -203 -178 -251 -53 -40 15 -434 -35 70 -127 -148 -227 27 66
6934 66 -65 -8 31 10 -29 -24 11 39 -239 32 -18 72 112 -6 35 99 146 -32 -255 142 66 25 -42 -232 21 -146
6960 -146 35 48 -132 -25 128 157 -108 99 228 -34 99 -47 68 -22 -200 -251 2 21 -306 298 -119 113
6982 113 135 -68 49 21 149 0 -20 -184 238 102 13 230 118 -251 70 195 -46 103 147 13 -266 -218
7004 -218 -27 -118 -176 -188 69 -123 -227 -194 132 -85 56 -122 325 -24 36 -7 66 27 -201 235 -20 -81 -42
7027 -42 67 155 53 174 120 -198 -67 188 -67 76 -212 -110 132 -126 34 -49 -177 138 -105 -259 82
7048H2l70M14L2n2k85J78J29o9q8k8j00J06J87K9j07R6j32J29j46J82k00Q3j17
7071d7J59k07LJ11M1P1k20J58m9J6J00j73P5k54L82k70K17k51J16O3P2J57k23
7094D7J18j22J62l56J1L72r9k33J04PKN9j42O1K67k65l9k38J73K99L9k65j0J39
7118I1J30j85P1Kk92J68K5l00J6L44j80L8L3J19j83jJ07J01k42j18K23j49K87
7141A05p2j42J14j3L31k47l77K47J9L3k35J41M5R5j95K04j70L62l52R2K21k98
7163i2m0n0L4K15k39Q4J66J74k58p6k8P7L3l4n9k0O2K3M6p8o5M7j17K04j36J71
7189D4K8p0pJ41n0k76J57K63j44p6J30j67J13k16R5j64K36J69l49J33OJ61J0k81
7213a14k0J24k31L64L9j47m4L9q3J03p1J36M4l17J45J6L7q1J0J60p0N4j45M0q4
$$ plain form
7048 82 -288 126 158 106 -179 -1 128 59 -29 -57 -157 -51 136 165 58 154 22 151 5 187 -13 70 -47
7071 -47 112 -95 -92 19 60 131 -89 69 20 36 136 -37 38 -216 166 -104 113 -138 -22 41 113 270 47
7094 47 165 43 205 -151 -140 232 133 -100 4 11 13 72 -70 -9 258 -7 -46 -284 -111 188 227 -38 -48 91
7118 91 221 36 107 109 -183 -15 10 -290 -274 70 -110 -72 -39 80 -103 -104 3 104 -138 -256 -33 -182 105
7141 105 33 -109 5 -8 323 76 -301 -54 -35 -2 -237 -96 -51 44 -151 53 -117 245 -107 -15 206 -92
7163 -92 -132 -182 -148 67 -172 -88 78 252 -6 -82 -110 -33 0 -34 -93 -113 -51 -28 18 -60 -125 -78 -195 9 -127 44
7189 44 72 2 -5 136 86 -190 -33 230 86 10 140 -27 86 -130 -35 -199 37 206 -143 -10 -4 157 167 -114
7213 -114 -134 -10 -241 123 162 15 -29 10 -73 30 -41 95 139 -178 -33 -17 20 -61 -51 109 39 93 -52 -12 -96
7238i6J42m5N0j89R8J02j3j13J95r1j18J35r4j36K61jk39J21k1J8K30l73J74J19
7262A16N1k02l9N7J22lj20J11k75K57o4q3J06j48M8n5L1J66j70L9O3j63Q3o8J36
7287dJ05j91L5M9J57J94k44j39J56j9k03k54M32j86J51j11K72k45J16N4L4k8k15
7310h4J12l5m2R3K3o0l2k40n3K67J34o4Q9k39lJ51l7K21j34q6l2o0n6L44k54o1
7336a38j9L5L53k43n4j45N3J06Jl3n5K6J35J52k36%R4K56j59j43k2n6N1lJ81r9
7362C8j16Q1j65K90k41N7nJ18O7j85J93O5j08P1j71j64K3K14j11J17q5P6m59M15
7386A5J7k60M65k98J19l57L59m28N05l04K09J60m37J65Q5n0Jj75K27k4J7j6J03
7409I8K8N2m02L62k04K81k6l46K37r0LR2k37K55j27K09k53J96M4k65L3J78p1M0
$$ plain form
7238 -96 46 1 51 -138 -40 62 49 -64 131 40 -78 57 -37 -173 88 87 -152 -31 -52 -34 196 -177 -3 116
7262 116 167 -35 -74 -17 105 102 -18 93 -182 75 11 -72 34 -114 -66 -121 -90 76 -94 -55 8 -155 -72 -140 -4
7287 -4 101 -90 -55 -6 151 345 101 -38 118 99 -104 -358 74 -112 39 -72 200 -45 71 125 159 131 -84
7310 -84 28 -7 -49 44 67 7 -25 -265 -318 -51 83 19 108 -131 -134 17 -20 201 67 -19 -51 -111 -167 177 -77 -138
7336 -138 -157 -122 231 -12 -66 -211 -158 -52 -51 -84 -139 -113 22 174 -62 -62 32 288 129 -14 -36 -92 -41 -44 137 38
7362 38 -78 3 -162 128 -113 -56 -61 57 124 -61 132 197 89 160 -11 -175 -152 62 -49 68 -17 59 -400 15
7386 15 32 -228 237 -61 58 -299 60 -368 137 -167 42 202 -235 -70 15 -35 -34 -209 18 -6 11 -5 98
7409 98 126 178 -224 138 -66 215 189 -157 80 -10 -7 85 -152 103 -24 185 -68 128 172 -93 -60 118 47 87
7433H7k42m9L73k05j54N2K05K5j92q8K33j79p5J73o0Q7N4O2nm57L57J92k03k6
7457c5K47j29l43K71J09j55K00j29j60r9K78q3L39k11k11m7j2K94j11l2L7m68
7479d50M87K17k68k35M41k59K3O4p7J15pj10J48l5n3P7o7n6L9O1j75K92p2j14
7503a4R9p7P5k04L77k30j14J59n2N2k43K78j05j27K65P5k50J32j35L8l6J44k52
7526a45L66l69j61L59k72L86j55m5K33k09J21m6J05o5l29K15Q1j04J58m4j99M96
7548C77l24L9q6N0j21O5K4P6l08K08j57M7J41J38l39K40j85j60L09n4N8Q5p4o6
7572a7K3N7j41K24k8J17m68J22L41j93M1j46R4j06J49j4J00j15P3O9m74J86J25
7595A9j11N0Ok77K48L3k45J04rL9J69l6J33o8j39L64k34M8j09p0L01j47k27J06
$$ plain form
7433 87 -155 -204 169 -36 -190 -138 67 92 -100 -188 45 -134 -209 -36 -96 -9 45 107 102 -355 2 194 -9 -35
7457 -35 212 83 -260 11 120 -35 165 36 -124 -223 55 -28 311 100 -111 -158 -170 124 13 -19 18 -450
7479 -450 37 254 -14 -249 192 -67 -44 20 -57 58 51 -59 89 54 1 78 11 -45 -6 55 -120 172 100 -14
7503 -14 85 8 83 -121 256 26 -88 71 19 71 -172 106 1 -126 139 214 -36 96 -39 -1 -37 107 -145
7526 -145 221 -148 -309 50 -222 164 9 -36 197 -12 109 63 168 103 -226 -11 70 -34 124 80 -119 377
7548 377 53 92 6 56 -65 0 24 100 -208 0 -157 -110 31 169 -170 70 -115 -275 34 -20 38 123 49 -17
7572 -17 6 63 -78 146 118 235 -233 -111 230 37 78 -68 26 -80 69 55 155 40 113 182 -292 -106 19
7595 19 -92 -42 -36 -313 -65 -32 -277 -173 -182 -143 26 -10 123 55 -84 280 46 94 -15 -85 216 69 -158 -52
7619e2J20j22J51j83J91j15K19r2m8J48l38K3J65j81N1K42k16j70o0L41Q6o7p2
7642B1q5K30j11j52k00K79J35k21J97j94L31l65K52m09M36j45j14k6K29j54L8
7663b8Q5j72R9j50M3K24o8m2k07J09N0L4j25M3M0P4Q7K7j60k20J16m1N4J31J7
7688B0j57P9M8q8O1q9P0J67K16l80J07J65j94o3J7J53n1j7m5L1M8J3p6J54j5j89
7714a5K04k55N1J5j33O9J28J6K8j29M1pJ57k54K25j43L2L9M0k76J63j28K26O4
7738A58k74J20o1K48k42l2K12n5o0K4n6J94r5N3j12l3p7j66L18p1QO5j00J94q6
7763G4L1k19r8Q0J05n2K4j13j88N65l89K52O6k0j55L3K40k11N3r8J09k02O4K86
7787B37k23M8j23J95k07P3J35J20k27n0J03Q3j74J9o4J22l9k13J18L26m6k71M8
$$ plain form
7619 -52 68 -54 97 -86 105 -10 209 117 69 217 -121 -98 67 -114 -63 179 -37 -207 -267 74 160 93 21
7642 21 -64 166 55 -97 -297 -18 117 -104 93 -101 230 -135 117 -292 144 -1 -115 -141 88 -66 -28
7663 -28 57 -115 -16 -166 -123 101 33 -9 -216 -107 -57 -23 -148 -105 -65 9 96 123 -37 -257 -141 -182 -128 3 20
7688 20 -137 -58 -10 -98 -37 -126 -56 111 327 -53 54 219 25 -38 -21 132 81 64 19 50 98 111 35 189 174 -15
7714 -15 189 -66 -15 0 -133 -64 64 80 108 -21 20 13 170 -84 141 -2 30 69 109 -167 -4 -132 94 158
7738 158 -116 4 -57 191 -51 -83 129 74 14 38 -18 176 81 134 22 -11 -88 -254 64 -7 1 66 -34 160 74
7763 74 105 -114 -212 -132 -27 -79 -55 -168 -356 209 -180 72 138 118 -37 -4 236 25 78 -20 89 -113 -49 237
7787 237 14 62 -61 134 -73 0 135 255 28 -22 81 164 -10 9 -55 67 28 -185 -67 259 213 -58 -10
7810a0J85k40L1lQ4j18J35n0JJ61l86k5K54J76k45J00o5J02j61k8K98m82J34L1
7834a21n1O3L49j51j35j23J50J7J05j94P5Q2j31K28k25J54k78J23o4OM4R4J79
7857A96k09J59o65N83q9k44K71j04k3O4J08l11L16O4l98K82j80J67J83m02K75
7878D3kK14l19K06k94K60q1M6j77J17L6n5j7j1p8M7K64no5m0k26J79j53R7O2K6
7904G4J09o1m5m3m2J3O8j52J04N4j75L08k91J31k08K11j33K32J01m44L12k7l74
7927b78M01j68RJ09k22J93J05j49k0K8j94L42o1l41L06l6M6r8M5J75k63L02l7
7950A94j56k04K09j12j05J15Q7j33J13p6J18J28l58J69J50k28K09l4l25K11L7
7971Ij89K51q1N3O9n7n1k5K84k43j13J29l3j98R5J2R3j39K3L20l65K77j5j02N6
$$ plain form
7810 -10 175 -65 -34 -37 47 -71 64 14 15 176 -210 -235 19 195 -50 50 -15 87 -74 -102 196 -286 -152 -121
7834 -121 -172 -109 240 89 -46 -169 -19 -2 103 -91 -16 66 -65 163 -62 92 -186 -63 -127 -121 -77 17 196
7857 196 -13 146 -519 64 -25 -269 2 -102 -125 -61 47 -264 52 116 -282 0 -180 -13 170 -232 43
7878 43 41 255 -64 142 -152 108 27 73 -104 13 49 -6 -23 -34 -112 -65 199 194 129 89 -137 42 -111 -14 48 74
7904 74 183 122 77 34 -8 5 73 -79 25 79 -96 212 -79 52 -156 55 -78 154 255 -189 123 96 -278
7927 -278 123 -45 -36 73 -149 44 149 0 -20 8 -186 156 95 -246 60 24 70 -28 17 192 -71 231 194
7950 194 38 -166 43 -69 -174 -59 28 -105 8 -68 50 178 -180 -11 139 -89 120 86 -239 -28 9
7971 9 -180 71 -10 43 112 55 4 -21 263 20 -93 36 3 -195 -100 -88 5 -134 -111 209 -156 121 106 4 60
7996F0L4l6rO7p4k1k38J51J70j17J05k32N30k53k65Q8p9R0j54M40k65j36Q7l8
8020i5M38k30N7j2k26J09NQ8l61J35j49L31J7j49M9j16L06m27M02J28l16P2q3
8043b7K89k3l29O1K32n4j18j54R4j34N00l88l8j38K97k31J46Pj1M0L3J41l67K18
8067D6k66L64j40k6n5J59j9K%j3q1J09q2r5J16j9kJ23l61K82k02J53L3M2k45J93
8093A6j25J8L03k35O2j08J07j25N3K01j83p4K85l05J86k38P4K05L3P2k31k0Q1
8116E2q3q5P6L8J21o8j92j1J30J54n4j69K11M3k63K8K58l04kJ01J88k86L4J63
8140H0j33P2m8L39k61o1P0j80L20J31n69J68K28j72p2J42m0Pn1L25m46L46k39
8163d4k27L62k20J16jj10J61O7L2j45m2j53J94k7J84j38kP5n4mj30P3MM5J25j99
$$ plain form
7996 60 94 58 49 116 42 21 -217 -66 104 -13 92 -140 390 137 -128 -40 -119 -29 -183 257 -8 -144 -57 -95
8020 -95 343 113 170 158 -68 41 46 134 -227 -92 -241 90 107 -42 7 -109 197 -230 172 300 -16 56 -27
8043 -27 262 239 -90 -29 203 149 31 -123 -29 -163 337 -51 -89 -227 70 -161 -15 -8 -19 21 54 195 -172 46
8067 46 -220 144 4 -22 -77 82 63 65 65 52 -29 80 -2 -97 19 0 -2 121 -240 42 -160 -7 26 68 -177 16
8093 16 -109 -91 212 -23 39 -69 38 -87 -34 167 -16 -90 195 -110 76 -162 -88 117 150 222 -9 -29 52
8116 52 -31 -116 -40 -2 119 51 -141 -152 -22 132 78 -91 120 163 -100 -72 186 -118 -120 -19 169 -117 -83 80
8140 80 -53 19 -29 310 49 -12 58 -122 198 329 -240 -72 156 -16 -88 54 14 21 -30 295 -151 195 -44
8163 -44 -271 91 -129 -13 -14 -124 37 104 136 -9 -51 -204 -10 -37 147 9 7 82 28 24 -106 -33 -29 16 141 -58
8189e8j6O
$$ plain form
8189 -58 -74 -68
8191f8
$$ Imaginary data points
##PAGE= N=2
##DATA TABLE= (X++(I..I)), XYDATA
0@%%%%%%%%%Qj6J6j6J6k4L2l3M1m9N7o8P7r0J06j22J38j57J81k07K31k59K95l30
33a73L66m10M57n09N67o28O96p72Q54r45J047j158J285j429J593j781J997k254
51a197K562k938L413m034M885o125Q106j1786K0907q4486j54523J49435J81342
64A05561K0316j45633j04614J9207R2514N2864m419n0628n8828j7303O9574Q2190
76F0801j3296j04592n8668N9766J07268K6622p3843q6088r014O2664P6029K9300
88G6949m9272r3736l7417O9952J02840K0468p7016q3690O59P3049N8318q290n1384
101A430m3283J595M8546N0810o763o2442m9686K0236P6529N4424l6519j00405
113d5528n4808O0947J22223M7947r6566j41105j3578J35260J15186m0437j31026
$$ plain form
0 0 0 0 0 0 0 0 0 0 0 8 -8 8 -8 8 -16 16 -17 24 -25 32 -36 41 -49 57 -65 73 -84 97 -110 121 -138 157 -173
33 -173 193 -217 240 -269 298 -330 366 -406 448 -497 550 -608 677 -752 841 -940 1057 -1197
51 -1197 1365 -1573 1840 -2194 2691 -3434 4672 -7114 13793 -70693 -225216 -75781 105561
64 105561 125877 -19756 -124370 -105163 -12649 40215 35796 -14832 -73660 -90963 -21389 60801
76 60801 47505 -57087 -115755 -55989 51279 77901 4058 -82030 -91044 -28380 47649 76949
88 76949 27677 -66059 -103476 -33524 69316 89784 12768 -70922 -70263 2786 61104 52814 1430
101 1430 -41853 -40258 8288 59098 52335 -10107 -59793 -39557 36972 91396 54877 -45528
113 -45528 -100336 -39389 82834 130781 34215 -106890 -120468 14792 129978 89541 -41485
124d1485o1473O1384R1850K0241m8272n2707k0459K0179N7924M4523l7660r3218
136e9173l0904Q4642J00453j2481j14074p1810N2637R9844L3688m5798o6157l5856
148f4989K0337O7192N3210k2784q1868m8135M6375Q3302J4253o2855m9133J4200
160c0895L8756K0618L40j6308l4007k5714K5783O9736K9786o9996r7683M791J11349
173B6556Q1163m7435j17804n2500O7456J02846K3956p0750q0642j1312O0300O8892
185E0726N170o2461o1427M723O4147N7675j3297p7424n5935L5982R2259M2726
197H2864n9632r6817k1268Q2202Q7722o399q1803o1507J6088O7825N0329j2880
209D6724n8323m4520J3963N9023M1203k5254o0841k0178L9826M3149J974k8144
$$ plain form
124 -41485 -102958 -41574 50276 70517 22245 -30462 -50921 -30742 27182 71705 34045 -59173
136 -59173 -90077 -5435 95018 82537 -31537 -103347 -50710 49134 82822 37024 -29133 -64989
148 -64989 -44652 22540 75750 52966 -28902 -77037 -30662 52640 66893 4038 -45095 -30895
160 -30895 7861 28479 28819 12511 -21496 -47210 -21427 48309 78095 8099 -89584 -84793 26556
173 26556 107719 60284 -57520 -110020 -42564 60282 84238 13488 -67154 -78466 -18166 50726
185 50726 55896 -6565 -67992 -63269 878 58553 45256 -32168 -88103 -52121 40138 82864
197 82864 23232 -73585 -94853 -12651 75071 68672 -13131 -74638 -58550 9275 59604 46724
209 46724 -11599 -56119 -42156 16867 58070 32816 -28025 -48203 -8377 34772 36746 8602
221H602k6062r101J2579L3182L1750j2646o5657m5550M8178R4364J7700q5909
233A430q2170K0857R0685M8492m0861o8523k1335K8942M2550K7433j2459n1635
245a6594m0898K3654P0635L4898n0896q1699j0056P8195O9312k1638q1247m8615
257g4949L2977P5990L7694l8659p1945k9142M2342O9156K2245n0708o5523m304
269e4826N6377M9025r553n0993l4124J7168M3670K1378j5881l1673k2127O723
281b4836L4682L2536o193m6300m1469J4659O5285M1051l7867p4632j9884N4665
293h303O1866J43n4656m2491R445L9464K9172J998k8561m1996j1612M4404N7018
306E5891k414o9751n6185L2752Q6510L1848o2698p6290j970O5821N7171q861o0673
$$ plain form
221 8602 -17460 -26561 -13982 19200 50950 38304 -27353 -72903 -24725 69639 87339 1430
233 1430 -80740 -59883 30802 79294 38433 -30090 -51425 -22483 20067 47500 35041 -16594
245 -16594 -57492 -33838 36797 71695 20799 -60900 -70956 7239 76551 54913 -26334 -74949
257 -74949 -41972 34018 71712 33053 -38892 -68034 -25692 43464 65709 15001 -50522 -54826
269 -54826 1551 50576 41023 -9970 -44094 -26926 16744 38122 22241 -9432 -31559 -24836
281 -24836 9846 42382 36189 -10111 -51580 -36921 28364 69415 31548 -43084 -62968 -8303
293 -8303 53563 53706 -950 -43441 -33996 5468 34640 36638 8077 -33919 -45531 -1127 55891
306 55891 53477 -16274 -72459 -39707 46803 78651 15953 -60337 -62307 3514 60685 51824 -8849
319h849m7632J1929N7522M5665j5040o5231m2134L4006O8494J9228m8288n2940
331d3270J449M5843L3443r651l2141k1992p20K0953L3247J1490l2326m6697m655
344d5027M9291M8122j2775o0669l3768L1348N2365J3689l0577l6251q686K0753
356a2185K8634J4249j1944l4410k6285J8276N2406K3793l9194n9850p619N7565
368C436N5826j4277o7479l8688L1503O0308K3942l3149n4612j8845L5975N2970
380C6910J4534m1370n4675n759N3531N0193j4382n7894l0882K6606M8318J6593
392D1723k7917l6367j0583J8908L2140K0003j7283m4546k2534L1984N2790J0071
404D8389m7382m7401J0097N1907K7296k2902l5539j1310J3474K0852J4946m01
$$ plain form
319 -8849 -56481 -44552 12970 58635 43595 -21636 -63770 -29764 38730 57958 9670 -43270
331 -43270 -41821 4022 37465 27814 -4327 -26319 -27039 -6086 27161 38651 6325 -40372 -45027
344 -45027 4264 52386 39611 -21058 -54826 -23478 28887 42576 11999 -24252 -32938 -12185
356 -12185 16449 30698 18754 -15656 -41941 -23665 28741 52534 13340 -46510 -54129 3436
368 3436 59262 44985 -22494 -61182 -29679 30629 54571 21422 -33190 -52035 -16060 36910
380 36910 51444 10074 -44601 -50360 3171 53364 38982 -18912 -49794 -23188 25130 41723
392 41723 13806 -22561 -33144 -14236 17904 37907 20624 -23922 -46456 -14472 38318 48389
404 48389 1007 -46394 -36297 15610 42906 20004 -15535 -26845 -13371 7481 22427 22026
416B2026k0463k8316m360L6237M0095j0821n4998l0741L2044N6633J4414m3718
428H032m9916M60M6341L9194n625m2340l8353O412M9077L8831j7174n6052l1687
441e2800L0832N9366J6961m4735n0878J828M5433L5787q601l9542k8608Q959L5415
454I417K8370o730l9787l3450J5079N0682K5922l1310n0095r673L9859L8815o914
467C0185l6799k0139J0311K0169J2943J366j2377k1335j1233J6969L4091J0636
479C4787l3919m0314N551M5558K9322j9938m3542j8703K4351L8061J1933k2152
491A0995l4664j5645K2790M3085J4510l6006m6767j753M7193M1141j4635n1643
503b1399k6287K7200M3617J2675k4865l5729j2167K3390L7365J3001k7629m2490
$$ plain form
416 22026 1563 -26753 -31113 5124 45219 34398 -20600 -51341 -19297 37336 51750 8032
428 8032 -41884 -41424 4917 44111 38486 -3854 -42207 -35795 13282 52113 34939 -21113 -52800
441 -52800 -21968 37398 54359 9624 -41254 -39426 6007 41794 33193 -6349 -34957 -25998 9417
454 9417 37787 31057 -8730 -42180 -27101 23581 49503 18193 -31902 -41575 -1716 37099 30185
467 30185 -6614 -26753 -16442 3727 16670 18036 5659 -15676 -26909 -9940 24151 34787
479 34787 868 -39446 -33895 11663 40985 21047 -22495 -41198 -16847 21214 33147 10995
491 10995 -23669 -39314 -16524 26561 41071 5065 -41702 -43455 3738 44879 30244 -21399
503 -21399 -47686 -20486 23131 35806 10941 -24788 -36955 -13565 23800 36801 9172 -33318
515c3318r745M0707M4998o819n0869l1094K3283M6056J4040k8959l2683j509K1654
528d258J8893M457r411k0577j4472J0189K9388J7005j9101l7446j0566L1959L4828
541C0888l732l4073k4788Q028K8881K0357o799k6526k1953L055L0409K8963q906
554B3804m2571k6030K3824M5961J4178l4218m1699p28L8200L1386o581l2747k7100
567c4321N122L4872L0131r440m2359k9284K0699N1004K0208l8374m8172Q79M5230
580F195L2338j4674l7808j6994J6942K5790R891q571j8530j6143L093K5571K1428
593B8528j0132l2439j7886J9593L4429P338k6524k5886J435K0810J8410J531j5417
606C790k0371o753J6215K7271Q680k6081l3449J602L7120K7399j4482l7150j7426
$$ plain form
515 -33318 -43063 -2356 42642 35823 -15046 -46140 -22857 23199 37239 8280 -24403 -25912 -4258
528 -4258 14635 19092 9681 -10896 -25368 -15179 14209 31214 12113 -25333 -35899 -3940 30888
541 30888 27156 -6917 -31705 -23677 5204 25561 18762 -7764 -29717 -26662 3747 32710 23804
554 23804 -18767 -44797 -20973 24988 39166 4948 -36751 -37479 721 32107 25526 -7221 -34321
567 -34321 -29199 5673 35804 26364 -15995 -45279 -24580 26424 46632 8258 -39914 -39035 6195
580 6195 38533 23859 -13949 -30943 -14001 11789 21680 13109 -5421 -21564 -18471 7100 28528
593 28528 18396 -14043 -31929 -12336 22093 29431 2907 -22979 -21544 -734 17676 19207 3790
606 3790 -16581 -23334 -7119 20152 28832 2751 -30698 -29096 8024 35423 20941 -16209 -33635
619c3635K0203L3786J0242k0277k8818r682J9124L3147J2015k8212l8225l557
631c3889L9753L7464j1087m7414k5335K7157M2728P920k9816k9580K9K3883K2002
644B3815N99j8262k1854n619K0255K8930J964l1091k7860R217L5008J8389j8993
657A4498l1762p047J9932K0320K319j1720j6978r620Q261K1186J3231j2343k9898
670a9621j2114K3025L1160P47k8990k3679O486K5962J7773o863k3278j7298M479
683b2211K5178K3453p270l5835k3448K1622M2471J2375l3038l9258K929L9586
695F554K6928j3959l3038j4793J4060K6187J3994j1253k5882j5146J3175L1003
707A7830J5049k1575l5200m878L1793K8677p702l1022j7552J2987K4470Q554j0404
$$ plain form
619 -33635 -13432 20354 30596 10319 -18499 -28181 -9057 24090 36105 7893 -30332 -33889
631 -33889 5864 43328 32241 -15173 -40508 -13351 29377 37297 7481 -22099 -22070 1813 23815
644 23815 24414 6152 -15702 -21321 -1066 27864 29828 -1263 -29123 -19906 15102 33491 14498
657 14498 -17264 -24311 -4379 15941 18260 6540 -10438 -20058 -11797 9389 22620 10277 -19621
670 -19621 -31735 -8710 22450 23197 -5793 -29472 -22986 2976 20749 13886 -9392 -26690 -22211
683 -22211 2967 26420 19150 -16685 -40133 -18511 23960 36335 3297 -35961 -33032 6554
695 6554 33482 19523 -13515 -28308 -14248 11939 25933 14680 -11202 -26348 -13173 17830
707 17830 32879 11304 -23896 -28774 3019 31696 23994 -7028 -24580 -11593 12877 21431 11027
720A1027j5283r721K399J6152J5809l126k2617j7711R300K7348J2759j7894k6021
733a7579l387J8587J8852J650j4938j7968m311J3753K2424P805k0469l0301k029
746b7911L3501K8803j2229l8084j8152K2577L4868O288k5670k4566m89J9524K1121
759A9581L821j9243k4659k699K5475K7238l756l3865k3970J7513L6600J0136k5526
772F646k7116m79K2730J8483k158j6507j4330k529J2472J9130M946j9060k2553
785b0325P14K4292J9101q750k5633j1648J3491J9266N095r272j4291q925N329
798a1556J7540J3564o994k4952j5592J6589L1909P424k6828k7752L730K8519K0274
811B5875r232k5446j3245R675K0970J3815o575k4377j7224J2713L1565J3472k2626
$$ plain form
720 11027 -4256 -13977 -11578 4574 20383 17257 -5360 -23071 -13771 13577 26336 8442 -17579
733 -17579 -20966 -2379 16473 18123 3185 -14783 -19094 -5341 17083 24888 4419 -25882 -27911
746 -27911 5590 34393 22164 -15920 -34072 -11495 23373 29661 3991 -20575 -21064 -1540 19581
759 19581 23402 4159 -20500 -23199 2276 29514 25758 -8107 -32077 -14564 22036 32172 6646
772 6646 -20470 -20949 1781 20264 18106 1599 -12731 -15260 -2788 16342 21288 2228 -20325
785 -20325 -19611 4681 23782 15032 -10601 -22249 -8758 10508 15603 6331 -7960 -16885 -11556
798 -11556 5984 19548 12554 -12398 -27990 -11401 20508 27932 1104 -26648 -22918 5601 25875
811 25875 16643 -8803 -22048 -12373 8597 22412 15837 -8540 -25764 -13051 18514 31986 9360
824I360l3997l297L3412K7226j0985l2781j4208J5988K4216P800j3251j8594p978
837a7089Q812J8707J1768j0989k5082r345J9670K3825j99k3165j7574P045K0123
850F507Q451p968j1504p310o02J0265J4627J865j6742j9632K152K5476J8375j2932
864A1028k8882q488J9085K2408K275j7172j8064j437J4910J7591M253j6315k3087
877b1895k553K5619K4794p472l2079j8010J7924L2507P673k5192k4623K579K1830
890A102J6871k685j7318j6062J055J7938J7763j636k2687j9054R297K7648J1713
903B3945j7503k3832k464J8652J6400k826j4122r778L49P470J2123N616r564j8243
917a3777n378J6723K0829j053k2653j6757R793K1485Q057j0210j5286o769O356
$$ plain form
824 9360 -24637 -27934 5478 32704 21719 -11062 -25270 -9282 14934 22734 9483 -9111 -17089
837 -17089 -8277 10430 22198 11209 -13873 -23218 -3548 20277 20078 -3087 -20661 -13616 6507
850 6507 14958 6990 -4514 -11824 -12426 -2161 12466 14331 -2411 -22043 -19891 5585 23960 11028
864 11028 -17854 -26342 -7257 15151 17426 254 -17810 -19247 -4337 13254 17507 1192 -21895
877 -21895 -24448 1171 25965 18493 -13586 -31596 -13672 18835 26508 1316 -23307 -20728 1102
890 1102 17973 15288 -2030 -18092 -17037 901 18664 17028 -5659 -24713 -15416 12232 23945
903 23945 6442 -17390 -19854 -1202 15198 12372 -1750 -11528 -11179 -3709 8414 14030 4466 -13777
917 -13777 -19155 -2432 18397 17344 -5309 -22066 -12273 9212 17269 7059 -8227 -14996 -8640
930h640J4216J0544m699j9185j4356J0585K7372J0553k2191k7860J235K7954K0757
943B6285j0062k6830j1932J3254K0921P997r994j8956j0498J0755K3135R680j6660
956G095k5780l938K4294K3318o965k6975j3057J3390K0921N402j2345j4500l434
969a2574Q064J1306P014m918j6186r996J0269J9924N482j5410j8676M68J7615
982B382J3260n233j3586p728J834R256J0655K170j1507j6263j569J9256J8988
995B1915o765k6634j3083J6794K5175L427j9746j9300J903J8053J4056j740j4651
1008e96j5524q02J8794J9007m440k5339j6271J3243K7969Q055k1556k3016K826
1021a7650K1453J3155n954j5366r350L521J2244J0260q88j3322j4544L259J9739
$$ plain form
930 -8640 5576 16120 11421 -7764 -22120 -11535 15837 26390 4199 -23661 -22426 5528 26285
943 26285 16223 -10607 -22539 -9285 11636 19633 9639 -9317 -19815 -9060 14075 23755 7095
956 7095 -18685 -22623 1671 24989 18024 -8951 -22008 -8618 12303 17705 5360 -9140 -12574
969 -12574 -4510 6796 13810 8892 -7294 -17290 -7021 12903 18385 2975 -15701 -15233 2382
982 2382 15642 10409 -3177 -10905 -9071 185 10840 13010 1503 -14760 -16329 2927 21915
995 21915 15150 -11484 -24567 -7773 17402 20829 1083 -18217 -16314 1739 15795 14055 -596
1008 -596 -16120 -16922 1872 20879 16439 -8900 -25171 -11928 16041 24096 2540 -20476 -17650
1021 -17650 3803 16958 11004 -4362 -13712 -10191 2053 12313 11425 -1897 -16441 -13182 6557
1034F557J2531j0874k0031n753J4039J5850K70j2879r572P03O890Q372M849n588
1048E364j3969o886J0872J8009M011j7641j8799M304K1960J1662r964j8160o428
1061a5665R147J5130O110p756j4957r015Q534K0593Q990j6426k4071j112K3339
1074B841K0411p973k6044j1600J5006K0683L270j2976j4506l292J0045J4795M672
1087A5332j0738j7440m699J6396J9462k483k1684j3328J0518J8936M959j1475
1099C756j2663o77P386O912L723k039r334r180L839J5215R206r639j8219m281
1113a5995J5630J5424k662j4607r723L262J0512R177l04j0501j2295q07J5167
1126B278J6026l695k2703j3546J3968K3656M459j8763j8944K600J9307J2165o098
$$ plain form
1034 6557 19088 8214 -11817 -17570 -3531 12319 12589 -290 -9862 -9159 -2269 6103 10952 5364
1048 5364 -8605 -15491 -4619 13390 17401 -240 -19039 -14735 7225 18887 8923 -9237 -15665
1061 -15665 -6518 8612 14722 6966 -7991 -17006 -8472 12121 21111 4685 -19386 -20498 2841
1074 2841 23252 15279 -10765 -22365 -7359 13324 16594 3618 -10888 -14180 -4135 10660 15332
1087 15332 4594 -12846 -17545 -1149 18313 15830 -5854 -19182 -8664 10272 15231 3756
1099 3756 -8907 -9584 -2198 4714 8437 6398 -2936 -12116 -8277 6938 16144 6505 -11714 -15995
1113 -15995 -365 15059 12397 -2210 -11933 -8671 1841 11018 10714 213 -12082 -12889 2278
1126 2278 18304 14609 -8094 -21640 -7672 15984 20443 1680 -17264 -14664 4643 16808 10710
1139A0710j4351r078L010J3596J1490l727j7111j2513Q297K1046Q447j5022k0670
1152a5876L1J8660J2753n609j4384p005M817R539N342o53p439r776j675J2532
1166A257J3009m103j6756r481R415J6601L537j1896j1565N57Q169P441K876m738
1180D323j0751o480P404J5702N914j3419j9040O09K0142J4535q517j9549p595
1193a6722J1149J5901L588r942j2781m391Q120J4846O687j2377j8986k399J8737
1206A430J7557n119k2154j1642J2565J9719K875j3736j2287q3R589R431J602p224
1220B523j0658m142R127J4428K228j4811j3356M331J6273P643p836j2755k907
1233i912P505P384K463k076o877p166P45J1484J0639n527j6318q007J1980J7750
$$ plain form
1139 10710 -3641 -12719 -9709 3887 15377 11650 -5461 -17974 -9677 11369 19816 4794 -15876
1152 -15876 -15845 2815 15568 9959 -4425 -11430 -6613 2926 8268 7615 176 -9600 -11275 1257
1166 1257 14266 10163 -6593 -16074 -6659 9942 13479 1583 -9982 -9425 -1256 6185 9061 4323
1180 4323 -6428 -12908 -5504 10198 16112 2693 -16347 -15738 4404 18939 10422 -9127 -16722
1193 -16722 -5573 10328 13916 3974 -8807 -13198 -5078 9768 16455 4078 -14908 -17307 1430
1206 1430 18987 13868 -8286 -19928 -7363 12356 15231 1495 -10792 -10875 -1286 8145 9747 2523
1220 2523 -8135 -12277 -3150 11278 13506 -1305 -14661 -10330 5943 13586 5750 -7005 -9912
1233 -9912 -2407 4977 7440 5364 -1513 -8679 -7934 3550 14189 8662 -7656 -15663 -3683 14067
1247A4067R09j5918j1974L498J3352Q624l544j1062q347J805J1831J1448k749
1260A1940j7527j2022R953K0750N481j6238j8369J917J8329J1673p467j4753n735
1273a2068N614J0326O322l506j1159q381M429J3954Q471q918j6861l579J4493
1286h63J2975l120j3072p054M518Q838L886j493m587o594k314P054J1625R89j2748
1301a960j1528M352J5511Q299r274j4429k274R884R705J690o686r610l672O913
1315c079J2332M701j0623j6609r29J7545J5030p048j9789q357J2081J6440K394
1328A4089j2676j1522j48R329R753K253r502j2705k168J3529J3704k481j7430
1341e975j1428R218J8063L626j3005j1970J255J0018P098r01o372n690k080M298
$$ plain form
1247 14067 14976 -942 -12916 -9418 3934 12558 9014 -2048 -10395 -8590 3241 14689 11940
1260 11940 -5587 -17609 -7656 13094 18575 2337 -16032 -14115 4214 15887 8420 -6333 -12068
1273 -12068 -6454 3872 10194 6688 -4471 -12852 -8423 5531 14002 5084 -11777 -15356 -863
1286 -863 12112 8992 -4080 -11134 -6616 2222 6108 4615 28 -6566 -8880 -1826 9799 10788 -1960
1301 -1960 -13488 -9136 6375 14674 5400 -9029 -11303 -1419 8286 9976 3290 -6320 -9992 -3079
1315 -3079 9253 13954 3331 -13278 -14207 3338 18368 11320 -8469 -16826 -4745 11695 14089
1328 14089 1413 -10109 -10257 -928 8825 11078 1576 -11129 -13297 232 13936 11455 -5975
1341 -5975 -17403 -8185 9878 13504 499 -11471 -10216 -198 6900 5999 -373 -6063 -8143 -3845
1355c845R507M369q774j2164m12J2545R903l964j2644n638O239R453K519l317
1369C777o532n565J053R337R082l599j3998r014R289J7978L340j5744j4307L700
1383a1203J5094Q883o052j2462n514M809J0132O182l033j2404q921O932J6479
1396H922N620j2704j6474N99J6458J1644o940j4545m721P638R277K583m453o856
1410c952m156K256Q179P607l789j2583n807Q819J3042O80j0878q787K612R194
1424B437N179k336n219m698j414N051R189K690r886j1309J010J4259J0377p114
1438H216j6125l942J0632J1478N12q995q617j187P540R064K479q439j2670j856
1452a1910J4137J3702m837j8128q848J0945J6612K219j3778j1606K916J0749O606
$$ plain form
1355 -3845 5662 10031 1257 -10907 -11319 1226 11129 7165 -5479 -11117 -4878 4575 7094 3777
1369 3777 -2755 -8320 -7267 2070 11152 7553 -6445 -15459 -6170 11808 15148 -596 -14903 -11203
1383 -11203 3891 12774 6722 -5740 -11254 -6445 3687 9869 6836 -5568 -14489 -7557 8922
1396 8922 14542 1838 -14636 -14037 2421 14065 7125 -7420 -12141 -4503 4774 7357 2904 -3952
1410 -3952 -8108 -5852 2327 9934 6145 -6438 -12245 -3426 9616 10296 -582 -9369 -6757 2437
1424 2437 7616 5280 61 -4637 -6051 -1000 8189 10879 993 -10316 -9306 4953 15330 8216
1438 8216 -7909 -11851 -1219 10259 10771 1776 -6841 -8028 -488 8576 11055 2616 -10054 -11910
1452 -11910 2227 15929 11092 -7036 -15884 -4939 11673 13892 114 -11492 -8576 2173 8779
1465H779j855p441p096l61Q193R683j072j1502r728N198J4569N003r762j1372
1479h764O45Q839O311j232n771l718r68K305O214M896m777j0619l255R515J0465
1494A0086k63j1917q530M988J1117L640m823p368m304K515P869O638k828j0946
1508d126p686O146J5130N266j3370j4892K471J5460R140o846j3357m536P782R352
1522E934K252m898q154m591M592J0995M829q196j2378j821J2370J1219m380j3293
1536e520n285P180Q753J714m941n645j889J809N186N125n29q901p119M945J1877
1551F760L369q490j0133M90R299O362k440o521m133N6M517O938K137p593r900
1566i282M2J1566J0359n009j5366o229J1009J3150L25j1155r035J765Q768P133
$$ plain form
1465 8779 6924 -517 -7613 -7974 219 9902 8830 -2672 -12400 -7202 7367 12370 2608 -8764
1479 -8764 -8119 720 7031 5799 28 -3690 -4658 -2353 3861 8757 3980 -6639 -9894 -379 10086
1494 10086 9823 -2094 -10624 -5636 5481 9121 4298 -3070 -7374 -4859 3010 9648 6820 -4126
1508 -4126 -11812 -5666 9464 14730 1360 -13532 -11061 4399 13539 6693 -6664 -11200 -3418 5934
1522 5934 8186 3288 -4866 -9457 -4865 6130 10959 2763 -9615 -11436 934 12153 7773 -5520
1536 -5520 -10805 -3625 5128 6842 1901 -3744 -5633 -3824 1362 6487 5958 -2943 -10062 -5117 6760
1551 6760 10129 1639 -8494 -8004 1295 7657 5217 -1304 -5437 -5381 -864 6074 8211 618 -9282
1566 -9282 -9240 2326 12685 7676 -7690 -13919 -2910 10240 10565 -590 -9625 -7860 908 8041
1580H041j348p305p709p65R688J0588l042j3236q279P785J4204L472j1381j1537
1594a0824K348J0849N659l401o817m172J577N151N633M03p033p722J199J0445
1608C295O729n756j0634k329P678P046l90n863l882J83K250L719M007j824q633
1623d404n028O409J1351J890j0633j0346K821J2318N893o058r488k623M670P436
1637D208L405l483q138n154M591J1341M848r830j2543N32J2943R567n746j2701
1651f160m588Q341R373L37o089n447j806L374O791L639m495q731l218P471R968
1666H760m34j0580p088N017Q579K562m506n052j653J971L475L601M99n793p117
1681g759J709R815O113n981j0921k641R101R132j621q805m831K083N478M757L62
$$ plain form
1580 8041 6693 -612 -8321 -9086 602 11190 8148 -5088 -13367 -5582 8622 12094 713 -10824
1594 -10824 -8476 2373 8032 4631 -2186 -6358 -4781 370 6003 6406 -627 -8349 -7150 3295
1608 3295 10024 4268 -6366 -8695 -1017 6029 5639 -224 -4106 -3923 -1673 2046 6053 4229 -4404
1623 -4404 -9432 -3023 8328 10218 -415 -10761 -7940 4378 10271 4213 -5275 -7898 -3228 4208
1637 4208 7613 4130 -4008 -9162 -4571 6770 11618 1788 -10755 -10223 2720 12287 6541 -6160
1651 -6160 -10748 -2407 6966 7303 1214 -4233 -6039 -2665 4126 7765 3270 -5461 -8679 -1208 8760
1666 8760 8326 -2254 -9342 -4325 4254 6816 2310 -2742 -4395 -2424 1051 4652 5151 -642 -7759
1681 -7759 -6050 3765 9878 3897 -7024 -9665 -564 8568 6947 -1858 -6689 -4606 872 5629 5991
1696E991n903p209n84Q796R071k480j2882p193Q653J3015J245j1363q825K250
1710g418J0259N257l557o719m465J266O619O871j685r703o539M888J1152M381
1724A0607q967j0726J175R963N528l505o567k524K122L794K694O34l553n965j245
1739f535O871P409k488q790m783N026Q728J547n952n722oL553L894K197j859o580
1755c490m029M210R207L584q610j0695J245J2115P035n898j0693k674O768P621
1769E696J332n925n619j753M143P021L190o133r874o93R982Q902l768j1361m737
1784i597O994R143N2o914m370O56L164L654J874k337n420l459L951Q022K334p934
1800a87p592J824Q498M362m041n809k170K734L594K553N8l953n451n56Q009O765
$$ plain form
1696 5991 88 -7121 -7705 1091 10162 7682 -5200 -12393 -3740 9275 10520 -843 -9668 -7418
1710 -7418 2841 8098 4541 -2178 -6643 -5377 1242 8113 6428 -3275 -9814 -4926 6226 10607
1724 10607 1640 -9086 -7911 2052 7580 4075 -2492 -5016 -2894 900 3594 4228 675 -5290 -6535
1739 -6535 336 7745 5257 -3533 -8316 -3290 5438 6985 1033 -4689 -4695 -1142 2752 4949 3090 -3490
1755 -3490 -7519 -3309 5898 9482 872 -9823 -8578 3537 10572 4674 -6019 -8693 -1925 5696
1769 5696 7028 1103 -4516 -6269 -2126 4895 8085 1952 -7922 -8615 1367 10269 6501 -4860 -9597
1784 -9597 -2603 6540 6592 -322 -4692 -4036 -872 2782 4656 2319 -3101 -6560 -2609 5413 7747 -187
1800 -187 -7779 -5955 2543 6905 2864 -2945 -5115 -2381 1213 3766 3824 -129 -5580 -6136 1873 8638
1816H638l800j0208m324P430J0201J45r787o298K801P467L907j984n743m559P99
1831e315O588O390j466r813o687O087J1615K433r608r330J775J0279N366m627
1845C687p357k104L159M525L088j139n576m514K014P562M703m869r307j421Q023
1860D74O532k583o640k598K495L556J766k66j611l552k523L377P188Q92p412o777
1876g682K801Q697L841n480p386p21N312M360J040k940m715k995L002P201L492
1891G827o132r590k87J0178Q233m841j0628l844P193Q251J49o592n044P03M241
1906a83M019J381l743o600j197O619P128j497q657n447M702R016J171o227m879
1921d394J049L518K488L37j214l077k546N21N976M113m482q155o48P330O220k543
$$ plain form
1816 8638 4838 -5370 -9694 -2264 7937 8082 -1705 -8003 -5202 2265 6172 4188 -1555 -6114 -5315
1831 -5315 1273 7663 6197 -3616 -10303 -4216 7399 9832 224 -9106 -7331 2948 8314 3687
1845 3687 -3670 -5774 -2615 1910 4998 3859 -1717 -6231 -4217 3345 8048 3179 -6128 -7549 474
1860 474 7006 4423 -2217 -4815 -2320 1236 3002 2736 1125 -2427 -4950 -1573 5615 6507 -905 -7682
1876 -7682 -4881 3816 7657 2177 -5209 -5930 -618 3742 4782 1842 -2873 -5868 -2866 4335 7827
1891 7827 1695 -7895 -8182 1996 10229 5388 -5240 -9084 -1891 6360 6509 -83 -5127 -4424 -183
1906 -183 3836 5217 1474 -5126 -6323 296 7424 5927 -2730 -8177 -3475 5541 6712 485 -4394
1921 -4394 -3345 173 2661 2998 1784 -1293 -3839 -3318 2658 6771 2289 -5866 -6514 816 7036 4493
1937D493p231k898L303N045J278j601l140l594k42N774N892k210q765n109N898
1952c107J0437J297r626p505L041Q614L790l998n843k503K559N005L398j524o406
1967b371n009L788R295K580p517q541J336R277N145m531p463j166M202L626Q41
1982C492j565k877k915P70M624M059k108p174k984N497O675l61o122m038J985
1997c042M282J800q87k253k029j713K131N550J985n761o886J120Q172N369m733
2012C105q467j823O616N450m45m557l885o58L677N047J176m312o996r37Q112P156
2028H259l153r953l692O976P996k20p022m669J946M691K326o32k525l501j369
2043d542L823N297O31o282n231K195P910K487m998n773M91M312K471k15j839k204
$$ plain form
1937 4493 -2738 -5636 -2333 2712 3990 2389 -751 -4345 -4587 1187 7079 4869 -3896 -9005 -3107
1952 -3107 7330 8627 -999 -8504 -5463 3151 6941 2943 -2900 -5403 -2844 2161 5559 4035 -2371
1967 -2371 -7380 -3592 5703 8283 766 -7775 -6439 2838 7983 3452 -4011 -5177 -975 2651 3492
1982 3492 1927 -950 -3865 -3095 1529 5588 3480 -3694 -6678 -1181 5494 5133 -989 -5027 -3042
1997 -3042 1240 3040 2153 -100 -2129 -3842 -1711 3839 5824 63 -6823 -5703 2469 7838 3105
2012 3105 -5362 -7185 -569 4881 4436 -121 -4006 -4664 -987 4060 5236 924 -6072 -7009 1103 8259
2028 8259 5106 -4847 -8539 -1563 6433 6213 -809 -5478 -3532 1159 3485 2853 328 -3173 -4542
2043 -4542 -719 4578 5209 -1073 -6304 -4109 3801 6288 1290 -4483 -3992 320 2791 2576 737 -1467
2059a467j596J97M309L979k730o960k597O049O935p04p216m759L409O077J972
2074D898l054l879k327J468M458L812j930o683l927M403Q551K110q241p789K785
2089e345Q906L687m916o073j540M351M109L98j897l646k803J945N930L143m425
2104A824p390n30P017N824k706p399k083M330M055J45k305k105j373M25K509L380
2120C618j47m829m309K874O806J554n237n022O29M733L217j335l063k037n42K140
2136i50L968K014m583o063R1P249N851l609q801k717O941O666r58o453l531J452
2152c433M312L197r86l291l643q18M893N746j381p489m152M578P539J049o373
2167b52n506K073N707J756k025k293j570m12K154L294J001l275m904k75O217L873
$$ plain form
2059 -1467 -3063 -2866 1443 5422 2692 -4268 -6865 -816 6119 5415 -1801 -6560 -3151 2926 4898
2074 4898 1844 -2035 -4362 -2894 1564 5376 3446 -3237 -7164 -2761 5790 7900 -341 -8130 -5345
2089 -5345 3561 7248 2332 -3741 -5281 -930 3179 3577 1680 -1966 -4769 -2824 3106 6249 1824
2104 1824 -5566 -6096 921 6745 4039 -3360 -5443 -1113 2942 3087 782 -1323 -2696 -2271 238 3618
2120 3618 3471 -1358 -5667 -2793 4013 5567 330 -4692 -4063 670 3887 2552 -511 -2548 -3090 -950
2136 -950 3018 5032 449 -5614 -5523 1726 7577 3968 -4833 -7550 -609 6057 5099 -1354 -4885 -3433
2152 -3433 879 4076 3090 -201 -3844 -4662 231 5977 4596 -2893 -7045 -2467 5072 6121 -252
2167 -252 -5758 -3685 2022 3778 1753 -540 -2110 -2522 -368 2926 3927 652 -4252 -4527 1690 5563
2183E563k909n829j397L679L827K68k833k210r76P07L220L255j495o074l231N100
2199a335P278j96o995n339K984P212K158m709m655m08K838L214J662j787m086
2214b164k955K716O369K547n696p189R44P955M513m108p270r43N056M155n78l174
2230A78k401n22J474L106K290k455m801j781M693N043r23n806l026L230M082N80
2246B961k027k175o79K67J624K546R47l564m576R62O186L608m440o105n05N474
2262E04M118j409m644k171J554K215K319Q67k908m480o40N460N244j831p864l604
2278g270N678P061k0o699m224K598N088J910k347l277j629R68K979K891o85m645
2294a623l459K789N596J735m570m767N37M764K370j906k125j132k15J229K408
$$ plain form
2183 5563 2654 -3175 -4572 -893 2934 3202 369 -1841 -2817 -2110 1110 4365 2870 -3204 -6435 -1335
2199 -1335 5943 5747 -1248 -6587 -3603 3609 5767 1058 -3597 -4005 -1167 2047 3709 1922 -2164
2214 -2164 -5119 -2403 3966 6513 817 -6372 -5428 2527 7040 2932 -4338 -5281 -225 3930 3352 178
2230 178 -2223 -2745 -1271 1835 4125 1670 -3131 -4912 -219 4824 3901 -1905 -4931 -1701 2381 2961
2246 2961 934 -1241 -1920 -1653 -29 2517 3464 -100 -4676 -3714 2472 6080 1640 -4465 -4970 504
2262 504 4622 3213 -1431 -3602 -2048 167 2486 3353 445 -4035 -4675 785 6029 4198 -3666 -7270
2278 -7270 -1592 5469 5449 -1250 -5474 -2876 2212 4122 1775 -1502 -3131 -2163 816 3707 3022 -1623
2294 -1623 -5082 -2293 3303 5038 468 -4299 -3762 1002 3372 1466 -659 -1791 -2006 -777 1631
2309A631J388j846m246r07L937N292j687o134k279L480M825J39l171l033K34J747
2325f30J952J326o82l773l264K968O337J581n666o381J488P509M019n049o006
2340d271p0M301L498k12l225k660m14K111L819J499l472n238j45N645M029k264
2356B931n924j626L621M191Q6l523j867M20R50J997J493j108l504j809K348M966
2372C642N19m884l777K058M511J480k534k546k94J062J229J082P44j596l891n77
2388c772M605M663k399o485k567N008O134q26n761l451K738M082J368j564k694
2403i21k305O68L209L389j190m950l443L421O260R45n510m362J612M918K188k625
2419A304l275n78J278J595K026O9l111k979J174M569K264k922m917l04M503K552
$$ plain form
2309 1631 3019 1173 -3073 -3980 -43 5249 3562 -2572 -4851 -1371 3454 3593 422 -2611 -2377 -630
2325 -630 1322 2648 1966 -1807 -5071 -2103 4234 5815 149 -6232 -4744 2765 6784 1735 -4271
2340 -4271 -4341 -40 3458 3246 21 -2639 -3053 -942 2877 4376 904 -4334 -4479 1166 5195 2931
2356 2931 -2993 -4619 -998 3193 3279 -244 -2111 -1691 -741 1256 2749 1641 -1863 -3672 -1324 3642
2372 3642 4161 -723 -4500 -2442 2069 3549 1015 -1531 -1825 -763 466 1548 2292 696 -3195 -3772
2388 -3772 833 5496 3097 -3388 -5955 -947 5187 4361 -1400 -4851 -2113 1969 3337 1773 -921
2403 -921 -3226 -2558 651 4040 2850 -2100 -5543 -2122 4138 5083 -427 -4789 -3177 1741 3929 1304
2419 1304 -1971 -2549 -1271 324 2350 2419 -692 -3671 -2497 2072 4336 1414 -3503 -3807 696 3248
2435C248j710k775n94Q71O12R43J199k52l182k225K214N364R89n460m781K490
2451c049N752K174l940m636K03L636K663o66j639k544j141J968M080J187l523
2466E25m954K93N749L582l060n553j266M240L757m39k960k300m0K049K419J113
2482C155k506l769m87M059L985j394n050k207K996M330k11l415j621J253J124
2497B42K70Q27K58j651k678M04M148K541k948m971k97M929L107j840m144j537
2513c340K473K533O33j321j264j942o5K800L334j164m927k514L212N482N09m972
2529e33l861J705M213K052k007k740j858J023L171K331j330l630k678K524N248
2544C630J050n069l896J350M890J734k762k915K78J571R25J94M98q47k283q29
$$ plain form
2435 3248 1538 -1237 -1831 -960 -348 595 1794 1542 -1640 -3865 -1651 3713 4702 -758 -5539 -3049
2451 -3049 2703 4877 937 -3699 -3496 140 2803 2137 498 -2046 -3187 -1219 2861 4048 525
2466 525 -4429 -4136 1613 5195 2135 -3418 -4684 -444 3313 2874 -86 -2386 -2426 -377 2042 3155
2482 3155 649 -3120 -3607 452 4437 3043 -2007 -4214 -1218 3112 2901 -514 -2135 -882 242
2497 242 512 1339 1597 -54 -2732 -2328 1820 4361 1413 -3558 -3855 1074 4181 2341 -1803 -3340
2513 -3340 -867 1666 2299 978 -286 -2228 -2293 507 3841 2677 -2250 -4764 -1552 3930 4439 -533
2529 -533 -4394 -2689 1524 3576 1569 -1171 -3029 -2006 1165 3496 2166 -1464 -4142 -1618 3630
2544 3630 4680 -389 -4285 -2935 1955 3689 927 -1988 -1710 -139 786 980 1478 631 -1652 -2481
2560b481K721L561j040m510k699L531M384M9m049k339J402K527Q00m76j066j034
2576g19j119Q35L419J324l473m026O75M747L058k862m580j446L976L246m20k683
2592d8j996m46J991L151O71l285l803K41M844L328k583n384j165M552L473j073
2608B468l358j480J143J468Q51K32l13k385j320J554L825P89l779l927J591M814
2624B173J448l264l348Q24K564J128n02j000o66o34j90J781K245j148l684j838
2640d111L365M030m65l745k908J845L418J154j594k206j283M39K780K318p48m529
2656b240j955K989M463O36m764l668K116M717J194l059k483J96J301J543N14p6
2672A424j609k447P23L338K839l046m493k96M309L107j704m173q97K663J955m94
$$ plain form
2560 -2481 240 3801 2761 -1749 -4448 -917 3467 3516 -533 -2872 -1470 1057 1857 1381 315 -719
2576 -719 -1838 -1003 2416 3740 267 -3759 -3084 1663 4721 1859 -2721 -4167 -191 3055 2635 -48
2592 -48 -2044 -2490 -499 2652 3323 38 -3765 -3524 1320 4648 2065 -3319 -4484 68 3541 2468
2608 2468 -890 -2370 -1227 241 1092 1324 1011 -1374 -2694 -1140 2685 3474 -305 -4232 -2641 2173
2624 2173 3621 357 -2991 -2167 397 1525 1023 23 -643 -1277 -1467 314 2559 1411 -2273 -4111
2640 -4111 -746 3284 2819 -926 -3834 -1989 1429 2583 989 -1217 -2500 -2061 719 3037 2289 -2240
2656 -2240 -4195 -1206 3257 3893 -871 -4539 -2423 2294 3488 429 -2054 -1858 -557 986 1500 1424
2672 1424 -185 -2632 -1909 1429 4268 1222 -3271 -3567 742 3849 2145 -2028 -2925 -262 1693 1199
2688A199p04m65q77m58R96K339O17k557l243R97M130J777l061l349O4K741K494
2705B640p25k071j560k83J628K749O91l070l707R75M525K530k975m408n81L950
2721C08K962j281l109j057Q94J589J093M54j526k204p06K551L707n31n111k159
2737d126L094M599l8l996k596J730K953P8j324n71j70o83L76J701J384j457l220
2754b266m33L303K914j767l570q78K248J718L18j060j387p81N08K010J741j095
2770A523l522j750L408L779o11m060k339J941L740P44k438j884O0P82J359J557
2786B289m84k774k117J481M043J600l755m221Q88N056K217l085l946L00K828J823
2802B143j175j226o38l8J10R68J818q06k602j436K234K839K95l205j989J593K234
$$ plain form
2688 1199 495 30 -847 -1305 -309 2030 2647 90 -3153 -2156 1974 3751 690 -2659 -2595 146 2640
2705 2640 1915 -156 -1716 -1999 -371 2378 3069 -1 -3708 -2733 1792 4322 1347 -3061 -3642 308
2721 308 3270 1989 -1120 -2177 -1283 306 1399 1853 327 -1877 -2583 -32 3675 3144 -1967 -4126
2737 -4126 -1032 3567 3529 -467 -3063 -1333 1620 1698 374 -197 -367 -1050 -674 1027 2411 954 -2266
2754 -2266 -2699 604 3518 1751 -1819 -2697 -449 1269 1587 527 -860 -1641 -1133 877 2618 1523
2770 1523 -1999 -3749 -341 3438 2827 -1233 -3572 -1631 2109 2853 415 -1469 -1409 -627 732 2289
2786 2289 1805 -969 -3086 -1605 2438 4038 283 -3938 -3050 2006 4223 1138 -2808 -2508 320 2143
2802 2143 968 -258 -896 -934 -824 144 1962 1156 -1446 -2882 -648 2191 2486 -719 -2708 -1115 1119
2819A119M83j027q11j264J43J309K036K96k804k550Q73M006J659k877l439K22
2835b626L055K184j288k008j052M21J319J215J066j917l179J11L401L243j918
2850B027m854j369L996M056j039m384j497K034K354N35j520j033n11K29R30J640
2866A594L62k410k505J486L071J184k385k754J26K930J266j198j279l73j12M15
2882e82J568Q50j495k420m28K704K698j013l688p90K067K230j14j349j335k51
2898a348N99R01J605M1k840k396K047M268Q07m168l343J375M777J294k990l387
2914b758Q13K387J473n58j368j004l07N60J571J679j650l177l51L259K595j490
2930A674l386r29K151K569l41j973q41K09K31J099J136n04j996j444J465K934
$$ plain form
2819 1119 1602 575 -236 -1500 -1357 -48 1988 2284 -520 -3070 -2197 1809 3468 591 -2848 -2626
2835 -2626 429 2613 1325 -683 -1735 -1314 5 1220 2286 369 -2810 -2699 702 3945 2027
2850 2027 -2827 -4196 -200 3856 2817 -1567 -3064 -1030 1324 1859 339 -694 -1205 -976 -46 1594
2866 1594 1956 -454 -2959 -1473 1598 2782 397 -2357 -2231 699 1965 767 -512 -885 -997 -582
2882 -582 986 1836 341 -2079 -2507 197 2895 1882 -1806 -2596 -529 1701 1587 238 -1097 -1348
2898 -1348 -749 152 1757 1798 -1042 -3438 -1391 2877 3684 -484 -3827 -2452 2325 3619 629 -2758
2914 -2758 -1945 442 1915 1357 -11 -1015 -1322 -762 809 2488 838 -2339 -2690 569 3164 1674
2930 1674 -1712 -2641 -490 2079 1738 -235 -1076 -867 -636 463 1599 1095 -901 -2345 -880 2054
2946B054N54k701k509J285K474O69j398j071M0k19N32J574O18j526l117K4L809
2963A092K594k075m475m91L702K921j306l571q72J570K281Qr16q71r25j96J765
2980B35J966l68l263j843K369L472J8l288k291J495K702Q52j625j498n9O56O16
2997A46J230J53j727j890P87K699J226k000k409JK475J063r20j407l26L96K58
3014b45N69J320l23k288j408J856L198J40l708k433K200L252P26l064j842Q28
3030a222J748P20m69j87j203j026O53K705J155k729k497p5L664K003k018l604
3046b382k8K826J726p93j484r94N2Q77J185N39q79k329m35K421J994j121k633
3063a458q40J810K016k80j273r03O33j01L32Q77L54j358j983O45K945J421k320
$$ plain form
2946 2054 2608 -93 -2602 -1317 1157 1826 428 -643 -603 -822 -290 1284 1902 376 -2741 -2717 1092
2963 1092 3686 1611 -2864 -3355 347 3268 1962 -1609 -2481 -911 1370 1378 462 -409 -1334 -1530 235
2980 235 2201 1833 -1430 -3273 -904 2568 2586 -702 -2993 -1498 1204 2056 431 -1067 -1126 -470 146
2997 146 1376 1529 -198 -2088 -1301 1398 2624 624 -1785 -1784 691 1754 834 -573 -899 -503 -245
3014 -245 324 1644 1321 -967 -2375 -519 2679 2819 -889 -3322 -1122 2130 2856 -208 -2050 -1222
3030 -1222 526 1246 777 590 -613 -1639 -986 1719 2874 145 -2352 -2427 1237 3240 1222 -2382
3046 -2382 -2410 416 2142 1349 -135 -1129 -1077 -200 985 1524 645 -1684 -2119 302 2296 1175 -1458
3063 -1458 -2298 -488 1528 1248 -25 -928 -295 -396 -64 813 1167 -191 -2174 -1529 1416 2837 517
3080E17l552P12L388J546j892k304R2J121J281j08j45p75j157l67K066K397j263
3097A557l506j111K589L277n78l323j644J612K795L9j422j278k98Q06Q86J211
3113A612p26j781j497J374L011L01k910j950J297K467O48j731j341L52P84k1M62
3130C51O78p87j744m75K592J652j117k992o10K371K041o87k348p26J335P83O9
3147C86K32j72j103p56P24K402N50k563k695J290L388J054k277k768L73K309J459
3164A833r30j467n12M6P61J615L27j518k150mK942J638j522k979l65K641J812
3181B168j092j704l94M14P17L42M98j16j555j085J381K299Lk806j326J153L053
3198A950n0j852j427Q73Q28L23n72L04m83j077J61J736J677j280k842m67K549
$$ plain form
3080 517 -3035 -2323 1065 2611 719 -1585 -1493 -372 909 801 656 -119 -1276 -1643 423 2820 1557
3097 1557 -1949 -3060 -471 2806 2228 -1095 -2739 -1127 1668 1707 285 -993 -1291 -485 401 1612
3113 1612 886 -895 -2392 -1018 1993 2294 -616 -2566 -1269 1198 1846 115 -1226 -874 -90 -111 351
3130 351 1029 242 -1502 -1977 615 2267 1150 -1842 -2452 -81 1960 1273 -1075 -1801 -466 317 386
3147 386 618 446 -657 -1413 -689 1713 2263 -300 -2995 -1705 1683 2737 460 -2308 -1935 374 1833
3164 1833 903 -564 -1076 -1030 -269 1346 1673 155 -1995 -1999 943 2581 1059 -1920 -2285 356 2168
3181 2168 1076 -628 -1022 -608 109 451 949 833 -722 -1807 -426 1873 1876 -930 -2256 -1103 1950
3198 1950 1900 48 -1379 -506 322 645 73 377 -106 -1183 -1022 714 2391 1111 -1731 -2198 351
3215C51K434j183k823j084J851J930O3j381r00k27L12J384J116p92k314r32J970
3232b25K504k3l245j668J680K750o6j781j048K16R66N52J60j39r01j241L34K460
3250A285Q12k170j732J38K406J109j348j849J96J369N31n99J78j01q77n19J236
3267F5J702k19k111j787J666K568J51k456r74N39J464O71m95q89n70k77N56J340
3285I44P59j718k183N86K879J266j981k810L50K345J606j139j594k40O81M20N09
3302F80K49q47j069n44J632J888p23k689r34K136K223r14j914q51R78J063ml16
3320D4o4k40j017K46J695J048j593k040j8K729J114j343k450L96J616O39m8q22
3338a08m14l60J87J231J194q38k569p79K486K330j29l181j373J638K341k60j706
$$ plain form
3215 351 2785 1602 -1221 -2305 -454 1476 1539 158 -742 -969 -657 727 1843 1051 -1263 -2195 -225
3232 -225 2279 2256 -989 -2657 -977 1773 1707 -74 -1122 -906 60 612 772 633 -268 -1509 -1175 1285
3250 1285 2097 -73 -1805 -1667 739 1848 500 -1349 -1153 216 747 148 326 225 -652 -1171 65
3267 65 1767 1548 -563 -2350 -684 1884 2035 -421 -1395 -856 608 1279 784 -105 -675 -952 -396 944
3285 944 1703 -15 -2198 -1612 1267 2533 552 -2258 -1908 437 2043 904 -690 -930 -249 171 680
3302 680 929 82 -987 -1531 101 1989 1266 -1423 -2357 -221 2002 1088 -826 -1677 -699 364 360 44
3320 44 -20 -260 -1277 -1031 664 1712 119 -1921 -1939 790 1904 561 -1889 -1493 123 762 714 -108
3338 -108 -522 -882 -695 536 1730 892 -1677 -2456 30 2360 2231 -950 -2323 -685 1656 1396 -310
3355c10r41N23O90O06M68m53j567o82J180J919O80k370k179J155K808L67j879
3372A5j455M56J490J38m52k0j67o85r5Q21J348p75j660p35J812J725p11j621j013
3391a584J299J240j31n75p8m43n15O59J425K36j752j442N36K360J060k172j910
3408a787M85J900J012j020j366j84P80L10M58O22r70j716J51K024J654j468k597
3425a712m69K382J919r12k259n13J442R08j47j38m26n34l67Q26J235K35j918j470
3443a918J020K438K20k087j163N77J662K11o93l36J04o46p5J155R34j102j523
3460a222p25K174J826q16k524m07J646J336p3j430o14J56N77N40P32l47j644j169
3478a984J709K268j43k701j604J551K490M88k409j232L19J867L11k39m84o87n44
$$ plain form
3355 -310 -1251 -728 -38 568 1036 583 -984 -1666 -486 1433 2113 -257 -2436 -1281 1527 1894 15
3372 15 -1440 -984 506 644 192 172 5 -680 -775 46 1394 619 -1041 -1776 36 1761 1050 -571 -1584
3391 -1584 -285 955 824 249 171 -272 -787 -128 1297 1533 -219 -1661 -1125 1235 2295 123 -1787
3408 -1787 -1302 598 1610 590 -776 -960 -180 130 588 1210 240 -1476 -1325 699 2353 885 -1712
3425 -1712 -2181 201 2120 1208 -1051 -1564 -122 786 639 501 75 -459 -826 0 1235 1470 -448 -1918
3443 -1918 -898 1540 1760 -327 -1490 -913 749 960 267 -69 35 -611 -686 469 1403 301 -1222
3460 -1222 -1947 227 2053 1237 -1287 -1694 -48 1288 1215 -215 -829 -673 -96 444 1176 829 -815 -1984
3478 -1984 -275 1993 1850 -851 -2455 -904 1586 2074 -335 -1567 -1248 619 930 691 207 -480 -1024
3495a024N72J393O61j644j807M81K151J100j480j619J24J292P25n41p81K10J4
3512a73l14L96J033K34j729j145J382J558K74j974j187Q63J690L66j188n41J31
3529c24k39O02O17L94r94j295Q0J752J421j521k268K00K153J133j008j671l36
3546a304J131R15L0k82m10j077r2J420J139m73k157p81J557K246p71j910r30J272
3564d77J369k83p67J2k46l10L22P66P26j071j561L48J929N72j188j183j17J485
3582C26Q10r13n48j88J97j12N34Q41l24j577o37J510J725m20k381o76J562J728
3600A457J9j757p48L64J133J81k69R8j018o35Q28J638j31j501j405Q45J914Q51
3618A864j933j460O32J675L88q71o27O1QJP38L21l21j450j94J444J277q26j383
$$ plain form
3495 -1024 -452 941 1602 -42 -1849 -1368 783 1883 403 -1216 -1092 200 925 384 -397 -187 -173
3512 -173 -487 -91 942 1176 -553 -1698 -316 1242 1516 -458 -1645 -782 908 1274 86 -455 -324
3529 -324 -563 39 656 1050 56 -1239 -1159 593 2014 493 -1775 -1575 578 1711 703 -968 -1304
3546 -1304 -173 742 772 490 80 -997 -1089 331 1470 997 -1160 -1941 -384 1862 1091 -819 -1749 -477
3564 -477 892 609 -158 -146 -392 -702 -380 386 1112 41 -1520 -1172 757 1329 141 -1042 -1159 326
3582 326 1136 223 -325 -513 -316 -428 106 947 623 -954 -1591 -81 1644 1224 -1157 -1833 -271 1457
3600 1457 1476 -281 -1029 -665 468 649 380 478 -540 -1175 -347 1291 1160 -341 -1746 -901 1013 1864
3618 1864 -69 -1529 -897 778 1166 295 -332 -271 -263 -262 476 797 476 -974 -1168 276 1553 727 -656
3637f56p09J232J299m83o81l69J61J42n1O20N86j372j065N66J755M38j296j693
3655a576L63K016P42j351j206L0P39N32J83J42m30j035j94J530J373j140j935
3672a217o06K067J486n65j932p43J474J132m40n75n20P0q7N75J025k94j205j065
3690a420Q15J829J84j721j303J197J276J90q02n96r4M65J6k0O26jj281l20J480
3709E20J028r62j464o49J741J204q27j044l09L37P24L0M12l47q65n52P99J543
3727A319J45j897j491J466J786J88j633j352O16J547K43p14o24K0K9j67J212K79
3745I72r79r49J67J591O78j007j857L91J541N02o42q19m7L16J66LK82J45p67n80
3765h93O02J533oj561j092Q28J548K22j218q34Q85R5l5j09P67o01r90n1J291Q86
$$ plain form
3637 -656 -1365 -133 1166 683 2 -367 -206 -64 -115 505 1091 -281 -1346 -780 975 1413 117 -1576
3655 -1576 -1213 803 1545 194 -1012 -982 -243 289 472 614 184 -851 -1045 485 1858 718 -1217
3672 -1217 -1823 244 1730 1165 -767 -1510 -36 1096 656 81 -439 -369 -456 119 1144 850 -355 -1420
3690 -1420 -605 1224 1408 -313 -1616 -419 857 1047 245 -351 -445 20 36 16 642 641 -640 -960 520
3709 520 1548 586 -878 -1527 214 1418 591 -453 -762 -425 299 329 741 394 -471 -1023 -224 1319
3727 1319 1464 -433 -1924 -458 1328 1516 -117 -1469 -853 694 937 223 -401 -381 -352 -519 693 972
3745 972 -7 -956 -789 802 1480 473 -1384 -993 548 1050 408 -411 -458 -142 24 27 309 454 -313 -893
3765 -893 -291 1242 1236 -325 -1417 -589 959 1181 -37 -871 14 109 74 -35 732 131 -859 -910 381 1267
3785A267p14k045k7K054R92j128j386j88J018P75q0n59m33r4K87L06J010j80j491
3804f16q43J270J577j12j913j047J447J090j14j022o08O44J25L12L9J77n07q78
3822i79J68J563O45j442j113R9J775K22o60q82K15K98J17j02L81J72q22o71Q77
3841a39J274l9j833p31Q69J860l08j361o40M65J002N4l27j63k53o04O24Q36O04
3860A190j280j560P02J892O35j598j414M43J562N40o88q55j36M36J98N7M78l45
3878B57p60j84Q23J235n25j626l90J425Q81n77j010k16M91L07j27K43J60j43o91
3897d27j3R94N76j211j145N60J361O56j157j151L14P03M97k11j64p6n70n3Q28
3916C11J017o69j689k44J290J551p53j683o32J141J189l54p79m04K51M30j04O95
$$ plain form
3785 1267 553 -1492 -1519 535 1527 399 -987 -1175 -157 618 538 -21 -454 -548 -261 45 1055 875 -616
3804 -616 -1459 -189 1388 1276 -637 -1684 -237 853 739 -283 -891 -247 -122 190 229 406 -101 -979
3822 -979 -811 752 1397 -45 -1158 -1059 716 938 278 -604 -389 -91 26 -76 305 477 -345 -1016 -139
3841 -139 1135 1096 -737 -1468 -599 1261 953 -408 -1048 -583 419 473 146 -17 -270 -874 -250 586 1190
3860 1190 -90 -1650 -948 944 1579 -19 -1433 -990 572 1112 424 -431 -567 -131 67 124 602 257
3878 257 -503 -687 136 1371 846 -780 -1170 255 1136 559 -451 -667 -176 131 4 247 407 264 -427
3897 -427 -440 554 1130 -81 -1226 -666 695 1351 194 -957 -643 60 557 346 182 106 -464 -517 311
3916 311 1328 659 -1030 -1274 16 1567 814 -869 -1501 -360 829 475 -304 -708 -457 -27 -131 564
3934E64k22q50k88L20J561k4j182j216O06J664J63j168q02K60O32M50m07J36N7
3953B54q07k62J068N72m01j326k82J436J039o72j317m7P40M94k04l37j49J35m54
3972e20N61O63J95j069j145N88J629K81j360j113N21J349J47n92n43j00K33J91
3990h4OQ18q54q52j13J508R17j136j356J71J336R18j055j040J75Q17J92k62m1
4009F5J9l59l73M70Q56L3r10p77O08J307j45q58p79N26N91J9j81n6p9n26J98N82
4031B31Q63p87j288L2J232R01p88j263j26J161M21o7q75K82j29J73L4M85j08q51
4051d67q39Q89J668l04j496o76Q98J221J07j144o04M23P80k43M7j0j98n59K62
4070b45R38O68j327r82R4J308P09j018j091K80R90K58o33Q9q7J28k95r8J012m3
$$ plain form
3934 564 342 -508 -796 -476 1085 1061 -121 -1337 -731 933 1096 -72 -874 -614 18 468 61 197 254
3953 254 -553 -815 253 825 424 -902 -1184 252 1291 619 -698 -745 -5 489 285 -52 -201 -66 -520
3972 -520 41 704 899 -170 -1315 -727 902 1183 -177 -1290 -769 580 727 135 -408 -508 -275 -84
3990 -84 -78 740 -114 -966 -1079 429 1346 210 -1146 -975 361 1279 224 -816 -641 176 368 106 65
4009 65 84 -275 -648 -178 678 711 -199 -976 -368 939 794 -64 -843 -317 274 293 112 56 -23 -549 -351 231
4031 231 1094 307 -981 -949 283 1184 396 -867 -993 168 589 522 -353 -71 -200 -27 7 492 384 -467
4051 -467 -1306 -417 1251 947 -549 -1225 -327 894 1001 -143 -747 -324 456 213 260 250 52 -507 -245
4070 -245 693 1361 34 -948 -854 454 1163 145 -946 -666 324 582 -51 38 -49 79 -216 -314 698 655
4090F55j318n09R19J234l47j043n77N04J045j45m23j39K1j16L43M94o6p06q33
4109a007L73J267O33j240j201L08J317N52p05r16J75M87K90JJ4j56p39J23P91
4128C67O13l30j317m22J367Q47m25j226l28J010M78l87k27j93K4N2p2N48J33o02
4148i0n76j02J482K06r91q17K39J025K42l60n87L93m48m3N70M84m20r52j74R53
4168C4R90j91j362o18J125Q55l57n57p45N60K52K44N9R5o53l23N9J315J65j154
4188b07r37N36J291L52j104q21M22Q32L49o17k94J64k06k00N48M48j53j135q9
4207h21Q08Q86o23p37k47O64N78j05m04j78K8m8J9M02M15o94j009N15R81P14j128
4228A6r75K19J514J69q36m78J02J10K60L63k42j66n97p5P45O56n33j208k19J442
$$ plain form
4090 655 -663 -1172 -253 981 634 -409 -986 -482 563 418 -5 -144 -123 -239 104 598 532 -174 -1007
4109 -1007 -634 633 1266 26 -1175 -867 450 1002 297 -619 -444 43 333 334 348 192 -547 -424 367
4128 367 980 650 -667 -1089 278 1125 700 -526 -854 156 634 247 20 -173 -149 -97 -169 379 512 -90
4148 -90 -666 -768 714 920 -71 -888 -649 376 618 258 -329 64 -384 -427 143 627 207 -745 -919 34
4168 34 1024 833 -529 -1147 -22 833 476 -81 -826 -266 -14 230 289 384 -269 -592 -533 782 947 -207
4188 -207 -1144 -608 683 1035 -69 -890 -468 364 713 96 -198 -34 -240 -440 108 556 403 -732 -821
4207 -821 -13 873 250 -487 -734 -70 508 403 -1 -179 -151 -199 -180 222 637 -57 -1066 -551 430 1144 16
4228 16 -959 -740 774 943 107 -371 -269 -159 101 464 222 56 -541 -616 129 785 252 -956 -1175 267
4248B67P60p01j207L4R91N25n91m2r3N2j29nO24O2p35o54L86J237k13q24n82L14
4270e24Q97J9n86j06M72j11k92J88K72K70j178j40R46O24m09r15j00P19P37m72
4290C11q86J95L00J55j85J70j76k67k23J89J165J98j327r79J094J139J24j083
4308h6n51K50R38j07m43j55l8K63m83O55K88m21q58k51J407M57o73q91j58J029
4328A72K15m81j38K17J5J6j8L16L25p64o78N96J102r2j280j16L69Q67k77m64J4
4349h4pJ73r5K60L32m34q13O1Q76P70q00j144K8J436O44r13q92R9M26M28k93l2
4371B6k83J75k92O19L67j17j068j91P59P85k14j140j40O39Q77n37n24l7M36k51
4391a11L1K36L55n11o78K44J057P8o41o55L14O63J04j82o73L25K39l19J36K89
$$ plain form
4248 267 1027 326 -881 -847 144 669 78 36 -57 -5 -134 -139 485 547 -188 -842 -456 781 568 -256 -838 -524
4270 -524 373 392 -194 -300 172 61 -231 -43 229 499 -679 -819 127 751 342 -573 -673 46 783 311
4290 311 -575 -380 -80 75 -110 60 -116 -383 -606 -417 748 946 -381 -1360 -266 873 997 -86
4308 -86 -637 -387 551 444 1 -154 -192 71 -412 243 531 110 -748 -999 408 865 192 -699 -857 172
4328 172 387 -94 -232 -15 0 16 -2 314 639 -125 -803 -207 895 803 -477 -593 -224 643 366 -98 -84
4349 -84 -91 82 -13 247 579 145 -668 -607 269 1039 239 -905 -877 559 1203 290 -602 -503 -77 351 58 26
4371 26 -257 -82 -374 245 612 495 -573 -764 -5 780 566 -574 -714 -75 802 265 -259 -296 140 -111
4391 -111 -80 156 511 0 -678 -434 623 701 60 -595 -281 382 486 304 -369 -44 195 -124 12 301
4411C01J80n49p00O07R63l85q27n66P65Q64M1j033j88N97K06Pj08L1m84n1K42
4432h7L64L09r05p08O29J069J5p48p80K32Q51M48n93k30PJ6q5J82M83j60p10Q8
4454c13M36O73j79j209k46Q99N22j83r07J71L91k20J53J03K05l12n41J56O32K63
4474D94n06p29L45J024l18j29o69L01M53j88j13J21J4m39JN61K17l2j173m4P78
4495c1R08m83j035l06R45N69k13o76P7K11j23L6L58J25n30n79K28J403k74r08
$$ plain form
4411 301 481 -68 -768 -161 802 417 -410 -976 -211 653 694 -339 -527 70 276 283 175 206 -278 -329 -87
4432 -87 277 586 -319 -1027 -398 671 686 -62 -842 -610 241 689 96 -134 -127 -111 -196 -14 469 309 -401 -313
4454 -313 123 796 617 -592 -838 61 583 400 -507 -336 55 -165 -12 91 296 -16 -557 -401 231 494
4474 494 -12 -741 -396 628 310 181 -488 -187 266 78 -35 86 100 -339 -338 223 440 408 -765 -809 -31
4495 -31 877 394 -641 -947 -2 567 354 -322 -245 -34 -157 -121 237 362 -168 -747 -519 884 610 -298
$$ [...]
8191a
##END NTUPLES=NMR FID
##END=
