##TITLE=1H_CA-8601-3
 DMSO, 8 sc, 
 31.5.2019
##JCAMPDX= 6.0         $$ Bruker NMR JCAMP-DX V2.0
##DATA TYPE= NMR FID
##DATA CLASS= NTUPLES
##ORIGIN= UXNMR, Bruker Analytische Messtechnik GmbH
##OWNER= root
$$ XWIN-NMR		Version 3.5
$$ Fri May 31 14:04:43 2019 Russian Standard Time (UT+4h)  she@DPX200
##.OBSERVE FREQUENCY= 200.13155
##.OBSERVE NUCLEUS= ^1H
##.DELAY= (6, 6)
##.ACQUISITION MODE= SIMULTANEOUS
##.ACQUISITION SCHEME= undefined
##.AVERAGES= 8
##.DIGITISER RES= 18
##SPECTROMETER/DATA SYSTEM= spect
##.PULSE SEQUENCE= zg30
##.SOLVENT NAME= DMSO
##.SHIFT REFERENCE= (INTERNAL, DMSO, 0, 15.7039)
##AUDIT TRAIL= $$ (NUMBER, WHEN, WHO, WHERE, WHAT)
$$ ##TITLE= Audit trail, XWIN-NMR		Version 3.5
$$ ##JCAMPDX= 5.01
$$ ##ORIGIN= Bruker BioSpin GmbH
$$ ##OWNER= she
$$ F:/spectra/data/she/nmr/H-F/1/audita.txt
$$ ##AUDIT TRAIL=  $$ (NUMBER, WHEN, WHO, WHERE, WHAT)
(   1,<2019-05-31 14:03:39.81 +0400>,<she>,<DPX200>,
      <created by zg, POWCHK disabled, PULCHK disabled
       configuration hash MD5:
       00 E9 B6 7A A2 85 ED C7 34 08 36 98 17 FE 4E 26
       data hash MD5: 16K
       C1 E0 C7 EA DA E5 4E B5 E4 FA DF 6D D3 02 EF 6A>)
$$ ##END=
$$ 
$$ hash MD5
$$ 9B 2D 18 51 00 52 69 0E D7 F3 99 4D B5 BB 86 38
##$RELAX= 
##$RELAX= 
##$RELAX= 
##$RELAX= 
##$RELAX= 
##$RELAX= 
$$ Bruker specific parameters
$$ --------------------------
##$DU= <F:/spectra>
##$EXPNO= 1
##$NAME= <H-F>
##$PROCNO= 1
##$TYPE= <nmr>
##$USER= <she>
##$AMP= (0..31)
100 100 100 100 100 100 100 100 100 100 100 100 100 100 100 100 100 100 
100 100 100 100 100 100 100 100 100 100 100 100 100 100 
##$AQSEQ= 0
##$AQ_mod= 1
##$AUNM= <au_zg>
##$AUTOPOS= <>
##$BF1= 200.13
##$BF2= 200.13
##$BF3= 200.13
##$BF4= 200.13
##$BF5= 200.13
##$BF6= 200.13
##$BF7= 200.13
##$BF8= 200.13
##$BYTORDA= 1
##$CFDGTYP= 0
##$CFRGTYP= 5
##$CHEMSTR= <none>
##$CNST= (0..31)
1 1 145 1 1 1 1 1 1 1 1 1 1 1 1 1 1 1 1 1 1 1 1 1 1 1 1 1 1 1 1 1 
##$CPDPRG= <>
##$CPDPRG1= <>
##$CPDPRG2= <>
##$CPDPRG3= <>
##$CPDPRG4= <mlev>
##$CPDPRG5= <mlev>
##$CPDPRG6= <mlev>
##$CPDPRG7= <mlev>
##$CPDPRG8= <mlev>
##$CPDPRGB= <>
##$CPDPRGT= <>
##$D= (0..31)
0 1.2 0 0 0 0 0 0 0 0 0 0.03 0 0 0 0 0 0 0 0 0 0 0 0 0 0 0 0 0 0 0 0 
##$DATE= 1559297019
##$DBL= (0..7)
120 120 120 120 120 120 120 120 
##$DBP= (0..7)
150 150 150 150 150 150 150 150 
##$DBP07= 0
##$DBPNAM0= <>
##$DBPNAM1= <>
##$DBPNAM2= <>
##$DBPNAM3= <>
##$DBPNAM4= <>
##$DBPNAM5= <>
##$DBPNAM6= <>
##$DBPNAM7= <>
##$DBPOAL= (0..7)
0.5 0.5 0.5 0.5 0.5 0.5 0.5 0.5 
##$DBPOFFS= (0..7)
0 0 0 0 0 0 0 0 
##$DE= 6
##$DECBNUC= <off>
##$DECIM= 24
##$DECNUC= <off>
##$DECSTAT= 4
##$DIGMOD= 1
##$DIGTYP= 9
##$DL= (0..7)
0 120 120 120 120 120 120 120 
##$DP= (0..7)
150 150 150 150 150 150 150 150 
##$DP07= 0
##$DPNAME0= <>
##$DPNAME1= <>
##$DPNAME2= <>
##$DPNAME3= <>
##$DPNAME4= <>
##$DPNAME5= <>
##$DPNAME6= <>
##$DPNAME7= <>
##$DPOAL= (0..7)
0.5 0.5 0.5 0.5 0.5 0.5 0.5 0.5 
##$DPOFFS= (0..7)
0 0 0 0 0 0 0 0 
##$DQDMODE= 0
##$DR= 18
##$DS= 0
##$DSLIST= <SSSSSSSSSSSSSSS>
##$DSPFIRM= 0
$$ [...]
##$SUBNAM2= <"">
##$SUBNAM3= <"">
##$SUBNAM4= <"">
##$SUBNAM5= <"">
##$SUBNAM6= <"">
##$SUBNAM7= <"">
##$SUBNAM8= <"">
##$SUBNAM9= <"">
##$SW= 24.9336996594482
##$SWIBOX= (0..15)
0 0 2 0 0 0 0 0 0 0 0 0 0 0 0 0 
##$SW_h= 4990.01996007984
##$TD= 16384
##$TD0= 1
##$TE= 0
##$TE2= 300
##$TE3= 300
##$TEG= 300
##$TL= (0..7)
0 120 120 120 120 120 120 120 
##$TP= (0..7)
150 150 150 150 150 150 150 150 
##$TP07= 0
##$TPNAME0= <>
##$TPNAME1= <>
##$TPNAME2= <>
##$TPNAME3= <>
##$TPNAME4= <>
##$TPNAME5= <>
##$TPNAME6= <>
##$TPNAME7= <>
##$TPOAL= (0..7)
0.5 0.5 0.5 0.5 0.5 0.5 0.5 0.5 
##$TPOFFS= (0..7)
0 0 0 0 0 0 0 0 
##$TUNHIN= 0
##$TUNHOUT= 0
##$TUNXOUT= 0
##$USERA1= <user>
##$USERA2= <user>
##$USERA3= <user>
##$USERA4= <user>
##$USERA5= <user>
##$V9= 5
##$VALIST= <valist>
##$VCLIST= <CCCCCCCCCCCCCCC>
##$VD= 0
##$VDLIST= <DDDDDDDDDDDDDDD>
##$VPLIST= <PPPPPPPPPPPPPPP>
##$VTLIST= <TTTTTTTTTTTTTTT>
##$WBST= 1024
##$WBSW= 4
##$XGAIN= (0..3)
0 0 0 0 
##$XL= 0
##$YL= 0
##$YMAX_a= 243462
##$YMIN_a= -252742
##$ZGOPTNS= <>
##$ZL1= 120
##$ZL2= 120
##$ZL3= 120
##$ZL4= 120
##$ABSF1= 10
##$ABSF2= 0
##$ABSG= 5
##$ABSL= 3
##$ALPHA= 0
##$AQORDER= 0
##$ASSFAC= 0
##$ASSFACI= 0
##$ASSFACX= 0
##$ASSWID= 0
##$AUNMP= <proc_1d>
##$AZFE= 0.1
##$AZFW= 0.1
##$BCFW= 1
##$BC_mod= 2
##$BYTORDP= 1
##$COROFFS= 0
##$CY= 11.3945322036743
##$DATMOD= 1
##$DC= 2
##$DFILT= <>
##$DTYPP= 0
##$F1P= 18.9103706918063
##$F2P= -1.10871071338519
##$FCOR= 0.5
##$FTSIZE= 0
##$FT_mod= 4
##$GAMMA= 1
##$GB= 0.15
##$INTBC= 1
##$INTSCL= 1
##$ISEN= 128
##$LB= 0.24
##$LEV0= 0
##$LPBIN= 0
##$MAXI= 10000
##$MC2= 0
##$MEAN= 0
##$ME_mod= 0
##$MI= 1.114404
##$NCOEF= 0
##$NC_proc= 0
##$NLEV= 6
##$NOISF1= 3.799351
##$NOISF2= 2.8
##$NSP= 1
##$NTH_PI= 0
##$NZP= 0
##$OFFSET= 15.70392
##$PC= 1
##$PHC0= -8508.546
##$PHC1= 25.20023
##$PH_mod= 1
##$PKNL= yes
##$PPARMOD= 0
##$PSCAL= 0
##$PSIGN= 0
##$REVERSE= no
##$SF= 200.130013532006
##$SI= 16384
##$SIGF1= 3
##$SIGF2= 2
##$SINO= 400
##$SIOLD= 16384
##$SREGLST= <1H.CDCl3>
##$SSB= 0
##$STSI= 0
##$STSR= 0
##$SW_p= 3612.71676300578
##$SYMM= 0
##$S_DEV= 0
##$TDeff= 0
##$TDoff= 0
##$TI= <>
##$TILT= no
##$TM1= 0
##$TM2= 0
##$TOPLEV= 0
##$USERP1= <user>
##$USERP2= <user>
##$USERP3= <user>
##$USERP4= <user>
##$USERP5= <user>
##$WDW= 1
##$XDIM= 8192
##$YMAX_p= 0
##$YMIN_p= 0
$$ End of Bruker specific parameters
$$ ---------------------------------
##NTUPLES= NMR FID
##VAR_NAME=  TIME,          FID/REAL,        FID/IMAG
##SYMBOL=    X,             R,               I
##VAR_TYPE=  INDEPENDENT,   DEPENDENT,       DEPENDENT
##VAR_FORM=  AFFN,          ASDF,            ASDF
##VAR_DIM=   8192,          8192,            8192
##UNITS=     SECONDS,       ARBITRARY UNITS, ARBITRARY UNITS
##FACTOR=    0.0002004,     1,               1
##FIRST=     0,             0,               0
##LAST=      1.6414764,     0,               0
##MIN=       0,             -252742,         0
##MAX=       1.6414764,     243462,          0
$$ Real data points
##PAGE= N=1
##DATA TABLE= (X++(R..R)), XYDATA
0 0 0 0 0 0 0 0 0 -8 8 -8 16 -16 16 -24 32 -32 40 -48 56 -69 80 -93 106 -125 144 -164 186 -212 241 -272
30 -272 306 -344 386 -431 482 -538 597 -664 737 -815 905 -1001 1109 -1228 1360 -1509 1677
47 1677 -1868 2086 -2342 2642 -2999 3439 -3991 4712 -5696 7123 -9397 13610 -24066 107324
61 107324 87111 -161188 -106633 89594 243462 143331 -54615 -150357 -34893 116541 150396
72 150396 34674 -85283 -107412 -17778 67235 73324 150 -76272 -101987 -47119 35245 63916
84 63916 -578 -91631 -117932 -43553 53514 66298 -19406 -98784 -88386 -10058 54484 53884 -3076
97 -3076 -57826 -62491 -12092 60105 94099 42140 -53611 -82454 6966 126133 141209 23822
109 23822 -97942 -72200 83604 187873 116542 -47064 -113367 -5726 152423 175147 39315
120 39315 -91116 -73054 56851 148137 107655 -12074 -80442 -35459 60655 107218 64973
131 64973 -24927 -75172 -34035 53036 90030 36921 -49832 -79499 -19763 59846 66792 -285
143 -285 -60713 -55390 -825 43529 35479 -7598 -37661 -35251 -12833 16205 36100 23721 -19845
156 -19845 -55929 -39521 27298 77932 42345 -52289 -91713 -20022 83327 97661 824 -96895
168 -96895 -77070 39555 113659 61708 -50757 -96750 -28399 75352 98243 19462 -67500
179 -67500 -70804 4892 78203 75036 -814 -66423 -52330 22617 78411 58563 -17368 -67920
191 -67920 -34337 44173 77046 30914 -38268 -54146 -1929 54410 49743 -1147 -33437 -20411
203 -20411 11004 27412 20398 4548 -5928 -13345 -16631 330 29759 32281 -5866 -47181 -41210
216 -41210 13618 58453 32378 -41923 -76205 -27472 47363 62269 -1577 -73251 -69258 5872
228 5872 63129 39754 -33173 -76188 -45076 27450 61846 20595 -48047 -70693 -23794 45105
240 45105 61330 4285 -62227 -59779 7209 63000 46819 -22002 -63353 -27910 37843 56015
252 56015 13311 -34659 -35377 5385 36179 24769 -5692 -15563 -4552 4806 6065 7461 10836
265 10836 6800 -10077 -23846 -9087 23700 31131 -2914 -40669 -37136 7392 43102 23482 -31428
278 -31428 -56744 -24354 27172 40937 3016 -47561 -53267 -7950 37185 33917 -12666 -54407
290 -54407 -45908 7790 47816 27065 -30688 -60878 -28719 32789 53737 7253 -51177 -50926 5643
303 5643 50798 35307 -20405 -49544 -18636 30311 38368 4418 -25636 -21333 5301 21556 12455
316 12455 -3432 -5998 -1135 -1362 -1052 5640 11648 7285 -8803 -19802 -7134 17817 22831 -869
330 -869 -26241 -25543 1807 26930 19523 -14041 -35942 -22567 11056 30340 13938 -24750 -43314
343 -43314 -17932 24245 35946 2399 -41771 -45907 -243 43008 30326 -22790 -53460 -26510
355 -26510 27455 45320 4711 -42942 -39848 5489 37750 23166 -17391 -35365 -12453 19785
367 19785 23340 1960 -14928 -12423 1231 10780 8368 1992 -704 -2247 -3837 817 8914 10845
381 10845 4502 -5237 -9015 -543 12944 14960 3691 -9381 -12308 -1242 15640 19753 2706
394 2706 -18051 -20202 1272 25723 23582 -8805 -34723 -20705 18452 36901 10968 -32017 -40648
407 -40648 -1868 37715 28269 -17364 -44063 -22023 22039 35477 3065 -33780 -31402 2980
419 2980 26248 15687 -13298 -27339 -11939 11458 15564 1676 -11763 -13251 -2743 7705 7799
432 7799 -11 -4965 -4150 -989 3109 4719 2751 1544 961 -1724 -2296 3154 9623 9529 804 -10097
448 -10097 -7928 9441 21729 10787 -13032 -21012 -1789 24965 25794 -4900 -30279 -18195 17246
461 17246 32544 9641 -26039 -32311 -519 29484 20926 -13896 -33401 -17265 13525 23705
473 23705 1607 -25593 -25656 -3316 14332 10036 -10009 -23848 -16103 2478 9551 482 -13448
486 -13448 -17810 -8140 4502 4563 -6092 -12388 -7886 -484 1718 -2927 -7087 -2423 3508 44 -7694
501 -7694 -6203 4506 11309 4000 -10983 -13439 4389 21060 13404 -10345 -20413 -3522 22230
514 22230 24312 -1691 -24277 -14925 13962 27617 9913 -18408 -24357 -879 22325 17292 -8106
527 -8106 -24259 -15104 7237 17500 3176 -18752 -22624 -7762 8461 8378 -8069 -22673 -18221
540 -18221 -1569 6397 -1850 -15791 -19706 -9699 2110 181 -11219 -15480 -8628 -1223 -2021 -8687
554 -8687 -11083 -3843 2585 -2214 -11345 -9726 1668 8742 1891 -11455 -13898 1353 15306 9522
568 9522 -8711 -16904 -5103 14192 17910 -110 -17714 -13043 7058 18778 9876 -10887 -19402
581 -19402 -5396 13855 15600 -1554 -17770 -16295 1479 15310 7620 -12465 -20847 -9042 7986
594 7986 11100 -3814 -19023 -15690 913 9421 694 -12930 -15622 -4633 5997 2307 -9141
607 -9141 -11652 -3287 3284 743 -6948 -8735 -416 5518 572 -8651 -8001 2139 8602 3590 -8328
622 -8328 -11534 -433 11685 8272 -5545 -13963 -6813 7783 13273 1122 -13984 -13714 511 12860
636 12860 8632 -7806 -18320 -9533 8272 13077 21 -15832 -16801 -807 13600 8308 -9883
649 -9883 -18075 -7314 9133 12225 -1256 -14590 -10681 4804 12105 3741 -7766 -8977 1686
662 1686 10621 6549 -3874 -5212 2494 8522 5964 -1246 -3158 3515 9742 5866 -2389 -3590 3359
677 3359 9984 7862 -2062 -7613 -603 10119 10499 94 -9417 -7067 5425 13105 5219 -9921
691 -9921 -12991 -1262 11748 10816 -4435 -16303 -9076 7838 13751 2319 -12959 -14287 729
704 729 14161 9068 -7531 -14120 -3874 10204 11671 -340 -10689 -5998 7105 11322 3859 -5293
718 -5293 -4883 3603 10090 5749 -2317 -2750 3380 7964 5665 -346 -2255 2951 8374 5740 -951 -2932
734 -2932 2234 8377 7930 499 -5467 -762 8541 10624 3134 -5722 -5375 5194 13668 8459 -3830
749 -3830 -8486 815 12701 14146 1804 -8899 -4251 10284 16389 7837 -5127 -7206 4621 16209
763 16209 12743 -1007 -7258 158 11502 13723 4081 -5832 -3601 7008 11515 5458 -2923 -4381
777 -4381 2379 8090 5249 -2742 -5038 -23 4647 3559 -2735 -6574 -2406 3896 3170 -3439 -7521
792 -7521 -3942 2993 5075 -1701 -8385 -5980 3300 7435 2061 -6900 -7816 1751 11200 8071 -3261
807 -3261 -7657 -70 11225 13250 3645 -5825 -2435 9731 16084 9562 -1574 -3685 5766 15734
821 15734 13726 2807 -3297 1883 11347 14150 6613 -2215 -1762 6687 11224 6968 -826 -3718 1236
836 1236 7316 6085 -1625 -5550 -2066 3556 3811 -2010 -7506 -5103 1255 2730 -3080 -8626 -7135
851 -7135 -504 3553 -1608 -9807 -9357 -630 5005 1488 -7359 -10365 -2356 6969 6240 -4186 -9783
866 -9783 -4164 6553 10267 2274 -7498 -5933 5311 12105 7363 -2835 -6236 1668 11709 11043
880 11043 1410 -4965 -786 8167 11396 5084 -3481 -3345 4614 9718 6036 -1665 -4225 655 6978
895 6978 5942 -1418 -5148 -1741 3927 4756 -1013 -6332 -4131 2644 4113 -1474 -6772 -5906 329 4277
911 4277 -177 -7446 -8069 -909 4523 1477 -6071 -9581 -3738 4919 4629 -3784 -9640 -5818 3184 7167
927 7167 736 -8047 -7867 1242 7730 4327 -4249 -8346 -1974 7056 7429 -687 -7095 -3391 4551 8169
943 8169 2974 -4881 -4921 2611 7507 4643 -2033 -5002 -245 6369 5953 -688 -4682 -1246 4461 5857
959 5857 407 -4878 -2767 3551 5658 510 -4852 -4609 1696 5615 1929 -5128 -6455 -7 5034
974 5034 3189 -4071 -8044 -3365 4416 4651 -2578 -8110 -5787 1925 5718 468 -6832 -7436 -235 5353
990 5353 3132 -4155 -7734 -3233 4392 5279 -1149 -6421 -4465 2363 5997 2495 -4232 -5236 764
1005 764 5848 3974 -1624 -4840 -969 4987 5370 90 -3613 -1401 3713 5616 1941 -3285 -2780 2996
1021 2996 5866 2336 -2933 -3767 860 6194 3789 -3037 -5064 -431 4844 4557 -1397 -6157 -3209
1036 -3209 3551 5481 -94 -6117 -5266 1092 5741 2412 -5066 -6998 -1096 4907 4033 -2550 -7071
1051 -7071 -4015 3619 5485 -89 -5854 -4960 1018 5295 2452 -4268 -5806 -276 4884 3686 -1561
1066 -1561 -5040 -1667 4144 5204 -141 -4103 -2222 3243 5542 1902 -3472 -3186 2607 5879 2773
1081 2773 -2366 -3399 1154 5685 4332 -1904 -4348 -343 4600 4973 -102 -4791 -2375 3770 5811
1096 5811 1256 -3996 -4194 1093 5736 3440 -3432 -5610 -861 4296 4398 -855 -5796 -3802 2853
1111 2853 5291 389 -4884 -4894 216 4902 2404 -3919 -5662 -1165 3763 3360 -1830 -5631 -2833 2974
1127 2974 4256 -488 -4884 -3123 1665 4445 1093 -3845 -4059 1345 4480 2362 -2570 -4363 -4
1142 -4 4586 3987 -1741 -4649 -1231 3869 4558 129 -4506 -2945 3055 5208 1091 -3793 -4054 784
1158 784 5047 3113 -2921 -5201 -1115 4011 3935 -1038 -5087 -3449 2406 4385 161 -4226 -4461 5
1174 5 3596 1858 -3320 -5270 -1501 2654 2488 -1907 -5165 -3224 1447 2921 -847 -4583 -3515 263
1190 263 2643 717 -3460 -4198 -366 2940 1582 -2522 -4522 -1483 2774 2912 -1206 -4398 -2322 2110
1206 2110 3550 405 -4040 -3417 1369 4180 1488 -2928 -4383 -307 3926 3483 -1816 -4591 -1903
1221 -1903 3066 3997 -113 -4221 -3531 1447 4020 1069 -3773 -4523 -513 3196 2155 -2934 -5137 -2028
1237 -2028 1934 2009 -1677 -4910 -3701 792 2487 -768 -4775 -4309 -602 2019 -6 -3980 -5212 -1221
1253 -1221 2020 891 -2960 -4779 -2607 1526 2261 -1542 -4556 -2677 1380 2686 261 -3706 -3716 680
1269 680 3755 1738 -2214 -3856 -745 3473 3423 -1091 -3641 -1657 2648 3829 1037 -3220 -3042 1520
1285 1520 4178 2132 -2132 -3552 -874 3103 2679 -1640 -4106 -1848 1859 2969 -395 -4256 -3823
1300 -3823 446 2690 46 -3946 -4443 -844 2260 554 -3388 -5065 -1876 1739 1495 -2343 -4883
1315 -4883 -3080 1302 2474 -1197 -4394 -3391 591 3001 667 -3374 -3937 -64 3192 1895 -1954
1330 -1954 -3553 -832 3110 3641 -366 -3236 -1364 2381 4162 1413 -2461 -2656 1509 4218 2622
1345 2622 -1407 -2769 -196 3454 3392 -632 -3063 -1060 2459 3382 411 -2876 -2560 1329 3231 687
1361 687 -2397 -2745 -113 2387 1755 -1937 -3437 -897 2164 2122 -1096 -3626 -2076 1405 2918 64
1377 64 -2858 -2664 471 2632 1641 -2084 -3398 -424 2824 2363 -1016 -2935 -1608 2239 3301 351
1393 351 -2755 -1993 1336 3365 1622 -1860 -2732 420 3492 2570 -750 -2829 -894 2696 3486 26
1409 26 -2782 -1375 2212 3322 1403 -2130 -2227 1105 3547 1834 -1421 -2122 90 3080 2613 -693
1425 -693 -2289 -324 2380 2842 469 -1969 -1570 1607 3226 1258 -1752 -1773 706 2945 2075 -846
1441 -846 -2363 -207 2690 2715 -216 -2176 -1325 1964 3212 863 -2064 -1830 1008 3190 1892 -1524
1457 -1524 -2687 -124 2777 2256 -628 -2437 -1204 1998 2935 340 -2305 -1755 948 2914 1181 -1734
1473 -1734 -2345 118 2620 1766 -1113 -2153 -621 2108 2499 177 -2391 -1245 1386 2695 825 -1692
1489 -1692 -1604 1149 3176 1842 -1262 -2079 185 2828 2440 -750 -2401 -476 2688 2613 378 -2101
1505 -2101 -1378 1679 3441 1127 -1921 -2090 611 2888 1991 -970 -2381 -173 2712 2455 -432 -2429
1521 -2429 -1052 1587 2799 159 -2354 -1555 735 2598 1199 -1507 -2358 -128 2208 1422 -916 -2246
1537 -2246 -876 1726 1991 -296 -2490 -1327 984 2126 575 -1909 -1947 387 2466 1295 -1198 -2326
1553 -2326 -359 2031 2028 -569 -2173 -796 1884 2411 113 -2175 -1612 1059 2641 1081 -1443 -2072
1569 -2072 390 2371 1932 -1089 -2242 -204 2213 2176 -258 -1884 -1343 1318 2362 496 -1811 -1582
1585 -1582 631 2092 1041 -1174 -2198 47 1929 1730 -308 -2173 -1089 1236 1941 -108 -2341
1600 -2341 -1733 772 1677 434 -1594 -2189 159 2067 1046 -1463 -2216 -770 1570 1681 -547 -2182
1616 -2182 -1164 1100 1815 248 -1930 -1789 510 2009 797 -1418 -2033 57 1886 1592 -682 -1802
1632 -1802 -622 1401 1659 178 -1383 -1209 966 2117 688 -1414 -1136 307 1783 1568 -688 -1738
1648 -1738 -529 1724 1559 -378 -1666 -1206 876 1736 302 -1688 -1055 373 1759 1004 -1323 -1967
1664 -1967 -273 1578 1077 -1042 -1991 -812 1349 1530 -405 -2262 -1335 635 1543 157 -1594 -1822
1680 -1822 341 1823 772 -1074 -1741 -353 1579 1772 -311 -1923 -711 1405 1808 347 -1298 -1036
1696 -1036 995 2165 744 -1029 -1291 198 1546 1576 -499 -1678 -355 1506 1806 59 -1290 -624
1712 -624 986 1889 470 -1489 -1239 315 1789 1007 -1011 -1763 -125 1480 1170 -930 -1863 -881 842
1729 842 1584 -226 -1911 -1465 736 1569 697 -1370 -1983 82 1435 1031 -880 -1626 -591 1108 1549
1746 1549 -427 -1923 -862 979 1508 504 -1405 -1217 558 1804 1142 -891 -1429 -44 1683 1466
1762 1466 -427 -1362 -480 1324 1369 209 -1263 -849 1041 1688 649 -1085 -1039 689 1784 1340 -661
1779 -661 -1678 -127 1622 1450 -495 -1649 -721 1154 1839 119 -1442 -1262 694 1149 470 -1158 -1612
1796 -1612 62 1281 838 -983 -1568 -857 1315 1221 -232 -1439 -1068 622 1268 260 -1137 -1447 136
1813 136 1368 846 -942 -1493 -114 1203 1163 -217 -1538 -675 1130 1341 314 -1186 -1092 805 1600
1830 1600 722 -1085 -1145 105 1657 1028 -495 -1151 -350 1142 1288 -75 -1014 -738 971 1244 337 -1143
1848 -1143 -950 370 1154 631 -770 -1510 -429 1326 865 -404 -1383 -850 720 1215 -136 -1527 -1149
1865 -1149 305 1188 654 -1241 -1629 196 1105 759 -663 -1385 -518 874 1256 -283 -1204 -941 959
1882 959 1232 244 -1351 -1018 409 1309 512 -911 -1234 -118 1285 1185 -404 -1317 -692 899 1181 133
1900 133 -1079 -902 491 1184 591 -1176 -1016 26 1104 567 -738 -1525 -575 907 739 -124 -1254
1917 -1254 -795 488 1029 41 -1386 -1273 220 1104 472 -837 -1369 -278 982 914 -403 -1341 -718 675
1935 675 1019 -227 -1260 -989 434 1023 450 -1053 -1211 -9 1140 788 -798 -1207 -325 1054 1112 -183
1953 -183 -1337 -579 986 1149 75 -875 -596 336 1179 343 -872 -986 -44 1088 683 -554 -1256 -409
1971 -409 958 862 -255 -1042 -660 560 817 205 -1224 -934 -128 1100 552 -752 -1107 -253 656 793
1989 793 -514 -1106 -902 492 886 -329 -1047 -1113 318 1026 419 -915 -954 -144 937 466 -797 -1032
2007 -1032 -311 912 1087 -159 -993 -489 779 1088 275 -461 -651 371 1304 551 -568 -776 186 971
2025 971 903 -68 -932 -299 1009 994 -55 -696 -574 386 1070 356 -806 -920 79 859 618 -536 -1035
2044 -1035 -483 632 727 -390 -999 -582 324 909 -13 -952 -838 200 635 379 -746 -985 -190 1036
2062 1036 733 -208 -961 -230 756 1025 96 -746 -272 647 931 355 -441 -739 317 1003 678 -460 -538
2081 -538 18 831 833 28 -849 -596 405 752 236 -743 -737 -51 658 234 -521 -896 -292 434 562 -488 -1136
2102 -1136 -588 225 762 -313 -791 -772 126 633 234 -786 -660 108 733 608 -518 -896 -11 802 730
2121 730 -233 -639 -161 656 1077 528 -320 -665 55 974 406 -204 -573 96 958 810 -498 -802 -381 637
2141 637 567 236 -899 -621 476 937 -15 -922 -858 -49 810 529 -636 -1006 -273 595 649 -373 -810 -344
2161 -344 462 602 -24 -858 -520 514 655 87 -784 -934 335 652 457 -312 -893 -75 659 601 -106 -674
2181 -674 -405 616 659 -67 -626 -730 211 461 289 -414 -565 -294 655 577 -324 -861 -590 644 523 -121
2201 -121 -1024 -673 211 1026 371 -537 -789 81 795 561 -485 -862 -29 880 526 -113 -843 -237 450 794
2221 794 -39 -379 -402 158 844 74 -790 -595 -76 819 458 -20 -876 -434 678 554 32 -421 -199 328
2241 328 549 288 -627 -523 234 263 471 -626 -640 -302 457 697 -163 -778 -530 329 804 -56 -755 -606
2261 -606 382 854 416 -460 -747 -176 799 463 -251 -868 -317 556 553 -69 -455 -198 439 561 175 -307 -639
2282 -639 -9 564 487 -514 -288 -74 672 796 -31 -661 -135 523 571 232 -627 -764 -98 681 602 -461
2302 -461 -812 176 817 544 -422 -928 -388 633 433 -205 -949 -279 400 437 -100 -809 -502 306 480 174
2322 174 -677 -790 -57 633 373 -349 -529 -220 328 412 -61 -492 -234 124 568 276 -294 -272 37 708 580
2343 580 -252 -419 -300 313 656 38 -578 -399 289 819 106 -287 -589 348 909 501 -774 -718 46 562
2363 562 331 -287 -739 -272 456 477 -232 -588 -444 192 344 -107 -719 -733 139 113 -84 -587 -620 -12 318
2384 318 394 -316 -578 -174 57 259 115 -595 -482 172 460 199 -372 -688 -17 726 508 -114 -422 -59
2404 -59 509 781 201 -613 -286 734 730 278 -608 -318 536 608 444 -323 -431 120 437 370 -398 -667 -253
2425 -253 445 209 -181 -340 -455 242 332 -29 -753 -485 -127 232 207 -382 -647 -169 83 359 -17 -530 -572
2446 -572 175 509 129 -605 -620 -92 381 164 -264 -336 -160 582 628 -56 -281 12 469 739 26 -417 -347
2467 -347 329 695 -7 -291 -354 127 570 446 -248 -199 237 460 344 -215 -442 -193 236 360 -134 -402 -455
2488 -455 -274 470 276 -248 -532 -221 401 326 -15 -640 -507 496 385 50 -660 -466 133 343 253 -459
2508 -459 -321 123 722 227 -227 -340 30 489 307 66 -345 -210 556 552 -81 -411 -182 538 467 329 -165
2529 -165 -577 43 493 318 77 -417 18 305 554 -64 -402 -269 132 448 323 -357 -282 -238 321 406 -349
2550 -349 -680 -174 540 358 -125 -496 -310 349 467 -330 -373 -246 189 603 214 -658 -421 306 586 279
2570 279 -241 -336 -77 498 375 36 -530 -265 244 295 88 -393 -378 584 502 224 -397 -126 -71 584 464 -34
2592 -34 -369 -298 119 553 136 -262 -398 59 489 162 -253 -455 58 752 399 -346 -532 173 466 285 -44
2613 -44 -643 -306 246 290 -82 -470 17 454 318 116 -415 -363 262 468 66 -109 -509 -35 173 -69 13
2634 13 3 -130 38 473 237 48 -388 207 347 95 -174 -414 119 364 472 78 -432 -102 447 563 -58
2655 -58 -354 -383 286 541 339 -212 -481 392 377 176 -395 -589 37 332 457 202 -323 -135 261 390 -16
2676 -16 -252 -198 219 466 186 -155 -48 -125 140 427 90 -211 43 186 650 119 -297 -392 -154 146 307
2697 307 -520 -201 -310 163 225 -49 -645 -278 227 181 56 -349 -236 190 391 -23 -454 -557 119 474 40
2718 40 -119 -174 -238 352 145 -161 -219 -11 118 279 -67 -229 -150 181 261 64 -284 15 30 280 277 160 -85
2741 -85 -31 297 369 -35 -156 -297 116 446 238 -642 -154 33 540 59 -194 -348 -116 265 -31 -160 -556
2762 -556 -50 410 530 -326 -375 -344 97 178 43 -390 -209 104 352 388 -28 -297 98 372 301 -141 -237 0
2784 0 123 264 56 75 -85 236 131 198 -177 -280 7 112 262 -128 -234 -66 109 403 86 -273 -222 256
2806 256 433 75 -628 -462 112 276 154 -495 -169 -34 389 87 -357 -405 -169 207 138 -76 -279 -93 174
2827 174 -45 109 -247 -175 237 383 408 22 -313 97 362 175 -195 -140 -119 -30 399 228 -172 -236 347 453
2849 453 506 -326 -242 -248 199 270 -210 -363 -64 65 386 -250 -383 -400 140 526 -50 -426 -199 -56 412 141
2871 141 -246 -442 173 61 101 -266 -267 47 215 169 -108 -16 81 88 175 124 -144 -354 -41 238 197 -152 -272 -137
2895 -137 139 449 69 -318 10 358 332 199 47 -537 38 428 226 -31 -518 22 379 319 -167 -451 -41
2916 -41 255 248 -24 -233 -181 221 332 31 -208 -203 -79 22 -30 -85 -54 135 191 57 38 -53 -64 56 345 37
2940 37 -469 -396 -74 245 125 -129 -315 -270 242 68 -248 -262 -137 316 469 93 -271 -96 501 217 -76
2961 -76 -395 -354 28 287 3 -157 -254 65 243 286 -187 -114 130 255 304 40 -362 -171 104 173 242 -237 66
2984 66 -175 235 169 -142 -64 -30 48 -3 38 -125 -268 33 375 -12 -295 -149 59 186 254 -338 -412 -41 261
3007 261 167 -33 -192 -119 316 441 110 -339 16 83 20 -34 -206 -224 157 422 120 -239 -134 -40 354 265 -123
3030 -123 -137 131 13 226 143 -297 -40 46 300 152 168 -242 -116 224 138 -183 -285 -371 37 62 64 -218 -345
3053 -345 -162 101 -8 -380 -479 110 82 -44 -355 -214 -152 222 259 -232 -217 -279 81 7 -48 -160 -240 160 166 59
3077 59 -105 -67 26 101 118 48 -250 -18 107 142 25 -14 -179 244 152 -38 -136 -192 158 65 294 5 -462 -235
3101 -235 492 189 -180 -256 -72 155 261 181 -73 -33 77 408 204 -348 25 -74 10 34 -301 -209 -42 97
3123 97 330 -27 -166 -17 155 86 173 -285 -352 44 132 -335 -368 -302 -166 99 72 -99 -378 -85 92 -48 -126
3146 -126 -164 -111 10 220 23 -263 -186 36 199 -16 -78 -163 -51 270 339 -127 -205 -145 141 386 173 -188 -151
3169 -151 214 336 137 -73 -49 126 424 12 -76 -279 -96 366 155 -45 -160 -25 12 -14 -6 -214 -277 -117
3191 -117 109 35 -76 -211 -51 36 329 -113 -270 -265 -39 198 83 -241 -124 78 163 -35 -289 -84 -91 71
3213 71 -7 -80 -482 -70 159 128 118 89 -63 105 379 134 32 -156 53 426 272 -160 -70 92 138 306 67
3236 67 -179 -173 215 -35 30 -269 58 15 314 71 -90 -37 -273 114 294 -93 -148 -62 90 30 -105 -339 -8
3259 -8 255 31 -43 -162 -328 36 235 16 -244 -123 -129 140 120 103 -66 94 0 43 -53 -131 3 157 346 364
3283 364 -228 98 46 48 52 -165 -126 1 148 -2 -146 -155 175 186 -66 323 -67 -163 112 205 -51 13 -293 -40
3307 -40 293 257 80 -271 -6 168 206 206 16 -63 -196 425 168 -25 -320 203 110 -54 -188 -361 -161 23
3329 23 36 -173 -223 -219 177 -9 41 -46 -132 30 55 215 -146 -20 -81 -67 134 -27 -124 170 98 255 145 -267
3353 -267 -107 -2 210 37 -250 -62 25 237 93 81 225 -166 257 220 -256 -67 79 116 212 -118 -109 -37 356
3376 356 175 252 -84 -143 170 370 88 -60 -149 -38 101 166 -145 -62 -141 108 178 -119 -142 -51 25 76 110 -443
3400 -443 -22 117 155 -36 101 -63 -222 10 11 -155 -23 -150 134 -87 65 118 -34 -48 197 94 40 -68
3422 -68 -137 115 115 97 -153 164 86 327 -227 -181 -81 -127 161 192 -61 -196 -8 286 209 -169 2 -288 186
3445 186 127 66 -149 14 210 177 -2 -176 -44 53 43 159 -36 -164 -88 383 149 2 -160 -27 141 -53
3467 -53 -357 -142 -124 70 105 -144 26 -183 88 -22 31 -92 -166 92 84 -72 75 -133 -118 -18 -78 99 -112
3490 -112 -179 58 23 229 30 -73 -304 -122 66 -100 -93 -16 -11 20 231 55 -83 21 120 -175 44 -243 34
3513 34 107 28 -151 -195 102 283 -105 -247 -133 130 183 142 -45 -197 -61 -196 -4 26 -215 9 -31 212 -191
3536 -191 -49 -37 -77 64 -25 -65 25 -56 -21 149 186 -164 -203 -106 221 4 249 -199 -103 177 124 54 -34 137 154
3561 154 177 114 -13 70 -10 20 110 -177 -24 117 249 209 -11 -23 48 32 28 292 -301 -14 182 17 -138 -106
3585 -106 92 25 135 80 -107 -141 28 217 90 31 -212 -43 -15 -34 9 -35 55 198 53 10 -32 -68 15 -67 110
3610 110 -154 68 -457 134 206 -126 -35 65 56 212 21 1 -92 -14 61 188 29 -214 133 -32 55 186 112
3633 112 41 181 253 33 -221 -135 -20 132 99 -17 20 45 67 39 -160 -147 130 -29 23 -189 -315 88 -10 -17
3657 -17 87 -267 55 1 -300 -262 -327 -71 27 332 109 -18 72 -141 96 -53 -207 -64 119 27 119 140 -116
3680 -116 -43 -79 36 -23 92 -162 5 276 151 17 -149 48 -4 177 -128 -187 -19 11 160 -143 -116 -366
3702 -366 101 -116 -17 10 -59 1 28 217 -155 -271 214 80 223 -15 -237 -5 5 309 16 -136 -87 19
3724 19 87 179 -380 -175 198 -25 20 -4 -48 -107 -43 84 -86 -266 -366 -25 162 171 137 -86 -117 68 -13 4 -311
3749 -311 -219 -43 33 -80 96 -404 148 -35 -72 -250 -160 10 25 -37 -14 59 31 18 -5 49 46 141 -40 122 -73
3774 -73 14 54 18 -17 -12 -190 -11 106 -22 71 159 -79 -161 140 293 -31 -140 84 171 26 24 -233 -88 51
3798 51 106 112 -168 -99 -26 -173 83 -88 22 -107 29 61 145 -133 -150 209 119 73 -135 78 24 138 12 -28
3822 -28 70 198 -39 -88 34 -7 16 -60 -5 -139 -74 50 294 87 -58 -35 -183 -32 110 142 32 138 84 92
3846 92 84 74 -234 -3 217 -113 62 -102 -60 -97 -65 -2 -221 -7 61 288 -170 8 -85 86 135 -5 94 -86
3870 -86 -241 -202 -143 -20 -54 -57 -90 -68 -50 -77 1 -6 -50 -165 40 -84 -161 69 160 -40 -30 -21 85 272 128 -62
3896 -62 -89 -257 15 19 17 -254 92 112 126 38 -25 219 -137 263 37 -16 76 83 -11 27 -16 -125 -102 119 -189 -80
3922 -80 -137 35 44 -18 287 48 -96 113 50 141 157 -241 194 58 28 69 38 33 107 116 -38 49 21 -58 156 215 2
3949 2 -76 14 122 -38 99 -75 -113 226 110 -58 -26 -248 -18 -2 -69 -308 -317 139 -42 56 -99 -58 -141 189
3973 189 -161 -43 75 64 -127 286 43 -203 -137 58 108 -36 77 130 -155 74 121 61 196 46 98 167 95
3996 95 -322 143 -127 -88 -210 -57 159 -29 -2 29 -67 -119 -158 -99 -211 -193 197 197 -53 153 -172 173 -104 52
4020 52 145 -84 54 -84 7 -61 61 -113 -115 5 -145 55 126 -87 -113 189 65 -3 190 78 -22 -28 174 -118
4044 -118 -92 -1 190 43 -211 -140 45 91 -87 44 -93 -135 9 246 18 -188 -108 270 33 136 -136 -146
4066 -146 -65 35 71 191 19 -33 60 104 115 -229 46 15 -104 -104 76 6 -11 121 -41 67 -262 -10 -2 83 -206
4091 -206 -209 13 31 -65 -72 -72 34 -38 -25 -179 14 22 -47 138 -152 38 98 6 -205 198 -65 -52 -20 43 134 205 -4
4118 -4 -72 -62 31 9 62 -281 -120 161 209 118 18 -128 119 43 -268 147 -100 110 -145 -95 -164 -70 143 213 56
4143 56 -125 88 -231 -97 -123 32 28 -15 213 37 89 -270 -146 133 -109 333 0 203 -184 6 275 -37
4165 -37 91 13 44 -18 -160 -55 158 7 -87 87 -35 19 -202 67 -50 -234 -12 208 178 78 -162 205
4187 205 99 -146 37 127 -167 104 134 196 184 -4 -42 23 -71 -105 27 72 66 -130 -199 -204 -373 -139 -2 -52 -27
4212 -27 -126 -153 81 -105 48 28 -206 15 -55 15 79 -61 -79 189 -80 -68 -256 -44 129 113 208 15 111 -171
4236 -171 39 222 -27 7 74 42 108 -100 60 82 -224 137 113 186 217 -162 114 314 -225 80 81 71 217 94
4260 94 38 -165 -139 -134 -10 68 43 147 -33 26 -17 -40 -106 -11 -251 8 -45 -66 39 89 57 -23 104 336 6 210
4286 210 -283 -26 22 42 167 -6 -64 -127 53 88 5 163 -54 214 157 131 -42 -6 38 -157 66 -148 178
4309 178 194 183 -80 -7 49 63 185 -76 41 188 -96 76 297 26 -36 -73 188 -127 149 -109 -23 36 178
4332 178 54 106 69 43 -7 -17 -73 -102 17 -179 3 58 17 -120 262 306 140 -39 -52 48 -36 -15 87 -56
4356 -56 -237 90 84 -126 335 -235 -19 74 -135 201 -93 186 52 59 19 102 -163 26 52 22 9 -106 -88 13
4380 13 -74 71 -79 -41 47 -8 86 126 -70 147 2 11 -8 37 60 127 195 -11 -84 -153 114 -157 89 -173 13
4405 13 197 14 252 134 -6 52 -17 -120 81 86 -100 17 212 83 -15 52 126 51 9 71 -27 -7 152 19
4429 19 -155 104 196 -30 299 -211 -8 -167 2 -110 -14 31 -193 46 -147 160 -224 39 179 166 -83 -175
4451 -175 -98 62 16 78 118 -70 -46 86 67 -100 129 -341 5 -85 -82 59 37 -81 -78 -201 55 142 -405 41
4475 41 221 -92 -159 -81 44 6 203 -197 -19 88 268 -72 -84 -9 -17 -55 170 -85 160 -55 108 327 14
4498 14 41 -28 -173 -18 -103 123 201 51 123 128 233 -168 12 87 275 -196 76 33 36 -47 95 -156 95 66 159
4523 159 103 -37 -76 78 118 92 -38 -76 153 94 -59 90 90 -17 153 170 -30 -8 111 144 51 246 -58 66
4547 66 -120 144 38 -26 153 -206 25 -152 -50 -205 -95 182 59 215 16 18 219 129 -64 57 3 14
4569 14 279 -24 -122 -316 -176 -252 105 -128 -27 107 -1 56 -116 142 -96 62 146 79 45 -21 75 73 -13 30
4593 30 -40 -18 132 23 148 190 170 221 -15 0 58 117 -187 54 -82 -119 -26 -140 65 -106 -86 109 -28 244
4617 244 67 -85 -149 55 -1 67 -129 -7 202 -40 327 9 -73 -84 -275 -5 -95 -46 33 -15 190 3 -9
4640 -9 -109 -20 3 14 -1 11 60 -28 167 137 117 -94 66 202 -149 -232 126 -46 113 72 104 46 -147 231 -8
4665 -8 49 104 120 -149 -90 -109 65 4 191 113 147 -141 -44 -77 -62 -2 -308 162 -255 -109 1 -115 -94 -58 -47 142
4691 142 -130 30 -373 -8 -140 51 118 -343 -52 26 -21 138 -28 225 2 60 -105 -121 -133 107 -31 202
4713 202 -17 58 29 88 45 -44 -51 -126 68 114 -22 -119 90 -56 -46 -66 98 -24 110 66 39 -94 220 -61 93
4738 93 189 -45 -81 -48 184 -42 -38 -33 -44 -135 3 -174 -67 -125 59 -23 -11 226 205 139 28 0 -66 22 14 -43 -122
4765 -122 73 -54 -32 -144 -1 58 174 -54 -112 255 37 -142 -98 -100 -53 -4 147 40 95 -108 -134 -107 6 119
4789 119 105 45 15 70 -25 96 164 104 -23 243 6 11 23 -275 102 -169 -228 -32 -168 -46 -250 92 243 150
4813 150 -177 -54 -52 -91 139 135 62 12 -202 46 -145 -72 -37 -179 -124 -121 -145 -127 -98 127 -52 87 171 110 239 -84
4839 -84 -225 36 -132 178 157 143 0 -34 144 214 10 48 146 198 103 95 -5 -115 346 70 76 -31 -84 197 140
4864 140 -51 -105 -128 115 -39 -117 223 115 10 45 306 -36 -81 -98 -166 94 169 -41 -214 51 105 105 -20 22
4888 22 -390 73 76 96 -1 -17 -95 78 -27 -59 -77 105 25 316 -46 34 -124 -274 374 -197 130 242 28 73
4912 73 164 231 80 102 -145 99 117 -55 -108 -111 130 325 112 -236 119 1 -49 135 -14 348 106 -315 18
4935 18 -214 79 57 36 75 201 57 -187 185 9 -83 -146 -13 -32 -65 -81 -162 72 -115 -26 -111 -138 -231 -57 111
4960 111 -57 -40 177 258 157 47 -50 -80 -91 120 -96 179 41 20 44 -55 21 -10 -86 74 -170 58 35 -62
4984 -62 -69 55 45 188 -66 -24 179 -14 33 -18 -158 178 -23 230 -61 -150 181 92 273 -17 29 -9 -200 -252
5008 -252 -8 43 31 28 -4 165 -71 -35 -114 35 106 78 -171 -56 233 102 -76 -78 30 -80 -217 99 2 43
5032 43 -47 57 -69 -342 110 44 -131 -174 -81 -217 166 -14 38 -5 -200 -13 -115 105 111 283 -101 90 121
5055 121 148 -74 -78 -102 141 21 -96 -335 56 -6 1 10 21 -43 21 -59 -145 3 -22 190 -84 89 -275 -31 -32 -8
5081 -8 -58 -60 148 -91 217 30 139 1 -196 4 34 -214 34 -234 -91 -121 -169 -178 43 38 235 3 -145 43
5105 43 81 71 -4 4 140 143 -101 63 -88 20 -141 139 113 -26 51 197 82 179 10 -157 38 83 68 8 -79
5130 -79 -59 -215 120 -65 -57 45 -13 4 -121 157 34 146 -28 -159 287 -5 -7 131 3 -30 21 -68 -42 -74
5154 -74 -15 78 -55 67 61 6 91 33 201 202 171 96 47 -204 -136 52 175 -21 85 162 128 171 -93 -16 -147 -35
5180 -35 -173 9 127 -73 62 106 -29 56 -30 -26 -24 11 173 168 -20 -2 -80 -25 -20 5 -103 93 -101 -171 86 80 108
5207 108 3 157 148 63 -28 76 -26 140 79 270 65 -192 -40 60 -178 -76 7 -156 222 159 -38 -50 -252
5230 -252 -155 153 25 -44 86 -39 20 100 37 -22 -145 157 -260 -48 182 35 -186 22 20 171 15 70 -119
5253 -119 -262 179 200 -149 -110 59 92 83 -268 -238 -252 -48 -38 -112 37 -145 -29 11 244 271 106 -86 -52 109
5277 109 -47 9 42 -207 82 0 -67 80 70 -44 165 -18 -40 -168 -76 -128 -121 -107 18 -41 -337 4 -90 -20 -20
5302 -20 -81 -97 -73 -94 -40 88 4 27 91 26 100 82 228 -142 -15 164 -50 155 -134 -164 -19 -3 -140 -94 91
5327 91 40 21 54 92 -185 -127 135 227 -97 -4 64 -17 -131 106 89 54 164 208 117 189 171 -64 108 -101 175
5352 175 125 -52 -117 56 103 -150 92 3 60 -186 57 -131 -127 70 99 -28 82 146 38 -5 -43 75 62 -51
5376 -51 -57 5 -49 284 162 90 57 158 4 191 -81 -57 -184 -21 -150 -41 104 102 142 -57 42 34 79 -304 41
5401 41 -106 79 317 80 -240 103 -24 22 -7 -26 45 1 -46 135 159 -130 -11 -36 20 60 -118 -186 260 79
5425 79 286 -6 38 -34 -42 -148 49 -32 -273 109 33 -22 82 -183 -116 9 39 133 -30 50 72 -115 3 136
5449 136 -154 122 326 81 -9 -104 -7 84 56 -46 -39 59 -127 -28 101 41 -81 57 151 -49 5 82 -158 119
5473 119 165 -179 120 2 49 134 -164 -171 141 109 -99 -115 -8 5 -146 77 -32 -153 89 -219 -105 -173 109
5496 109 -144 96 6 100 33 -103 -254 75 -213 103 -145 226 -105 61 203 115 -127 32 137 17 -156
5517 -156 -112 -44 -233 54 185 63 -20 299 173 -223 15 -111 -21 272 95 132 55 -56 -154 105 -109 -47 -66
5540 -66 -33 -130 12 -27 -118 144 -11 -233 -143 -75 -6 -49 -260 -167 91 75 -94 -110 -5 13 251 140 -124 9
5564 9 35 -167 -68 27 7 106 35 14 43 108 -1 20 -111 178 -76 -99 -142 -7 24 71 -84 -11 -152 104 -56 -5
5590 -5 88 -2 -32 -242 -47 40 -101 23 125 -201 37 -214 -124 -151 96 -47 -347 5 -20 43 213 -123 220
5613 220 47 -235 -38 -98 -104 -73 -199 208 -26 -156 -21 -96 14 -95 -119 -59 50 -97 31 98 175 71 -63
5636 -63 -227 -9 49 70 -68 174 -37 26 -146 145 44 -18 -183 -297 -93 -82 91 106 55 95 -131 90 -96
5659 -96 56 -11 42 114 -152 -97 -129 170 -159 -128 62 15 -18 5 82 46 203 136 38 -81 58 -256 122 97 -169
5684 -169 -145 -164 86 346 -23 252 175 -125 17 -107 164 111 144 86 155 -40 -69 77 29 183 -224 42 124
5707 124 22 111 60 -65 147 -13 44 15 68 58 -71 45 41 -231 -14 -47 140 -96 147 23 75 109 8 118
5731 118 -133 13 -52 36 92 45 -198 36 89 132 140 37 -47 -80 11 -36 176 144 32 -137 38 27 21 103 112 -4
5757 -4 -98 -160 -270 -104 212 -51 4 143 -63 -170 -169 17 118 -214 -92 -43 -11 189 80 27 109 119 -54 -79
5781 -79 10 -27 93 -109 332 252 4 130 181 1 53 22 111 -28 21 -10 28 38 45 184 82 -5 -108 -148 211
5806 211 -38 85 -64 -125 146 12 -161 -123 -113 135 -48 158 71 66 59 -32 -114 -224 -78 37 149 -147 211
5829 211 11 -89 136 -86 -120 38 81 -94 -31 30 -105 60 25 142 80 49 191 -159 -384 2 26 -67 -67 -115
5853 -115 -29 -32 163 -2 132 28 68 -142 -69 -29 -80 254 9 86 130 -199 -68 -138 17 -78 -71 286 -315 270
5877 270 -27 -103 -119 -182 -210 54 -27 -110 -81 -84 153 2 171 12 128 -98 79 -123 -95 256 -237 152 -18
5900 -18 176 207 -221 -182 156 -134 -76 42 17 -58 155 -128 22 -57 80 -243 -122 3 10 8 51 103 -101 -78 86
5925 86 29 -104 -229 -57 45 -126 122 8 -27 -109 -235 -72 -248 -101 63 -18 44 61 238 58 -23 -30 -62 135
5949 135 -202 142 -56 -107 -296 -186 -100 -51 -210 -36 99 -203 -137 169 -129 -124 93 136 25 92 69 33 -216
5972 -216 -81 22 -81 32 114 -54 153 64 24 -45 191 -13 -71 241 53 -69 164 11 -1 -45 10 81 32
5995 32 -139 122 -2 32 -121 125 -71 -12 163 -102 -75 152 282 -20 -262 -193 64 11 13 -109 89 127 -42
6018 -42 108 180 -112 -152 138 -73 -240 31 63 29 -122 46 47 -157 95 -21 -130 228 -52 -206 -3 24 208
6041 208 19 89 -129 -89 266 -68 -163 326 -255 187 -36 63 -76 -87 75 -41 -5 41 -199 -101 20 106 -14
6064 -14 6 49 172 -24 34 214 -16 -110 -95 46 -21 101 20 -13 -155 -61 -70 157 -8 57 109 -126 -1 -87 -118
6089 -118 -42 165 309 -57 -29 -52 87 132 46 165 -51 133 35 162 -106 -133 59 43 191 47 -143 -179 -77
6112 -77 -38 92 223 -85 64 -75 47 158 -91 -134 148 -23 213 -34 104 171 -214 -6 -104 -78 -167 -162 99
6135 99 -108 13 80 205 -50 43 -26 45 45 113 47 31 112 -138 77 -9 -118 53 -108 -36 -106 60 49 -14 -2 -41
6161 -41 95 65 -14 274 -48 -125 6 -11 164 -36 51 -277 -193 -1 -31 -14 -83 170 -85 144 3 -113 -198 113
6185 113 347 116 -55 24 -75 -49 161 18 25 -233 14 88 276 -134 177 -29 -46 140 -165 47 155 11
6207 11 42 95 -86 73 124 -164 -60 28 100 -39 93 0 -27 56 140 -51 -133 -90 -21 110 -33 -65 105 -91 116
6232 116 236 92 -39 -129 -61 -13 337 -285 -60 69 52 -101 -186 185 5 -78 -14 -32 -96 -313 79 -69 -127
6255 -127 -20 69 -55 -10 -95 50 -180 -53 -9 98 -2 -130 243 -23 88 4 -11 238 -87 -177 12 155
6277 155 106 0 84 103 124 -42 70 -28 28 -220 57 99 181 -14 -316 143 -129 -20 159 -30 -87 10 93 221
6301 221 -146 -79 8 232 55 104 18 18 8 27 160 -91 154 -122 -14 2 -127 -89 193 15 -68 -144 177 89
6325 89 -240 -63 -157 173 -170 24 83 14 35 -351 67 -276 -179 -77 40 -27 0 -100 -10 83 -106 -123 109 35
6349 35 71 -55 50 -55 -129 79 -15 -22 -192 46 129 112 -12 42 78 98 -82 -86 -172 41 94 -155 47 130 202 -189
6375 -189 65 -87 50 91 -34 -105 117 52 -191 -156 -218 226 50 -39 -92 162 -91 -147 -256 -85 31 191 221
6398 221 213 34 10 69 -16 -250 -104 46 -73 115 -38 -53 -128 -101 67 -23 -5 -176 -127 23 47 40 -163 -144 -135 59
6424 59 195 69 -72 76 55 78 -14 -195 -189 -151 -49 11 -106 97 96 9 152 12 116 3 43 -28 -103 -8 168
6449 168 95 224 -28 -75 72 -11 23 -146 168 -169 105 19 -212 24 -8 -121 -116 45 -82 179 9 -17 231
6472 231 -67 124 32 -94 -17 68 -83 188 16 165 -375 -178 -124 -16 234 -257 -54 -14 -202 153 -44 -14
6494 -14 -145 61 59 0 -112 35 -88 100 -12 -183 -352 -65 45 177 -76 0 -132 198 -49 29 67 -193
6516 -193 94 -99 123 6 -3 -38 58 -242 135 31 -266 -53 266 -213 223 128 -146 38 91 29 -99 9
6538 9 -211 -132 -107 -163 58 74 141 195 226 -167 -60 -193 -33 127 100 22 -58 113 129 -128 10 137 145 224 -288
6563 -288 118 -42 39 -2 -121 73 -77 -62 29 113 -80 71 -263 -60 98 -121 155 12 27 65 172 -106
6585 -106 73 50 -136 9 -5 78 -313 5 -93 -84 -55 127 5 263 45 -40 15 -315 146 49 158 8 172
6608 172 -10 5 151 -220 128 -302 43 -92 63 -140 163 -192 18 -180 -23 -49 -107 -70 -85 -17 -69 -53 -209
6631 -209 150 70 -163 -66 64 -72 21 -216 -155 -156 122 -160 298 55 -1 -158 -92 91 -152 35 33 48 -6 112
6655 112 7 -163 -127 4 -78 -3 -47 53 121 -200 252 -171 143 141 68 -28 30 -29 182 -66 1 -87 165 14
6679 14 -62 -17 -241 257 79 71 -173 54 -75 -80 182 -12 121 99 -247 -77 -114 -182 64 44 193 159 6 35
6703 35 101 148 4 -110 -154 -58 177 86 80 26 -93 21 22 -87 19 -137 -84 95 189 -24 130 6 -75 -44 -164
6728 -164 13 157 35 -45 -9 111 -121 34 -152 201 155 111 -106 -310 -201 282 -189 -76 48 43 -130 63
6750 63 145 5 -112 26 -19 -2 -122 143 -212 -61 -48 -80 84 228 112 -75 -34 -185 25 -80 -169 -79 -112
6773 -112 -84 -42 -10 28 11 -35 146 125 152 -88 -70 204 34 264 -105 186 63 195 -65 31 -29 -82 -109 -40 82
6798 82 41 -55 75 -9 -187 -45 -155 -55 -85 -99 -45 87 84 -93 117 80 -168 7 -14 124 119 -79 -28 -154 18
6823 18 -111 -227 150 35 -144 94 -196 -99 124 -5 111 -127 -76 278 -69 23 185 108 -35 -53 269 35
6845 35 16 146 148 -151 -34 92 -161 -21 161 217 130 -33 -96 99 -109 1 131 -146 151 -299 -104 -81 74
6868 74 -219 38 9 -14 13 -119 0 137 120 24 14 -185 -44 -245 -157 32 174 124 -79 68 165 106 64 -292
6892 -292 94 125 86 25 47 -227 -89 25 -122 -41 77 -142 132 -213 -34 80 -188 -35 -83 -124 92 68 129
6915 129 164 -159 5 143 265 -10 -171 -104 88 -62 -69 50 -82 -12 -24 -70 -173 120 -42 -114 3 -92 76
6938 76 -174 -82 -22 -7 188 79 -113 -36 -5 -23 37 51 -65 19 -65 -225 -250 -97 11 180 113 -140 171 8
6962 8 -137 267 -70 11 135 23 -11 12 64 110 -26 -316 -10 37 -197 -209 -142 -117 -48 -14 -48 -203 63 96 -74
6987 -74 107 -135 36 33 -61 106 -134 180 -130 -180 -149 1 -213 157 191 -10 -43 -17 27 -111 -277 -3 -298
7010 -298 150 -51 -102 -147 25 -65 -3 -34 -68 149 64 235 -24 -64 77 53 -85 124 234 159 -142 238 77
7033 77 -328 16 24 253 149 -102 11 -12 127 -320 -190 -27 132 -1 -178 -69 -169 -64 36 56 -263 -17
7055 -17 -30 -85 12 74 81 85 46 -77 196 -180 -68 -173 -45 130 1 -381 12 144 -27 -231 -180 251 -108 -38
7079 -38 167 51 -73 -155 -2 -111 4 56 110 -146 -146 36 71 -161 -140 100 -75 224 133 -95 54 62 1 195
7103 195 189 51 215 141 8 133 62 -9 -156 -10 -140 122 -154 -74 -27 -27 113 1 -100 103 142 -222 -7
7126 -7 -157 11 109 -75 -47 -43 120 -55 -34 52 -82 -201 -119 -12 102 113 -62 132 -37 106 -21 190 91 -61
7150 -61 -111 92 17 -41 -232 28 -231 -122 -38 -28 202 -78 62 23 -110 69 -20 9 -28 -85 257 -223 -45 -12
7174 -12 224 -83 -205 -82 144 -18 -183 -210 -5 -20 62 40 -121 131 160 -8 -176 62 62 -63 114 2 -68
7197 -68 52 -60 156 48 -120 -107 71 -16 0 21 237 -3 -25 170 58 -123 54 235 -160 -47 10 -29 -1
7220 -1 -83 121 59 240 -42 -90 -1 67 -73 -118 77 -62 -6 37 -84 57 -233 -63 -49 -48 64 -98 -91 20 -72
7245 -72 -238 121 -32 -31 62 199 165 212 -94 78 -86 176 -243 69 172 26 143 -63 130 -69 -136 -25
7267 -25 -106 150 116 135 31 35 -180 -93 88 -189 -187 -33 83 153 69 -19 11 32 -17 -42 1 -69 77 -129 14 -235
7293 -235 80 58 16 -183 -22 -191 34 -44 196 -39 -6 83 -72 -51 -250 -165 -235 238 40 -83 -73 -34 10 131
7317 131 -57 184 -79 -307 130 172 163 -86 -16 26 -95 -20 -142 57 -82 -125 209 27 -51 -57 -99 -13 94 0
7341 0 25 59 68 -62 -26 -91 -164 -243 -223 -23 -12 -245 -81 -106 -31 -177 -116 -173 192 100 56 93 79 -23 -158 -58 160
7368 160 82 149 51 -238 122 -81 -47 -13 -31 -131 137 -40 211 -118 37 -253 -23 -300 131 228 25 105 -12
7391 -12 200 -197 37 -134 -188 -115 -9 74 -138 -81 142 64 168 -109 -18 -87 49 49 -41 49 25 -40 62 181 -263
7416 -263 -134 57 -31 21 -33 112 277 47 -20 -44 86 36 -77 342 133 81 59 4 6 -110 365 -184 187 -105
7440 -105 80 47 -169 228 239 -78 137 -147 67 59 -35 -79 -119 13 66 -50 45 104 80 -12 137 167 121 16 -111
7465 -111 68 -67 75 199 -79 -97 -25 -141 -161 178 77 -18 88 92 -82 -94 147 36 -3 114 -60 -132 34
7488 34 173 114 -114 164 -149 -49 55 -7 152 213 -2 178 238 -67 -209 133 -91 -54 -108 128 13 -125
7510 -125 -145 -139 97 83 11 0 200 -51 -158 27 -107 6 12 -74 165 17 -35 48 -91 -194 -46 -74 11 15 100
7535 100 -36 73 -9 -160 -12 -303 -285 217 -22 65 68 -67 -23 -103 -48 -72 -177 90 -30 -162 -83 -105 -64 101
7559 101 -37 92 27 154 -196 174 -1 140 -13 -156 -23 -28 49 -114 175 -172 -40 18 75 -99 -20 55 -29
7582 -29 -8 182 45 -67 24 66 23 180 -156 99 16 -20 -13 -44 146 -162 -123 132 52 -8 -111 165 -60 26 98
7607 98 142 -33 11 -144 -14 -88 -49 9 -189 50 -19 -139 134 50 123 -18 61 27 221 99 -84 123 -146 186
7631 186 79 -3 -131 133 118 -10 -75 184 74 69 -12 61 190 -133 -70 -126 301 -29 2 -15 -208 133 91 -40
7655 -40 -4 66 -121 118 -51 -139 -124 229 15 -288 195 45 20 98 -46 4 45 0 -261 76 -136 -141 -90 -17 92
7680 92 -2 -100 -39 48 176 174 35 -28 -114 -33 -92 25 210 -36 88 49 89 114 108 -152 -47 -123 -86 -230 77 200
7706 200 116 191 115 -273 -83 -177 110 -130 183 263 204 -250 -19 -49 26 -135 43 -66 84 -48 -34 196 16
7729 16 25 -10 88 -114 -264 -150 96 -317 -53 -39 -105 -66 -119 -67 -181 78 138 -51 222 -111 -114 43 -199 7
7753 7 -9 101 55 99 110 81 -130 93 -193 -73 48 68 -80 58 -94 -276 -16 -46 40 16 83 -26 -11 82 -54
7778 -54 33 -50 136 281 167 -1 -116 -150 47 110 -167 128 128 121 82 -259 -195 -5 192 -13 232 61 -84 232
7802 232 -74 129 -106 84 -179 -123 4 -152 -7 49 -68 -222 -81 -211 143 79 34 223 -95 -97 -31 135
7824 135 -108 -70 236 -93 50 211 -87 -146 -47 13 -219 42 17 43 -56 -54 -16 -152 -74 256 308 -82 -206 -162
7848 -162 78 -48 68 -112 63 -44 -122 191 44 -156 11 -142 -182 17 -148 -108 -329 168 47 17 61 147
7870 147 34 207 61 -121 -83 131 -5 92 83 97 172 201 29 -9 87 6 348 -30 88 -1 43 6 67 -67 146
7895 146 -100 -8 -190 -60 67 43 114 -49 -10 -104 35 -247 220 180 30 27 29 -241 -99 -259 8 -100 254
7918 254 79 -76 -78 123 -192 40 -89 22 -21 -69 157 -82 106 33 -71 -60 -201 33 124 183 -18 39 -115
7941 -115 32 -200 -218 67 9 -47 131 -72 -102 1 -89 -76 -62 87 102 -12 -206 -88 -182 -213 -3 36 48 -100
7965 -100 -2 41 -61 -96 92 -73 -37 -185 -63 -21 -93 26 -107 67 -60 -246 99 119 -37 -206 178 15
7987 15 -179 -233 10 -112 44 -19 72 9 259 158 -72 72 -7 129 28 -19 -91 -11 38 158 -22 215 214 -81
8011 -81 152 -38 117 39 -96 4 -156 -14 -175 95 -139 -97 135 -37 68 127 -85 -213 16 94 -1 -315
8033 -315 -6 55 39 -168 -49 108 -6 58 -110 -34 77 -73 -83 -37 -103 -72 -31 -132 87 177 71 -20 129 -29
8057 -29 -99 203 22 96 62 54 108 136 233 -153 -72 113 -20 57 -157 -73 119 -81 92 14 -101 -37 80 23 86
8082 86 -162 -26 88 -31 55 -203 -148 124 88 106 -74 93 110 -32 -40 -251 -241 144 107 95 71 -197 -207 5
8106 5 -59 14 91 14 -20 82 87 -26 -39 -45 120 -59 -4 10 185 -24 196 19 -118 30 -156 21 -71 5 -78 -37
8132 -37 92 -35 38 153 -36 10 44 102 299 -28 118 -281 131 18 177 -48 76 99 56 -168 74 8 -70
8155 -70 19 -37 4 47 205 -7 -22 72 55 76 0 96 144 -70 -80 -82 -11 73 91 0 119 98 -33 -143 111 149 -107
8182 -107 -77 5 -79 -114 -2 25 161 -91 -138
8191a38
$$ Imaginary data points
##PAGE= N=2
##DATA TABLE= (X++(I..I)), XYDATA
0 0 0 0 0 0 0 0 0 0 0 8 -8 8 -8 16 -16 19 -24 26 -32 40 -47 55 -63 71 -81 94 -106 121 -137 153 -174 195
32 195 -218 245 -271 303 -338 375 -414 461 -511 564 -625 693 -769 851 -947 1056 -1181 1330
50 1330 -1501 1712 -1971 2300 -2738 3345 -4251 5749 -8675 16572 -82670 -252742 -102183
63 -102183 82198 131135 -20494 -179509 -196460 -53130 74864 65579 -64823 -168167 -148335
74 -148335 -22448 69876 39514 -73071 -138238 -97480 8619 72817 38031 -54211 -99198
85 -99198 -55871 33591 84744 53565 -26365 -65476 -24479 52321 94921 71803 4311 -43161
97 -43161 -21543 54302 114273 98373 9316 -65601 -35307 78533 148980 90537 -41184 -102436
109 -102436 -18374 121682 151964 29641 -108537 -108403 28058 145310 105457 -50285 -142955
120 -142955 -72060 70794 122178 32669 -95013 -122674 -29562 73246 77423 -9100 -92628
131 -92628 -92575 -11003 65770 56694 -23658 -86260 -67824 11004 66981 41132 -32687 -69013 -34213
144 -34213 27493 56059 29278 -20529 -40471 -16648 20922 44036 40197 9016 -27986 -32655
156 -32655 7110 61219 73813 16057 -58485 -56758 32057 107728 77194 -30136 -91807 -30898
168 -30898 86336 119141 28659 -76650 -77535 22504 109347 86389 -17929 -82998 -40346 53850
180 53850 97680 50715 -34612 -68780 -16857 61512 83008 29484 -42713 -59236 -287 69776
192 69776 70546 3442 -54129 -40327 24674 66999 38801 -21848 -41580 -9182 28783 34447 12532
205 12532 -9288 -14302 -8441 -674 13546 28449 18226 -18847 -41372 -15993 36956 57315 12347
218 12347 -52985 -57230 11440 72685 54304 -23157 -71075 -32708 50363 80642 25623 -46782
230 -46782 -57245 1970 66955 68989 5363 -51794 -40725 24222 74948 57942 -12013 -57484
242 -57484 -25006 48408 78692 33152 -36035 -51598 4379 64003 56132 -4032 -42770 -22023
254 -22023 26742 45419 17654 -17890 -19817 1381 13253 9400 4494 2936 -1729 -12824 -16753
267 -16753 1410 25679 19883 -18008 -41351 -19548 26039 42871 6778 -43080 -45581 3798
279 3798 46599 36160 -13857 -49140 -30178 23621 52573 25585 -25314 -46220 -14835 38745
291 38745 56403 15037 -38705 -43972 6180 57127 51025 -8427 -52521 -27326 36040 61384
303 61384 22126 -34027 -42421 3921 47515 35862 -9769 -32080 -13124 17922 25758 6947
315 6947 -11579 -10133 -271 1874 1225 4404 6023 -1969 -14056 -16130 -9 19037 13582 -13381
329 -13381 -29882 -15910 13547 26613 6835 -25864 -33464 -6780 24404 27499 -900 -33002
341 -33002 -33495 3082 37044 28834 -13173 -43487 -26428 23565 49265 17245 -35280 -45217 -1054
354 -1054 46001 41308 -10481 -46471 -22977 28237 44942 12729 -27281 -30020 4258 32358 22591
367 22591 -6518 -18592 -6945 10028 15425 7150 -2368 -4246 -2075 -654 3525 8556 6308 -2675
381 -2675 -9035 -7232 2918 12398 7957 -6170 -14802 -9846 3841 14809 10133 -9430 -23136 -14000
395 -14000 9944 23907 9804 -21603 -33893 -7683 28032 29822 -6120 -39251 -29020 15742
407 15742 42076 15643 -30335 -39770 -2376 36212 32178 -8974 -36682 -17863 21245 33868
419 33868 10166 -18657 -21403 3092 24161 19223 -932 -11417 -5023 8397 15799 10662 677
432 677 -2799 1496 6030 8763 7732 4350 2026 2424 1582 2157 6731 10028 5756 -3224 -8186 -2083
448 -2083 13153 17888 1060 -18420 -16095 7284 25255 14455 -17089 -30897 -7448 25262 26834
461 26834 -5468 -33380 -24264 12613 32349 10583 -24802 -31195 -3519 24564 22264 -6739 -27554
474 -27554 -15795 11555 22482 8457 -12333 -17872 -2309 16030 16665 1764 -10188 -7424 5906
487 5906 15619 10934 -1269 -4745 3311 10785 10383 4113 689 5359 10289 6164 -794 2048 11700
502 11700 13665 3698 -8035 -5118 12762 22044 7314 -14752 -15694 6096 24511 16015 -12466
515 -12466 -26175 -7305 20552 21848 -3869 -26953 -21022 6910 22859 7339 -19953 -26575 -7923
528 -7923 13712 14821 -5675 -23699 -18363 2410 14103 5885 -11551 -19332 -7737 9597 12294
541 12294 -870 -12683 -10414 3240 12495 6443 -5340 -6843 2760 9480 6178 -821 -1428 5851
555 5851 10207 3893 -3734 -231 10316 12786 2859 -7955 -5778 9688 17845 6144 -11730 -13374
569 -13374 2961 17419 12071 -8435 -20442 -8360 11949 15685 -945 -19138 -19045 -632 14669
582 14669 7891 -12544 -22842 -12544 6103 12894 -1010 -19629 -20042 -2738 11518 6651 -10421
595 -10421 -20580 -10602 7236 10357 -2830 -14801 -11726 1798 9257 2038 -9874 -9483 1106
608 1106 6166 678 -6649 -6247 1626 5821 -951 -9345 -6146 4019 6799 -1661 -11475 -10738 1806
623 1806 9707 1582 -12910 -15652 -4017 8375 7523 -7867 -18980 -11998 4101 10420 211 -15179
637 -15179 -19054 -4724 10692 8694 -7990 -19319 -12378 5218 13806 2140 -15342 -16557 -854
650 -854 12821 8865 -7152 -15847 -6991 8962 11306 -1752 -11810 -8219 3616 9093 1674 -8709
664 -8709 -7929 1168 5208 -308 -7348 -7241 -664 3571 -2067 -9922 -8515 -727 2936 -2315 -11318 -12821
680 -12821 -3897 4309 531 -11017 -16140 -9123 2838 5645 -5655 -17813 -15095 -396 8683 1886
694 1886 -13224 -18656 -6522 9253 9087 -6626 -18180 -11845 4922 12969 1950 -14037 -14582 224
708 224 11675 7260 -6703 -13470 -4567 8314 8595 -2532 -10151 -6003 3529 6848 254 -7573 -5957
723 -5957 1330 4268 -101 -5639 -5420 72 3772 55 -6610 -6249 270 4256 1480 -5780 -8631 -2232
739 -2232 6460 5173 -4077 -9976 -5630 5069 9486 1438 -10360 -9936 2133 11205 6542 -6725
753 -6725 -12867 -3811 9842 10895 -2135 -12487 -8976 4347 11719 3271 -10417 -12367 -1311 8408
767 8408 5660 -6137 -12868 -6573 4357 5436 -3425 -10711 -8313 -190 4060 -807 -8458 -8042 -1129
782 -1129 2975 -62 -5608 -6814 -1155 4425 2355 -4188 -5412 504 6371 5723 -912 -5196 251
797 251 9176 10375 2301 -4301 -1211 8672 14319 7641 -3643 -3895 6225 14701 11657 -3 -6473
812 -6473 613 12397 13608 2982 -6672 -4712 5719 12336 5799 -5982 -8732 -395 7743 6088
826 6088 -3536 -10304 -6318 2929 5171 -1918 -9010 -8770 -1769 3075 -305 -7669 -9061 -3124 2090
841 2090 690 -5104 -7869 -3206 3358 3204 -3146 -6094 -1901 5037 6544 579 -5405 -2097 7228
856 7228 10236 4111 -3397 -2767 6528 13806 9145 -1255 -4153 4500 13876 12542 2306 -5316 60
871 60 11504 14142 5374 -4253 -3725 5794 12771 8077 -3067 -6610 764 8941 8168 -423 -7412 -4404
887 -4404 4541 6885 589 -6331 -6120 395 5185 1732 -5715 -7033 -1290 3694 1984 -4121 -6797
902 -6797 -2599 3602 3447 -2917 -6513 -2860 3461 5126 -334 -6358 -3978 3968 7302 2330 -4692
917 -4692 -4765 2631 9278 5959 -2807 -5880 906 8920 9106 907 -6069 -2426 7511 10754 3907 -4426
933 -4426 -4595 3554 10410 7091 -2370 -5584 116 7927 7965 861 -5800 -3404 4826 7715 2094 -4497
949 -4497 -4763 1377 6233 3294 -3741 -5724 -497 4573 3223 -2703 -6301 -2396 3721 3910 -2316 -6297
965 -6297 -3455 2633 4272 -552 -6781 -5107 2176 5252 1115 -5613 -6403 -23 6309 3977 -4140
980 -4140 -6984 -1741 5612 6409 -420 -6627 -3850 4316 7741 2730 -4197 -4912 1501 7628 5805 -1800
996 -1800 -5156 -601 5709 6721 1270 -4322 -2947 3811 7182 2942 -2858 -3855 971 5857 4150
1011 4150 -1878 -4636 -331 4151 4029 -737 -4888 -2499 2996 4256 -679 -5375 -3691 1529 4331
1026 4331 700 -5457 -5466 431 4660 1849 -4393 -6588 -1577 4562 4020 -2920 -6997 -3349 3467 5549
1042 5549 249 -6077 -5337 2185 6483 2815 -3962 -5626 -542 6018 5618 -1317 -5755 -2142 4344
1057 4344 6599 1514 -4411 -3772 2945 6610 3386 -2443 -3967 794 5977 4816 -1370 -4020 -386
1072 -386 4733 5039 138 -3905 -1896 3741 5503 879 -4104 -2939 2362 5436 2101 -3824 -4364 1016
1088 1016 5146 2978 -2784 -5114 -1374 4596 4529 -1615 -5561 -2991 2811 5251 1379 -4743 -4763 1053
1104 1053 5555 2912 -3107 -5462 -1199 4813 5000 -924 -5074 -2511 3282 5754 1662 -4061 -3815
1119 -3815 2137 5903 3003 -2269 -3882 449 5439 4622 -683 -3568 -491 4365 5344 730 -3456
1134 -3456 -1703 4024 5727 1525 -2939 -2735 2305 5632 2954 -2493 -3621 1152 5281 3720 -1446
1149 -1446 -4145 -841 4445 4938 -402 -4632 -2763 2747 5122 1630 -4160 -4446 1244 5302 2945
1164 2945 -2527 -4711 -1339 4099 4381 -1055 -4491 -2446 2633 4559 1164 -3548 -3508 1423 4707 2602
1180 2602 -1914 -3391 -380 4114 4042 -673 -3349 -890 3222 4361 866 -2835 -1878 2464 4677 1799
1196 1799 -2035 -2227 1304 4708 3109 -1290 -3247 399 4389 3867 -302 -3537 -1620 3487 4893
1211 4893 602 -3545 -2869 1886 4564 2135 -3114 -4301 -13 3909 2928 -1487 -4909 -2233 3086
1226 3086 3706 -472 -4699 -3153 1273 3822 1210 -3787 -4473 -104 3496 1905 -2260 -4257 -1369
1241 -1369 2854 3180 -1054 -3854 -1858 1965 3447 679 -3124 -2625 1593 4069 1576 -2184 -2619 511
1257 511 3891 3006 -1345 -3048 -42 3691 3885 -220 -3218 -1662 2755 4390 1006 -3014 -2456 1058
1273 1058 4062 2611 -2286 -3785 -415 3135 2784 -1279 -4510 -2597 1915 3046 -408 -4343 -3958
1288 -3958 -118 2782 874 -3876 -5125 -1518 2057 901 -2542 -5048 -3136 1346 2212 -1629 -4704
1303 -4704 -3572 576 2690 155 -3773 -4082 304 2977 1255 -2669 -3849 -604 3039 2896 -1344
1318 -1344 -3815 -864 2924 3617 327 -3061 -2344 2055 4069 1292 -2558 -2926 826 3851 2601 -1906
1334 -1906 -3618 -527 3049 2938 -633 -3891 -2704 1714 3233 127 -3532 -3514 -324 2690 970 -3109
1350 -3109 -4208 -1205 2016 1100 -2305 -4437 -2770 1049 1939 -1472 -4248 -3331 355 2104 77 -3506
1366 -3506 -3577 -648 2108 584 -2395 -3581 -1267 1816 2056 -1450 -3536 -1771 1347 2596 160 -2868
1382 -2868 -2748 792 2795 1106 -2205 -3098 -336 2789 2280 -1541 -3550 -1429 2191 2716 -56 -3203
1398 -3203 -2538 938 3263 936 -2591 -3063 -173 2717 2050 -1988 -3503 -1029 2158 2138 -769 -3279
1414 -3279 -2176 1355 2652 203 -2868 -2533 437 2620 1139 -2076 -3146 -227 2352 1545 -1258
1429 -1258 -3155 -1297 1885 2099 -844 -3208 -2022 1026 2290 522 -2439 -2906 304 2378 1127
1444 1127 -1783 -2989 -1173 1855 2311 -916 -3181 -1681 1427 2304 177 -2505 -2863 648 2688 1327
1460 1327 -2026 -2775 -411 2213 2152 -970 -2878 -1110 1870 2345 86 -2297 -1995 975 2738 869
1476 869 -1803 -2080 328 2543 1968 -860 -2456 -189 2561 2313 -503 -2153 -1276 1722 2817 650
1492 650 -2004 -1526 850 2469 1273 -1585 -2497 95 2534 1835 -1006 -2691 -1006 2129 2671 -327
1508 -327 -2741 -1546 1437 2460 724 -2165 -2316 589 2584 1178 -1675 -2672 -406 2022 2066 -672
1524 -672 -2664 -1117 1725 2182 123 -2187 -1785 757 2463 862 -1476 -1856 -11 2326 1741 -810
1540 -810 -2300 -466 1926 2077 114 -1860 -1083 1480 2617 508 -1801 -1384 1050 2575 1677 -1015
1556 -1015 -1793 293 2700 1899 -571 -2073 -836 1880 2399 35 -2061 -1363 1154 2438 996 -1325
1572 -1325 -1961 566 2519 1634 -1207 -2061 -470 1811 2093 -532 -2561 -1110 1353 1875 177 -1827
1588 -1827 -1987 366 2250 734 -1213 -1911 -307 1775 1566 -673 -2263 -733 1637 1751 -35 -1774
1604 -1774 -1464 1148 2432 671 -1541 -1590 488 2033 1524 -997 -1979 -125 2072 1734 -308 -1493
1620 -1493 -639 1458 2162 158 -1552 -1196 954 1921 1275 -1250 -1760 32 1847 1332 -459 -1839 -442
1637 -442 1384 1969 -273 -2012 -1153 880 1575 685 -1426 -2030 177 1660 899 -1288 -1569 -801 1532
1654 1532 1503 -574 -1962 -1226 984 1531 -97 -1967 -1679 605 2059 670 -1368 -1757 -178 1558
1670 1558 1418 -774 -1892 -425 1576 1584 -227 -1757 -1116 1120 2130 610 -1448 -1181 714 1970
1686 1970 1306 -884 -1921 88 1971 1628 -443 -1370 -350 1350 2194 448 -1903 -1163 615 1585
1702 1585 649 -1215 -1538 -123 1906 946 -924 -1733 -555 1204 1413 -442 -2008 -1125 589 1509 121
1719 121 -1760 -1778 356 1775 601 -1321 -1755 -201 1667 1212 -841 -1950 -679 1357 1505 -149
1735 -149 -1580 -1327 807 1976 645 -1144 -1314 383 1636 1257 -752 -1701 -104 1475 1671 -485
1751 -485 -1491 -878 1326 1987 394 -1413 -971 707 1731 1151 -779 -1264 -105 1869 1416 -435 -1386
1768 -1386 -501 1224 1567 -353 -1608 -992 869 1692 597 -1314 -1605 322 1587 720 -1303 -1441 -431
1785 -431 1311 1000 -336 -1839 -713 942 1454 41 -1492 -1268 585 1794 535 -1195 -1384 69
1801 69 1296 998 -669 -1525 -388 1316 1191 -271 -1041 -600 803 1674 569 -1070 -878 681 1582
1818 1582 954 -593 -1363 -146 1401 1207 -318 -1298 -505 1214 1583 26 -1097 -884 682 1412 544
1835 544 -835 -1198 31 1397 673 -611 -1269 -496 974 1206 -204 -1612 -763 727 1391 59 -1038
1852 -1038 -1301 135 1522 606 -1178 -1455 -234 936 1128 -184 -1417 -355 1220 1327 17 -980
1868 -980 -1038 419 1561 472 -884 -994 307 1257 1124 -411 -1253 -70 1140 1337 112 -1129 -747
1885 -747 864 1363 190 -1146 -877 460 1011 709 -653 -1266 -194 1118 656 -427 -1189 -506 900
1902 900 1089 -306 -1598 -915 413 808 276 -927 -999 180 1252 592 -816 -1389 -296 855 949 -424
1920 -424 -1468 -815 766 988 327 -1085 -1028 570 1407 606 -976 -1323 -48 1052 933 -460 -1415 -184
1938 -184 837 1245 -130 -1035 -585 704 1360 389 -972 -871 439 1146 578 -585 -1246 -266 1165 1066
1956 1066 -295 -1058 -446 613 1129 -215 -1345 -748 530 867 547 -759 -909 -111 1063 472 -857
1973 -857 -1190 -390 594 936 -253 -1375 -675 733 957 -79 -715 -986 92 1026 499 -542 -1025 -157
1991 -157 983 883 -350 -1030 -413 990 925 71 -659 -753 455 1081 511 -779 -533 361 1000 961 -276
2010 -276 -1144 -65 1050 915 1 -722 -154 850 1136 122 -770 -780 453 857 303 -910 -998 -256 852
2029 852 507 -628 -1081 -502 485 807 -229 -1284 -745 223 687 273 -877 -964 -109 995 464 -555
2047 -555 -891 -147 633 756 8 -910 -221 742 1134 336 -531 -365 520 1334 786 -481 -495 81 1191 1121
2067 1121 84 -976 -238 785 928 -54 -833 -552 472 850 203 -630 -830 247 659 454 -607 -1020
2085 -1020 -329 392 372 -307 -1035 -839 4 615 -179 -1172 -1086 -85 758 226 -730 -935 -291 605 643 -73
2105 -73 -832 -237 842 924 -97 -771 -554 706 994 430 -514 -635 108 1052 658 -305 -622 152 698 824
2125 824 -66 -790 -187 713 812 -234 -661 -547 218 825 230 -582 -901 45 573 278 -376 -1256 -396 414
2145 414 776 -162 -872 -720 421 890 163 -1047 -674 304 663 365 -502 -842 45 1005 804 -212 -818
2164 -818 -138 568 726 -104 -833 -585 486 515 32 -606 -662 169 765 371 -292 -823 -6 628 430 -9
2184 -9 -889 -453 298 664 183 -744 -637 9 520 420 -498 -797 5 721 791 -240 -816 -612 769 872
2204 872 90 -624 -560 418 957 337 -442 -554 232 850 354 -241 -638 2 772 605 -277 -1034 -285 509
2224 509 469 -112 -636 -599 202 758 134 -388 -810 -245 369 503 -366 -902 -194 460 552 -70 -907 -382 321
2245 321 747 115 -585 -857 43 854 485 -360 -599 -53 643 741 -14 -803 -154 473 839 88 -587 -331
2265 -331 471 546 513 -427 -615 234 743 143 -312 -543 -231 581 405 -16 -383 -249 411 748 94 -493 -379
2286 -379 177 291 345 -394 -853 -311 505 320 -195 -910 -372 457 681 201 -535 -744 217 472 340 -608
2306 -608 -808 72 956 537 -492 -934 52 636 557 -83 -873 60 448 781 116 -629 -486 281 621 364
2326 364 -467 -551 46 721 576 44 -515 114 503 578 -125 -540 -363 311 526 367 -439 -484 0 711 357
2347 357 -298 -726 -211 288 505 -116 -697 -370 275 849 -90 -796 -667 168 696 69 -572 -804 -43 333
2367 333 331 -399 -653 -139 434 212 -158 -532 -397 188 512 397 -353 -500 252 548 288 -128 -406 1 357
2388 357 597 98 -371 -250 573 692 348 53 -53 272 690 256 -290 -484 206 675 572 -39 -508 -245
2408 -245 462 341 -295 -608 -172 298 437 -42 -774 -535 263 261 0 -679 -706 -116 386 -99 -692 -783 -303
2429 -303 113 498 -305 -277 -298 268 654 -147 -232 -408 -28 484 273 -89 -402 102 350 452 108 -349 -270
2450 -270 368 575 292 -351 -354 -155 706 462 -302 -432 70 523 365 -248 -310 0 287 246 -289 -270 -252 279
2472 279 444 -31 -406 -360 -55 271 112 -391 -708 -215 152 282 -156 -469 -337 163 604 7 -210 -617
2492 -617 -56 511 179 -365 -358 -204 601 289 -104 -358 -106 265 564 71 -559 -594 475 398 -51 -347 -219
2513 -219 23 579 397 -426 -446 117 354 304 -59 -467 -148 410 642 -308 -547 -300 183 343 -12 -625 -456
2534 -456 -180 141 -24 -306 -682 -375 260 300 -181 -349 -261 -4 445 86 -219 -446 -60 422 435 -421 -455
2555 -455 -237 529 513 -43 -834 -239 383 439 131 -562 -445 346 596 155 -232 -216 -120 534 272 -207 -459
2576 -459 210 450 186 -87 -265 -205 108 337 149 -206 -214 43 278 199 -389 -386 -19 346 441 -28 -415 -267
2598 -267 66 350 -159 -698 -557 142 532 78 -367 -737 124 449 265 -172 -415 -45 476 218 -206 -469
2618 -469 -333 331 81 -382 -268 -317 77 388 125 -214 -423 187 183 161 -160 -141 109 113 418 138 -145 -152 210
2641 210 410 83 -99 -285 -35 563 175 -291 -335 -38 594 519 -162 -495 -30 194 399 -94 -258 -161 160
2662 160 445 216 -379 -87 284 290 96 -275 -189 33 335 364 8 -259 -10 225 374 168 -231 -51 97
2683 97 253 307 -508 -272 -364 67 252 -197 -278 -116 175 339 -101 -507 -333 -24 422 112 -284 -326 -127 346
2705 346 290 -445 -276 178 312 337 7 -280 59 274 322 -69 -109 -208 64 419 29 -123 -170 275 184 96 -260
2728 -260 -147 -193 87 276 36 -191 -58 400 142 97 -224 -298 -23 203 176 -58 -244 -201 516 259 -227 -655
2750 -655 -311 -9 363 -116 -408 -301 99 389 -127 -56 -568 100 332 354 -48 -267 -20 294 185 -105 -241
2771 -241 -315 397 250 54 -483 -91 407 473 152 62 -87 220 190 89 98 -306 -200 161 567 138 -178 -362
2793 -362 192 410 48 -238 -426 92 377 209 -83 -423 -74 364 195 -17 -610 -137 -41 351 132 -388
2813 -388 -148 189 424 -66 -385 -569 207 328 128 -102 -380 195 249 542 -149 -368 65 141 186 -236 -126
2834 -126 59 186 155 63 -265 -245 -269 224 223 0 -150 15 91 319 270 -326 -429 -66 498 236 -72 -288 -223
2857 -223 103 262 -259 -394 -35 321 174 16 -342 -256 241 349 5 -153 -323 -18 264 -185 -243 -51 158
2878 158 294 273 111 -263 -159 70 35 0 -352 7 21 163 192 -179 -117 -115 164 209 -17 -507 -318 352 269
2901 269 -137 -216 -70 340 182 70 -370 -348 287 247 113 -327 -293 83 445 275 -170 -188 -151 137 327 44
2923 44 -363 -301 -1 41 249 -139 -256 118 243 82 -46 -176 -71 106 98 119 -202 -44 95 251 -60 -254
2945 -254 -320 105 395 238 -300 -306 -175 492 396 -214 -218 -40 99 251 85 -207 -305 239 429 120 -336 -303 175
2968 175 255 122 -230 -237 187 280 192 -350 -316 -281 142 -24 -160 -42 68 31 199 -94 -176 -60 -311 132 31
2991 31 -25 -180 -128 187 270 46 -277 -272 212 202 430 -105 -382 218 591 310 0 -84 39 496 264 -68 -205
3014 -205 87 320 165 78 -153 -14 48 337 -36 -132 -246 105 291 200 -90 -193 80 217 -36 4 -376 -169
3036 -169 172 -8 -35 -431 -200 30 49 7 43 -283 -125 194 276 -160 -192 -417 30 319 179 -351 -185 40
3058 40 344 -98 -340 -64 90 263 150 -178 -406 191 415 188 -81 55 -38 181 178 -37 -83 -41 252 213
3080 213 -195 -20 -309 -206 40 51 21 -87 -109 166 167 43 10 -333 37 335 -87 -195 -216 -38 140 97 -313
3103 -313 -369 -244 113 196 -198 -103 -329 -47 287 -70 -168 24 -23 -6 -74 -472 41 44 71 -146 -166 -120 -273 157
3127 157 -38 -102 -223 -92 -16 129 -83 -233 -397 -220 -159 69 23 -240 -126 66 336 -102 -221 -64 180
3148 180 341 114 -164 -68 -71 165 248 -163 -173 -123 265 158 -294 -15 143 422 339 -118 -80 14 146 72 24 -117
3172 -117 20 2 178 154 -165 -206 -121 -40 37 125 -331 -160 -66 43 -338 -251 -346 -165 7 131 -222 -478 126
3195 126 404 -81 -159 -164 -122 203 226 -184 91 143 72 387 123 347 51 103 222 116 -248 -267 208 385 302
3218 302 -270 -43 -20 437 181 114 -166 -44 18 245 86 -228 59 38 24 145 14 -23 -192 177 4 -221
3240 -221 15 9 71 8 -67 -60 59 -17 -1 6 -214 -255 148 -225 -44 -70 -158 -93 -40 221 134 -74 -231 124 134 95
3266 95 -152 -209 -123 -58 67 -235 -49 9 53 -48 -160 -63 -128 211 89 -118 -201 22 178 118 126 -87 -187 -147
3290 -147 217 -41 -187 -274 -91 184 256 -199 -200 -203 291 236 -112 -30 84 69 130 -36 -152 -348 168 74 -160 -212
3314 -212 -62 -132 246 4 -195 -318 9 -92 140 7 -89 -55 107 359 221 -168 -50 128 212 105 24 -90
3336 -90 -282 62 -1 126 -100 -41 87 -49 42 -26 -129 24 -71 -92 -104 -61 -62 177 40 -179 6 -168 -104 119
3360 119 -110 -115 15 139 -90 -185 106 -61 -17 224 77 -86 -153 -290 -171 -175 -22 1 -215 133 -83 164 -101
3383 -101 -96 -49 166 -38 -116 -196 -49 -32 59 124 -111 -224 110 95 95 -136 -235 -52 260 -40 -10 -66 71 43 13
3408 13 -89 -301 99 53 98 -9 32 72 37 120 165 -275 16 -93 88 -82 -119 -162 -95 186 40 162 -29 56
3432 56 105 331 136 -403 -18 -36 -58 3 -52 -65 -190 131 100 104 -120 -125 356 50 -143 -129 -141 116 -26 31 -100
3457 -100 -70 -19 171 264 147 -220 197 74 276 -134 -211 -167 128 -132 -85 -185 -58 85 254 -89 123 -18
3479 -18 -35 107 -27 -168 113 -5 202 -40 125 49 150 400 275 26 -248 1 -1 419 -28 -38 -287 -65
3501 -65 204 82 -19 187 -133 296 146 196 -4 61 128 264 65 -167 -105 155 112 -159 -89 -274 -186 96 -189
3524 -189 -40 -473 86 -56 101 -12 -361 -80 33 271 -97 -67 -105 41 201 193 -165 -221 106 105 120 44 39 40
3548 40 34 111 -61 -154 -188 -71 30 200 -288 -233 -89 57 58 -48 -44 11 130 32 -97 74 -28 -215 -59 -82 -162
3573 -162 -179 36 74 -98 155 -92 17 71 135 -52 -103 -228 -109 -9 -148 -160 -280 115 217 -1 -204 -47
3595 -47 247 170 94 -17 -201 -152 178 86 -186 -61 -171 191 312 -73 14 -32 -42 164 241 106 -58 133 -117
3618 -117 143 183 66 23 31 281 25 -173 60 173 258 206 -146 -122 110 83 23 -123 -70 3 150 54 10 -128
3642 -128 -195 47 -102 11 15 -6 -124 28 22 -67 -64 -51 76 169 -218 -200 59 12 -14 77 -366 -114 113 162 84 20
3668 20 90 346 -24 63 119 -67 67 -3 214 13 -151 145 113 75 115 160 -185 19 290 151 -23 -86 275
3691 275 122 169 26 -107 95 25 -158 16 -269 -66 -78 62 137 3 -89 145 159 198 -334 -19 -100 -62 170
3714 170 11 127 23 101 17 34 -145 -139 -182 511 100 28 -173 -105 42 -303 -168 -142 -121 50 219 -102 -25 45
3738 45 -65 167 205 18 -97 120 89 -27 53 -96 -120 106 189 224 -500 89 65 251 -126 195 -336 34 6
3761 6 272 -255 56 -46 -1 94 -303 61 -163 -78 180 123 7 -60 50 284 15 -136 -191 -113 87 -31 -126
3784 -126 -99 -307 88 -2 -72 -278 97 150 49 -248 -67 -17 -9 102 -223 -42 -322 90 -83 -75 -20 19 37 -63
3808 -63 114 -223 5 -39 -21 136 223 -175 -47 -48 48 40 -182 32 94 -94 31 43 29 149 -134 132 11 -134
3832 -134 -121 17 -46 79 -239 -140 121 141 -17 -39 158 100 -84 20 -160 61 -18 102 -22 114 -52 -98 -16
3855 -16 12 -214 -178 -118 -65 118 207 -213 166 137 -36 -197 -67 -141 -6 -37 -1 40 -182 -240 -106 -99 62 -188 -64
3880 -64 81 94 120 61 92 -41 84 31 -71 -23 14 -71 123 10 -293 -204 -143 43 203 94 -160 6 14 -17 18
3905 18 -91 28 55 -120 -109 -6 -52 76 102 -179 9 -73 12 309 48 -145 68 -82 90 172 57 66 -145
3928 -145 -30 68 -110 -136 6 -156 15 233 21 -128 -18 33 187 -43 -133 -68 -88 102 -18 34 -92 102
3950 102 168 191 -138 -253 230 115 274 6 16 -71 116 17 91 90 -155 75 106 11 -117 134 75 158 -129 83
3974 83 52 66 -34 98 -49 -95 -69 286 35 -56 96 -58 -15 11 178 -188 -27 -322 133 -32 -170 -258 -5
3997 -5 -84 185 -29 -90 -290 21 -136 72 -98 -352 -103 -13 -117 -72 258 -162 155 18 279 -197 -28 -58
4019 -58 173 9 -28 119 99 137 84 -4 -4 82 -85 -148 36 111 -90 136 -29 -75 -209 -311 91 328 -191 94
4043 94 -129 -8 50 88 120 -26 -134 -49 109 -10 -160 47 -4 3 140 -35 -18 -244 137 11 -25 -66 233 76
4067 76 -180 8 -4 -104 146 18 -25 -137 4 112 -94 36 -184 47 101 124 -192 -191 -355 173 16 -103
4089 -103 -62 -464 179 183 -80 -55 -122 37 -34 85 36 109 -93 -59 152 31 -58 -26 26 112 24 88 54 -125 70
4114 70 35 -83 -99 -171 31 221 -61 82 34 -157 280 65 -19 -77 101 -126 166 -100 -142 -8 19 -71 48
4137 48 -52 -108 179 -58 -175 -189 -100 -69 132 -176 37 -117 -92 50 -87 109 -297 106 -23 202 67 -42
4159 -42 -120 56 -33 19 -173 -29 52 -35 -128 19 161 63 77 19 141 -126 229 96 -4 -21 -215 -36 -182 166
4183 166 -222 -216 -49 -28 -90 17 -34 111 31 49 299 55 -96 -37 -153 -88 -24 22 190 -4 154 38 -108 -52
4207 -52 178 27 96 -90 -217 189 -106 7 0 -336 50 116 -57 58 -22 -257 24 -28 148 -109 25 129
4229 129 -16 -48 230 100 75 -28 80 6 -5 4 51 -248 231 -16 -144 -12 48 230 -93 -138 129 -2 -77
4252 -77 68 -14 -5 147 90 41 45 59 -96 38 -156 -202 80 -41 -200 -63 -74 16 -91 15 97 109 -106 114 -1
4277 -1 50 -225 -34 -66 19 111 -140 81 115 11 29 119 -152 16 -17 -36 -122 -130 -115 -96 -10 -53 104 -137 -125 -175 142
4304 142 231 -24 -49 -62 61 -35 -146 -148 63 111 -62 17 -269 -184 -72 -124 35 -32 8 5 -63 -43 89 -197 -189 -56
4330 -56 -27 128 7 -92 -13 184 7 -111 42 -135 327 -43 24 -122 -11 -27 -27 181 123 167 42 98 -65 -114
4354 -114 -255 57 185 150 -62 92 -115 -110 -123 119 -37 71 163 104 167 125 59 -10 148 -55 62 -17 -61 186
4378 186 73 166 20 77 4 51 40 -276 15 -120 -30 193 -63 -99 92 58 26 -109 -266 110 -6 -3 -44 32
4402 32 157 -213 -131 -122 -149 -26 -45 156 181 7 -67 -116 -36 -295 208 -137 100 -63 -100 101 -72 124 132 80 -102
4427 -102 69 -46 219 113 40 99 -49 58 -16 95 255 130 -27 -44 -16 -132 95 9 164 -18 159 -158
4449 -158 -24 44 0 -78 89 -71 -163 118 63 133 100 -34 -56 137 236 92 55 -195 -122 37 5 5 -246 -157 201
4474 201 140 44 5 47 137 87 -337 -79 -310 -7 90 -214 78 29 327 -143 60 -136 -85 -238 77 -19 48 155
4498 155 155 -2 -90 166 -198 -138 -129 -13 122 -55 218 -101 133 130 -54 175 344 -176 113 78 -50 41 -118
4521 -118 161 -50 -95 -49 -45 -34 90 126 -49 -48 18 -216 -143 -35 -125 -41 195 -113 -2 -105 246 10 70 -182
4545 -182 -216 166 -9 -80 -78 -82 69 -166 -38 -364 120 -30 -28 224 -59 184 105 -13 274 -54 -113 -5 48 81
4569 81 -8 -143 -105 54 78 22 -11 -177 171 156 -107 47 124 -52 211 -127 -3 -148 162 136 -294 139 21
4592 21 136 -47 16 -63 -6 155 18 17 55 -18 -36 -64 -76 -76 187 13 -16 -91 181 -17 137 -46 18 231 -314
4617 -314 -23 -5 146 -116 -24 42 -84 -34 108 -38 92 -15 -39 45 252 -94 -180 -126 115 143 -77 109 6
4640 6 -20 -20 -72 -168 35 -35 -51 -139 -28 -41 -136 97 -82 183 -22 -66 -149 -68 -29 -21 -147 -124 284 97 -115 -7
4666 -7 185 70 55 37 -77 -35 -200 -104 154 -124 -57 112 3 132 -68 -49 -67 146 7 -163 -190 67 58 106
4690 106 -8 80 106 211 130 111 101 -135 32 -208 22 27 -166 -203 219 -257 -79 161 -104 -118 -59 100 66 27
4714 27 -73 25 -128 -153 -125 4 -91 165 223 84 -117 -23 265 51 91 -24 96 -219 -97 -46 67 262 304
4737 304 145 225 296 -198 6 9 23 76 32 250 -22 56 -162 142 -14 95 -13 -37 -18 -124 129 285 -374
4760 -374 -119 -13 8 267 244 104 72 296 -80 232 -96 -61 -179 -342 -126 71 -292 -43 133 -12 147
4781 147 -113 76 26 -81 66 55 -41 5 34 -25 46 189 70 22 97 -87 -101 31 -56 167 283 -42 65 -172
4805 -172 -60 2 -78 -45 -120 -18 164 -53 10 255 -169 291 62 -143 -30 -84 200 6 102 62 -41 -205 83
4828 83 -49 -90 -199 -20 81 -22 -4 -88 67 -63 134 -14 103 114 -17 312 -30 133 92 273 107 166
4850 166 179 -33 -41 -153 -213 19 -31 221 338 -231 -237 -138 224 123 -21 -84 -171 88 60 -205 -170 -7 -93 35
4874 35 131 140 -12 95 -306 109 116 -77 -197 -55 70 64 -115 -2 93 -15 98 -96 7 2 -42 102 -41 62
4898 62 -71 -167 -224 -54 -1 -391 81 -99 10 -10 13 -9 15 94 -86 225 -22 -139 -33 -2 15 -128 -3 125
4922 125 -9 56 -113 -71 151 -267 163 0 -124 67 -79 137 136 179 32 96 276 122 -124 118 -84 -66
4944 -66 217 -73 -306 138 -27 -168 -141 -75 -237 -57 37 21 48 19 -11 -41 136 92 16 -201 -33 -51 116 -101
4968 -101 109 376 106 -216 48 -41 -79 -95 -61 -105 345 72 -127 73 -165 218 -95 247 119 93 -54 188
4990 188 -65 -202 -31 -127 126 116 -200 63 -189 6 115 106 -227 -75 -106 253 88 -66 -154 -105 61 -225
5012 -225 3 174 -42 162 121 -2 176 14 -147 171 -60 75 8 -80 115 -15 27 137 111 -51 -236 -187
5034 -187 -57 -163 -47 -102 124 -9 -81 -96 -302 187 -42 -286 83 -82 75 -9 -56 146 158 -59 -127 -200 237
5057 237 44 38 206 134 118 101 -4 -95 140 13 92 51 -159 260 44 137 97 -74 191 99 -64 -27 14 154
5081 154 98 -307 40 105 240 -34 8 53 53 10 117 144 178 -33 -35 -123 2 30 -77 -17 60 -140 -210 -193 233 76
5107 76 -62 153 33 57 30 62 36 -101 -1 14 21 67 -90 -80 77 131 222 33 60 12 78 -220 -160 5 147
5132 147 -125 102 -17 182 -131 -132 49 279 -253 -14 -241 12 239 -156 -151 -136 -43 -195 -124 57 -127 145
5154 145 61 -125 81 -55 70 79 259 147 -519 -133 142 -22 12 -173 -11 -25 42 -126 87 152 267 -98
5176 -98 19 332 26 -30 7 54 94 -168 42 209 33 -289 -152 -42 -14 -58 -82 -101 -223 119 18 -43 3 -33
5200 -33 118 105 -96 103 -45 -46 -105 -144 24 -169 -115 92 94 -113 -119 58 -55 -8 -175 104 86 11 -131 93 -52
5225 -52 -125 38 171 317 33 134 133 193 -153 148 -225 -298 204 -118 -68 -187 -28 -100 -139 -143 9 -157 -48 -79
5249 -79 -107 -79 28 -236 14 43 -9 -40 155 8 93 -12 -138 -109 63 55 54 -151 -65 19 44 318 254 92 22 142
5275 142 -147 -6 -90 -80 -138 121 -81 98 -188 81 -34 -67 -50 -142 -106 -215 112 350 -19 -105 137 208 143
5298 143 3 94 202 21 -129 -113 282 -44 9 82 106 -15 -36 267 -101 -298 -61 179 -104 177 -4 -33
5320 -33 -129 39 -21 41 -47 217 85 -84 -164 2 140 157 68 108 217 -103 101 257 28 251 175 129 -238 20
5344 20 235 78 -99 183 -75 -99 88 60 -37 160 75 -192 14 -168 158 134 -3 233 179 -144 -89 -54 -116
5367 -116 -7 -25 -78 155 -120 -118 -147 84 -19 105 119 104 -52 33 142 39 6 -83 -9 -149 30 79 7 -216
5391 -216 26 -215 -37 87 169 -305 -48 -70 56 -53 225 -54 78 -105 -43 28 92 -158 106 75 -111 -249
5413 -249 -104 1 -34 -144 11 -26 -42 -155 145 369 -37 120 38 195 -119 6 265 -75 189 20 -292
5434 -292 -105 -55 143 88 114 79 -104 63 -163 4 78 -22 -13 72 83 123 185 -86 41 -95 159 142 -77 -26
5458 -26 -5 293 77 139 -62 -74 91 204 162 -119 -273 40 186 -45 53 -187 -23 39 102 -27 101 293 -3
5481 -3 10 -43 38 -73 36 65 329 125 -77 -70 27 -270 85 210 19 101 25 80 -15 147 33 -37 29 -100 166
5506 166 -70 62 136 92 175 93 -77 79 -26 -144 -124 33 -27 34 -41 -181 -126 141 -56 96 74 170 117 54
5530 54 121 90 -16 111 185 -103 -221 184 139 80 5 -70 289 -20 -6 113 -8 -171 198 20 107 83 -61 -122
5554 -122 -130 -9 186 129 -11 293 240 -80 106 97 105 -157 43 -96 -42 -120 58 153 -27 -100 66 -110 88 73
5578 73 302 -22 -275 -12 54 52 88 -24 -79 -29 76 -86 29 -62 -133 -29 -59 39 163 10 -45 37 75 -29 116
5603 116 -7 -121 1 -1 -79 85 -79 -69 -165 130 -103 120 -4 -38 -69 85 235 112 119 -55 -78 163 154 -24
5627 -24 67 -71 -210 50 31 87 148 22 75 -146 51 97 13 171 62 -68 -143 -172 144 -38 25 252 -29 88
5651 88 -142 -114 47 181 77 -20 -127 -212 -73 -192 118 -190 -45 118 -79 -33 86 8 51 -58 45 108 12
5674 12 -114 -257 79 161 62 142 27 -93 19 253 106 -94 205 2 146 -139 -88 -57 103 109 -38 -53 -108
5697 -108 -54 124 -140 275 24 72 50 17 -125 69 115 185 62 6 -8 -26 4 17 77 50 149 126 -177 23 209
5722 209 62 -19 -47 -39 45 134 -148 238 -43 130 48 103 -45 61 112 -61 35 -87 368 -51 28 125 -194 72
5746 72 -207 -66 183 -90 -236 -65 -146 37 75 27 136 -70 -9 69 -48 9 -326 79 201 28 18 -31 -37 315
5770 315 198 139 -24 -179 4 -22 78 -57 -31 -116 75 132 -27 -13 -254 -155 -153 75 -52 67 -113 23 110
5793 110 60 53 125 -65 -28 34 122 61 79 -175 -34 -16 -170 -184 136 -112 104 -196 -36 -204 -145 6 153 -225
5817 -225 75 -90 21 86 58 121 14 -196 -38 88 -10 36 0 -91 169 36 -70 26 37 -157 -35 -85 137
5840 137 44 16 -4 -91 -43 124 57 -57 156 -26 19 -40 345 30 108 -182 211 -7 76 8 191 -3 -87 65
5864 65 61 -102 -63 15 128 -111 -120 223 -92 154 41 -139 130 219 117 -73 -84 78 -192 -147 233 50 72 212
5888 212 -87 128 221 -52 -19 -39 -140 -17 100 124 74 -75 -70 125 -57 -176 -63 132 -245 -18 -144 93
5910 93 31 -88 1 -128 178 -117 108 139 42 27 -22 85 100 -92 -46 -198 -207 8 -9 -47 175 159 -97 199 174
5935 174 75 309 -117 -87 -9 17 218 41 261 67 -169 -103 221 -41 -17 -20 -11 32 -53 -112 -114 -129 -43 -75 -86 -19 -45
5962 -45 -37 3 -261 -143 -34 -58 53 -59 189 -219 249 140 -171 -150 143 -138 169 59 -7 -26 -196 -233 -78
5985 -78 -106 21 20 91 4 223 40 9 -22 -169 -93 -41 65 2 -89 -118 27 -86 -124 60 -69 -19 -24 -127 11 -132
6011 -132 214 43 0 179 -290 -40 -150 -185 -93 38 -7 -187 114 -130 -97 -60 -7 -60 38 114 -75 -49 -98 77
6035 77 -65 205 -141 -34 179 -36 -122 117 66 45 -64 61 -103 182 -16 -102 131 -91 -16 82 -3 -92 97
6058 97 178 -161 6 -149 -34 115 -77 201 -109 -105 55 25 -3 -121 -46 -119 158 -72 -84 -177 130 -365 47
6081 47 187 -17 81 120 62 7 -195 107 -50 95 -66 47 -88 -53 58 -97 49 26 162 78 56 -80 274
6104 274 48 16 -60 6 -1 -133 144 29 -182 -79 -211 123 67 108 -76 -155 26 -118 11 -54 35 -80 32
6127 32 -242 -103 -93 65 115 91 -266 116 81 240 178 -18 205 202 0 -55 -45 58 -214 1 -27 2 -113 84
6151 84 26 -44 -8 -228 -24 11 64 -112 -70 -143 12 134 330 10 70 -111 -249 -143 -218 -291 63 12 -27 93
6175 93 130 -161 -212 -31 40 -79 71 -25 124 -119 13 -167 14 -9 -68 -163 -136 107 -129 -95 -16 -305 173 -43
6199 -43 50 9 113 -185 -133 226 35 -136 -10 24 -292 231 66 87 78 222 -3 -75 190 15 3 -263 117
6222 117 168 -107 -11 49 168 -9 118 46 -61 4 57 -132 -73 -8 -106 -159 119 -118 43 193 304 164 -186
6245 -186 -64 -93 61 -78 37 -83 -43 -195 48 -150 67 28 66 46 5 58 76 188 20 116 -104 -109 28 -253
6269 -253 -95 32 200 38 154 -97 -49 151 -267 -73 -37 -153 31 -1 -120 75 23 -224 -4 39 239 -134
6291 -134 35 193 -55 141 97 -104 -87 138 -74 164 127 98 14 83 -63 -117 86 98 -49 17 25 25 119 -51 221
6316 221 112 -62 -128 0 -211 57 90 -123 115 -173 120 -216 -108 -54 -151 75 -11 -50 -209 76 -128 25
6338 25 -164 -210 -27 -7 -132 -14 -199 -49 169 157 -158 -70 153 34 181 -245 127 62 142 42 64 -62 -102
6361 -102 25 19 76 74 -122 -102 -137 -146 -156 160 136 -50 -221 -159 -83 50 -85 -23 -72 68 -111 -124 95 -1 274 -116
6387 -116 -75 -145 45 345 138 159 -66 -81 30 -312 -3 210 42 11 -37 14 31 96 83 47 154 28 -44 46
6411 46 136 -29 -15 -138 -35 -101 43 158 -33 -2 -22 -12 -112 6 -1 126 -305 146 155 -43 155 60 67 153 3
6436 3 165 -65 73 290 4 -183 -29 32 64 123 -11 346 38 -11 -31 42 -34 86 43 59 -101 -176 -151 -3
6460 -3 -119 -188 137 -80 42 -30 -62 129 83 -243 -34 -21 80 139 3 -177 -58 251 -122 14 23 -36 53 52 -120
6485 -120 -14 -68 30 212 33 198 -232 -185 62 189 39 -134 42 -49 37 154 143 66 218 45 -76 149
6507 149 -48 -160 -261 -48 -137 -98 20 64 183 -251 -8 -24 197 -48 65 -97 214 28 -62 -181 -169 74
6529 74 -153 -60 92 12 177 141 53 -288 101 40 -50 -105 -119 -175 -31 32 50 93 -20 -272 320 -143 -183 -47 -295
6554 -295 -64 0 94 -106 -214 56 66 0 70 267 -175 210 31 -44 -41 99 186 135 38 276 -244 -106 51 -237
6578 -237 -38 -119 -122 11 -74 51 183 139 78 -5 43 183 35 -77 100 37 3 50 -141 176 98 -125 109 -289
6602 -289 -7 -95 36 -161 -43 280 -56 -197 194 -217 80 27 -13 8 7 170 -99 -284 -118 275 154 -36
6624 -36 70 85 78 36 54 293 -24 -91 4 -30 213 -126 152 -100 88 -143 -250 22 84 240 122 -15 -87 104
6648 104 -99 26 73 152 -82 63 71 -237 -19 263 151 67 -151 88 -108 -63 -101 104 -81 -32 43 127 66 138
6672 138 -134 -135 6 78 -59 -179 263 -139 94 31 -256 9 -53 85 -56 -89 -197 86 75 -48 73 -141
6694 -141 17 -131 165 235 126 162 33 199 122 -24 65 -156 -32 -164 -20 -459 28 117 28 -267 143 66
6716 66 -230 -3 -12 127 61 270 41 78 63 -80 377 27 -61 130 109 48 -149 -151 -55 -77 196 188 190 -136 109 46
6742 46 -28 13 -18 -113 -128 225 -55 65 21 -339 199 72 46 -69 -14 68 -118 181 48 13 -179 -14 -35 -55
6766 -55 150 -38 133 13 -4 207 -231 130 49 271 125 127 -84 -99 145 -8 -148 -126 -27 25 -310 -177 -184 -23
6790 -23 -124 -48 -92 117 -14 98 193 -9 91 -97 -180 12 56 -138 -49 133 -79 29 99 -327 -38 67 280
6813 280 19 -163 -4 -110 17 -125 -90 -202 -187 12 -161 -76 -210 -115 -29 -81 -167 -60 16 -123 74 273 -69
6836 -69 75 63 -137 44 -159 -72 8 -134 -37 -40 212 21 95 79 -178 44 305 46 -136 -61 -92 -266 92 -53
6860 -53 131 2 -80 220 -46 -48 -112 152 196 -52 -67 -11 128 249 81 235 -136 86 57 142 33 -88 211
6883 211 8 -24 243 -83 45 135 -52 -84 -49 75 -125 278 53 49 -56 86 -110 69 -15 119 -163 -156 24
6906 24 -162 -182 -261 -10 -3 259 -151 -72 38 -138 250 84 -51 27 -90 -33 -188 -231 -204 -7 223 -73 -81 -200
6930 -200 63 -163 119 139 -32 -167 -10 267 -9 -62 -7 18 174 -38 11 -65 -104 200 134 -120 45 -296 -130
6953 -130 -114 -310 -79 38 76 -23 -215 -147 85 -130 -13 74 239 -24 -69 353 228 -90 159 -221 -167 -152 -116
6976 -116 -18 15 63 -86 32 -4 -83 106 -147 -94 268 4 -68 120 -52 -103 -89 -119 177 248 250 -112 182 61
7000 61 -113 81 -85 11 299 59 -36 -13 -26 29 134 -73 136 51 -299 -33 -48 -41 182 194 62 341 -51 -11
7024 -11 -31 93 230 -238 329 -13 0 -47 -7 -24 52 -52 -276 -44 22 32 222 -20 -220 24 29 186 -60 51
7048 51 71 -89 -1 40 13 -79 -93 -48 -122 -46 84 -91 86 95 -115 -113 -86 126 85 -24 73 -89 200 14 -153 -95
7074 -95 126 -93 100 49 -32 -27 40 -136 -265 30 -48 184 -178 110 37 -113 185 105 -92 44 -105 82 56
7097 56 -49 25 24 84 -12 106 74 63 -221 14 48 111 47 74 15 -110 49 -76 72 -308 -103 143 26 -28 180
7122 180 85 215 -32 145 267 -97 -2 339 24 -95 109 -113 28 -82 -158 -140 79 -219 -68 -198 203
7143 203 -171 51 85 -101 25 115 -278 -51 176 32 -84 -11 15 -30 48 5 -49 -247 120 -9 105 -27 288
7166 288 67 40 231 -122 -72 162 197 18 -174 127 119 221 18 -107 223 2 147 -91 133 242 210 56
7188 56 106 -93 183 -79 34 244 26 69 198 -267 118 225 -23 73 -160 124 -66 -10 34 114 -26 -1 112
7211 112 -109 47 -37 98 -5 -291 -22 117 -28 40 17 -169 101 239 -47 49 145 138 10 -29 36 109 -304
7234 -304 227 147 22 150 -63 -197 56 68 94 24 44 -105 -12 -58 74 -108 -150 118 52 35 -49 -82 3 195
7258 195 34 111 -116 206 240 156 -127 -154 -52 36 -156 425 25 121 75 -182 -88 -223 -90 -13 -170 66 43
7281 43 188 -25 -75 -129 -2 7 171 75 -16 3 -171 -122 128 205 -175 -65 -6 -99 -28 -7 -234 75 -83 -41 108
7306 108 -120 156 -68 -2 -74 34 10 -52 -336 -59 -34 -93 183 -88 -82 -168 -69 47 -54 -57 4 152 -96 -94 -99 77
7332 77 -144 -73 -191 -125 222 59 -21 195 -88 133 160 -27 26 155 115 -115 -141 57 -1 -97 117 -152 -129 86
7356 86 218 149 -1 -30 -124 97 39 103 -131 64 51 -113 -190 -180 227 -67 -161 20 -251 -78 -13 61 -99 56
7380 56 327 -48 -12 37 27 -185 78 -107 14 71 44 -99 14 -32 124 37 50 134 -307 -182 111 37 74 0
7404 0 19 -127 215 -100 -10 -173 12 -82 -126 -123 14 176 -248 25 -14 -14 -150 -134 89 29 62 25 51 23 -138 19
7430 19 232 28 109 44 172 -6 -89 -66 -53 77 -3 -59 125 -133 42 64 -24 -123 -98 -52 122 117 5 110 -94
7455 -94 -30 -40 191 -95 169 -13 86 148 -92 -321 64 162 -110 -158 -52 -67 35 -2 9 156 -112 -32 186 -63
7479 -63 -80 199 191 -57 -36 11 -67 65 -41 -67 -63 31 59 -89 -153 309 -117 40 133 79 -183 -35 -129 -88 12 72
7505 72 16 -153 -63 -60 255 9 164 91 24 164 105 83 -29 -16 13 -289 150 202 93 197 -73 -222 27 -150
7529 -150 13 -134 -17 200 -169 -223 -300 -49 123 -357 97 -93 308 71 128 -40 -41 72 -61 -144 -16 -62
7551 -62 23 -140 -13 62 -124 211 67 209 22 154 138 12 60 -65 -49 -18 -114 24 -2 82 -59 26 -65 -146
7575 -146 -34 -4 122 23 75 -3 240 -45 -32 164 161 -17 -69 -170 193 -122 -224 -206 -5 -115 59 64 -183 124
7599 124 100 12 96 -52 -269 -96 195 257 22 102 -117 -133 -7 72 42 -88 75 -150 -43 25 234 -85 60
7622 60 124 136 75 -51 116 -138 84 -67 -12 31 11 -90 -117 -102 -11 19 -3 -113 179 -41 76 108 138 -79 146
7647 146 -308 -95 -311 -116 -142 -90 79 -142 76 -191 124 -27 -39 -25 -63 -92 -36 -225 104 -288 -112 148
7669 148 -197 145 79 -56 66 -30 -114 59 -161 -225 248 -79 -8 27 49 -8 95 -197 157 215 -193 -82 -98
7692 -98 314 -265 312 -44 -182 188 1 123 -64 35 -49 -20 80 97 -80 -97 -170 -72 73 52 -132 -2 17
7715 17 -10 64 102 -3 -40 -74 44 -161 3 82 36 -109 -24 57 -15 31 -100 -38 106 209 -27 82 -63 35 -144
7740 -144 122 -38 201 -76 183 345 -73 4 -24 -30 53 143 131 121 281 41 -36 64 -125 -312 -81 78 -121
7763 -121 156 219 12 -29 -159 293 -203 -60 -56 -62 -56 133 67 -139 55 -34 -19 -207 17 106 -21 136 -31 -267
7787 -267 13 -150 -168 -153 -37 11 -109 32 -135 48 212 -34 148 -106 85 -6 -119 64 -241 -175 -95 153
7809 153 -112 33 210 85 -75 239 58 -18 170 37 -30 -206 -154 -113 -24 69 57 -109 -102 71 -6 -88 67 82
7833 82 100 -18 86 -223 -103 30 44 -22 79 -27 27 -123 -146 80 -127 151 -101 4 51 -25 112 272 52
7856 52 27 92 299 -142 104 132 328 34 179 94 62 42 -110 -154 109 6 -135 213 -48 13 126 21 -137
7879 -137 -55 -19 86 125 -127 -9 98 96 55 -57 -16 -104 63 -100 111 -144 -16 -44 -151 28 34 23 107 122 -45
7904 -45 4 -210 -163 116 86 90 137 -84 191 -8 109 21 -187 4 -109 21 -136 -89 261 82 -278 143 -97
7927 -97 -166 -193 78 -108 61 190 180 125 -166 100 -283 60 61 163 20 81 -341 3 -100 100 -64 -54 112
7950 112 -214 -161 176 -98 -251 -1 47 -184 -79 -45 -67 66 166 138 -101 43 -92 -97 210 -18 -75 240 116
7973 116 -13 171 28 -9 -69 11 0 288 -110 -191 -183 52 66 -79 129 2 69 -125 68 -101 -114 -51 -121 -122 -248
7998 -248 29 288 -31 10 -7 159 112 -152 60 167 35 -171 -39 -103 -138 -141 161 131 -117 22 203 132 163
8021 163 25 -12 -29 191 68 -134 -221 20 181 144 86 107 -75 71 -63 271 -24 4 -40 33 -38 19 -95 -186
8045 -186 -38 -120 20 -5 133 199 -158 -25 37 -106 -53 -143 -45 -200 -12 -140 289 -3 -1 -158 50 -174 57
8068 57 257 -5 64 -187 220 162 62 38 246 158 27 124 -38 -86 -143 -38 5 -44 3 -25 -92 22 -80 23
8092 23 112 -91 -13 116 23 -46 178 19 219 -124 -12 16 -147 -207 -166 105 -9 3 48 81 106 130 66 129 13
8117 13 106 34 1 110 -241 -55 41 124 -32 -233 -36 -56 43 12 -56 -59 -126 149 88 -68 -90 209 18 20 -92 117
8143 117 -103 -272 42 -73 -101 -56 -47 -288 -164 -94 -269 -275 134 55 -90 -190 -39 11 -43 290 74 -72 159
8166 159 -150 83 -149 59 137 -282 -13 -16 -28 -197 -3 -16 -88 20 97 253 10 6 -201 -18 95 78 -200
8189 -200 -2 121
8191A21
##END NTUPLES=NMR FID
##END=
