##TITLE=1H_CA-8601-2
 DMSO, 8 sc, 
 29.5.2019
##JCAMPDX= 6.0         $$ Bruker NMR JCAMP-DX V2.0
##DATA TYPE= NMR FID
##DATA CLASS= NTUPLES
##ORIGIN= UXNMR, Bruker Analytische Messtechnik GmbH
##OWNER= root
$$ XWIN-NMR		Version 3.5
$$ Wed May 29 14:10:40 2019 Russian Standard Time (UT+4h)  she@DPX200
##.OBSERVE FREQUENCY= 200.13155
##.OBSERVE NUCLEUS= ^1H
##.DELAY= (6, 6)
##.ACQUISITION MODE= SIMULTANEOUS
##.ACQUISITION SCHEME= undefined
##.AVERAGES= 8
##.DIGITISER RES= 18
##SPECTROMETER/DATA SYSTEM= spect
##.PULSE SEQUENCE= zg30
##.SOLVENT NAME= DMSO
##.SHIFT REFERENCE= (INTERNAL, DMSO, 0, 15.7039)
##AUDIT TRAIL= $$ (NUMBER, WHEN, WHO, WHERE, WHAT)
$$ ##TITLE= Audit trail, XWIN-NMR		Version 3.5
$$ ##JCAMPDX= 5.01
$$ ##ORIGIN= Bruker BioSpin GmbH
$$ ##OWNER= she
$$ F:/spectra/data/she/nmr/H-F/1/audita.txt
$$ ##AUDIT TRAIL=  $$ (NUMBER, WHEN, WHO, WHERE, WHAT)
(   1,<2019-05-29 14:09:36.87 +0400>,<she>,<DPX200>,
      <created by zg, POWCHK disabled, PULCHK disabled
       configuration hash MD5:
       00 E9 B6 7A A2 85 ED C7 34 08 36 98 17 FE 4E 26
       data hash MD5: 16K
       26 A9 7B 4E 7C 41 8D 4C E8 0C B5 B0 52 07 AB 4A>)
$$ ##END=
$$ 
$$ hash MD5
$$ C4 5A D7 E0 E7 E4 F5 06 4C 80 1C 2D 90 3E AB E2
##$RELAX= 
##$RELAX= 
##$RELAX= 
##$RELAX= 
##$RELAX= 
##$RELAX= 
$$ Bruker specific parameters
$$ --------------------------
##$DU= <F:/spectra>
##$EXPNO= 1
##$NAME= <H-F>
##$PROCNO= 1
##$TYPE= <nmr>
##$USER= <she>
##$AMP= (0..31)
100 100 100 100 100 100 100 100 100 100 100 100 100 100 100 100 100 100 
100 100 100 100 100 100 100 100 100 100 100 100 100 100 
##$AQSEQ= 0
##$AQ_mod= 1
##$AUNM= <au_zg>
##$AUTOPOS= <>
##$BF1= 200.13
##$BF2= 200.13
##$BF3= 200.13
##$BF4= 200.13
##$BF5= 200.13
##$BF6= 200.13
##$BF7= 200.13
##$BF8= 200.13
##$BYTORDA= 1
##$CFDGTYP= 0
##$CFRGTYP= 5
##$CHEMSTR= <none>
##$CNST= (0..31)
1 1 145 1 1 1 1 1 1 1 1 1 1 1 1 1 1 1 1 1 1 1 1 1 1 1 1 1 1 1 1 1 
##$CPDPRG= <>
##$CPDPRG1= <>
##$CPDPRG2= <>
##$CPDPRG3= <>
##$CPDPRG4= <mlev>
##$CPDPRG5= <mlev>
##$CPDPRG6= <mlev>
##$CPDPRG7= <mlev>
##$CPDPRG8= <mlev>
##$CPDPRGB= <>
##$CPDPRGT= <>
##$D= (0..31)
0 1.2 0 0 0 0 0 0 0 0 0 0.03 0 0 0 0 0 0 0 0 0 0 0 0 0 0 0 0 0 0 0 0 
##$DATE= 1559124576
##$DBL= (0..7)
120 120 120 120 120 120 120 120 
##$DBP= (0..7)
150 150 150 150 150 150 150 150 
##$DBP07= 0
##$DBPNAM0= <>
##$DBPNAM1= <>
##$DBPNAM2= <>
##$DBPNAM3= <>
##$DBPNAM4= <>
##$DBPNAM5= <>
##$DBPNAM6= <>
##$DBPNAM7= <>
##$DBPOAL= (0..7)
0.5 0.5 0.5 0.5 0.5 0.5 0.5 0.5 
##$DBPOFFS= (0..7)
0 0 0 0 0 0 0 0 
##$DE= 6
##$DECBNUC= <off>
##$DECIM= 24
##$DECNUC= <off>
##$DECSTAT= 4
##$DIGMOD= 1
##$DIGTYP= 9
##$DL= (0..7)
0 120 120 120 120 120 120 120 
##$DP= (0..7)
150 150 150 150 150 150 150 150 
##$DP07= 0
##$DPNAME0= <>
##$DPNAME1= <>
##$DPNAME2= <>
##$DPNAME3= <>
##$DPNAME4= <>
##$DPNAME5= <>
##$DPNAME6= <>
##$DPNAME7= <>
##$DPOAL= (0..7)
0.5 0.5 0.5 0.5 0.5 0.5 0.5 0.5 
##$DPOFFS= (0..7)
0 0 0 0 0 0 0 0 
##$DQDMODE= 0
##$DR= 18
##$DS= 0
##$DSLIST= <SSSSSSSSSSSSSSS>
##$DSPFIRM= 0
$$ [...]
##$SUBNAM2= <"">
##$SUBNAM3= <"">
##$SUBNAM4= <"">
##$SUBNAM5= <"">
##$SUBNAM6= <"">
##$SUBNAM7= <"">
##$SUBNAM8= <"">
##$SUBNAM9= <"">
##$SW= 24.9336996594482
##$SWIBOX= (0..15)
0 0 2 0 0 0 0 0 0 0 0 0 0 0 0 0 
##$SW_h= 4990.01996007984
##$TD= 16384
##$TD0= 1
##$TE= 0
##$TE2= 300
##$TE3= 300
##$TEG= 300
##$TL= (0..7)
0 120 120 120 120 120 120 120 
##$TP= (0..7)
150 150 150 150 150 150 150 150 
##$TP07= 0
##$TPNAME0= <>
##$TPNAME1= <>
##$TPNAME2= <>
##$TPNAME3= <>
##$TPNAME4= <>
##$TPNAME5= <>
##$TPNAME6= <>
##$TPNAME7= <>
##$TPOAL= (0..7)
0.5 0.5 0.5 0.5 0.5 0.5 0.5 0.5 
##$TPOFFS= (0..7)
0 0 0 0 0 0 0 0 
##$TUNHIN= 0
##$TUNHOUT= 0
##$TUNXOUT= 0
##$USERA1= <user>
##$USERA2= <user>
##$USERA3= <user>
##$USERA4= <user>
##$USERA5= <user>
##$V9= 5
##$VALIST= <valist>
##$VCLIST= <CCCCCCCCCCCCCCC>
##$VD= 0
##$VDLIST= <DDDDDDDDDDDDDDD>
##$VPLIST= <PPPPPPPPPPPPPPP>
##$VTLIST= <TTTTTTTTTTTTTTT>
##$WBST= 1024
##$WBSW= 4
##$XGAIN= (0..3)
0 0 0 0 
##$XL= 0
##$YL= 0
##$YMAX_a= 279130
##$YMIN_a= -279195
##$ZGOPTNS= <>
##$ZL1= 120
##$ZL2= 120
##$ZL3= 120
##$ZL4= 120
##$ABSF1= 10
##$ABSF2= 0
##$ABSG= 5
##$ABSL= 3
##$ALPHA= 0
##$AQORDER= 0
##$ASSFAC= 0
##$ASSFACI= 0
##$ASSFACX= 0
##$ASSWID= 0
##$AUNMP= <proc_1d>
##$AZFE= 0.1
##$AZFW= 0.1
##$BCFW= 1
##$BC_mod= 2
##$BYTORDP= 1
##$COROFFS= 0
##$CY= 11.3945322036743
##$DATMOD= 1
##$DC= 2
##$DFILT= <>
##$DTYPP= 0
##$F1P= 18.9103706918063
##$F2P= -1.10871071338519
##$FCOR= 0.5
##$FTSIZE= 0
##$FT_mod= 4
##$GAMMA= 1
##$GB= 0.15
##$INTBC= 1
##$INTSCL= 1
##$ISEN= 128
##$LB= 0.24
##$LEV0= 0
##$LPBIN= 0
##$MAXI= 10000
##$MC2= 0
##$MEAN= 0
##$ME_mod= 0
##$MI= 1.114404
##$NCOEF= 0
##$NC_proc= 0
##$NLEV= 6
##$NOISF1= 3.799351
##$NOISF2= 2.8
##$NSP= 1
##$NTH_PI= 0
##$NZP= 0
##$OFFSET= 15.70392
##$PC= 1
##$PHC0= -8500.167
##$PHC1= 17.00025
##$PH_mod= 1
##$PKNL= yes
##$PPARMOD= 0
##$PSCAL= 0
##$PSIGN= 0
##$REVERSE= no
##$SF= 200.130013532006
##$SI= 16384
##$SIGF1= 3
##$SIGF2= 2
##$SINO= 400
##$SIOLD= 16384
##$SREGLST= <1H.CDCl3>
##$SSB= 0
##$STSI= 0
##$STSR= 0
##$SW_p= 3612.71676300578
##$SYMM= 0
##$S_DEV= 0
##$TDeff= 0
##$TDoff= 0
##$TI= <>
##$TILT= no
##$TM1= 0
##$TM2= 0
##$TOPLEV= 0
##$USERP1= <user>
##$USERP2= <user>
##$USERP3= <user>
##$USERP4= <user>
##$USERP5= <user>
##$WDW= 1
##$XDIM= 8192
##$YMAX_p= 0
##$YMIN_p= 0
$$ End of Bruker specific parameters
$$ ---------------------------------
##NTUPLES= NMR FID
##VAR_NAME=  TIME,          FID/REAL,        FID/IMAG
##SYMBOL=    X,             R,               I
##VAR_TYPE=  INDEPENDENT,   DEPENDENT,       DEPENDENT
##VAR_FORM=  AFFN,          ASDF,            ASDF
##VAR_DIM=   8192,          8192,            8192
##UNITS=     SECONDS,       ARBITRARY UNITS, ARBITRARY UNITS
##FACTOR=    0.0002004,     1,               1
##FIRST=     0,             0,               0
##LAST=      1.6414764,     0,               0
##MIN=       0,             -279195,         0
##MAX=       1.6414764,     279130,          0
$$ Real data points
##PAGE= N=1
##DATA TABLE= (X++(R..R)), XYDATA
$$ plain form
0 0 0 0 0 0 0 0 1 -8 8 -8 16 -16 24 -25 32 -40 48 -56 65 -80 95 -107 127 -145 167 -193 218 -248 282 -319
30 -319 357 -403 452 -505 564 -629 700 -777 863 -956 1058 -1172 1298 -1436 1591 -1766 1962
47 1962 -2185 2440 -2740 3091 -3509 4022 -4671 5515 -6667 8341 -11010 15958 -28278 126470
61 126470 111573 -178786 -126657 94154 279130 170263 -61864 -176932 -37699 141342
71 141342 175355 34967 -103183 -123203 -15114 82739 85547 -3271 -93526 -121836 -48987 54504
83 54504 78689 -15845 -124700 -135564 -28395 80391 67819 -52685 -131203 -86184 20293
94 20293 74982 39726 -38029 -75066 -43221 19941 69654 77417 20760 -58721 -65677 33566 143016
107 143016 137596 4915 -111179 -55534 127353 219274 102976 -84907 -122820 36620 209780
$$ packed form
0@%%%%%%JrJ6j6K4l2M0m9N7p2Q8j04J21j45J75k02K34k72L12l60M11m66N30o01
30c19O76p60Q55r57J069j193J329j477J640j819K014k230K470k734L027l357L728
47A962m147M625n180N831o600P531q693J0186j2182J5008j9351K6968m4236J54748
61A26470j4897k90359N2129K20811J84976j08867k32127j15068J39233J79041
71A41342L4013j40388j38150k0020J08089R7853K808q8818r0255k8310P2849J03491
83E4504K4185r4534j08855j0864J07169J08786j2572j20504p8518M5019J06477
94B0293N4689l5256p7755l7037L1845O3162M9713P763n6657p9481o956R9243J09450
107A43016n420j32681j16094N5645J82887R1921j16298j87883l7913J59440J73160
$$ plain form
118 209780 187957 -1504 -128895 -54825 116772 189419 93138 -59385 -102338 -1918 116390
129 116390 129797 36916 -69443 -87303 1877 103254 103095 1054 -96679 -87372 22731 111412
141 111412 70150 -52891 -110993 -45945 58110 86239 13402 -70454 -69152 -1720 44257 35755
153 35755 1270 -26424 -33271 -20182 7507 39741 46722 -1347 -65138 -56750 30718 98521 60397
166 60397 -50171 -105851 -29033 98236 118840 6078 -103669 -85210 37767 126320 79556
177 79556 -47263 -105546 -36136 74212 110364 39595 -64225 -89590 -7574 89831 99227 13016
189 13016 -81222 -80094 23451 114247 83524 -32808 -100352 -43721 72837 113604 29631 -75830
201 -75830 -75652 17057 85743 59987 -20148 -61010 -24059 33095 42842 13277 -12102 -19822 -16246
$$ packed form
118B09780k1823j89461j27391P4070J71597P2647r6281j52523m2953J00420J18308
129A16390J3407r2881j06359j7860Q9180J01377j59j02041r7733R307J10103Q8681
141A11412m1262j23041n8102O5048J04055K8129p2837q3856J302O7432M5977q502
153C5755l4485k7694o847J3089K7689L2234O981m8069o3791Q388Q7468O7803l8124
166F0397j10568n5680P6818J27269K0604j12762j09747J8459J22977Q8553m6764
177G9556j26819n8283O9410J10348L6152p0769j03820k5365Q2016R7405R396q6211
189A3016r4238J128J03545R0796l0723j16332o7544N6631J16558M0767q3973j05461
201g5830J78R2709O8686k5756q0135m0862L6951N7154R747k9565k5379p720L576
$$ plain form
214 -16246 -4955 10625 24010 16845 -21586 -54200 -29835 31008 52886 5061 -61060 -71478
226 -71478 -6528 61326 47678 -31643 -82304 -51351 24374 65895 27734 -49958 -80090 -30195
238 -30195 43908 68711 16828 -63232 -81302 -7895 75489 74690 -10531 -87706 -66285 38801
250 38801 103703 48145 -59794 -90583 -12806 82258 83865 -9112 -81514 -48619 38435 73867
262 73867 27419 -38678 -52802 -7686 36267 31070 -1862 -22642 -23461 -11960 4884 13643 8124
275 8124 -9386 -30275 -32284 -4083 25145 16024 -21426 -45941 -33135 6532 31160 11151 -31753
288 -31753 -48329 -25894 13758 35016 12965 -35383 -56206 -22641 32809 52229 9422 -56887
300 -56887 -66158 2316 70977 55691 -26983 -82075 -42182 52078 86545 17056 -69325 -68552 12433
$$ packed form
214a6246J1291J5580J3385p165l8431l2614K4365O0843K1878m7825o6121j0418
226g1478O4950O7854j3648p9321n0661L0953P5725M1521l8161p7692l0132M9895
238c0195P4103K4803n1883q0060j8070P3407Q3384p99q5221p7175K1421J05086
250C8801O4902n5558j07939l0789P7777R5064J607r2977p2402L2895Q7054L5432
262G3867m6448o6097j4124M5116M3953n197l2932k0780q19J1501J6844Q759n519
275H124j7510k0889k009K8201K9228r121l7450k4515J2806L9667K4628k0009m2904
288c1753j6576K2435L9652K1258k2051m8348k0823L3565N5450J9420m2807o6309
300e6887r271O8474O8661j5286q2674n5092L9893R4260L4467o9489q6381P73Q0985
$$ plain form
313 12433 77800 53457 -29778 -71153 -24949 45198 56692 8726 -40548 -41901 1165 36371
325 36371 27189 -6457 -28218 -24964 -1887 20211 18620 -5984 -25455 -23546 -4161 15891 14074
338 14074 -9364 -25005 -18158 -2798 7009 7379 -2943 -16328 -20267 -14088 2075 19420 12698
351 12698 -21437 -41929 -18636 26774 42619 3984 -51336 -51814 11486 62089 36042 -35517
363 -35517 -67684 -20592 53252 64253 -2414 -62330 -44968 23766 63182 32719 -31078 -53418
375 -53418 -10950 42078 46245 6243 -33468 -33282 5764 40109 32221 -6093 -31444 -21312 13740
388 13740 37150 19814 -17791 -29772 -6636 21451 24658 955 -21482 -15662 6338 12203 1248
401 1248 -5907 -3860 -2145 -5741 -10376 -3348 12892 11087 -15844 -32663 -12067 22408 29272 -4909
$$ packed form
313A2433O5367k4343q3235m1375M6204P0147J1494m7966m9274j353M3066L5206
325C6371r182l3646k1761L254K3077K2098j591k4604j9471J909J9385K0052j817
338A4074k3438j5641O847J5360R807L70j0322j3385l939O179J6163J7345o722
351A2698l4135k0492K3293M5410J5845l8635n5320m78O3300N0603k6047p1559
363c5517l2167M7092P3844J1001o6667n9916J7362O8734L9416l0463o3797k2340
375e3418M2468N3028M167m0002l9711J86L9046L4345p888l8314k5351J0132L5052
388A3740K3410j7336l7605j1981K3136K8087L207k3703k2437N820K2000N865j0955
401A248p155K047J715l596m635P028J6240j805k6931j6819K0596L4475O864l4181
$$ plain form
415 -4909 -43856 -35073 15908 45301 15040 -36743 -49247 -7317 41862 39526 -12153 -49032 -28890
428 -28890 20723 44922 19740 -26687 -41986 -8362 34682 39347 4502 -32282 -31955 8618 43699
441 43699 31006 -12893 -36210 -14933 27200 42537 10813 -28693 -26616 9840 34172 20131
453 20131 -11286 -23718 -3832 19495 14995 -5305 -10784 -1763 5017 90 -7780 -4964 6991
466 6991 6308 -13064 -22561 -6600 14018 12997 -11453 -33004 -22487 11010 24104 -350 -31560
479 -31560 -34966 -6991 22503 19151 -15526 -40161 -26078 9004 27870 11189 -26508 -41422
491 -41422 -12943 26266 31334 -2341 -37725 -33519 9976 42063 22498 -23504 -39435 -8541
503 -8541 33142 37534 -1306 -34592 -20552 19678 34768 11991 -17823 -21005 3727 23295 14306
$$ packed form
415d909l8947Q783N0981K9393l0261n1783j2504M1930M9179k336n1679l6879K0142
428b8890M9613K4199k5182m6427j5299L3624M3044M665l4845l6784L27M0573L5081
441D3699j2693m3899k3317K1277M2133J5337l1724l9506K077L6456K4332j4041
453B0131l1417j2432J9886K3327m500k0300n479R021O780m927p870K816J1955
466F991o83j9372r497J5961K0618j021k4450k1551J0517L3497J3094k4454l1210
479c1560l406K7975K9494l352l4677k4635J4083L5082J8866j6681l7697j4914
491d1422K8479L9209N068l3675l5384M206M3495L2087j9565m6002j5931L0894
503h541M1683M392l8840l3286J4040M0230J5090k2777k9814l182K4732J9568q989
$$ plain form
516 14306 -6987 -11887 -1696 7335 5310 -2624 -5873 -55 1370 -7068 -10973 -4032 2960 488
530 488 -10485 -19874 -15369 731 6511 -6349 -23238 -26498 -12218 6551 7374 -14644 -34692 -27457
544 -27457 -920 16593 4613 -28308 -41680 -15504 20309 22150 -11220 -41117 -31685 10636
556 10636 34468 9977 -30995 -37205 -3103 30736 26108 -10912 -34736 -14817 20560 28296 4957
569 4957 -20206 -19746 4448 21774 12638 -8657 -14504 -4499 7552 9716 -124 -10183 -8061 -550
583 -550 865 -2961 -6024 -6589 -4160 -3059 -8338 -11659 -5919 -111 -2981 -11955 -18327 -12990 2490
598 2490 7904 -8158 -25612 -21549 313 15897 5496 -22814 -33309 -8353 21189 18791 -11655
611 -11655 -33838 -20957 14384 29694 5029 -28379 -28348 2020 27029 18947 -12845 -30370 -12178
$$ packed form
516A4306k1293m900J0191R031k025p934l249N818J425q438l905O941O992k472
530D88j0973r389M505J6100N780j2860j6889l260J4280J8769Q23k2018k0048P235
544b7457K6537J7513j1980l2921j3372K6176L5813J841l3370k9897R432M2321
556A0636K3832k4491m0972o210L4102L3839m628l7020k3824J9919L5377P736k3339
569D957k5163M60K4194J7326r136k1295n847J0005J2051K164r840j0059K122P511
583e50J415l826l063n65K429J101n279l321N740N808k870q974o372N337J5480
598B490N414j6062j7454M063K1862J5584j0401k8310j0495K4956K9542k398l0446
611a1655k2183J2881L5341J5310k4665l3408L1L0368K5009q082l1792j7525J8192
$$ plain form
624 -12178 17552 22626 1343 -21413 -21619 1065 19209 10632 -12053 -21185 -10087 6923 11418
637 11418 -2121 -17697 -15536 -251 6797 38 -10738 -13712 -4799 4232 -390 -10447 -9527 -81
651 -81 4068 -1807 -10931 -9697 4220 12733 1255 -14399 -11835 6128 19182 10471 -11255 -18822
665 -18822 1760 23982 20148 -4255 -19872 -8691 18295 28537 7730 -18064 -16975 7207
677 7207 25729 18867 -7619 -22608 -7408 18135 22901 3247 -18332 -18644 3223 21201 12314
690 12314 -11808 -21745 -8117 11465 15464 -1592 -19376 -14918 4898 13087 2767 -11749 -13844
703 -13844 -1206 10494 4912 -8135 -8988 1052 8152 4077 -5708 -7069 4105 12582 4910 -6940
717 -6940 -6421 5973 15882 10344 -5557 -11634 2848 19442 16574 -1187 -12943 -5274 15239 23643
$$ packed form
624a2178K9730N074k1283k2756k06K2684J8144q577k2685r132J1098J7010M495
637A1418j3539j5576K161J5285P048o759j0776k974Q913R031m622j0057R20R446
651h1M149n875r124J234J3917Q513j1478j5654K564J7963J3054q711k1726p567
665a8822K0582K2222l834k4403j5617J1181K6986J0242k0807k5794J089K4182
677G207J8522o862k6486j4989J5200K5543M766j9654k1579l12K1867J7978q887
690A2314k4122r937J3628J9582L999j7056j7784M458J9816Q189j0320j4516k095
703a3844J2638J1700n582j3047q53J0040P100m075r785j361J1174Q477p672j1850
717f940N19J2394R909n538j5901o077J4482J6594k868j7761j1756P669K0513Q404
$$ plain form
731 23643 7917 -12882 -12284 7270 22872 18016 -4214 -17921 -4652 19385 23777 5707 -14042
744 -14042 -13391 8336 26214 16400 -7422 -15362 255 20407 22641 3630 -13412 -6327 14797
757 14797 22387 9616 -5858 -7153 7288 19417 12652 -1983 -5428 5096 13164 11230 864
770 864 -4648 2653 11786 8125 -2741 -5387 1339 9214 7839 -3944 -11070 -3010 8947 8788 -2950
785 -2950 -14025 -10555 5080 13817 2339 -14825 -15782 -128 14269 11385 -7146 -19496 -7212
798 -7212 14747 19439 3107 -14340 -12393 9204 25106 15255 -6557 -11862 4269 22999 24097
811 24097 5914 -9324 -840 19541 26337 13876 -1710 -2565 11390 24168 18161 2222 -2454
824 -2454 6610 16602 15985 4992 -3635 1555 11657 11221 1606 -4598 -1848 5570 8116 -708 -10172
$$ packed form
731B3643j5726k0799N98J9554J5602m856k2230j3707J3269K4037M392j8070j9749
744a4042O51K1727J7878r814k3822p940J5617K0152K234j9011j7042P085K1124
757A4797P590j2771j5474j295J4441J2129o765j4635l445J0524Q068j934j0366
770H64n512P301R133l661j0866k646O726P875j375j1783p126Q060J1957j59j1738
785b950j1075L470J5635Q737j1478j7164r57J5654J4397k884j8531j2350J2284
798g212K1959M692j6332j7447J947K1597J5902r851k1812n305J6131J8730J098
811B4097j8183j5238Q484K0381O796j2461j5586q55J3955J2778o007j5939m676
824b454R064R992o17j0993q627N190J0102m36r615o204K750P418K546q824r464
$$ plain form
839 -10172 -6417 3372 5563 -2745 -13103 -12942 -836 7858 -351 -15413 -17191 -4649 8139 6377
853 6377 -9945 -20371 -9944 9289 12854 -1945 -16560 -13821 5059 18565 9439 -9880 -14171
866 -14171 1101 18373 18084 1202 -12448 -3843 15551 21995 9483 -5745 -6107 8323 21247
879 21247 15311 -973 -6061 3509 15049 15448 3985 -6511 -1277 10724 12645 3512 -5161 -4131
893 -4131 4611 9950 2896 -8170 -7001 2385 6642 1096 -8596 -10894 -1467 7310 2183 -10977 -14054
908 -14054 -4456 6095 5811 -7823 -17623 -9319 6236 9714 -2667 -15295 -14370 1838 13439 5251
922 5251 -12194 -16052 -2782 12208 12117 -3327 -15866 -8190 9981 15710 3546 -10724 -10813 3329
936 3329 15923 10767 -5676 -10975 -685 11877 13037 1053 -9785 -4823 8753 12317 3522
$$ packed form
839a0172L755R789K191q308j0358J61J2106Q694q209j5062j778J2542J2788j762
853F377j6322j0426J0427J9233L565j4799j4615K739J8880J3506r126j9319m291
866a4171J5272J7272k89j6882j3650Q605J9394O444j2512j5228l62J4430J2924
879B1247n936j6284n088R570J1540L99j1463j0496N234J2001J921r133q673J030
893d131Q742N339p054j1066J169R386M257n546r692k298R427Q777n127j3160l077
908a4054R598J0551k84j3634r800Q304J5555L478j2381j2628R25J6208J1601q188
922E251j7445l858J3270J4990r1j5444j2539P676J8171N729j2164j4270q9J4142
936C329J2594n156j6443n299J0290J2562J160j1984j0838M962J3576L564q795
$$ plain form
949 3522 -5941 -6001 3642 11413 5478 -5288 -6744 1909 8294 4894 -4265 -8192 -1463 8312 5151
964 5151 -5618 -9651 -3590 5640 7096 -3689 -13152 -7831 4969 8422 -887 -11997 -12608 583
978 583 10825 4048 -11277 -14820 -4013 9087 8985 -4595 -15929 -9651 7053 11811 1291 -12224
992 -12224 -12261 1176 13191 7745 -7790 -12599 -2268 10239 11553 -247 -10726 -6092 7685
1005 7685 12384 3492 -6344 -6401 3526 11860 7080 -4500 -6822 1829 9409 7588 -1414 -7553 -828
1020 -828 8644 7626 -1828 -7403 -2826 5933 8355 -2 -9430 -6060 4777 8683 1628 -8595 -9739
1035 -9739 420 9875 4531 -8165 -11960 -3334 7947 8538 -3553 -13953 -8091 6102 10879 883
1049 883 -10850 -11803 511 11962 6786 -7407 -12284 -3247 9266 10446 -845 -11139 -6691 6726
$$ packed form
949C522r463o0R643P771n935j0766j456Q653O385l400r159l927O729R775l161
964E151j0769m033O061R230J456j0785r463N321J2800L453r309j1110o11J3191
978E83J0242o777j5325l543J0807J3100j02j3580j1334O278J6704M758j0520j3515
992a2224l7J3437J2015n446j5535m809J0331J2507J314j1800j0479M634J3777
1005G685M699q892r836n7R927Q334m780j1580k322Q651P580j821r002o139O725
1020h28R472j018r454n575M577Q759K422q357r428L370J0837L906p055j0223j144
1035i739J0159R455n344j2696l795Q626J1281N91j2091j0400N862J4193M777r996
1049H83j1733r53J2314J1451n176j4193m877R037J2513J180j1291j0294M448J3417
$$ plain form
1063 6726 11606 3273 -7121 -7980 2210 11661 6961 -4657 -7512 583 8872 8253 -517 -7327 -1978
1078 -1978 7875 9039 144 -5587 -3036 5399 9730 2505 -6440 -4966 4693 9161 3795 -4881 -7348
1093 -7348 740 9706 6091 -5064 -9509 -2219 7540 8488 -1579 -10857 -6964 5875 9894 1471
1107 1471 -8786 -10255 395 10477 6067 -6859 -11409 -3457 7423 8985 -1536 -11369 -7671
1120 -7671 5386 9863 2003 -7969 -8805 563 9829 5813 -5640 -8400 -867 7367 7800 -935 -8194
1135 -8194 -3698 6378 8351 710 -6087 -4461 4123 8930 3485 -5531 -5695 2591 8183 4416 -3944
1150 -3944 -7341 -232 8282 6506 -3764 -7881 -2646 5972 8376 -508 -9750 -6646 4641 8651
1164 8651 1550 -8555 -9833 -229 9324 5303 -6980 -11361 -3571 6390 7563 -2184 -11356 -8137
$$ packed form
1063F726M880q333j0394q59J0190R451m700j1618k855Q095Q289o19q770o810N349
1078a978R853J164q895n731K551Q435M331p225q945J474R659M468n366q676k467
1093g348Q088Q966l615j1155m445P290R759R48j0067r278L893J2839M019q423
1107A471j0257j469J0650J0082m410j2926m550P952J0880J562j0521r833L698
1120g671J3057M477p860r972q36R368R266m016j1453k760P533Q234M33q735p259
1135h194M496J0076J973p641o797J626Q584M807n445r016j64Q286N592l767q360
1150c944l397P109Q514j776j0270m117N235Q618K404q884r242L104J1287M010
1164H651p101j0105j278R604R553m021j2283m381P790R961J173r747r172L219
$$ plain form
1178 -8137 3945 7884 703 -8717 -9766 -850 8076 4647 -6162 -10266 -3145 5521 6286 -1898 -9779
1193 -9779 -5769 4461 7177 306 -7134 -6705 1496 7391 3229 -5446 -6971 618 6403 4209 -3067
1208 -3067 -7843 -1942 6599 6103 -3214 -7629 -3687 4607 7239 -196 -8607 -6631 3189 7706 1290
1223 1290 -7100 -9316 -1118 7692 4098 -6429 -10595 -4289 4572 6043 -2737 -11620 -8216 2400
1237 2400 6414 -291 -9501 -10854 -2621 6274 2967 -7323 -11879 -5242 3398 4564 -2916 -10711 -7658
1252 -7658 2270 5720 -651 -8013 -8179 -384 5952 2759 -6072 -7889 -722 5674 4553 -2656 -7548
1267 -7548 -2598 5922 6219 -1636 -6418 -3340 3942 7442 1366 -6546 -5084 3254 7310 2681 -4964
1282 -4964 -7116 -384 7320 5117 -4675 -8809 -3522 4270 6089 -1857 -9774 -7928 2112 6109 159
$$ packed form
1178h137J2082L939p181r420j049Q916Q926l429j0809m104P121Q666P65q184p881
1193i779M010J0230K716o871p440M29Q201N895m162q675j525P589N785k194p276
1208c067m776N901Q541m96r317m415L942Q294K632p435q411J976R820M517o416
1223A290q390k216Q198Q810l594j0527m166O306Q861J471q780q883L404J0616
1237B400M014o705r210j353Q233Q895l307j0290m556O637Q640J166p480p795L053
1252g658R928L450o371p362j66P795O336l193q831j817P167O396j121p209m892
1267g548M950Q520K97p855m782L078P282L500o076p912J462Q338M056m629p645
1282d964k152O732P704k203r792m134N287P792J819p946p917J846J0040L997n950
$$ plain form
1297 159 -8714 -10477 -2582 5593 2679 -7699 -11466 -5419 3009 4416 -3566 -11548 -8261 1659 4825
1312 4825 -1034 -8714 -8854 -1097 5379 2552 -6343 -8480 -1812 4874 4248 -2095 -7095 -2894 5320
1327 5320 5935 -614 -5553 -3498 3213 7325 2891 -4418 -4536 2943 7087 4216 -2638 -5726 -240
1342 -240 7326 6116 -1803 -6603 -2664 4956 7283 685 -7481 -6151 2779 7384 1675 -6079 -8121
1357 -8121 -1530 6744 4306 -5129 -9079 -3422 4067 5430 -1746 -9019 -6746 2689 6284 224 -6826
1372 -6826 -6897 -321 5822 3252 -5113 -7411 -1661 4744 4731 -1504 -6760 -3299 4395 6000 474 -5075
1388 -5075 -3909 2244 6884 3178 -4449 -4909 894 6326 4418 -1903 -5444 -1087 6132 5892 -1399
1403 -1399 -5761 -2282 4452 7296 1643 -5569 -4740 3762 7562 3009 -4199 -6430 252 7207 5609
$$ packed form
1297A59q873j763P895Q175k914j0378l767O047Q428J407p982p982L287R920L166
1312D825n859p680j40P757O476k827q895k137O668O686o26o343n000M201Q214
1327E320O15o549m939K055O711M112m434p309j18P479M144k871o854l088N486
1342b40P566j210p919m800L939P620K327o598q166J330Q930M605n709p754k042
1357h121O591Q274k438r435l950N657P489J363p176p273K273R435L595o060p050
1372f826p1O576O143k570q365k298N750O405j3o235n256L461P694J605n526n549
1388e075J166O153M640l706p627m60N803N432j908o321l541M357P219k40p291
1403a399m362L479O734K844n653p212Q29Q502L800m553p208k231O682O955j598
$$ plain form
1418 5609 -2907 -6724 -1516 5602 7051 402 -6152 -4386 4588 7502 2380 -4284 -5004 1005 7047
1433 7047 5244 -2696 -5721 -647 5656 5925 -3 -5690 -3200 4444 6659 984 -4559 -4119 1965
1448 1965 6753 3392 -4058 -5377 520 5806 4236 -1803 -5895 -1971 5552 5433 -1199 -5681 -2879
1463 -2879 3622 6537 1482 -5274 -4997 2760 6866 2667 -3282 -5641 -42 6544 5307 -2095 -5687
1478 -5687 -1389 4780 6489 1307 -5285 -3980 3709 7393 2997 -3515 -4821 1031 7078 5770 -1810
1493 -1810 -5433 -724 5214 6753 887 -5136 -2980 4215 7164 2206 -3765 -4289 1611 6580 4026
1508 4026 -2993 -4800 434 5685 4697 -1107 -5241 -1788 5004 5418 -411 -4818 -2903 2538 5718
1523 5718 1457 -4497 -4664 1818 5592 2814 -3129 -5332 -948 5392 4367 -2050 -5420 -2797 3450
$$ packed form
1418E609q516l817N208P118J449o649o554J766Q974K914n122o664p20O009O042
1433G047j803p940l025N074O303K69n928n687K490P644K215n675n543M40O084
1448A965M788l361p450j319N897N286j570o039m092L924P523j19o632m482K802
1463b879O501K915n055o756K77P757M106m199n949k359N599O586j237p402l592
1478e687M298O169J709n182o592J305P689L684m396o512j306N852O047j308p580
1493a810l623M709N938J539n866o023K156P195K949m958n971n24N900M969k554
1508D026p019j807N234N251r88n804m134L453O792M14n829m407J915N441L180
1523E718m261n954j67O482L774k778n943k203M384O340j025o417l370K623O247
$$ plain form
1538 3450 5460 1008 -5126 -4203 2611 6054 2739 -3484 -5232 -352 5992 4954 -2112 -5330 -1097
1553 -1097 4656 5645 579 -4769 -3634 3671 6273 1933 -3480 -4046 1117 6573 4274 -2719 -4603
1568 -4603 362 5060 4692 -538 -4797 -2116 4393 5377 31 -4307 -3221 2209 5340 2334 -3742
1583 -3742 -4805 1030 5067 2756 -2571 -5428 -1932 4646 4238 -1693 -5604 -3009 2730 4984 881
1598 881 -5269 -4937 1594 4764 2061 -3610 -5564 -916 4780 4014 -2540 -5882 -1949 3665 5117 433
1614 433 -5169 -3932 2809 5692 1678 -3548 -4453 667 5701 4124 -2114 -4672 -317 4583 4580 -78
1630 -78 -4370 -2586 3539 5026 1067 -3595 -3245 1473 5352 2592 -3295 -4332 445 4453 3525 -1551
1646 -1551 -4884 -1987 3889 4329 -1311 -4911 -2959 2075 4806 1306 -4848 -4977 1043 4789 2296
$$ packed form
1538C450K010m452o134R23O814L443l315o223j748M880O344j038p066l218M233
1553a097N753R89n066n348J135P305K602m340n413n66N163N456k299o993j884
1568d603M965M698l68n230m259K681O509R84n346m338J086N430L131l006o076
1583c742j063N835M037k311n327k857L496O578m08n931l911K595N739K254m103
1598H81o150L32O531L170k703n671j954M648N696p66o554l342L933N614J452m684
1614D33n602J237O741K883m014n226r05N120N034j577o238k558M355M900lm658
1630g8m292J784O125J487l959m662L50M718L879k760n887j037M777M008r28n076
1646a551l333K897N876M40n640l600J952N034K731l500o154j29O020L746k493
$$ plain form
1661 2296 -3321 -5564 -1354 4231 3690 -2115 -5440 -2267 2970 4618 452 -4967 -4143 2028 5081
1676 5081 1846 -3213 -4381 -122 4955 4000 -2143 -4424 -891 3916 4776 228 -3878 -2868 3194
1691 3194 5192 1116 -3084 -3102 1662 5127 3373 -2631 -4137 81 4508 4248 -1055 -4437 -2031 3301
1707 3301 4392 -426 -4228 -2928 1905 4339 1573 -4093 -4346 802 4476 2347 -2734 -4787 -1633
1722 -1633 3822 3609 -1749 -4768 -2181 2601 4343 360 -4772 -4007 1401 4725 1536 -3251 -4577
1737 -4577 -596 4421 3718 -2049 -4481 -1177 3327 4454 512 -3863 -2857 2720 4797 1563 -3024
1752 -3024 -3135 1024 4895 3266 -1898 -3911 -29 4372 3854 -33 -3649 -1627 3096 4754 682
1767 682 -3459 -2796 1480 4710 2232 -3146 -3937 616 4192 2805 -1613 -4277 -1630 3478 4225 -936
$$ packed form
1661B296n617k243M210N585n41n805l325L173N237J648m166n419Q24O171L053
1676E081l235n059j168M259N077r55o143k281L533M807Q60m548m106J010O062
1691C194J998m076m200j8M764L465j754o004j506M218M427k60n303l382K406N332
1707C301J091m818l802J300M833K434k766n666k53N148L674k129n081k053L154
1722a633N455k13n358l019K587M782J742l983n132P65N408L324l189m787j326
1737d577L981N017p03n767k432L304M504J127l942m375J006N577K077l234m587
1752c024j11M159L871j629n164k013L882M401n18l887l616K022M723J658m072
1767F82m141O63M276L230k478n378p91M553L576j387m418k664K647N108P47n161
$$ plain form
1783 -936 -4343 -2300 1947 4091 1068 -3681 -4437 975 4031 1550 -2432 -4336 -1017 3588 3417 -1699
1799 -1699 -4281 -1835 2967 3992 334 -3826 -3300 1633 4262 1371 -2667 -3575 134 4083 2964
1814 2964 -2019 -3977 -521 3390 3609 -135 -3691 -2102 3107 4357 894 -2776 -2291 1189 4021
1829 4021 2306 -2526 -3219 491 4129 2374 -1155 -4078 -1516 3362 3936 -581 -3736 -2578 1573
1844 1573 4127 1233 -3622 -4049 860 3739 1689 -2398 -4125 -1377 3361 3210 -1513 -4634 -1863
1859 -1863 2021 3685 515 -3890 -3403 1348 4041 1339 -2719 -3704 -319 3932 2686 -1871 -4203
1874 -4203 -835 3261 3275 132 -3495 -2503 2452 4296 1146 -2790 -3105 703 3806 2728 -2121 -3485
1890 -3485 33 3219 2966 -842 -3810 -1966 2527 3731 -33 -3529 -2407 1226 3678 1338 -3371
$$ packed form
1783i36l407K043M247K144l023m749p56N412L056k481l982j904L319M605j71n116
1799a699k582K446M802J025l658m160N26M933K629k891m038r08L709L949j119
1814B964m983j958L456L911K19l744l556J589N209J250l463l670M85L480K832
1829D021j715m832o93L710L638j755l529k923K562M878N74m517l155J158M151
1844A573K554k894m855m27M909K879k050m087j727K748M738j51m723l121K771
1859a863L884J664l170m405M87M751K693k702m058r85L385M251j246m557k332
1874d203L368M096J4l143l627R92M955J844l150l936l15L808L103j078m849j364
1890c485L518L186k53l808k968J844M493J204l764l496J122L633K452k340m709
$$ plain form
1905 -3371 -3982 -51 3287 2213 -1735 -3693 -1404 3146 2936 -928 -4184 -2005 1585 3217 515
1920 515 -3695 -3402 856 3726 1471 -2613 -3387 -736 3381 2978 -1697 -3830 -1036 2276 3208 182
1936 182 -3416 -2742 1722 3994 793 -2605 -2980 352 3506 2490 -2120 -3719 -541 2894 2846 -519
1952 -519 -3196 -1861 2424 3707 239 -3500 -2737 979 3321 1723 -2925 -3524 72 3346 1879 -1320
1968 -1320 -3625 -1483 2995 2961 -647 -3794 -2389 1305 3154 606 -3078 -3577 244 3205 1459 -2007
1984 -2007 -3892 -1257 2576 2883 -1425 -3917 -1805 1658 2765 439 -3293 -2808 1197 3382 1226
1999 1226 -2128 -2866 69 3164 2602 -1428 -3292 -572 3107 3044 57 -3023 -2007 2307 3574 452
2015 452 -2361 -2277 763 3778 1929 -1976 -3388 106 2957 1858 -1086 -3412 -1588 2107 2876 -997
$$ packed form
1905c371o11L931L338j074l948j958K289M550k10l864l256K179L590J632k702
1920E15m210K93M258K870k255m084p74K651M117m03m675k133K794L312R32l026
1936A82l598O74M464K272l201l398l75L332L154j016m610j599L178L435m8l365
1952e19k677J335M285J283l468l739P63L716K342j598m648n99L596L274j467l199
1968a320k305K142M478l4l608l147J405L694J849k548l684m99L821K961j746l466
1984b007j885K635L833L07m308k492K112L463J107k326l732M85M005K185k156
1999A226l354p38K935L095n62m030j864K720L679o3k987l080J016M314J267l122
2015D52k813Q4L040L015j849l905j412L494K851j099k944k326J824L695P69l873
$$ plain form
2031 -997 -3648 -2468 808 2732 479 -3172 -3703 7 2626 1424 -2025 -3672 -1482 2035 2514 -1234
2047 -1234 -3716 -2246 1297 2882 589 -3001 -3272 967 3666 1355 -1992 -2759 -244 3281 2901 -684
2063 -684 -2955 -318 2932 3240 768 -2364 -1871 2309 4142 1058 -2120 -2000 789 3351 2367 -1820
2079 -1820 -3092 -21 2636 2185 -652 -2879 -2098 1700 2856 -446 -3407 -2552 -118 2340 983 -2993
2095 -2993 -3645 -503 2479 1505 -1869 -3662 -1631 1847 2908 -817 -3229 -1750 1260 2852 797
2110 797 -3046 -2939 871 3443 1912 -1638 -2731 209 3165 2615 -833 -2793 -245 2775 3255 849
2126 849 -2329 -1580 1905 3570 941 -2029 -1886 466 2534 2062 -1576 -2852 -747 2309 2038 -522
2142 -522 -2718 -1993 1198 2479 321 -2731 -2484 174 2670 1684 -2362 -3442 -68 2650 1888 -1443
$$ packed form
2031i97k651J180L276J924k253l651n31L710K619j202l449j647K190L517M79l748
2047a234k482J470L543J585k293l590k71M239K699k311l347p67K515L525l80l585
2063f84k271K637L250L08k472l132M93M180J833l084l178J20K789K562r84m187
2079a820j272L071K657m51k837k227P81L798J156l302k961Q55K434K458j357l976
2095b993o52L142K982r74l374j793K031L478J061l725k412J479L010J592k055
2110G97l843J07L810K572j531l550j093K940K956n50l448j960K548L020M80k406
2126H49l178P49L485J665k629k970J43K352K068m72l638j276K105L056k71k560
2142e22k196P25L191J281k158l052K47K658K496r86m046j080L374K718p62l331
$$ plain form
2158 -1443 -3132 -1525 2356 3077 -69 -3243 -1650 1460 2971 1066 -2321 -2714 1211 3415 1300
2173 1300 -1357 -2337 -498 2697 2476 -933 -2815 -1081 1814 2276 465 -2337 -1838 1105 2620 541
2189 541 -1985 -2251 -454 2176 2236 -836 -2712 -1054 1719 2696 182 -2564 -1832 1454 3237 652
2205 652 -2359 -2344 308 2713 1775 -1507 -2982 222 2869 2376 -885 -2525 -952 2024 3032 147
2221 147 -2460 -1427 1258 2540 1106 -1717 -2280 519 2530 1109 -1213 -2193 -944 1906 2089 -367
2237 -367 -2603 -1378 1003 1969 393 -2313 -2657 -210 2290 809 -1611 -2590 -515 1679 2556 -1091
2253 -1091 -3044 -1156 1968 2447 328 -2231 -1947 1441 3222 977 -2134 -1874 863 3169 2056 -1678
2269 -1678 -2522 232 2984 2239 -717 -2199 -841 1714 2523 88 -1867 -1226 1015 2212 1051 -1549
$$ packed form
2158a443j689J607L881P21l146l174J593L110J511j905l387l93L925K204k115
2173A300k657r80J839L195k21l409j882J734K895M62j811k802M99K943J515k079
2189E41k526k66J797K630O0l072j876J658K773R77k514k746P32L286J783k585
2205F52l011J5K652K405r38l282j475L204K647m93l261j640J573K976J008k885
2221A47k607J033K685J282j434k823n63K799K011j421k322r80J249K850J83k456
2237c67k236J225K381R66j576k706l44K447K500j481k420r79K075K194Q77l647
2253a091j953J888L124M79k119k559K84L388J781k245l111K60K737K306j113l734
2269a678q44K754K752p45k956j482J358K555Q09k435j955O41K241J197j161k600
$$ plain form
2285 -1549 -2155 -30 1987 1502 -1085 -2568 -1278 1180 2179 -259 -2802 -1989 442 2077 823 -2226
2301 -2226 -3232 -31 2662 989 -1634 -2761 -996 2207 2410 -1079 -3156 -872 1712 2381 -66
2316 -66 -2392 -1974 1499 2838 423 -2284 -1909 582 2337 1699 -1496 -2187 14 2390 1998 118 -1534
2333 -1534 -909 1383 2396 700 -1751 -1512 351 2158 1344 -934 -2259 -457 2234 1982 -388 -2077
2349 -2077 -1437 1485 2348 152 -2529 -1846 618 2424 751 -2262 -3043 213 2437 1424 -1945 -3043
2365 -3043 -996 1801 1595 -1462 -3101 -1261 1310 1629 -278 -2524 -1843 642 1984 -78 -1946 -1478
2381 -1478 -33 1764 1555 -766 -2075 -496 1067 1613 415 -1114 -1198 1253 2967 1248 -900 -1362
2397 -1362 565 2480 2265 -550 -1990 58 2458 2446 -98 -2248 -1182 1582 2802 104 -2571 -1710
$$ packed form
2285a549o06K125K017m85k587j483J290K458R99k438k543Q13K431J635j254l049
2301b226j006L201K693j673k623j127J765L203K03l489k077K284K584O69k447
2316f6k326M18L473J339k415k707L75K491J755o38l195o91K201K376l92j880j652
2333a534O25K292J013j696k451K39J863J807q14k278j325J802K691k52k370j689
2349b077O40K922Q63k196k681O83K464J806j673l013p81L256K224j013l369j098
2365c043K047K797k06l057j639J840K571L19j907k246O81K485J342k062j868M68
2381a478J445J797k09k321j309J579J563N46j198j529q4K451J714j719k148m62
2397a362J927J915k15k815j440K048K400j2k544k150J066K764J220k698k675Q61
$$ plain form
2413 -1710 818 2228 502 -2418 -2749 332 2334 359 -2170 -2429 -953 1150 1202 -1112 -2620 -1315
2429 -1315 744 934 -672 -2299 -1878 -339 1658 567 -1010 -1786 -536 1573 1829 -500 -1610 -1006
2445 -1006 1499 2362 817 -1387 -1573 1062 2944 1212 -1001 -1780 359 2643 2315 -772 -2550 -165
2461 -165 2907 2118 -259 -2304 -1382 1881 2341 1 -2434 -1532 710 1626 429 -1716 -2366 -72 1788
2478 1788 623 -1603 -2047 -1168 404 919 -762 -2193 -1503 89 887 545 -1439 -2252 -462 1654 990
2495 990 -850 -1860 -972 1059 2141 139 -2282 -1154 1420 2307 777 -1695 -1806 1044 2826 1164
2511 1164 -1521 -1760 234 2471 1797 -1330 -2241 -15 2360 1482 -760 -1724 -907 1439 1775 -104 -1868
2528 -1868 -1079 612 1520 599 -1369 -1821 -213 743 678 -558 -1830 -1252 410 1610 -131 -1407 -1504
$$ packed form
2413a710K528J410j726k920l31L081K002j975k529k59J476K103N2k314j508J305
2429a315K059J90j606j627M21J539J997j091j577p76J250K109K56k329j110O04
2445a006K505Q63j545k204j86K635J882j732k213p79K139K284l28l087j778K385
2461a65L072p89k377k045R22L263M60k340k435R02K242R16j197k145o50K294J860
2478A788j165k226m44Q79J572N15j681j431O90J592P98l42j984q13J790K116o64
2495I90j840j010Q88K031J082k002k421J128K574Q87j530k472j11K850J782j662
2511A164k685k39J994K237o74l127r11K226K375q78k242r64Q17K346L36j879j764
2528a868P89J691R08r21j968m52J608R56o5j236j272N78J662J200j741j276r7
$$ plain form
2545 -1504 -74 1548 1133 -1204 -2384 -219 1972 1495 -766 -1958 -1060 1741 2288 -232 -2719 -1164
2561 -1164 1776 2424 472 -1956 -1555 1189 2556 792 -1489 -1511 481 1907 1553 -1273 -1478 246
2577 246 1671 941 98 -1290 -755 852 1852 650 -1176 -835 210 1300 1169 -203 -1734 -738 1180
2594 1180 1506 -236 -1772 -1775 840 2407 626 -1559 -1811 189 1808 1188 -1522 -2522 -369 2324
2610 2324 1487 -1158 -2257 -633 1471 2110 -276 -2214 -621 1275 1220 367 -1905 -987 903 2067
2626 2067 273 -1302 -970 89 1487 1382 -40 -1218 -70 1248 1341 526 -644 -1008 485 1820
2642 1820 1020 -489 -1148 -190 1482 1700 -397 -1856 -766 1268 1535 160 -1697 -1341 759 2359
2658 2359 706 -1862 -1770 815 1730 1156 -1481 -1963 115 2329 1170 -830 -1082 -370 1831 1221 -518
$$ packed form
2545a504J430J622m15k337j180K165K191m77k261j192Q98K801N47k520k487J555
2561a164K940O48j952k428M01K744J367j764k281k2J992J426l54k826k05J724
2577B46J425p30q43j388N35J607J000j202j826L41J045J090j31j372j531R96J918
2594A180L26j742j536lK615J567j781k185k52K000J619o20k710j000K153K693
2610B324q37k645j099J624K104O39k386j938J593J896n5q53k272R18J890J164
2626B067j794j575L32J059J398j05j422j178J148J318R3q15j170l64J493J335
2642A820q00j509o59R58J672K18k097j459J090K034K67j375j857L56K100J600
2658B359j653k568R2K585R15n74k637m82K078K214j159k000k52P12K201o10j739
$$ plain form
2675 -518 -1488 -343 1022 1517 452 -812 -1052 491 1486 662 -615 -511 -222 1020 1664 264 -943
2692 -943 -795 968 1466 790 -855 -1519 -79 1609 983 -1009 -1821 -962 1400 1694 -810 -2515 -1037
2709 -1037 1586 1983 -315 -2103 -1503 1427 1660 -77 -2048 -1067 806 1665 573 -1175 -1496 213
2725 213 1856 872 -787 -843 -147 1085 1174 3 -740 -486 783 1418 813 -252 -1101 47 1293 1234
2743 1234 -208 -1064 -723 543 1741 454 -1632 -1161 608 1783 485 -1374 -1896 5 2057 918
2759 918 -1212 -1856 -127 1943 1181 -1081 -1830 -848 1557 1331 -221 -1835 -1070 1208 1182 -70 -1312
2776 -1312 -880 553 1047 464 -89 -1021 81 907 842 62 -531 -664 476 1305 491 -1043 -1067 29 1233
2795 1233 1098 -622 -1591 -828 935 1328 -512 -1524 -1307 585 1526 -259 -2088 -1371 695 1286 222
$$ packed form
2675e18r70J145J365M95j065j264k40J543R95q24j277J04K89J242O44j400j207
2692i43J48J763M98o76j645o64J440J688o26j992q12Q59K362K94k504j705J478
2709a037K623L97k298j788O00K930K33j737j971R81J873Q59j092j748l21J709
2725B13J643r84j659n6O96J232Q9j171p43K54J269O35o05j065q49J148J246n9
2743A234j442q56L41J266J198j287k086M71J769J175j298j859n22J901K052j139
2759I18k130o44J729K070p62k262p49R82K405k26j552j614P65K278k6j252j242
2776a312M32J433M94n83n53r32J102Q26o5p80n93j33J140Q29q14j534k4J096J204
2795A233j35j720r69P63J763L93j840j012K17J892R41j785j829P17K066N91j064
$$ plain form
2812 222 -1533 -1530 223 1350 763 -1025 -1380 284 1343 868 -890 -1357 -22 1180 1152 55 -812 -601
2830 -601 775 1519 637 -511 -638 128 844 982 -319 -664 -282 984 1398 -29 -1338 -1275 123 1485
2848 1485 360 -1160 -1562 23 1291 874 -1015 -1958 -586 1323 1173 -707 -2144 -1009 815 1216
2864 1216 -549 -1872 -1060 697 1257 143 -1223 -1191 375 1374 424 -738 -808 328 1214 977 -210
2881 -210 -846 -34 1042 835 362 -290 -797 225 1249 851 -382 -866 -207 772 1242 172 -1252 -495
2899 -495 916 1411 263 -1217 -1350 345 1680 611 -1308 -1428 48 1214 900 -1034 -1876 -212
2915 -212 1663 935 -438 -1451 -708 764 1298 -292 -1341 -1140 550 852 58 -766 -1072 97 981
2932 981 486 -552 -634 -468 594 1091 -283 -1099 -906 482 930 555 -9 -1283 164 1390 1327 -279
$$ packed form
2812B22j755LJ753J127n87j788l55J664J059m75j758m67J335J202k8j097q67K11
2830f01J376P44q82j148j27P66P16J38j301l45L82J266M14j427j309O3J398J362
2848A485j125j520m02J585J268m17j889r43J372J909j50j880j437J135J824M01
2864A216j765j323Q12J757N60j114j366L2J566R99r50j162p0J136Q86k37j187
2881b10o36Q12J076k07m73o52n07J022J024l98j233m84O59R79M70j070j424P57
2899d95J411M95j148j480j33J695J335j069j919j20J476J166l14j934q42J664
2915b12J875p28j373j013P43J472N34j590j049K01J690L02p94q24l06J169Q84
2932I81m95j038q2J66J062M97j374q16J93J388M48l75n64j274J447J226o3j606
$$ plain form
2950 -279 -1057 -392 1052 1586 29 -1400 -671 1277 1625 398 -1209 -804 898 1575 706 -1320 -1047
2967 -1047 403 1149 587 -897 -1256 453 1314 500 -684 -1315 -340 336 810 -214 -1057 -875 -120 455
2985 455 311 -653 -1380 -372 389 589 -349 -1068 -885 270 1096 272 -1240 -1105 23 1135 714 -484
3003 -484 -1102 199 1680 1117 -484 -969 -225 1315 1234 15 -1152 -371 1613 1280 123 -722 -752 561
3021 561 1600 370 -736 -491 491 1102 1033 -393 -1069 -38 923 798 8 -856 -939 205 1029 211 -832
3040 -832 -860 140 514 246 -661 -1534 -811 783 633 -304 -1442 -1248 232 1120 281 -1207 -994 463
3058 463 1144 513 -897 -1327 -100 1348 1016 -734 -1078 -40 1023 1006 -204 -1340 -443 1126 855
3075 855 197 -651 -334 496 1042 516 -725 -589 -41 577 666 -122 -672 -525 639 845 70 -869 -419 220
$$ packed form
2950b79p78O65J444N34j557j429P29J948L48j227j607M05J702O77q69k026K73
2967a047J450P46n62j484l59J709Q61q14j184o31R75O76M74j024q43J82P55N75
2985D55j44r64p27J008P61K00r38p19J83J155Q26q24j512J35J128J112m21j198
3003d84o18J301J481n63j601m85P44J540q1j219j167P81J984l33j157q45l0J313
3021E61J039j230j106K45R82O11o9j426o76J031R61j25p90q64q3J144Q24q18j043
3040h32k8J000L74k68r07q73P23J594j50r37j138J94J480Q88q39j488K13J457
3058D63O81o31j410m30J227J448l32j750l44J038J063j7j210j136Q97J569k71
3075H55o58q48L17Q30N46n26j241J36N48O18Q9p88n50J47J164K06p75r39M50O39
$$ plain form
3095 220 993 757 -705 -935 105 1000 788 -57 -1075 -501 825 1360 -331 -1078 -776 745 1316 -1
3113 -1 -1175 -722 534 912 -42 -588 -1260 -293 959 453 -658 -1011 -406 426 313 -346 -1250 -891 326
3132 326 608 -399 -1126 -1061 -270 371 336 -488 -1298 -497 284 172 -381 -966 -877 688 887 371 -790 -801
3152 -801 356 1574 844 -553 -893 171 1165 1399 41 -963 -433 1104 1212 218 -853 -441 823
3169 823 1412 354 -811 -647 511 809 331 -471 -1190 -54 742 356 -686 -852 -685 215 771 -536
3187 -536 -966 -1075 158 395 -173 -984 -1383 -386 539 287 -695 -1145 -635 474 851 -72 -1409 -794 453
3206 453 1051 -39 -1135 -1006 280 1184 742 -324 -818 128 993 1087 -50 -1132 -127 1159 1111 102
3224 102 -478 -379 607 1067 666 -624 -489 435 823 540 -313 -1007 -620 941 542 -401 -881 -347 128 616
$$ packed form
3095B20P73k36j462k30J040Q95k12q45j018N74J326N35j691p47L02J521N71j317
3113aj174M53J256L78r54n46o72R67J252n06j111l53O05Q32j13o59r04L59J217
3132C26K82j007p27O5P91O41l5q24q10Q01P81j12n53n85Q9J565J99n16j161j1
3152h01J157J218p30j397l40J064R94K34j358j004N30J537J08r94j071M12J264
3169H23N89j058j165J64J158K98m78q02p19J136P96l86j042j66J67R00N56j307
3187e36m30j09J233K37n68q11l99R97R25k52r82m50N10J109L77r23j337O15J247
3206D53N98j090j096J29J286R04m42j066m94R46Q65R4j137j082J005J286m8j009
3224A02n80R9R86M60m01j290J35R24L88k83q53o94L87J561l99r43m80N34M75M88
$$ plain form
3244 616 68 -912 -757 258 468 87 -683 -1318 -249 528 696 -578 -1176 -607 508 977 -123 -1060
3262 -1060 -553 689 790 233 -426 -862 285 1041 538 -328 -731 218 870 506 -176 -1063 -288 900 921
3281 921 256 -497 -404 242 598 375 -462 -666 366 707 786 -205 -721 -192 968 1015 -23 -575 -539 290
3301 290 1205 544 -1029 -807 -47 842 269 -766 -924 -235 1012 474 -82 -740 -426 459 730 -93 -984
3320 -984 -738 520 1072 173 -383 -580 291 1113 798 -508 -695 -59 692 1000 -152 -866 -478 481 988
3339 988 125 -359 -698 107 1056 586 -476 -560 112 1040 584 46 -728 -303 909 925 -41 -518 -503 272
3359 272 583 497 -566 -303 244 874 352 -558 -803 -533 511 674 -356 -805 -471 497 892 83 -839
3378 -839 -738 161 455 143 -689 -710 -86 837 725 -468 -676 -46 381 626 -145 -639 -173 670 595 240
$$ packed form
3244F16n48r80J55J015K10l81p70o35J069P77J68j274n98N69J115M69j100r37
3262a060N07J242J01n57o59m36J147P56n03q66m03R49O52l64o82q87P75J188K1
3281I21o65p53R3O46L56k23q37k04J032L41P9r91n16N29J160M7j038n52L6Q29
3301B90R15o61j573K22P60Q89n73j035j58O89J247n38n56o58L14Q85K71q23q91
3320i84K46J258N52q99n56j97Q71Q22l15j306j87O36P51L08j152p14L88R59N07
3339I88q63m84l39Q05R49m70j062q4O72R28m56n38p74M25J212J6r66m77J5P75
3359B72L11q6j063K63N47O30n22r10k45K70J044J63j030m49L34R68L95q09r22
3378h39J01Q99K94l12q32k1O24R23j12j193k08O30M27K45p71m94M66Q43p5l55
$$ plain form
3398 240 -638 -573 440 885 499 -372 -848 -225 692 370 -203 -908 -379 366 923 -166 -590 -570 272 737
3418 737 377 -478 -543 110 656 597 -217 -681 -317 661 659 -176 -347 -139 179 707 182 -563 -546 168 585 423
3440 423 -335 -802 -11 557 489 -598 -760 -147 471 735 91 -1073 -351 546 574 69 -618 -581 73 644
3460 644 658 -498 -552 -162 298 470 -330 -776 -363 312 499 199 -588 -386 175 821 443 -660 -402 67
3480 67 814 440 -284 -555 -63 920 690 -150 -116 -345 53 871 198 -322 -413 143 421 567 -367 -775 -66
3501 -66 644 537 -264 -180 -552 352 732 62 -889 -481 308 513 330 -337 -828 -129 660 602 -528 -617 -73
3522 -73 327 531 -73 -777 -293 350 492 -92 -482 -694 176 563 -24 -144 -767 246 746 524 68 -401
3542 -401 -406 526 966 105 -319 -60 477 827 389 -587 -361 146 565 366 -222 -280 -239 473 517 -359 -522 -91
$$ packed form
3398B40q78O5J013M45l86q71m76O23R17l22n73p05N29P45N57j089m24K0Q42M65
3418G37l60q55o5O53N46n9q14m64L64R78kq35j71K08L18N28n25p45J7P14M17j62
3440D23p58m67P91N68o8j087j62O13O18K64o44j164P22Q97K8n05o87L7O54N71
3460F44J4j156n4L90M60J72q00m46M13O75J87l00p87K02N61O46l78j103K58M69
3480F7P47l74p24k71M92R83k30q40L4k29L98Q18o73n20r1N56K78J46r34m08P09
3501f6P10j07q01Q4l72R04L80o70r51M08P89K05j83o67m91O99P89n8j130q9N44
3522g3M00K04o04p04M84O43J42n84l90k12Q70L87n87j20o23J013N00k22m56m69
3542d01nR32M40q61m24K59N37L50m38r76K26N07M19j99n88n8M1P12M4q76j63M31
$$ plain form
3564 -91 307 459 241 -728 -458 48 399 40 41 -539 -179 444 120 -213 -730 -210 144 941 -296 -585 -173
3585 -173 302 414 30 -471 -760 47 284 110 -503 -710 -215 198 192 -129 -721 -474 446 637 84 -426 -409
3606 -409 266 764 165 -202 -478 -147 516 661 -194 -782 -208 384 801 -129 -430 107 273 589 458 -320
3626 -320 -146 134 982 541 -59 -437 66 322 581 -104 -662 -263 556 257 -68 -578 -672 95 441 370 -770
3647 -770 -699 32 375 35 -428 -708 -358 289 259 -421 -598 -193 7 321 -215 -589 -584 -155 280 450 -458
3668 -458 -754 -198 563 122 -153 -753 -205 544 717 49 -335 -209 120 597 138 -220 -179 233 726 363
3688 363 92 -314 -212 329 599 95 -150 -30 401 387 -148 -327 -313 111 470 445 -200 -178 -158 319 404 -358
3710 -358 -459 -40 60 501 123 -489 -642 272 311 -90 -305 -403 -198 727 318 -234 -366 88 404 264 132
$$ packed form
3564i1L98J52k18r69K70N06L51l59Jn80L60O23l24l33n17N20L54P97j237k89M12
3585a73M75J12l84n01k89Q07K37j74o13k07M95M13ol21n92K47R20J91n53n10J7
3606d09O75M98n99l67k76L31O63J45q55n88N74N92M17r30l01N37J66L16j31p78
3626c20J74K80Q48m41o00l78N03K56K59o85n58L99Q19k99l25n10r4P67L46p1j140
3647g70P1P31L43l40m63k80L50O47l0o80j77M05K00L14n36l74NM29M35J70r08
3668d58k96N56P61m41k75o00N48P49J73o68l84J26L29M77m59l58M1M12M93l63
3688C63k71m06J02N41K70n04k45J20M31j4n35j79J4M24L59k5o45K2K0M77Q5p62
3710c58j01M19J00M41l78o12j53R14L9m01k15r8K05R25m09n52j32M54L16j40j32
$$ plain form
3731 132 -471 -539 362 394 -33 -455 -368 -19 163 90 -597 -719 -191 418 201 1 -565 -377 512 45 -661
3752 -661 -710 -293 193 440 267 -529 -725 331 509 526 -334 -511 -218 487 135 8 -377 96 212 554
3772 554 272 -216 -229 281 654 241 -231 -502 141 619 478 217 -228 15 279 269 41 -379 -247 193 722
3793 722 -51 -279 -415 -310 414 360 -225 -534 -533 354 -93 -628 -469 -363 436 234 -268 -586 -771 -356 400
3814 400 -71 -833 -373 275 -44 -60 -19 -421 -248 427 329 -181 -381 -97 461 356 219 -308 -429 853 676
3835 676 162 -10 118 12 677 273 81 -343 -55 318 411 11 -206 -339 297 682 -73 -321 -76 203
3855 203 318 253 -517 -413 -215 369 200 -348 -914 -39 270 367 -81 -600 -554 -103 705 261 -272 -401 51
3876 51 102 489 -20 -309 -327 236 199 -408 -579 -313 57 420 164 -155 -412 82 469 234 -231 -1 -205
$$ packed form
3731A32o03o8R01L2m27m22Q7L49J82p3o87j22N28O09k17k00n66J88Q89m67p06
3752f61m9M17M86K47j73p96j96J056J78J7q60j77K93P05l52j27l85M73J16L42
3772E54k82m88j3N10L73m13m72k71O43M78j41k61m45K43K64j0k28m20J32M40N29
3793G22p73k28j36J05P24n4n85l09JQ87m47n35J59J06P99k02n02l18j85M15P56
3814D00m71p62M60O48l19j6M1m02J73O75r8n10k00K84N58j05j37n27j21J282j77
3835F76n14j72J28j06O65m04j92m24K88L73R3m00k17j33O36L85p55k48K45K79
3855B03J15o5p70J04J98N84j69n48n66Q75L09R7m48n19M6M51Q08m44n33j29M52
3876E1N1L87n09k89j8N63l7o07j71K66L70L63k56l19k57M94L87k35m65K30k04
$$ plain form
3897 -205 332 288 -290 -472 -137 141 673 304 -447 -379 297 801 264 -125 -241 138 263 168 83 -215 -130 523
3919 523 517 -403 -275 -163 442 319 71 -362 -55 -211 588 259 -262 -578 104 323 216 -81 -541 0 309
3940 309 551 -48 -391 -129 -88 577 -43 -335 -368 26 205 7 -79 -552 -172 257 -1 -85 -278 -451 233
3961 233 210 26 -654 -349 286 372 147 -60 -415 103 371 380 -266 -352 138 299 134 41 -292 -133 273 423
3983 423 198 -75 -316 261 182 275 -354 -79 154 379 241 -160 -188 16 396 346 -262 -179 8 241 201 242
4005 242 -233 -671 52 66 305 -376 -444 -341 225 370 -18 -526 -522 162 91 -333 -594 -319 -188 444 -47 -189
4027 -189 -387 -347 512 359 -107 -524 -65 225 23 -156 -462 -248 338 62 335 -441 -318 105 269 335 -382
4048 -382 -323 -115 384 371 49 -906 -360 223 97 242 -202 -483 231 446 -54 -415 -357 -118 459 191 -178
$$ packed form
3897b05N37m4n78j82L35K78N32l69p51O8O76N04n37l89j16L79J25r5q5k98Q5O53
3919E23or20J28J12O05j23k48m33L07j56P99l29n21l16O82K19j07k97m60N41L09
3940C09K42n99l43K62M1O65o20k92l3L94J79j98q6m73L80M29k58q4j93j73O84
3961B33k3j84o80L05O35Q6k25k07l55N18K68Ro46q6M90J61j65r3l33J59M06J50
3983D23k25k73k41N77p9R3o29K75K33K25j38m01k8K04L80n0o08Q3J87K33m0M1
4005B42m75m38P23J4K39o81o8J03N66J45l88n08MO84p1m24k61K75J31O32m91j42
4027a89j98M0Q59j53m66m17M59K90k02j79l06K14N86k76K73p76J23M23J64O6p17
4048c82N9K08M99j3l22r55N46N83j26J45m44k81P14K15n00l61N8K39N77k68l69
$$ plain form
4069 -178 -542 -124 -383 30 -66 -460 208 302 379 -114 -198 -392 166 282 -24 -283 -120 -147 634 52 -178 -370
4091 -370 -173 299 4 86 -114 -305 152 537 70 -173 -225 -151 39 285 -96 -316 15 131 109 19 -190 -186
4113 -186 128 407 109 -62 -451 299 361 395 -241 -397 274 629 -74 -205 83 -260 423 343 -215 -159 -44
4134 -44 61 395 -8 -383 -239 58 433 -159 -220 -478 -236 182 374 108 -429 -170 166 160 -18 -129 -30 384
4156 384 262 256 -169 -290 -28 -101 414 -189 -415 -100 209 1 165 -213 -41 285 445 92 -217 -165 72
4177 72 -48 484 29 -376 191 276 160 57 -103 -128 77 438 53 -281 47 304 335 -82 -295 -500 -216
4198 -216 439 569 151 -304 23 -74 57 -52 -156 -38 117 197 126 -171 -560 186 323 11 -284 -300 71
4219 71 252 301 -2 -143 75 341 464 392 -256 -212 -82 382 13 -234 -110 2 207 237 -121 -348 270 164
$$ packed form
4069a78l64M18k59M13r6l94O68R4P7m93q4j94N58J16l06k59J63k7P81n82k30j92
4091c70J97M72k95Q2k00j91M57L85m67k43n2P4J90K46l81k20L31J16k2r0k09M
4113a86L14K79k98j71l89P50O2L4o36j56O71L55p03j31K88l43O83q0n58N6J15
4134d4J05L34m03l75J44K97L75n92o1k58K42M18J92k66n37K59L36oj78j11R9M14
4156C84j22om25j21K62p3N15o03k26L15L09k08J64l78J72L26J60l53l09N2K37
4177G2j20N32m55m05N67Q5j16j03j60k5K05L61l85l34L28K57L1m17k13k05K84
4198b16O55J30m18m55L27r7J31j09j04J18J55Q0p1k97l89P46J37l12k95j6L71
4219G1J81M9l03j41K18K66J23p2o48M4J30M64l69k47J24J12K05L0l58k27O18j06
$$ plain form
4241 164 237 -122 163 -492 356 315 169 -207 -173 89 -4 89 -559 -352 190 482 -36 -109 -57 -384 27 557
4263 557 -346 -557 -140 -131 440 -239 -10 -474 -193 204 323 -179 -309 -208 203 296 -201 -473 -165 -49 296
4284 296 -177 6 54 118 197 99 -285 -163 -135 454 305 -462 -317 0 617 256 93 55 -81 205 220 127 -173
4307 -173 28 121 -109 341 -3 -95 32 541 109 6 -193 -273 -75 222 94 -74 -104 -216 -42 365 -251
4328 -251 -498 30 86 182 -244 -226 -64 70 29 104 -415 -207 -147 -36 138 -194 -489 -246 380 471 -46 -309
4350 -309 -82 -147 332 -204 -159 -208 -81 331 -230 -509 -355 -49 448 297 -386 -262 53 37 166 111 -357 -3
4372 -3 287 494 -94 -246 45 191 354 -179 108 -168 132 -36 -86 -176 -174 99 130 171 -338 -197 -149 89 170
4395 170 -7 -70 -168 333 245 178 -115 -160 -56 338 69 -260 -282 -41 258 73 -341 -405 -163 -43 -27 -400 -291
$$ packed form
4241A64P3l59K85o55Q48m1j46l76L4K62r3R3o48K07N42K92n18p3N2l27M11N30
4263E57r03k11M17RN71o79K29m64K81L97J19n02j30J01M11R3m97k72L08J16L45
4284B96m73J83M8O4P9r8l84J22K8N89j49p67J45L17O17l61j63l8j36K86J5r3l00
4307a73K01R3k30M50l44r2J27N09m32j03j99q0J98K97j28j68l0j12J74M07o16
4328b51k47N28N6R6m26J8J62J34m1P5n19K08O0J11J74l32k95K43O26R1n17k63
4350c09K27o5M79n36M5m9J27M12n61k79J54L06M97j51o83J24L15j6J29n5m68L54
4372cK90K07n88j52K91J46J63n33K87k76L00j68n0r0KK73L1M1n09J41M8K38Q1
4395A70j77o3r8N01q8o7k93m5J04L94k69l29k2K41K99j85m14o4K42J20J6l73J09
$$ plain form
4418 -291 2 47 203 51 -264 -182 -81 -55 12 -200 -109 -285 204 -25 -15 12 -49 294 233 8 -157 -67 -36 41
4442 41 69 32 38 53 326 469 59 -160 -70 221 400 274 -267 -68 94 -96 159 -328 -479 -72 175 136 -166
4465 -166 -268 127 65 -79 -87 -291 -46 -142 426 -50 -356 -408 -36 60 -8 -240 -170 30 -2 -56 -328 -519 175
4488 175 173 -141 -125 -439 -8 68 237 -142 -128 63 78 286 290 -11 -429 -63 318 93 102 -193 30 140 27
4511 27 -319 -244 97 143 273 167 69 5 205 315 164 128 -275 153 -82 97 184 -82 46 157 293 57
4533 57 -172 -230 157 357 239 -224 107 -283 -16 121 148 -290 122 96 207 259 -452 -536 164 329 40 -191
4555 -191 8 -40 302 62 -80 -300 -128 140 9 206 -112 1 -412 183 31 22 85 -208 250 641 135
4576 135 -42 246 269 57 14 -79 -62 216 502 -110 -121 264 291 -125 98 126 -288 -88 397 0 -91 -102 136
$$ packed form
4418b91K93M5J56j52l15Q2J01K6O7k12R1j76M89k29J0K7o1L43o1k25j65R0L1P7
4442D1K8l7OJ5K73J43m10k19R0K91J79j26n41J99J62j90K55m87j51M07K47l9l02
4465a66j02L95o2j44qk04K45r6N68m76l06n2L72R6o8k32P0K00l2n4k72j91O94
4488A75kl14J6l14M31P6J69l79J4J91J5K08Ml01m18L66L81k25Rk95K23J10j13
4511B7l46P5L41M6J30j06r8o4K00J10j51l6m03M28k35J79Q7k66J28J11J36k36
4533E7k29n8L87K00j18m63L31l90K67J37K7m38M12k6J11N2p11q4P00J65k89k31
4555a91J99m8L42k40j42k20J72K68j31J97l18J13m13N95j52rO3k93M58L91n06
4576A35j77K88K3k12m3r3J7K78K86o12j1L85K7m16K23K8m14K00M85l97r1j1K38
$$ plain form
4599 136 -35 219 -133 -294 -365 156 309 -69 -454 -269 160 274 262 -121 -77 -81 133 204 211 -343 -184 -12 104
4622 104 61 -77 -133 147 212 320 -215 21 105 -23 -226 -220 -18 -164 449 394 18 -137 -47 271 401 319 -46
4645 -46 -195 236 56 37 -259 -219 -65 75 50 -231 -310 437 273 163 127 -184 -271 -337 525 180 27 -29 2
4668 2 196 -77 -53 93 -264 224 297 74 -468 -255 162 337 -46 -212 -178 245 275 -63 -185 -71 93 206
4690 206 100 -65 -326 98 102 -90 71 -26 72 122 344 -369 -400 -205 75 46 64 -95 36 -70 -48 155 -403
4713 -403 242 -69 -113 271 -20 -175 -8 230 69 -204 -159 -22 226 303 194 -131 -381 -87 245 190 -106
4734 -106 -218 36 35 -82 -258 265 -138 -165 -51 340 32 -34 114 239 299 -389 -185 96 156 68 -217 -226 -21
4757 -21 112 538 32 -375 -191 21 -115 10 -51 -113 -6 219 -95 -163 -215 -98 232 177 119 -15 -329 312
$$ packed form
4599A36j71K54l52j61p1N21J53l78l85J85M29J14j2l83M4mK14P1Pn54J59J72J16
4622A04m3j38n6K80O5J08n35K36Q4j28k03OK02j46O13n5l76j55R0L18J30q2l65
4645d6j49M31j80j9k96M0J54J40k5k81p9P47j64j10l6l11q7o6Q62l45j53n6L1
4668BJ94k73K4J46l57M88P3k23n42K13M17J75l83j66L4M23L0l38j22J14J64J13
4690B06j06j65k61M24Mj92J61r7R8N0K22p13l1J95K80k9J8j59J31j06K2K03n58
4713d03O45l11m4L84k91j55J67K38j61k73M5J37K48P7j09l25k50K94L32n5k96
4734a06j12K54jj17j76N23m03k7J14L91l08o6J48J25O0o88K04K81O0q8k85rK05
4757b1J33M26n06m07J84K12j36J25o1o2J07K25l14o8n2J17L30n5n8j34l14O41
$$ plain form
4779 312 -8 -1 -245 -111 180 194 -165 -181 -5 -273 49 9 -60 -287 -166 215 -188 321 -197 -380 134 103
4801 103 35 -172 10 -49 194 224 140 42 212 -20 63 -189 -291 19 149 7 -164 -318 8 -128 316 191
4823 191 60 -235 181 -6 -31 108 5 66 -159 280 286 -112 182 109 73 -1 -82 -247 357 166 126 -208 -77
4846 -77 -301 -120 80 -43 -45 58 197 -5 78 -195 -446 -93 120 -136 98 -83 -375 318 42 -311 -40
4867 -40 -132 -280 -108 66 144 -267 386 168 -11 -113 -134 189 7 -68 221 -168 324 23 -278 44 -386 20
4889 20 109 28 -23 -213 207 29 203 -39 65 147 304 140 -247 -11 241 -41 407 294 76 114 -87 377
4911 377 -13 -106 -110 -152 49 -93 203 55 77 21 1 236 -209 -286 -109 -126 -19 -8 -10 -97 -270 180 -85 -302
4935 -302 -401 224 91 -27 -54 -135 -199 16 155 -32 -246 -342 -252 161 45 65 42 -103 79 256 -80 -143 129
$$ packed form
4779C12l20Pk44J34K91J4l59j6J76k68L22m0o9k27J21L81m03N09n18j83N14l1
4801A03o8k07J82n9K43L0q4r8J70k32Q3k52j02L10J30j42j71j54L26j36M44j25
4823A91j31k95M16j87k5J39j03O1k25M39Ol98K94p3l6p4q1j65O04j91m0l34J31
4846g7k24J81K00j23kJ03J39k02Q3k73k51L53K13k56K34j81k92O93k76l53K71
4867d0r2j48J72J74P8m11O53k18j79j02k1L23j82p5K89l89M92l01l01L22m30M06
4889B0Q9q1n1j90M20j78J74k42J04Q2J57j64l87K36K52k82M48j13k18L8k01M64
4911C77l90r3mm2K01j42K96j48K2n6k0K35m45p7J77j7J07J1kq7j73M50k65k17
4935c02r9O25j33j18k7q1o4K15J39j87k14r6R0M13j16K0k3j45J82J77l36o3K72
$$ plain form
4958 129 -10 72 270 -68 138 133 238 12 -138 -35 113 -300 44 -74 -182 280 -87 -218 77 -195 -18
4979 -18 168 196 -13 2 -192 -82 69 40 -73 -98 152 29 159 122 -133 -41 -91 159 -56 -87 34 403 78
5002 78 -202 -173 -163 79 -182 -20 -245 91 41 -33 -78 137 -139 -281 367 -54 -194 -86 193 182 -97 83
5024 83 55 -74 21 302 146 59 -138 -299 146 5 -100 -364 -271 292 -58 -75 -462 -109 72 -20 183 -293
5046 -293 61 59 84 -50 -82 -177 221 65 -194 91 -214 -272 125 27 86 -102 -162 -2 246 197 -363 -96 236
5069 236 178 264 -150 -298 78 114 316 -2 333 -314 -237 47 -181 -75 20 -19 161 11 181 -372 92 34
5091 34 16 -150 -233 -206 -24 47 -122 -277 197 500 -184 -257 -99 -100 -251 28 74 -167 -141 191 -61 -65 153 6
5115 6 -203 -44 301 -299 -182 18 -93 322 -269 -1 96 126 -12 306 128 203 359 300 92 24 -247 -177 -72
$$ packed form
4958A29j39Q2J98l38K06nJ05k26j50J03J48m13L44j18j08M62l67j31K95k72J77
4979a8J86K8k09J5j94J10J51k9j13k5K50j23J30l7k55R2n0K50k15l1J21L69l25
5002G8k80K9J0K42k61J62k25L36n0p4m5K15k76j42O48m21j40J08K79j1k79J80
5024H3k8j29R5K81j56q7j97j61M45j41j05k64R3N63l50j7l87L53J81r2K03m76
5046b93L54kK5j34l2r5L98j56k59K85l05n8L97r8N9j88o0J60K48m9n60K67L32
5069B36n8Q6m14j48L76L6K02l18L35o47P7K84k28J06R5l9J80j50J70n53M64n8
5091C4j8j66q3K7J82P1j69j55M74L03o84p3J58jj51K79M6k41K6L32k52mK18j47
5115Fk09J59L45o00J17K00j11M15n91K68R7L0j38L18j78P5J56n9k08o8k71P0J05
$$ plain form
5138 -72 21 -117 53 -176 27 157 323 140 -274 -137 167 83 37 -207 75 -46 -206 73 -368 -211 276
5159 276 -90 120 112 56 -11 -99 43 -160 51 131 103 118 36 -30 79 12 -76 66 -201 37 -18 120 94 -104 196
5184 196 338 107 37 144 -300 -100 148 205 299 -190 74 213 351 163 128 62 113 491 62 121 -67 221
5206 221 217 -91 -17 -172 -122 6 363 125 -31 -19 115 34 -34 -293 -44 92 -49 152 -59 -36 -230 107 35
5229 35 23 -367 0 86 67 52 165 258 -52 68 -45 152 17 -13 240 38 -47 -264 78 -34 479 251 -246
5252 -246 -282 -10 46 157 -199 -254 228 144 308 28 -98 -104 150 -35 132 -232 69 350 -3 212 153 66 92
5275 92 -155 185 -197 258 377 383 261 232 239 -8 -74 222 -92 -199 -159 144 -61 69 112 -112 -214 80 38
5298 38 133 -208 -34 251 -81 -34 10 174 -184 208 -54 -189 -95 399 65 47 -26 -3 140 301 -164 -128 136
$$ packed form
5138g2R3j38J70k29K03J30J66j83m14J37L04q4m6k44K82j21j60K79m41J57M87
5159B76l66K10qn6o7q8J42k03K11Q0k8J5q2o6J09o7q8J42k67K38n5J38k6j98L00
5184A96J42k31p0J07m44K00K48N7R4m89K64J39J38j88l5o6N1L78m29N9j88K88
5206B21ml08P4j55N0J28L57k38j56J2J34q1o8k59K49J36j41K01k11K3j94L37p2
5229C5j2l90L67Q6j9j5J13R3l10J20j13J97j35l0K53k02q5k17L42j12N13k28m97
5252b46l6K72N6J11l56n5M82q4J64k80j26oK54j85J67l64L01K81l53K15n9q7K6
5275I2k47L40l82M55J19Oj22k9Pk47o6K96l14j07M0L03k05J30M3k24j02K94m2
5298C8R5l41J74K85l32M7M4J64l58L92k62j35R4M94l34j8p3K3J43J61m65L6K64
$$ plain form
5321 136 -13 -121 166 175 -66 -105 -99 -13 255 405 148 -163 378 109 65 -117 -178 1 210 -238 7 201 -138
5344 -138 39 50 -93 15 -88 -217 -334 -13 -174 227 251 -182 -117 -155 41 26 141 -118 -174 -30 -125 -112 202
5367 202 -229 -66 -100 -83 190 39 -428 250 152 -77 -23 -339 -35 26 401 9 251 40 -269 263 61 -133
5389 -133 -310 -128 186 -69 86 -154 81 208 -213 50 -72 -176 214 472 182 -36 -344 167 446 49
5409 49 48 62 -4 83 256 358 -141 179 26 -99 -234 175 -85 207 196 238 -396 101 119 61 -152 -123 209 392
5433 392 110 -95 101 -213 75 -22 164 91 193 -96 -67 182 56 -13 131 -171 -125 -7 -66 -64 -248 -150 72
5456 72 317 -150 90 -265 93 -119 -210 -194 69 24 -125 -118 -218 -61 -56 209 9 -329 197 137 -121 -186 -252 -331
5480 -331 -126 244 -73 -16 328 -144 256 138 215 -279 269 -135 -29 40 -72 -238 104 -52 -53 210 -39 -228
$$ packed form
5321A36j49j08K87Rk41l9OQ6K68J50k57l11N41k69m4j82o1J79K09m48K45J94l39
5344a38J77J1j43J08j03j29j17L21j61M01K4m33O5l8J96j5J15k59n6J44r5J3L14
5367B02m31J63l4J7K73j51m67O78r8k29N4l16L04O1L75l92K42k11l09N32k02j94
5389a33j77J82L14k55J55k40K35J27m21K63j22j04L90K58k90k18l08N11K79l97
5409D9jJ4o6Q7J73J02m99L20j53j25j35M09k60K92j1M2o34M97J8n8k13K9L32J83
5433C92k82k05J96l14K88r7J86p3J02k89K9K49j26o9J44l02M6J18n9Kj84R8K22
5456G2K45m67K40l55L58k12r1J6K63m5j49Pj00J57NK65k00l38N26o0k58o5o6p9
5480c31K05L70l17N7L44m72M00j18P7m94N48m04J06O9j12j66L42j56jK63k49j89
$$ plain form
5502 -228 164 18 14 42 136 155 12 -70 11 -185 -29 234 38 -110 231 33 64 174 20 -263 59 -62 29
5525 29 -48 186 27 448 166 -7 -217 70 27 163 -119 -174 -112 -96 -60 0 -33 -142 -348 -201 183 -134 139
5548 139 -82 90 -80 -161 -49 -48 128 -128 -137 -168 -108 30 223 236 -209 248 -91 -213 71 23 -241 5 362
5571 362 -35 -117 330 -117 149 53 118 259 -15 154 97 -111 -112 -200 -273 56 444 -220 74 132 45 145 28
5594 28 9 86 186 -54 -4 98 -158 30 -45 58 -192 -429 126 -15 -95 121 105 -212 68 38 -107 -35 -90
5617 -90 -189 -201 181 133 -283 -94 -227 424 -141 61 43 189 162 77 -358 285 -17 181 109 -131 -72 53 402
5640 402 20 -36 370 -255 -22 30 39 -266 -70 197 121 253 -82 16 202 -219 -121 -53 -329 202 -118 -52 -61 22
5664 22 -114 -106 368 -412 -211 -46 -90 33 -10 53 181 43 -95 -86 -122 -11 -209 -175 168 -192 -181 9 -33 162
$$ packed form
5502b28L92j46mK8R4J9j43q2Q1j96J56K63j96j48L41j98L1J10j54k83L22j21R1
5525B9p7K34j59M21k82j73k10K87m3J36k82n5O2J6L6O0l3j09k06J47L84l17K73
5548A39k21J72j70q1J12JJ76k56rl1O0J38J93J3m45M57l39j22K84m8k64K46L57
5571C62l97q2M47m47K66r6O5J41k74J69n7k08jq8p3L29L88o64K94N8q7J00j17
5594B8j9P7J00k40N0J02k56J88p5J03k50k37N55j41q0K16j6l17K80l0j45P2n5
5617i0r9j2L82m8m16J89j33O51n65K02j8J46k7q5m35O43l02J98p2k40N9J25L49
5640D02l82n6M06o25K33N2Rl05J96K67p6J32l35R8J86m21R8O8k76N31l20O6rQ3
5664B2j36QM74p80K01J65m4J23m3O3J28j38j38Rl6J11j98L4L43l60J1J90m2J95
$$ plain form
5688 162 63 172 86 -51 -61 194 197 -56 49 -328 -129 -162 24 -33 133 -87 100 54 -224 73 123 69 22 -215
5712 -215 36 170 -214 114 -75 95 67 -29 106 -49 -288 242 199 -47 -166 57 -128 -104 4 -264 -187 -98
5734 -98 23 -92 -31 169 76 -39 32 80 -76 -197 38 298 -121 -178 44 272 239 -48 84 -433 128 -26
5756 -26 -136 333 67 -134 -129 -99 30 16 -248 -26 -125 110 -164 -49 7 -68 72 242 -220 316 257 50 14
5779 14 -73 -229 -183 163 -210 -43 213 -48 151 194 -7 -271 37 322 121 -49 -344 -171 -144 152 -224 148
5801 148 -252 242 -97 -16 17 35 89 51 502 131 205 -87 196 104 17 -52 -365 56 -149 -4 -44 -212 -34
5824 -34 110 3 -130 -324 196 239 86 -244 -46 250 -38 -69 -11 209 -39 -78 -225 175 -43 -75 159 441
5846 441 69 149 79 -97 194 369 -228 -69 253 -12 -149 59 244 -185 -27 132 -153 -310 -92 -98 -252
$$ packed form
5688A62r9J09q6j37j0K55Lk53J05l77J99l3J86n7J66k20J87m6k78K97N0n4m7k37
5712b15K51J34l84L28j89J70k8r6J35j55k39N30m3k46j19K23j85K4J08k68P7Q9
5734i8J21j15O1K00r3j15P1M8j56j21K35K60m19n7K22K28l3k87J32n17N61j54
5756b6j10M69k66k01NL0J29j4k64K22r9K35k74J15N6p5J40J70m62N36n9k07l6
5779A4q7j56M6L46l73J67K56k61J99M3k01k64L08K85k01j70k95J73K7K96l76L72
5801A48m00M94l39Q1L3J8N4l8M51l71P4k92K83r2q7o9l13M21k05J45m0j68J78
5824c4J44j07j33j94N20M3j53l30J98K96k88l1N8K20k48l9j47M00k18l2K34K82
5846D41l72Q0p0j76K91J75n97J59L22k65j37K08J85m29J58J59k85j57K18oj54
$$ plain form
5867 -252 161 -87 -242 65 169 387 236 -293 -15 112 -36 102 60 -204 37 -147 -120 -57 67 -135 6
5888 6 18 247 68 15 -154 97 207 188 -51 30 98 314 87 130 -2 -62 -83 -231 -2 -40 84 -69 28 285
5912 285 -26 -208 138 33 242 66 83 -37 -31 -3 41 183 -18 105 -59 7 265 173 -342 5 -43 22 133
5935 133 156 -235 -179 -258 -233 -283 181 141 -198 -153 66 -130 162 -185 50 -70 -236 -185 -3 -201 -7 65 -242
5958 -242 110 11 -62 -66 47 -2 -67 -3 58 277 121 154 -235 1 17 174 34 255 107 123 126 -207 269 -28
5982 -28 148 -121 306 123 88 196 -214 -33 -168 52 282 84 190 -7 3 127 -38 199 55 145 131 111
6004 111 348 69 35 -212 -240 44 -7 98 167 -164 -74 190 -54 -159 40 166 -199 -56 -53 226 247 161 46
6027 46 -223 252 245 14 46 32 6 -170 6 -146 -88 326 -9 15 218 72 -194 -79 107 -22 171 20 -224
$$ packed form
5867b52M13k48j55L07J04K18j51n29K78J27j48J38m2k64K41j84K7O3J24k02J41
5888FJ2K29j79n3j69K51J10j9k39Q1O8K16k27M3j32o0k1j48K29l8J24j53R7K57
5912B85l11j82L46j05K09j76J7j20OK8M4J42k01J23j64O6K58r2n15L47m8O5J11
5935A33K3l91N6p9K5n0M64m0l39M5K19j96K92l47K35j20j66N1J82j98J94P2l07
5958b42L52r9p3mJ13m9o5O4O1K19j56L3l89K36J6J57j40K21j48J6Ll33M76k97
5982b8J76k69M27j83l5J08m10J81j35K20K30j98J06j97J0J24j65K37j44R0j4k0
6004A11K37k79l4k47k8K84n1J05O9l31R0K64k44j05J99J26l65J43LK79K1q6j15
6027D6k69M75pk31L2j4k6j76J76j52N8M14l35K4K03j46k66J15J86j29J93j51k44
$$ plain form
6050 -224 -42 -153 -130 -233 25 131 -112 209 13 112 -108 -139 51 59 -25 -83 -4 243 -149 -103 -4 31 -93 -105
6074 -105 -64 -126 217 -43 177 63 118 183 -181 180 -88 176 88 29 215 111 -186 -260 109 -4 218 -2
6096 -2 -253 388 -205 270 -186 -42 -145 244 81 155 -106 121 -90 -40 35 -406 172 -337 -38 -59 59 111
6118 111 -30 -266 -265 -101 95 140 -11 -91 101 -317 -51 -51 -104 62 379 -24 14 -254 -50 128 -244 -254 -111
6141 -111 41 136 -219 -20 97 193 89 -20 -20 -172 -167 -168 -17 205 -41 65 -4 289 40 -138 -89 221 231 -134
6165 -134 200 -140 25 -85 -275 37 -47 -218 60 -281 145 -113 -139 -156 -169 80 -456 104 -69 63 -188
6186 -188 -198 -8 43 125 -102 40 89 219 -6 -241 -206 -56 183 103 289 -2 52 -1 -154 -275 10 -73 -131
6209 -131 63 -137 47 -36 58 -441 -59 -207 -84 -302 -175 0 33 -117 -132 377 213 -132 209 -12 -46 -274
$$ packed form
6050b24J82j11K3j03K58J06k43L21j96R9k20l1J90Qq4n8P9K47l92M6R9L5j24j2
6074a05M1o2L43k60K20j14N5O5l64L61k68K64q8n9J86j04k97p4L69j13K22k20
6096bk51O41n93M75m56J44j03L89j63P4k61K27k11N0P5m41N78n09K99k1J18N2
6118A11j41k36JJ64J96M5j51q0J92m18K66%n3J66L17m03L8k68K04J78l72j0J43
6141a11J52R5l55J99J17R6j04j09%j52NjJ51K22k46J06o9K93k49j78M9L10J0l65
6165a34L34l40J65j10j90L12q4j71K78l41M26k58k6j7j3K49n36N60j73J32k51
6186a88j0J90N1Q2k27J42M9J30k25k35L5J50K39q0J86k91N4n3j53j21K85q3n8
6209a31J94k00J84q3R4m99L82j48J23k18J27J75L3j50j5N09j64l45L41k21l4k28
$$ plain form
6231 -274 77 -74 -331 -141 141 165 -130 -97 181 38 -18 325 112 -17 76 79 2 207 21 -4 -623 -96 -199
6254 -199 -215 113 11 97 -151 -55 -215 14 -191 114 41 109 -163 232 -41 195 -169 321 103 -9 189 51
6276 51 7 -148 -270 92 -353 -14 160 1 56 -128 120 54 -69 -24 -132 -105 135 -21 -223 114 131 -38
6298 -38 -7 -124 -325 2 -79 -137 -177 -370 128 -47 232 -187 19 -33 150 -352 -466 -234 68 327 -185 65
6320 65 -128 -35 -195 113 -113 -140 10 -32 -178 -32 -101 -11 104 96 166 -72 -54 -191 510 99 -77 25 333
6343 333 11 32 -126 91 195 -156 8 -123 277 -215 207 240 161 49 -127 39 114 -44 -16 -21 244 184 -89
6366 -89 -88 -25 -71 131 -74 -74 -51 -442 306 22 -63 -54 -340 21 -162 -312 9 107 144 175 230 176 -71 59 106 12
6392 12 168 89 173 26 107 62 -51 -66 61 -62 -198 -42 -166 -7 65 71 -90 -92 -7 195 75 -163 143 70
$$ packed form
6231b74L51j51k57J90K82K4k95L3K78j43n6L43k13j29R3Lp7K05j86k5o19N27j03
6254a99j6L28j02Q6k48R6j60K29k05L05p3O8k72L95k73K36l64M90k18j12J98j38
6276E1m4j55j22L62m45L39J74j59N5j84K48o6j23M5j08K7K40j56k02L37J7j69
6298c8L1j17k01L27q1n8m0j93M98j75K79m19K06n2J83n02j14K32L02K59n12K50
6320F5j93R3j60L08k26k7J50m2j46J46o9R0J15qP0k38J8j37P01m11j76J02L08
6343C33l22K1j58K17J04l51J64j31M00m92M22L3p9j12j76J66P5j58K8nK65o0k73
6366h9JO3m6K02k05%K3l91P48k84q5Rk86L61j83j50L21R8L7L1N5n4k47J30M7r4
6392A2J56p9Q4j47Q1m5j13j5J27j23j36J56j24J59P2Oj61kQ5K02j20k38L06p3
$$ plain form
6416 70 -86 5 303 201 -291 254 24 -32 131 -85 117 267 -178 -199 -136 255 81 209 -148 -36 -55 -90
6438 -90 49 -250 82 237 -29 153 31 -253 264 -249 82 69 77 126 20 -353 -408 15 165 14 117 115 -52
6461 -52 95 379 -59 -174 -352 -315 -107 -79 -239 -133 47 -211 125 169 -75 185 -66 122 127 8 -113 -124
6483 -124 -80 -54 -223 -306 -33 116 191 -24 -45 -319 -311 -200 -58 32 233 -36 154 262 194 188 -13 -149 -124 36
6507 36 31 155 -90 -232 256 301 -91 213 -34 -3 -85 74 -44 -52 -101 199 53 3 -85 -145 -398 -177 -43 118
6531 118 -193 253 251 -64 154 180 36 -21 80 71 -69 56 -20 60 -37 -14 -283 -82 76 1 -193 -130 74 136
6555 136 188 -159 -103 -56 84 -48 -71 59 192 221 -148 -224 83 -78 -215 9 31 88 -92 -98 -263 2 -30 20
6579 20 18 -41 -12 218 -133 -215 -165 -150 -174 -19 65 -15 122 165 -53 -142 -17 164 59 -116 301 -41 -214 -91
$$ packed form
6416G0j56R1K98j02m92N45k30n6J63k16K02J50m45k1O3L91j74J28l57J12j9l5
6438i0J39k99L32J55k66J82j22k84N17n13L31j3QM9j06l73n5M23J50j51J03kj67
6461e2J47K84m38j15j78L7K08K8j60J06J80k58L36M4k44K60k51J88Nj19j21j1
6483a24M4K6j69q3K73J49P5k15k1k74QJ11J42R0K01k69J90J08o8ok01j36K5J60
6507C6nJ24k45j42M88M5l92L04k47L1q2J59j18qm9L00j46n0q8o0k53K21J34J61
6531A18l11M46kl15K18K6j44n7J01rj40J25p6Q0r7K3k69K01J58p5j94O3K04O2
6555A36N2l47N6M7J40j32k3J30J33K9l69p6L07j61j37K24K2N7j80oj65K65l2N0
6579B0kn9K9K30l51q2N0J5k4J55Q4q0J37M3k18q9J25J81j05j75M17l42j73J23
$$ plain form
6603 -91 -273 -51 253 -11 -179 -8 85 120 -124 158 -134 -197 -87 117 24 133 125 34 68 -82 -60 282 -172
6626 -172 -7 303 127 254 -189 86 97 -9 -85 -146 -19 106 119 135 324 -291 330 117 287 237 -179 -432
6648 -432 362 -13 -258 -125 -4 247 -114 -29 -404 -134 -1 202 117 -51 29 -35 -123 -95 115 -51 154 53
6670 53 107 -318 -56 7 -191 163 -208 315 229 350 -73 245 280 149 193 -36 -119 218 -100 -99 67 106 -123
6693 -123 35 323 -72 -51 -283 340 316 68 25 -348 -98 -178 88 247 -98 -274 129 -91 -61 178 -70 175
6715 175 47 179 66 230 199 177 -125 110 106 -46 -9 79 106 45 -330 119 300 -180 80 60 220 -128 24
6738 24 17 -76 -206 -54 -75 -4 -8 139 9 -20 -305 214 -93 242 -141 142 119 -83 126 -154 93 -106 -394
6761 -394 -205 -22 74 256 -153 151 145 57 98 139 96 -44 136 90 223 148 148 239 -63 60 -93 -37 211 -109
$$ packed form
6603i1j82K22L04k64j68J71R3L5k44K82k92o3J10K04r3J09qr1L4j50K2L42m54
6626a72J65L10j76J27m43K75J1j06p6o1J27J25J3J6J89o15O21k13J70n0m16k53
6648d32P94l75k45J33J21K51l61Q5l75K70J33K03q5j68Q0o4q8K8K10j66K05j01
6670E3N4m25K62O3j98L54l71N23q6J21m23L18L5j31M4k29q3L37l18JJ66L9k29
6693a23J58K88l95K1k32O23k4k48m3l73K50q0K66J59l45j76M03k20L0K39k48K45
6715A75j28J32j13J64l1k2l02K35mj52L7Q8K7o1l75M49J81m80K60k0J60l48J52
6738B4pr3j30J52k1P1mJ47j30k9k85N19l07L35l83K83k3k02K09k80K47j99k88
6761c94J89J83R6J82m09L04oq8M1M1m3j40J80m6J33p5%R1l02J23j53N6K48l20
$$ plain form
6785 -109 -24 -127 -17 145 -354 -89 19 -133 -58 -239 339 -66 400 180 3 -150 -348 80 245 263 -171
6806 -171 369 11 79 -80 11 -411 5 213 -396 37 70 37 -80 18 -106 -196 -28 153 465 -124 -189 242
6828 242 -111 40 79 151 -30 237 144 6 229 124 -58 345 43 43 115 37 78 84 -31 62 109 100 -293 -99 14
6853 14 -6 24 -92 -93 -158 -275 -239 180 169 -111 96 -39 51 -9 -196 124 117 -60 -265 -41 -25 -124 -210 -23 43
6878 43 -135 -70 -110 -3 -225 19 319 -271 83 -11 -81 135 -41 5 0 -16 65 6 127 -37 -44 13 -328 22 -104
6903 -104 32 -179 65 -149 23 -69 25 -21 -358 -354 26 316 85 -63 -374 -339 161 10 152 95 -10 -179
6925 -179 98 18 -24 153 133 -22 -289 -149 -328 -41 72 24 51 7 -70 -14 33 -194 158 29 -80 -91 -74 7
6949 7 17 -73 13 133 19 -165 -149 -10 14 -80 -186 27 126 107 32 165 -64 235 -9 165 -104 123 89 -277
$$ packed form
6785a09Q5j03J10J62m99K65J08j52P5j81N78m05M66k20j77j53j98M28J65J8m34
6806a71N40l58O8j59R1m22M16K08o09M33L3l3j17R8j24r0J68J81L12n89o5M31
6828B42l53J51L9P2j81K67r3j38K23j05j82M03l02%P2p8M1Oj15R3M7rl93J94J13
6853A4k0L0j16jo5j17L6M19j1k80K07j35R0o0j87L20pj77k05K24J6r9q6J87O6
6878D3j78O5m0J07k22K44L00n90L54r4p0K16j76M6nj6Q1n9J21j64pN7l41L50j26
6903a04J36k11K44k14J72r2R4m6l37ML80K90k31j48l11L5N00j51J42n7j05j69
6925a79K77q0m2J77k0j55k67J40j79K87J13m8K7m4p7N6M7k27L52j29j09j1J7Q1
6949GJ0r0Q6J20j14j84J6J39K4r4j06K13R9j9p5J33k29K99k44J74k69K27l4l66
$$ plain form
6973 -277 -165 17 114 48 58 126 -33 -151 -107 -121 107 -129 -24 137 -65 -122 -68 -210 -43 190 -151 -399 -242
6996 -242 439 58 98 127 -210 -172 29 -269 97 -101 74 -148 65 73 -75 -303 -223 50 17 41 -52 -68 11 161
7020 161 121 302 -85 271 -87 0 125 92 -47 151 28 77 -114 82 -225 28 184 51 -49 110 -161
7041 -161 -367 -200 -83 54 -87 108 289 -396 -127 -293 -204 63 3 181 273 216 404 -227 139 -16 -13 331
7063 331 7 -223 -142 58 3 -43 -199 -181 -81 176 172 -1 159 318 -129 245 308 78 -46 179 -147 64
7085 64 -197 66 -160 -364 -234 -143 -18 266 -57 64 113 -341 0 474 -72 -34 -31 59 -246 84 30 -89 40
7108 40 -143 95 -327 1 -97 477 225 -35 -44 -94 -206 257 147 39 4 94 -52 186 -110 105 68 38 98
7131 98 -499 -106 123 196 -67 101 -324 153 -39 55 -101 118 -60 -131 171 -99 436 -34 -73 -218 -103 -342
$$ packed form
6973b77J12J82R7o6J0O8j59j18M4j4K28k36J05J61k02n7N4j42J67K33l41k48J57
6996b42O81l81M0K9l37L8K01k98L66j98J75k22K13Qj48k28Q0K73l3K4r3j6P9J50
7020A61m0J81l87L56l58Q7J25l3j39J98j23M9j91J96l07K53J56j33j00J59k71
7041a61k06J67J17J37j41J95J81o85K69j66Q9K67o0J78R2n7J88o31L66j55LL44
7063C31l24k30Q1K00n5m6j56J8J00K57mj73J60J59m47L74O3k30j24K25l26K11
7085F4k61K63k26k04J30R1J25K84l23J21M9m54L41M74n46L8LR0l05L30n4j19J29
7108D0j83K38m22L28r8N74k52k60rn0j12M63j10j08l5R0j46K38k96K15l7l0O0
7131I8n97L93K29P3k63J68m25M77j92R4j56K19j78p1L02k70N35m70l9j45J15k39
$$ plain form
7153 -342 193 -378 210 -233 64 255 52 118 -113 182 -350 -62 119 -122 -90 168 -152 -76 -55 20 -184 -81
7175 -81 -125 149 126 13 26 171 -86 115 -91 95 -63 34 -86 -292 155 -17 81 3 -16 -410 32 -299 233
7198 233 220 296 -141 34 -90 32 -22 226 281 170 -141 194 -211 182 109 34 -58 28 154 -245 -20 75 119
7221 119 -21 -157 -90 -89 -142 42 249 -25 45 174 -41 59 133 72 29 -91 -95 -38 38 -60 -2 -215 -84 -143 230
7246 230 -167 -229 -3 -12 -130 194 -140 -145 191 -55 223 15 93 -86 -137 7 -122 -268 -21 16 -283 320 3
7269 3 -155 17 -107 153 78 -385 18 11 5 -65 147 -98 -154 6 251 117 -263 -180 -111 225 -281 -118 51 184
7293 184 -136 -233 28 49 -303 -43 -485 -113 -27 328 24 52 153 161 139 5 98 1 -121 -141 216 166 -173 74
7317 74 -87 2 -71 -300 -104 90 81 -156 -172 400 -11 134 151 -172 5 -152 41 -215 -105 313 131 23
$$ packed form
7153c42N35n71N88m43K97J91k03O6k31K95n32K88J81k41L2K58l20P6K1P5k04J03
7175h1m4K74k3j13J3J45k57K01k06J86j58R7j20k06M47j72R8p8j9l94M42l31N32
7198B33j3P6m37J75j24J22n4K48N5j11l11L35m05L93p3p5r2Q6J26l99K25R5M4
7221A19j40j36O7Jn3J84K07k74P0J29k15J00P4o1m3j20mN7P6r8N8k13J31n9L73
7246B30l97o2K26rj18L24l34nL36k46K78k08P8j79n1J44j29j46K47L7k99O03l17
7269Cj58J72j24K60p5m63M03pop0K12k45n6J60K45j34l80Q3O9L36n06J63J69J33
7293A84l20r7K61K1l52K60m42L72Q6L55l04K8J01Qk2j34R3r7j22k0L57n0l39K47
7317G4j61Q9p3k29J96J94rk37j6N72m11J45J7l23J77j57J93k56J10M18j82j08
$$ plain form
7339 23 171 52 -77 -27 62 229 -207 200 115 315 -211 261 -265 262 -149 -122 377 234 -99 -151 -27 63
7361 63 23 -136 -79 -26 38 103 315 98 -200 -200 287 -267 -169 196 40 -14 -27 -181 210 4 201 75 -337 144
7385 144 25 -115 27 -34 3 -39 -185 149 -335 443 -203 34 -197 -111 -176 118 -56 50 209 89 167 -300
7407 -300 61 -182 -190 21 211 -97 -181 -140 205 128 106 -21 45 -64 -107 15 94 -403 -111 238 129 -35 -371
7430 -371 123 13 109 -302 -79 -404 -92 -219 -183 -23 -2 -86 20 -231 -75 7 38 -136 -181 -91 -285 -31 259
7453 259 153 -270 -188 135 -130 -14 124 -42 -262 -49 55 16 -81 -340 -161 -221 -183 76 -25 -60 219 -15
7475 -15 68 -353 -142 47 -89 -101 81 148 -86 36 -6 -59 -130 264 -160 -216 -276 -117 97 -10 -129 325 -72
7498 -72 -82 -34 308 -122 -73 120 -202 27 -139 246 -87 -352 -152 -20 78 52 -246 162 20 -67 -163 309 2
$$ packed form
7339B3J48j19j29N0Q9J67m36M07q5K00n26M72n26N27m11K7M99j43l33n2J24R0
7361F3m0j59N7N3O4O5K12k17k98%M87n54R8L65j56n4j3j54L91k06J97j26m12M81
7385A44j19j40J42o1L7m2j46L34m84P78o46K37k31Q6o5K94j74J06J59j20P8m67
7407c00L61k43qK11J90l08q4M1L45p7k2j27O6j09m3J22P9m97K92L49j09j64l36
7430c71M94j10R6m11K23l25L12j27L6J60K1q4J06k51J56Q2L1j74m5R0j94K54K90
7453B59j06m23Q2L23k65J16J38j66k20K13J04l9r7k59J79o0L8K59j01l5K79k34
7475a5Q3m21K11J89j36j2J82O7k34J22m2n3p1L94m24n6o0J59K14j07j19M54l97
7498g2j0M8L42m30M9J93l22K29j66L85l33k65K00J32R8k6k98M08j42q7r6M72l07
$$ plain form
7521 2 -184 -10 -212 -283 -122 209 205 -167 -154 -62 56 -157 24 33 151 -9 180 -99 105 351 -66 157 79
7544 79 -138 -34 265 -53 -58 -215 -108 -232 352 -282 -225 -247 198 -62 -191 -134 0 140 4 -69 184 -25
7566 -25 358 192 22 -127 -100 136 -36 115 -356 116 -195 -62 376 78 238 145 144 44 208 69 -111 -194
7588 -194 -47 -150 -241 142 -87 34 -115 -62 -25 -91 136 -37 -24 -122 149 114 80 52 15 -190 45 272 -65
7611 -65 343 95 -2 83 -138 127 -23 325 -21 327 131 -183 -88 3 -99 99 81 -270 223 251 -144 138
7633 138 37 75 -97 -152 -104 -63 34 13 -278 197 102 -64 -84 -121 74 158 143 -137 -65 412 65 -290 -35 150
7657 150 61 -138 22 181 -43 117 -46 -257 -16 7 -294 -133 324 17 -115 -11 28 133 -76 -9 -103 -134
7679 -134 70 170 218 -46 0 50 -84 163 64 72 -236 124 -43 294 35 118 -219 60 260 -100 -37 -120 104
$$ packed form
7521Bj86J74k02p1J61L31ml72J3R2J18k13J81RJ18j60J89k79K04K46m17K23p8
7544G9k17J04K99l18nj57J07j24N84o34N7k2M45k60j29N7J34J40j36p3K53k09
7566b5L83j66j70j49K7K36j72J51m71M72l11J33M38k98J60r3jj00J64j39j80q3
7588a94J47j03r1L83k29J21j49N3L7o6K27j73J3r8K71l5l4k8l7k05K35K27l37
7611f5M08k48r7Q5k21K65j50L48l46L48j96l14R5R1j02J98j8l51M93K8l95K82
7633A38j01L8j72n5M8M1R7k1k91M75r5j66k0l7J95Q4j5k80P2M77l47l55K55J85
7657A50q9j99J60J59k24J60j63k11K41K3l01J61M57l07j32J04L9J05k09O7r4l1
7679a34K04J00M8k64M6N0j34K47r9Ql08L60j67L37k59Q3l37K79K00l60O3q3K24
$$ plain form
7702 104 116 -70 -182 96 -62 223 30 149 53 232 186 -50 -234 -34 117 -259 28 -18 81 261 233 -38
7724 -38 -147 27 -27 27 98 117 -197 158 12 -79 197 139 -80 187 156 90 31 101 -22 414 -37 14 160 68
7748 68 -80 230 82 -36 27 -149 -23 118 -274 180 209 -155 87 69 -78 -145 -15 -63 -29 -207 -63 119
7770 119 13 -37 65 -57 -145 133 90 -65 129 11 -25 -158 14 -64 -154 -198 -166 -17 -27 293 101 -132 -91
7793 -91 85 -41 -149 31 147 -240 -80 -271 331 252 -1 266 -56 9 -258 -48 -51 -80 167 182 -78 -126 -240
7816 -240 113 208 -74 -231 -117 -209 -363 -328 19 -139 167 177 249 159 156 30 -147 108 -70 -146 -529 -68 -463
7839 -463 139 -3 199 75 150 50 -214 313 -50 251 136 -102 -251 -6 170 -12 -51 131 -7 -136 -92
7860 -92 -45 166 130 357 290 -330 402 -179 73 -204 -169 4 -216 34 140 -30 -20 408 -137 -201 -137 318 -110
$$ packed form
7702A04J2j86j12K78j58K85j93J19r6J79m6k36j84K00J51l76K87m6R9J80k8k71
7724c8j09J74n4N4P1J9l14L55j46r1K76n8k19K67l1o6n9P0j23M36m51N1J46r2
7748F8j48L10j48j18O3j76J26J41l92M54K9l64K42j8j47o7J30m8L4j78J44J82
7770A19j06n0J02j22q8K78m3j55J94j18l6j33J72p8r0m4L2J49j0L20j92k33M1
7793i1J76j26j08J80J16l87J60j91O02p9k53K67l22O5k67K10lk9K47J5k60m8j14
7816b40L53R5k82j57J14r2j54L5L47j58L06J0P2r0lj26j77K55j78p6l83M61l95
7839d63O02j42K02j24P5j00k64N27l63L01j15k38j49K45J76j82l9J82j38j29M4
7860i2M7K11l6K27o7o20P32n81K52k77L5J73k20K50J06j70J0M28n45o4O4M55m28
$$ plain form
7883 -110 -41 -290 35 250 -102 -104 26 -158 157 183 100 89 -84 68 -300 -167 -89 167 -21 -225 -247 444 -33
7906 -33 -96 -18 78 29 -89 -142 -128 219 -63 276 181 14 148 22 -133 175 -49 299 225 -37 160 -28 -104
7929 -104 -290 128 311 -177 1 57 -173 -50 14 -42 26 415 126 -386 210 -66 37 37 -16 -165 -86 -89 -192
7952 -192 -172 -240 46 -284 139 -78 113 -118 -106 69 72 101 -176 103 -121 40 225 -267 -180 -510 73 99 125
7975 125 151 -156 40 258 73 -18 32 -45 -120 23 186 80 -477 17 62 -11 -242 197 6 15 169 -19 121
7998 121 -134 14 -63 -191 -220 -286 -227 -279 -202 -95 -30 271 188 -226 248 28 -11 300 124 226 -192 53 76
8021 76 -31 201 -99 19 -174 -54 64 -196 57 -64 -117 -160 -167 132 109 -46 -15 -162 -222 -140 -156 -93 237 -4
8045 -4 253 218 -161 -275 159 -236 -262 -173 -23 38 -66 38 309 -1 -216 -213 -242 -368 122 100 33 -227 188 -58
$$ packed form
7883a10O9k49L25K15l52kJ30j84L15K6q3j1j73J52l68J33P8K56j88k04k2O91m77
7906c3o3P8R6m9j18n3J4L47k82L39r5j67J34j26j55L08k24L48p4k62J97j88p6
7929a04j86M18J83m88J78N6k30J23O4n6O8L89k89n12N96k76J03%n3j49P9lj03
7952a92K0o8K86l30M23k17J91k31J2J75LK9k77K79k24J61J85m92Q7l30N83K6K6
7975A25K6l07J96K18j85r1N0p7p5J43J63j06n57M94M5p3k31M39j91RJ54j88J40
7998A21k55J48p7j28k9o6N9n2P7J07O5L01q3m14M74k20l9L11j76J02m18K45K3
8021G6j07K32l00J18j93J20J18k60K53j21n3m3pK99k3j55L1j47o0Q2j6O3L30k41
8045dK57l5l79j14M34l95k6Q9J50O1j04J04K71l10k15Lk9j26M90k2o7k60M15k46
$$ plain form
8069 -58 -61 291 -163 -70 11 281 94 -96 62 -27 -200 136 -147 -110 -36 -91 -149 234 231 -221 88 131 -135 -468
8093 -468 -37 -59 -50 -91 179 32 -225 -11 70 71 -183 -92 36 79 138 -7 -6 68 -280 36 196 -40 160 95 158
8118 158 -34 -209 22 -359 -372 182 250 172 193 -181 -114 314 -102 74 36 24 57 98 239 -60 -183 -302 -144
8141 -144 -149 71 -250 -247 209 202 -253 -8 106 43 -114 -12 -122 -49 -24 -184 -292 -298 97 99 -105 -146 -241 192 310
8166 310 207 -74 226 -16 -9 64 50 -45 -17 -16 88 -76 139 235 -207 206 -76 258 48 138 227 -66 315 -92
8190 -92 113
$$ packed form
8069e8lL52m54R3Q1K70j87j90J58q9j73L36k83L7P4n5n8L83lm52L09M3k66l33
8093d68M31k2Rm1K70j47k57K14Q1Jk54R1J28M3N9j45JP4l48L16J60k36K00o5O3
8118A58j92j75K31l81j3N54O8p8K1l74O7M28m16J76l8j2L3M1J41k99j23j19J58
8141a44nK20l21LM56pm55K45J14o3j57J02j10P3K5j60j08oL95Kk04m1r5M33J18
8166C10j03k81L00k42PP3j4r5K8JJ04j64K15R6m42M13k82L34k10R0Q9k93L81m07
8190i2K05
8191A13
$$ Imaginary data points
##PAGE= N=2
##DATA TABLE= (X++(I..I)), XYDATA
$$ plain form
0 0 0 0 0 0 0 0 0 0 0 8 -8 8 -13 16 -16 23 -24 30 -33 40 -48 56 -64 73 -85 98 -109 125 -142 160 -181 204
32 204 -228 253 -283 314 -351 388 -431 476 -528 585 -649 717 -795 882 -981 1094 -1224 1376
50 1376 -1554 1775 -2045 2389 -2844 3481 -4430 6004 -9100 17488 -88476 -279195 -122372
63 -122372 87612 153001 -11524 -199931 -227309 -60396 92225 78086 -77747 -197137 -169853
74 -169853 -20777 86364 44932 -91327 -167136 -112782 19668 95256 39648 -82368 -126637
85 -126637 -50989 62118 103630 41452 -54998 -75835 -1923 83870 104698 55367 -16534 -42865
97 -42865 7402 86650 121295 80334 -7449 -59613 -6470 109176 155460 71543 -60805 -98971
109 -98971 11854 156018 156169 -2082 -139024 -98396 71529 176796 89668 -98328 -168189
$$ packed form
0@%%%%%%%%%Qj6J6k1K9l2L9m7N4o3P3q8J04j20J37j58J83k07K34k67L02l41L85
32B04m32M81n36N97o65P39q19R07j004J113j234J366j512J677j863K075k318K600
50A376k930L329l820M434n233O325p911J0434j5104K6588j05964j90719J56823
63a22372K09984O5389j64525j88407k7378J66913J52621j4139j55833j19390K7284
74a69853J49076J07141m1432j36259p5809N4354J32450P5588n5608j22016m4269
85a26637P5648J13107M1512o2178r6450k0837P3912Q5793K0828m9331p1901k6331
97d2865N0267P9248L4645m0961q7783n2164N3143J15646M6284q3917j32348l8166
109i8971J10825J44164J51j58251j36942M0628J69925J05267q7128j87996o9861
$$ plain form
120 -168189 -43785 119349 135816 -4493 -145376 -133713 11028 118608 73875 -59829
130 -59829 -138024 -87131 37378 102428 38536 -78921 -120411 -48104 61567 95554 14753
141 14753 -89311 -93898 477 84418 73857 -10930 -74564 -46326 34355 73474 43175 -7098
153 -7098 -30985 -17022 19726 49255 51944 27979 -15315 -41640 -4829 70720 94821 28391
165 28391 -60486 -69100 26604 123478 97434 -29222 -104494 -39527 89747 135782 44913 -80866
177 -80866 -93913 17683 119041 101278 -7228 -89196 -59700 49550 116735 69610 -34579
188 -34579 -87459 -35465 71141 115163 41342 -68973 -87906 2608 99773 94589 -10921 -93679
200 -93679 -54479 52027 95418 35603 -49802 -67024 -4219 56475 46868 -4231 -30684 -20643
$$ packed form
120a68189J24404J63134J6467j40309j40883J1663J44741J07580m4733j33704
130e9829p8195N0893J24509O5050o3892j17457m1490P2307J09671L3987q0801
141A4753j04064m587R4375Q3941j0561q4787o3634K8238Q0681L9119l0299n0273
153g098k3887J3963L6748K9529K689k3965m3294k6325L6811P5549K4101o6430
165B8391q8877q614R5704R6874k6044j26656p5272O4967J29274M6035r0869j25779
177h0866j3047J11596J01358j7763j08506q1968K9496J09250O7185m7125j04189
188c4579n2880N1994J06606M4022p3821j10315j8933R0514R7165n184j05510q2758
200i3679L9200J06506M3391n9815q5405j7222O2805O0694r607n1099k6453J0041
$$ plain form
212 -20643 294 14650 20381 17341 3419 -22154 -33719 -225 50380 50112 -8252 -57462 -37560
225 -37560 36512 82923 39817 -43760 -65302 -1886 72299 78313 12035 -55522 -47770 26360
237 26360 83983 67125 -3956 -60033 -38469 45006 98813 57336 -34406 -76226 -18793 80127
249 80127 104674 17090 -79400 -68943 31992 102888 61917 -43148 -87543 -20228 69002 72365
261 72365 -1597 -60635 -45713 16478 50028 22563 -21022 -31692 -14705 4443 15334 14135
273 14135 975 -14582 -23262 -13725 15424 33495 12157 -25961 -34431 -4228 33894 39972 5348
286 5348 -32631 -28710 9922 41465 39079 4101 -33836 -30947 15419 56765 47840 -6598 -53503
299 -53503 -34694 40229 82614 35166 -48347 -70401 -3017 79110 75521 -14961 -82614 -44900
$$ packed form
212b0643K0937J4356N731l040j3922k5573j1565L3494N0605k68n8364m9210J9902
225c7560P4072M6411m3106q3577k1542O3416P4185O014o6278o7557P752P4130
237B6360N7623j6858p1081n6077K1564Q3475N3807m1477r1742m1820N7433R8920
249H0127K4547q7584r6490J0457J00935P0896m0971j05065m4395O7315Q9230L363
261G2365p3962n9038J4922O2191L3550k7465m3585j0670J6987J9148J0891j199
273A4135j3160j5557q680R537K9149J8071k1338l8118q470L0203L8122O078l4624
286E348l7979L921L8632L1543k386l4978l7937K889M6366M1346q925n4438m6905
299e3503J8809P4923M2385m7448q3513k2054O7384Q2127l589r0482o7653L7714
$$ plain form
311 -44900 47596 82499 24626 -57961 -68696 1518 62947 44788 -20051 -55515 -31160 19609
323 19609 40489 13006 -25881 -34491 -14744 10558 22972 9650 -17599 -28524 -13973 9139
335 9139 20552 8677 -16541 -24597 -7369 11365 14072 5983 -6773 -14222 -9675 2646 14992
348 14992 20266 5994 -21882 -27561 5133 41523 35825 -10958 -48656 -26390 39303 66318 15951
361 15951 -51092 -53209 12271 70133 49642 -27409 -66657 -20137 49886 61582 7974 -49208
373 -49208 -45915 11929 53746 33487 -17987 -43879 -22660 20911 41181 14762 -26104 -36796
385 -36796 -10297 23444 31442 2020 -32380 -30332 3352 25893 15575 -13012 -27645 -12457
397 -12457 11988 13599 -3409 -10778 -5536 -1191 -2484 -4691 1815 11940 5873 -16553 -22422 4316
$$ packed form
311d4900R2496L4903n7873q2587j0735P0214O1429j8159o4839l5464K4355N0769
323A9609K0880k7483l8887q610J9747K5302J2414j3322k7249j0925J4551K3112
335I139J1413j1875k5218q056J7228J8734K707q089j2756p449M547J2321J2346
348A4992N274j4272k7876n679L2694L6390n698m6783l7698K2266O5693K7015n0367
361A5951o7043k117O5480N7862k0491p7051l9248M6520P0023J1696n3608n7182
373d9208L293N7844M1817k0259n1474k5892K1219M3571K0270k6419m0866j0692
385c6796K6499L3741P998k9422l4400K048L3684K2541j0318k8587j4633J5188
397a2457K4445J611j7008p369N242M345j293k207O506J0125o067k2426n869K6738
$$ plain form
411 4316 31414 22962 -14712 -37749 -13046 35983 46788 2226 -41630 -30930 20510 54038
423 54038 30419 -24837 -43935 -4239 43878 46575 5245 -33967 -29378 15453 48220 32049
435 32049 -11586 -35112 -15731 26964 46375 16469 -27605 -34306 1300 37740 34082 -6381
447 -6381 -37324 -19594 21397 33865 6704 -23868 -24395 2396 22054 10139 -13174 -14861 -530
460 -530 5898 -137 -6646 -3322 6050 3334 -12341 -15646 3821 19440 9601 -14651 -24541 -4617
474 -4617 25157 26855 -4557 -28138 -16195 17261 35686 18753 -16952 -28143 -227 33198
486 33198 35760 7585 -23258 -21851 15000 45100 31841 -8695 -30446 -9354 34016 49074
498 49074 14227 -29111 -27241 14430 45862 30875 -13309 -34588 -6456 32683 33359 -536 -26076
$$ packed form
411D316K7098q452l7674k3037K4703M9029J0805m4562m3856J0700N1440L3528
423E4038k3619n5256j9098L9696M8117K697m1330l9212M589M4831L2767j6171
435C2049m3635k3526J9381M2695J9411k9906m4074o701L5606L6440l658m0463
447f381l0943J7730M0991J2468k7161l0572n27K6791J9658j1915k3313j687J4331
460e30O428o035o509L324R372k716j5675l305J9467J5619r839k4252r890J9924
474d617K9774J698l1412k3581J1943L3456J8425j6933l5705j1191K7916L3425
486C3198K562k8175l0843J407L6851L0100j3259m0536k1751K1092M3370J5058
498D9074l4847m3338J870M1671L1432j4987m4184k1279K8132L9139O76l3895k5540
$$ plain form
511 -26076 -17423 11618 24530 6315 -16352 -15913 445 7475 1630 -7740 -9246 -2802 -629 -7413
525 -7413 -10220 -1942 3243 -2017 -12098 -15353 -5677 8344 8645 -7264 -18573 -12352 5459 18060
539 18060 10696 -11876 -22372 -5144 21116 26673 5491 -21460 -21089 11505 38908 25201 -12254
552 -12254 -29002 -5510 34055 41595 5227 -30501 -20457 20084 41998 20524 -18343 -29715
564 -29715 257 32009 25706 -6663 -25651 -13834 12447 22019 3393 -18770 -18104 -2011 8296
577 8296 4218 -7942 -15513 -10031 -753 -773 -6583 -9052 -7768 -5443 -4409 -7532 -9753 -3995 1148
592 1148 -3832 -11564 -12418 -3699 7750 7459 -9359 -21082 -9276 12641 18548 673 -22584 -22005
606 -22005 7367 28428 13436 -18918 -29831 -6008 24966 26247 -6904 -33425 -20650 14115
$$ packed form
511b6076Q653K9041J2912j8215k2667M39J6358P030n845r370j506O444K173o784
525g413k807Q278N185n260j0081l255R676J4021L01j5909j1309O221J7811J2601
539A8060p364k2572j0496J7228K6260N557k1182k6951L71L2594K7403j3707l7455
552a2254j6748K3492L9565P540l6368l5728J0044M0541K1914k1474l8867j1372
564b9715K9972L1752o303l2369j8988J1817K6281R572j8626k2163O66J6093J0307
577H296m078j2160p571N482R278k0n810k469J284K325J034l123k221N758N143
592A148m980p732q54Q719J1449k91j6818j1723J1806K1917N907j7875k3257N79
606b2005K9372K1061j4992l2354j0913K3823L0974J281l3151k6521J2775L4765
$$ plain form
618 14115 28137 6582 -25118 -31168 -3834 21868 15061 -13481 -29274 -17819 6639 16765
630 16765 -427 -22919 -23076 -5287 9115 6234 -10628 -21937 -13313 4043 6717 -4308 -14036
643 -14036 -12030 -1521 5528 -1087 -11013 -7381 2663 3976 -3593 -9658 -5852 6233 9635 -4168
657 -4168 -16417 -8646 9524 14107 -279 -19232 -18228 4425 19967 6352 -19668 -25970 -6861
670 -6861 15960 14685 -11702 -31317 -19942 6887 16258 -1068 -26344 -30576 -8142 13965 8179
683 8179 -16435 -31015 -20996 3072 13691 -2958 -25981 -26090 -6086 10500 6129 -13689 -25200
696 -25200 -13309 7115 9939 -5389 -17740 -13323 1846 9430 135 -12530 -9911 2180 6684
709 6684 -246 -8810 -7420 3481 8578 -1129 -12004 -7499 5518 10108 272 -13509 -13322 2831
$$ packed form
618A4115J4022k1555l1700o050K7334K5702o807k8542j5793J1455K4458J0126
630A6765j7192k2492j57J7789J4402k881j6862j1309Q624J7356K674j1025r728
643a4036K006J0509P049o615r926L632J0044J313p569o065L806J2085L402j3803
657d168j2249P771J8170M583j4386j8953J004K2653J5542j3615k6020o302J9109
670f861K2821j275k6387j9615J1375K6829R371j7326k5276m232K2434K2107n786
683H179k4614j4580J0019K4068J0619j6649k3023j09K0004J6586m371j9818j1511
696b5200J1891K0424K824j5328j2351M417J5169P584r295j2665K619J2091M504
709F684o930q564J390J0901N097r707j0875M505J3017M590r836j3781J87J6153
$$ plain form
723 2831 14654 4596 -13805 -18326 -4496 12621 12942 -6991 -22611 -13992 8292 16502 3152
736 3152 -17861 -22178 -2705 17498 12816 -9588 -23079 -13183 10338 19918 2333 -20686 -19409
749 -19409 1953 17441 10184 -10740 -21780 -7797 12804 13100 -4752 -17859 -12510 3511 10860
762 10860 101 -14840 -13629 -490 5304 -1060 -11037 -12901 -3373 4043 -1748 -11741 -11687 -2226 3534
777 3534 -732 -11057 -13867 -2415 8243 3945 -9268 -13924 -4835 9518 12661 -1396 -14859
790 -14859 -8404 10450 19042 9282 -8456 -12619 4906 23592 19513 -1211 -12226 -2133 19104
803 19104 26619 9825 -11002 -8629 11657 24871 16335 -4276 -13490 301 19176 17939 -621
816 -621 -13173 -7730 7899 14783 2928 -12913 -12925 93 7235 1865 -9869 -14469 -6756 3261
$$ packed form
723B831J1823j0058j8401m521J3830J7117L21j9933j5620Q619K2284Q210j3350
736C152k1013m317J9473K0203m682k2404j3491R896K3521R580j7585k3019J277
749a9409K1362J5488p257k0924j1040J3983K0601K96j7852j3107N349J6021P349
762A0860j0759j4941J211J3139N794o364r977j864R528P416n791r993N4R461N760
777C534m266j0325k810J1452J0658m298j3213m656R089J4353L143j4057j3463
790a4859O455J8854Q592r760j7738m163J7525J8686m079k0724j1015J0093K1237
803A9104P515j6794k0827K373K0286J3214q536k0611r214J3791J8875j237j8560
816f21j2552N443J5629O884j1855j5841j2J3018P142n370j1734m600P713J0017
$$ plain form
830 3261 189 -10266 -13403 -7436 187 335 -8147 -14052 -7003 3592 3164 -6278 -12353 -6860 5351
845 5351 10688 68 -11765 -6975 8099 16657 9350 -5808 -9628 5736 21918 18539 566
858 566 -9152 831 19378 25613 9878 -8090 -4857 13792 25361 17235 -1985 -9775 3529 21184
872 21184 19570 1933 -10141 -4554 10924 17947 6295 -9575 -10149 3157 12114 6414 -6032
885 -6032 -12579 -3694 7771 6134 -5511 -11491 -6095 2716 5079 -3258 -11725 -7471 2809 5062
899 5062 -2730 -9965 -7667 2848 8836 1292 -10315 -8226 3905 11688 6614 -6407 -10619 1696
913 1696 15047 13115 -1990 -10298 -2901 13237 18940 5736 -9991 -7322 9492 19420 12380 -4264
927 -4264 -11004 1523 17816 17004 816 -10371 -4548 11117 18146 7031 -8887 -9187 4924 14438
$$ packed form
830C261l072j0455l137N967P623J48q482n905P049J0595m28r442o075N493J2211
845E351N337j0620j1833M790J5074Q558p307j5158l820J5364J6182l379j7973
858E66r718R983J8547O235j5735j7968L233J8649J1569q126j9220p790J3304J7655
872B1184j614j7637j2074N587J5478P023j1652j5870n74J3306Q957n700j2446
885f032o547Q885J1465j637j1645n980N396Q811K363q337q467M254J0280K253
899E062p792p235K298J0515N988p544j1607K089J2131P783n074j3021m212J2315
913A696J3351j932j5105q308P397J6138N703j3204j5727K669J6814R928p040j6644
927d264o740J2527J6293q12j6188j1187N823J5665P029j1115j5918l00J4111R514
$$ plain form
941 14438 9568 -4197 -10631 -2288 11025 10185 -1994 -9591 -4836 4920 8983 743 -9469 -7277
955 -7277 3153 7011 507 -7780 -8526 382 7417 1929 -8615 -9137 -53 7230 4281 -6063 -11452
970 -11452 -2748 9101 7914 -3714 -11371 -5938 6912 12849 2161 -11051 -9229 4747 13906
983 13906 8173 -5892 -12095 -790 13941 13276 -1238 -10719 -5421 9098 15900 5823 -9036
996 -9036 -8958 4476 14173 9224 -4105 -10133 -1327 11578 11118 -1358 -8966 -4747 5671 10742 2470
1011 2470 -8413 -7532 3087 8070 2680 -6357 -8418 -679 7276 3453 -6723 -9190 -1715 5696
1025 5696 4487 -4880 -10998 -4573 6309 6636 -3220 -10471 -6858 4041 9830 1364 -10591 -9725 2351
1040 2351 10880 6362 -6135 -11924 -2551 11151 11163 -2062 -10623 -5699 7295 13881 4732 -8976
$$ packed form
941A4438m870j3765o434Q343J3313q40j2179p597M755R756M063q240j0212K192
955g277J0430L858o504q287p46Q908P035n488j0544n22R084P283k949j0344n389
970a1452Q704J1849j187j1628p657N433J2850N937j0688j3212J822J3976R159
983A3906n733j4065o203J1305J4731o65j4514r481N298J4519O802j0077j4859
996i036P8J3434R697m949j3329o028Q806J2905m60j2476p608M219J0418N071q272
1011B470j0883Q81J0619M983n390r037k061P739P955l823j0176k467P475P411
1025E696j209r367o118O425J0882L27r856p251L613J0899N789q466j1955Q66J2076
1040B351Q529m518j2497n789R373J3702J2j3225q561M924J2994O586r149j3708
$$ plain form
1054 -8976 -8813 3934 13125 8946 -3848 -10357 -1594 11487 11570 -489 -8544 -4436 6502 11754
1068 11754 4046 -7337 -6699 3856 9790 5256 -3881 -7469 -454 8751 6335 -3714 -7377 -1544
1082 -1544 6269 6757 -1352 -8744 -4314 5656 7215 -859 -7971 -6532 3076 9051 2506 -8240 -8493
1097 -8493 1380 8623 5385 -4803 -10616 -2738 9155 9127 -1807 -9826 -5914 5858 12067 3864
1111 3864 -8567 -8459 3266 11782 7940 -3333 -9402 -1331 10446 11194 -158 -7676 -3933 6879
1125 6879 12283 4649 -6190 -5972 4480 10890 6533 -2512 -6688 236 9735 8253 -1395 -6353 -1169
1140 -1169 6676 8345 1469 -6187 -3953 6012 8369 1602 -5348 -5290 2790 9550 4213 -5760 -7356
1155 -7356 1108 8126 6303 -3303 -9417 -2520 8134 8705 -1341 -8764 -5553 5346 10713 3386
$$ packed form
1054h976J63J2747R191m179j2794o509Q763J3081Q3j2059q055M108J0938N252
1068A1754p708j1383O38J0555N934m534r137l588P015R205k416j0049l663N833
1082a544P813M88q109p392M430R970J559q074p112J439R608N975o545j0746k53
1097h493R873P243l238j0188n813P878J1893k8j0934q019L912J1772O209q203
1111C864j2431J08J1725Q516l842j1273o069Q071J1777P48j1352p518L743J0812
1125F879N404p634j0839K18J0452O410m357r045m176O924R499j482r648m958N184
1140a169P845J669o876p656K234R965K357o767o950N8Q080O760n337r973j596
1155g356Q464P018j823r606o114O897J0654N71j0046p423L211J0899N367p327
$$ plain form
1169 3386 -8041 -8109 2597 10324 7038 -3657 -9100 -1587 9477 10056 -241 -7708 -4475 5999
1183 5999 11547 4606 -5933 -6514 3648 10132 6938 -1911 -6904 -422 9634 8870 -226 -5941 -1862
1198 -1862 6123 9099 2694 -5642 -3883 5175 8629 3289 -4277 -5395 1604 8492 5067 -4358 -6854
1213 -6854 520 7106 6304 -2090 -8474 -3710 6507 7386 -1333 -8259 -6087 3072 8333 2256 -7896
1228 -7896 -8358 1028 7936 5210 -4482 -10050 -3784 7234 8095 -1648 -8314 -5426 4108 9372 3436
1243 3436 -6563 -7210 1855 8741 5757 -2851 -7279 -1415 8106 8634 -178 -5979 -2876 5497 9034
1258 9034 3375 -5090 -4481 4430 8520 3973 -3026 -5072 1134 8059 5369 -3298 -6477 -614 5685
1273 5685 5407 -1832 -7801 -4373 4160 5466 -1302 -7967 -7013 642 5884 1207 -8528 -9440 -1587 4825
$$ packed form
1169C386j1427o8J0706P727l286j0695n443P513J1064N79j0297p467L233J0474
1183E999N548o941j0539n81J0162O484l194q849m993O482J0056p64r096n715M079
1198a862P985K976o405q336J759R058L454n340p566j118O999O888l425r425k496
1213f854P374O586q02q394o384M764J0217Q79q719o926K172R159N261o077j0152
1228g896m62R386O908k726r692n568O266J1018Q61r743o666K888R534N264n936
1243C436r999o47R065O886k984q608m428N864R521N28q812n801L103Q373L537
1258I034n659q465O09Q911M090m547o999k046O206O925k690q667l179N863O299
1273E685k78p239n969L428Q533J306o768o665R54P655N242m677r735r12P853O412
$$ plain form
1289 4825 2892 -5609 -11108 -5525 4631 5205 -3529 -9964 -7328 1445 7267 1244 -8425 -8974 33
1304 33 6980 4216 -4460 -8932 -2972 6919 7391 -1552 -7061 -3725 4534 8493 2581 -5920 -5302 3709
1320 3709 7645 4132 -3281 -5683 521 7068 5440 -2360 -5807 -1757 4908 5686 -771 -7171 -4608
1335 -4608 3062 5184 -653 -6437 -6750 -730 5324 1498 -7170 -9104 -2596 3729 2703 -4655 -10421
1350 -10421 -5975 3495 4500 -3290 -9674 -8119 214 5561 930 -8671 -9754 -1393 5291 2902 -4943
1365 -4943 -9693 -4110 4986 5695 -2380 -8263 -5090 2671 6163 1267 -6594 -6743 1232 5804 2979
1380 2979 -3835 -6338 -1836 5058 4761 -2672 -6354 -2831 3107 5221 -158 -6411 -5110 2319 5294
1395 5294 393 -5391 -5940 -757 5606 2740 -5210 -7300 -1748 4690 3879 -2677 -8147 -4443 4022
$$ packed form
1289D825j933q501n499N583J0156N74q734o435K636Q773N822o023r669n49R007
1304C3O947k764q676m472N960R891M72q943n509L336Q259L959n912q501O18R011
1320C709L936l513p413k402O204O547j628p800l447M050O665P78o457o400K563
1335d608P670K122n837n784l13O020O054l826q668j934O508O325j026p358n766
1350a0421M446R470J005p790o384J555Q333N347m631r601j083Q361O684k389p845
1365d943m750N583R096P09q075n883L173P761L492m896p861j49P975M572k825
1380B979o814k503M502O894k97p433l682L523N938K114n379o253J301P429K975
1395E294m901n784n49N183O363k866p950k090N552O438q11o556n470L704Q465
$$ plain form
1410 4022 5508 -971 -7039 -5935 1347 6189 1833 -6873 -7311 -372 5326 3761 -3874 -8300 -3577
1425 -3577 4532 5237 -2043 -7276 -5244 1841 5801 1210 -6753 -6687 644 5055 2563 -3907 -7446 -2882
1441 -2882 4562 4166 -2534 -6946 -3840 2347 4853 406 -6348 -5534 2123 5261 1279 -4631 -6278
1456 -6278 -608 5464 3481 -4142 -6507 -1641 4374 4302 -1419 -6560 -3591 4204 6202 337 -5535
1471 -5535 -4711 1729 6599 3294 -4556 -6199 416 5807 4451 -1893 -6120 -2547 5111 5795 -525
1486 -525 -5457 -3994 2167 6400 2744 -4804 -5953 516 5772 3630 -2265 -6507 -2239 4513 5415
1501 5415 -1423 -6040 -3428 2532 5690 1005 -5839 -5053 1616 5330 1616 -3925 -5798 -991 4909
1516 4909 4087 -3291 -6079 -1431 3700 4619 -874 -5671 -3497 3562 5556 558 -4569 -4593 1393 5729
$$ packed form
1410D022J486o479o068J104P282M842m356q706m38O939N698j565p635m426M723
1425c577Q109P05p280n233K032P085L960m591p963O6P331M411k492o470l539M564
1441b882P444l96o700m412L106O187K506m447o754Q14P657L138l982n910j647
1456f278N670O072j983p623k365M866O015p2n721n141K969P795J998n865n872
1471e535Q24O440M870l305p850j643O615N391j356o344m227L573P658O84o320
1486e25m932J463O161M233l656p548j149O469N256k142n895m242M268O752R02
1501E415o838m617K612N960L158m685o844P86O669L714l714n541j873M807N900
1516D909q22p378k788M648N131R19n493m797K174P059J994m998n127k4N986M336
$$ plain form
1532 5729 3349 -3655 -5227 103 5310 4416 -1036 -5234 -2518 4566 6069 480 -4550 -3488 2149
1547 2149 6492 3123 -3812 -4782 860 5778 4553 -1665 -5689 -1774 4879 5932 -455 -5041 -2668
1562 -2668 3072 5884 1807 -4578 -4591 1779 5662 2301 -3073 -5119 -855 4764 4411 -2371 -5738 -1968
1578 -1968 3662 4459 122 -5418 -3699 2692 4798 791 -3938 -4482 629 5052 3246 -3387 -5128
1593 -5128 -552 4229 4629 -750 -5437 -2593 4122 5991 737 -4247 -3753 1952 6149 3355 -3144
1608 -3144 -4704 958 5638 4272 -1029 -4960 -2054 4948 5809 -240 -4459 -2684 2725 5293 2516
1623 2516 -4077 -4393 1134 5171 3016 -2084 -4654 -1449 4297 3930 -1494 -5180 -2164 2763 4322
1638 4322 451 -4642 -4138 1518 4377 1273 -3844 -4724 -808 4252 3048 -2839 -5454 -1275 3297
$$ packed form
1532E729k380p004j572N330N207q94n452m198K716P084J503n589n030J062N637
1547B149M343l369o935r70N642M918j225o218m024L915O653J053o387m586K373
1562b668N740K812m077o385j3O370L883l361n374k046M264N619l53o782l367L770
1578a968N630P97m337n540J719O391K106m007m729n44N111M423j806o633j741
1593e128M576M781M00n379m687K844O715J869n254m984M94N705M197k794o499
1608c144j560N662M680j366n301l931K906P002Q61o049m219J775N409K568k777
1623B516o593l16N527M037k155n100k570L205N746l67n424l686L016M927J559
1638D322l871n093N04N656K859l104n117q80L916N060j204n887k615M179M572
$$ plain form
1653 3297 4024 -879 -5394 -3516 3081 5109 273 -4175 -3843 1059 5357 2912 -3491 -4972 117
1668 117 4478 3974 -848 -4562 -1859 4175 5346 336 -3962 -2838 2124 5453 2460 -3171 -4332
1683 -4332 1126 5057 3257 -1485 -4444 -1552 4081 4523 -922 -4397 -2322 2102 4500 1070 -4430
1698 -4430 -4215 1061 4007 1219 -3708 -4907 -942 3807 2857 -2669 -5322 -1982 2963 3627 -417 -5090
1714 -5090 -3688 2014 4127 277 -3959 -3844 464 4530 2593 -3130 -4995 -224 4327 3785 -1102
1729 -1102 -4711 -2506 3300 5111 530 -3966 -2977 1856 5214 2552 -3053 -3864 605 4549 3647 -979
1745 -979 -4187 -1545 4041 4927 -250 -4242 -2165 2262 4282 1710 -3486 -3921 1224 4446 1937 -2376
1761 -2376 -3845 -1055 3764 3236 -1910 -4682 -1877 2476 3496 86 -4367 -3614 1556 4187 1082
$$ packed form
1653C297P27m903m515J878O597K028m836m448L32M902M298k445o403j481N089
1668A17M361n04m822l714K703O034J171n010m298J124M962L329k993n631j161
1683d332N458L931j800m742k959K892N633M42n445l475K075M424K398l430n500
1698d430K15N276K946k788m927j199L965M749r50n526k653L340M945O64m044m673
1714e090J402N702K113l850m236J15M308M066j937n723j865M771M551n42m887
1729a102l609K205N806J811m581m496R89M833L358k662n605q11M469L944r02m626
1745i79l208K642N586Q86n177l992K077M427K020k572n196m35N145L222k509m313
1761b376j469K790M819n28n146k772K805M353J020l410m453P53N170K631l105
$$ plain form
1776 1082 -3323 -3823 -398 3828 2728 -2783 -4766 -879 3029 3353 -732 -4557 -3225 2669 4330
1791 4330 216 -3700 -3200 1141 4635 2792 -2589 -3944 206 4315 3544 -855 -3769 -1667 3718
1806 3718 4322 -53 -3576 -1967 1948 4648 2362 -2900 -3353 1235 4239 2445 -1586 -3623 -1050
1821 -1050 3501 3851 -1002 -3809 -1615 2460 4106 668 -3858 -3357 1508 3933 1574 -2602 -3765
1836 -3765 -457 3806 2891 -1853 -4341 -1029 2869 3274 -65 -3877 -2468 2640 4410 808 -3165
1851 -3165 -3224 764 4230 2753 -2334 -3723 -228 4017 3314 -387 -3534 -1690 3246 4544 291 -3007
1867 -3007 -2546 1689 4479 2419 -2853 -3718 915 4373 2449 -1161 -3514 -1356 3341 3887 -627 -3380
1883 -3380 -1735 2134 3833 877 -2823 -3406 1414 3941 1624 -2472 -3685 -871 3374 2956 -1667
$$ packed form
1776A082m405n00L425M226j100n511j983L887L908L24m085l825J332N894J661
1791D330m114l916N00M341L494j843n381j355M150M109p71m399k914K102N385
1806C718O04m375l523J609L915K700k286n262m53M588L004j794m031k037K573
1821a050M551L50m853k807K194M075J646l438m526N01M865K425k359m176j163
1836c765L308M263r15m744k488L312L898M05l339l812J409N108J770l602l973
1851c165n9L988L466j477n087j389L495M245p03l701l147J844M936J298m253l298
1867c007M61M235K790k060n272q65M633L458j924l610k353K158M697N46m514k753
1883c380J645L869J699k956l700n83M820K527k317m096j213K814M245m18m623
$$ plain form
1898 -1667 -3768 -1397 2561 3485 -181 -3594 -2941 1839 4343 915 -2758 -2956 222 3885 2559 -2057
1914 -2057 -3790 -459 3176 3565 -410 -3770 -1872 2509 4413 504 -2826 -2286 1075 3339 2294
1929 2294 -2185 -3538 404 3712 2676 -523 -2983 -1530 2808 3538 -224 -2994 -1833 1629 3422
$$ packed form
1898a667k101K371L958R24l666l413O53M780K504l428l673j98L178L663j326m616
1914b057j733L331L635L89l975l360J898M381J904l909l330N40L361K264j045
1929B294m479j353L942L308j036l199k460J453M338P30l762k770J161L462J793
$$ [...]
8191e0
##END NTUPLES=NMR FID
##END=
