##TITLE=1H_CA-8601-1
 DMSO, 8 sc, 
 28.5.2019
##JCAMPDX= 6.0         $$ Bruker NMR JCAMP-DX V2.0
##DATA TYPE= NMR FID
##DATA CLASS= NTUPLES
##ORIGIN= UXNMR, Bruker Analytische Messtechnik GmbH
##OWNER= root
$$ XWIN-NMR		Version 3.5
$$ Wed May 29 13:22:49 2019 Russian Standard Time (UT+4h)  she@DPX200
##.OBSERVE FREQUENCY= 200.13155
##.OBSERVE NUCLEUS= ^1H
##.DELAY= (6, 6)
##.ACQUISITION MODE= SIMULTANEOUS
##.ACQUISITION SCHEME= undefined
##.AVERAGES= 8
##.DIGITISER RES= 18
##SPECTROMETER/DATA SYSTEM= spect
##.PULSE SEQUENCE= zg30
##.SOLVENT NAME= CDCl3
##.SHIFT REFERENCE= (INTERNAL, CDCl3, 0, 15.7039)
##AUDIT TRAIL= $$ (NUMBER, WHEN, WHO, WHERE, WHAT)
$$ ##TITLE= Audit trail, XWIN-NMR		Version 3.5
$$ ##JCAMPDX= 5.01
$$ ##ORIGIN= Bruker BioSpin GmbH
$$ ##OWNER= she
$$ F:/spectra/data/she/nmr/H-F/1/audita.txt
$$ ##AUDIT TRAIL=  $$ (NUMBER, WHEN, WHO, WHERE, WHAT)
(   1,<2019-05-29 13:21:37.15 +0400>,<she>,<DPX200>,
      <created by zg, POWCHK disabled, PULCHK disabled
       configuration hash MD5:
       00 E9 B6 7A A2 85 ED C7 34 08 36 98 17 FE 4E 26
       data hash MD5: 16K
       59 B8 A3 A9 86 CD 15 35 3C FE 3B 22 90 30 0A 71>)
$$ ##END=
$$ 
$$ hash MD5
$$ 5A E3 57 25 7A 30 A6 9B A4 8C 84 59 7D AD 4B 08
##$RELAX= 
##$RELAX= 
##$RELAX= 
##$RELAX= 
##$RELAX= 
##$RELAX= 
$$ Bruker specific parameters
$$ --------------------------
##$DU= <F:/spectra>
##$EXPNO= 1
##$NAME= <H-F>
##$PROCNO= 1
##$TYPE= <nmr>
##$USER= <she>
##$AMP= (0..31)
100 100 100 100 100 100 100 100 100 100 100 100 100 100 100 100 100 100 
100 100 100 100 100 100 100 100 100 100 100 100 100 100 
##$AQSEQ= 0
##$AQ_mod= 1
##$AUNM= <au_zg>
##$AUTOPOS= <>
##$BF1= 200.13
##$BF2= 200.13
##$BF3= 200.13
##$BF4= 200.13
##$BF5= 200.13
##$BF6= 200.13
##$BF7= 200.13
##$BF8= 200.13
##$BYTORDA= 1
##$CFDGTYP= 0
##$CFRGTYP= 5
##$CHEMSTR= <none>
##$CNST= (0..31)
1 1 145 1 1 1 1 1 1 1 1 1 1 1 1 1 1 1 1 1 1 1 1 1 1 1 1 1 1 1 1 1 
##$CPDPRG= <>
##$CPDPRG1= <>
##$CPDPRG2= <>
##$CPDPRG3= <>
##$CPDPRG4= <mlev>
##$CPDPRG5= <mlev>
##$CPDPRG6= <mlev>
##$CPDPRG7= <mlev>
##$CPDPRG8= <mlev>
##$CPDPRGB= <>
##$CPDPRGT= <>
##$D= (0..31)
0 1.2 0 0 0 0 0 0 0 0 0 0.03 0 0 0 0 0 0 0 0 0 0 0 0 0 0 0 0 0 0 0 0 
##$DATE= 1559121696
##$DBL= (0..7)
120 120 120 120 120 120 120 120 
##$DBP= (0..7)
150 150 150 150 150 150 150 150 
##$DBP07= 0
##$DBPNAM0= <>
##$DBPNAM1= <>
##$DBPNAM2= <>
##$DBPNAM3= <>
##$DBPNAM4= <>
##$DBPNAM5= <>
##$DBPNAM6= <>
##$DBPNAM7= <>
##$DBPOAL= (0..7)
0.5 0.5 0.5 0.5 0.5 0.5 0.5 0.5 
##$DBPOFFS= (0..7)
0 0 0 0 0 0 0 0 
##$DE= 6
##$DECBNUC= <off>
##$DECIM= 24
##$DECNUC= <off>
##$DECSTAT= 4
##$DIGMOD= 1
##$DIGTYP= 9
##$DL= (0..7)
0 120 120 120 120 120 120 120 
##$DP= (0..7)
150 150 150 150 150 150 150 150 
##$DP07= 0
##$DPNAME0= <>
##$DPNAME1= <>
##$DPNAME2= <>
##$DPNAME3= <>
##$DPNAME4= <>
##$DPNAME5= <>
##$DPNAME6= <>
##$DPNAME7= <>
##$DPOAL= (0..7)
0.5 0.5 0.5 0.5 0.5 0.5 0.5 0.5 
##$DPOFFS= (0..7)
0 0 0 0 0 0 0 0 
##$DQDMODE= 0
##$DR= 18
##$DS= 0
##$DSLIST= <SSSSSSSSSSSSSSS>
##$DSPFIRM= 0
$$ [...]
##$SUBNAM2= <"">
##$SUBNAM3= <"">
##$SUBNAM4= <"">
##$SUBNAM5= <"">
##$SUBNAM6= <"">
##$SUBNAM7= <"">
##$SUBNAM8= <"">
##$SUBNAM9= <"">
##$SW= 24.9336996594482
##$SWIBOX= (0..15)
0 0 2 0 0 0 0 0 0 0 0 0 0 0 0 0 
##$SW_h= 4990.01996007984
##$TD= 16384
##$TD0= 1
##$TE= 0
##$TE2= 300
##$TE3= 300
##$TEG= 300
##$TL= (0..7)
0 120 120 120 120 120 120 120 
##$TP= (0..7)
150 150 150 150 150 150 150 150 
##$TP07= 0
##$TPNAME0= <>
##$TPNAME1= <>
##$TPNAME2= <>
##$TPNAME3= <>
##$TPNAME4= <>
##$TPNAME5= <>
##$TPNAME6= <>
##$TPNAME7= <>
##$TPOAL= (0..7)
0.5 0.5 0.5 0.5 0.5 0.5 0.5 0.5 
##$TPOFFS= (0..7)
0 0 0 0 0 0 0 0 
##$TUNHIN= 0
##$TUNHOUT= 0
##$TUNXOUT= 0
##$USERA1= <user>
##$USERA2= <user>
##$USERA3= <user>
##$USERA4= <user>
##$USERA5= <user>
##$V9= 5
##$VALIST= <valist>
##$VCLIST= <CCCCCCCCCCCCCCC>
##$VD= 0
##$VDLIST= <DDDDDDDDDDDDDDD>
##$VPLIST= <PPPPPPPPPPPPPPP>
##$VTLIST= <TTTTTTTTTTTTTTT>
##$WBST= 1024
##$WBSW= 4
##$XGAIN= (0..3)
0 0 0 0 
##$XL= 0
##$YL= 0
##$YMAX_a= 401886
##$YMIN_a= -602758
##$ZGOPTNS= <>
##$ZL1= 120
##$ZL2= 120
##$ZL3= 120
##$ZL4= 120
##$ABSF1= 10
##$ABSF2= 0
##$ABSG= 5
##$ABSL= 3
##$ALPHA= 0
##$AQORDER= 0
##$ASSFAC= 0
##$ASSFACI= 0
##$ASSFACX= 0
##$ASSWID= 0
##$AUNMP= <proc_1d>
##$AZFE= 0.1
##$AZFW= 0.1
##$BCFW= 1
##$BC_mod= 2
##$BYTORDP= 1
##$COROFFS= 0
##$CY= 11.3945322036743
##$DATMOD= 1
##$DC= 2
##$DFILT= <>
##$DTYPP= 0
##$F1P= 18.9103706918063
##$F2P= -1.10871071338519
##$FCOR= 0.5
##$FTSIZE= 0
##$FT_mod= 4
##$GAMMA= 1
##$GB= 0.15
##$INTBC= 1
##$INTSCL= 1
##$ISEN= 128
##$LB= 0.24
##$LEV0= 0
##$LPBIN= 0
##$MAXI= 10000
##$MC2= 0
##$MEAN= 0
##$ME_mod= 0
##$MI= 1.114404
##$NCOEF= 0
##$NC_proc= 0
##$NLEV= 6
##$NOISF1= 3.799351
##$NOISF2= 2.8
##$NSP= 1
##$NTH_PI= 0
##$NZP= 0
##$OFFSET= 15.70392
##$PC= 1
##$PHC0= -8496.491
##$PHC1= 9.400249
##$PH_mod= 1
##$PKNL= yes
##$PPARMOD= 0
##$PSCAL= 0
##$PSIGN= 0
##$REVERSE= no
##$SF= 200.130013532006
##$SI= 16384
##$SIGF1= 3
##$SIGF2= 2
##$SINO= 400
##$SIOLD= 16384
##$SREGLST= <1H.CDCl3>
##$SSB= 0
##$STSI= 0
##$STSR= 0
##$SW_p= 3612.71676300578
##$SYMM= 0
##$S_DEV= 0
##$TDeff= 0
##$TDoff= 0
##$TI= <>
##$TILT= no
##$TM1= 0
##$TM2= 0
##$TOPLEV= 0
##$USERP1= <user>
##$USERP2= <user>
##$USERP3= <user>
##$USERP4= <user>
##$USERP5= <user>
##$WDW= 1
##$XDIM= 8192
##$YMAX_p= 0
##$YMIN_p= 0
$$ End of Bruker specific parameters
$$ ---------------------------------
##NTUPLES= NMR FID
##VAR_NAME=  TIME,          FID/REAL,        FID/IMAG
##SYMBOL=    X,             R,               I
##VAR_TYPE=  INDEPENDENT,   DEPENDENT,       DEPENDENT
##VAR_FORM=  AFFN,          ASDF,            ASDF
##VAR_DIM=   8192,          8192,            8192
##UNITS=     SECONDS,       ARBITRARY UNITS, ARBITRARY UNITS
##FACTOR=    0.0002004,     1,               1
##FIRST=     0,             0,               0
##LAST=      1.6414764,     0,               0
##MIN=       0,             -602758,         0
##MAX=       1.6414764,     401886,          0
$$ Real data points
##PAGE= N=1
##DATA TABLE= (X++(R..R)), XYDATA
0@%%%%Qj6J6k4L2l2M0n6P2q8J04j28J60j92K24k64L12l61M18m89N64o43P37q40
28d46R52j079J218j370J539j720J921k147K391k656K949l272L624m012M444m922
44b586N451o042O708p461Q319r310J0471j1853J3525j5600J8259k1804K6802l4438
58a9559M7681p7062K55456j57042n80906J96425M41233K41906j79860k11944j24480
69a68152K9192J14626J83540q458k33169j55662K37992K93433j14603m15893j17611
80c54765L26168L42347m1198k83787k08247j2820J24588K42660J90338j36138
90A89146l99176j59010K99703L37725p0194k92515o0225J94475P7065j55374r9059
101a37439J14651J16805k5921m0673j400q0520j14427P4693K44595R0566k07188
$$ plain form
0 0 0 0 0 0 8 -8 8 -16 16 -16 24 -32 40 -48 56 -72 88 -104 120 -144 168 -193 225 -264 300 -343 394 -446
28 -446 506 -573 645 -725 814 -906 1015 -1132 1259 -1397 1552 -1720 1904 -2108 2336 -2586
44 -2586 2865 -3177 3531 -3930 4389 -4921 5550 -6303 7222 -8378 9881 -11923 14879 -19559
58 -19559 28122 -48940 206516 49474 -531432 -335007 106226 348132 168272 -43672 -168152
69 -168152 -138960 -24334 159206 150748 -82421 -238083 -91 293342 178739 -237154 -354765
80 -354765 -28597 313750 272552 -11235 -219482 -232302 -107714 134946 325284 189146
90 189146 -210030 -369040 -69337 268388 198194 -94321 -154546 39929 116994 -38380 -137439
101 -137439 -22788 94017 68096 27423 26023 -54497 -168924 -94231 150364 240930 33742
112C3742k22274M6504J73738K3384o2236N8609P6838j16892j85448K5360J95019
123D6344R4476p0212o3240m341o7778r8712R1425K49611M8615k59245j93528J38381
135h8204K16866k9787j76018j8146J51344P1306j01417j14428k0712L2637R8348
146B1789J65972K8976k64689k88874R4700M04395K08946k33467l48530m6837K17250
157d0369J68475L708p1931j06649r1394O3522J96781M8240k25456j96287J59716
168i1644L39716L7893l50911k81614J40247L49368J57520j33343k56794j79095
178b68657N0820K77122K46017q1139l48045j93767K08789L17961j382k65749j27661
189a85691J40395J60257p552j12159r4021k2159Q5667J70743Q4560j74994k93767
$$ plain form
112 33742 -188532 -142028 31710 55094 -7142 51467 128305 11413 -174035 -148675 46344
123 46344 140820 70608 7368 3027 -64751 -163463 -72038 177573 226188 -33057 -226585 -88204
135 -88204 128662 98875 -77143 -95289 56055 127361 25944 -88484 -109196 -76559 21789
146 21789 187761 216737 -47952 -336826 -242126 162269 371215 137748 -210782 -257619 -40369
157 -40369 128106 131814 59883 -46766 -138160 -74638 122143 170383 -55073 -251360 -91644
168 -91644 248072 285965 -64946 -346560 -206313 143055 300575 167232 -89562 -268657
178 -268657 -217837 59285 305302 224163 -123882 -317649 -108860 209101 207719 -58030 -185691
189 -185691 -45296 114961 107409 -4750 -98771 -120930 -35263 135480 220040 45046 -248721
200b48721k7349L23511K68698j21761l16309j16696J47805J76394L8923o2099
210F2396p9306n9355N830R1938O6979p7833j10617N6851J55011P57j72891r6499
222a56739J07807J47174K093r2872m0036N167k7781l029R5528P9202o6047j17044
234f6577p346P1379J6208l1996L0592P8538k6966j47642o3341J25704J41796j8676
246A01673j10852n9536J3066M0322M7147K7820l8605q0446l199J13776O4322j25884
258a0396j55070O8469K25788P4384j75630k00882m51J70017J49914P643j17394
269C6392j56013o6291J27351K19435M1610k11417j94516P2466K28212Q2106j49388
280B9947j71563J4320J60153J15348l7196j54842j40340L9793K31792J72360j27535
$$ plain form
200 -248721 -276070 47441 316139 194378 -121931 -238627 -90822 85572 124495 62396
210 62396 -16910 -76265 -70435 21503 88482 10649 -99968 -43117 111894 112651 -60240 -156739
222 -156739 -48932 98242 100335 7463 -32573 -27406 -55187 -58216 37312 116514 50467 -66577
234 -66577 -73923 -2544 13664 -18332 12260 90798 63832 -83810 -147151 -21447 120349 101673
246 101673 -9179 -68715 -55649 -15327 31820 59640 21035 -59411 -62610 51166 115488 -10396
258 -10396 -165466 -96997 128791 203175 27545 -173337 -173788 -3771 146143 153786 36392
269 36392 -119621 -185912 -58561 160874 202484 -8933 -203449 -130983 97229 179335 29947
280 29947 -141616 -127296 32857 148205 111009 -43833 -184173 -144380 87412 259772 132237
291A32237l03662j10676K21681K80683P236k41388j81312N3843J72107J05606
301A36355k9749j28747j12493L7902J64778R2000j14348j89645j3587J96376J54736
312A93578q6383k08177p7671J11574J60981O3513q2008j60095q2029R3003J78279
323A04565O0110j34571j61573J8671J55135O6731q9029q7882K3679P0625K1989
334D8450l2526l9238j6531J1217M1824M9534j1489q5682n1944N7887Q4048q13
346E4737n7235k3415J9105O550k0222R54M0393K4429k9772m1110q956P814K1511
359e217M6964K4408n7943q7203J978J04906P4955o1952j19085p186J10534P0049
371I5208n7489r7804k5113O7264R1917K3529q2003j15599k2026J18975J45148
$$ plain form
291 132237 -171425 -282101 -60420 220263 227499 -13889 -195201 -141358 30749 136355
301 136355 106606 -22141 -134634 -96732 68046 160046 45698 -143947 -157534 38842 193578
312 193578 107195 -100982 -178653 -67079 93902 157415 75407 -84688 -166717 -73714 104565
323 104565 164675 30104 -131469 -112798 42337 109068 20039 -67843 -44164 26461 48450
334 48450 15924 -23314 -39845 -28628 13196 62730 51241 -34441 -86385 -28498 55550 54737
346 54737 -2498 -25913 -6808 -258 -20480 -19526 20867 45296 15524 -25586 -34542 -26728 -5217
359 -5217 41747 66155 8212 -78991 -77013 27893 102848 40896 -78189 -85375 25159 95208
371 95208 37719 -60085 -85198 -17934 73983 97512 15509 -100090 -122116 -3141 142007
382A42007o210j72820j34571O8913J79299P9098r1753j48277n1793R2916J36798
393I3607L6467j09102j42942j0095J58773J44755o5715k07569q7779J41976J96456
404A48832K2748j70122j66441J8573J72123J37333l3302j68983j31721N5075J90670
415G4785J01641j07879j80863l8789J37241J43418j4514j43688r9796M7475J30504
426D9535P8569n6721j44192p3563R6141J61846L4251j35006j44317J4125J48745
437B9413J00347n5765j24451m8764N7616Q8332L1441n3242p7840j2048O4688O0880
449F0607j4509p1068l9223M3344O5348K621n0346l2904R110K7815K2379J46k0735
462B585j9847j356J6114J4860m652j5077Q436J9375j5115l8713R44N0394L5553
$$ plain form
382 142007 135797 -37023 -171594 -102681 76618 155716 63963 -84314 -136107 -43191 93607
393 93607 130074 20972 -121970 -132065 26708 171463 105748 -101821 -189600 -47624 148832
404 148832 171580 1458 -164983 -146410 25713 163046 129744 -39239 -170960 -115885 74785
415 74785 176426 68547 -112316 -151105 -13864 129554 115040 -28648 -128444 -80969 49535
426 49535 128104 71383 -72809 -146372 -50231 111615 145866 10860 -133457 -119332 29413
437 29413 129760 73995 -50456 -99220 -41604 46728 78169 24927 -52913 -64961 -273 60607
449 60607 46098 -24970 -64193 -20849 44499 47120 -3226 -36130 -27020 795 23174 23320 2585
462 2585 -17262 -18618 -2504 12356 7704 -7373 1063 20438 5323 -33390 -32446 17948 53501
475E3501k8019o4601k3001N2745O5088j632o2172n2875J2465P1275N4076l7486
487C9364r4886l3824P5381R8612L192j04779r2142L4580J23013O7042o0265j18750
499f3462n4012P0969J27727M2545r7138j31587j5251J23068J25346k2204j50511
510d4510r8257P1292J52031N7126r9205j44685k6863J27311J37518j1353j48111
521b7706j19809M5138J64538R5541q7787j65611n0738J12726J42471J8851j21197
532F417j24896J1633J28948R9666l6495j32424q1797O7466J41006M6306j00970
543B4860j26181p528J14596J06327k2958j23025p8559M8912J13600N4270o1315
554D2999j07740k9540P9988Q9145m352q0673n9920K3323P3744L4404l9550n6335
$$ plain form
475 53501 25482 -39119 -62120 -9375 55713 54081 -8091 -60966 -48501 22774 76850 39364
487 39364 -55522 -89346 -13965 84647 87839 -16940 -109082 -74502 48511 115553 55288 -63462
499 -63462 -117474 -46505 81222 123767 26629 -104958 -120209 2859 128205 106001 -44510
510 -44510 -142767 -71475 80556 137682 38477 -106208 -133071 -5760 131758 120405 -27706
521 -27706 -147515 -102377 62161 157702 69915 -95696 -146434 -33708 108763 127614 6417
532 6417 -118479 -106846 22102 121768 85273 -47151 -128948 -61482 79524 125830 24860
543 24860 -101321 -108849 5747 112074 89116 -33909 -112468 -63556 50044 104314 42999
554 42999 -64741 -94281 -14293 74852 70500 -10173 -70093 -46770 26974 61378 21828 -34507
566c4507j0417L7022M2037L917l8503l6396R410L8468K0171j6073l0399q267K1709
579a828J8056j0250j5425N843J3854j086j6326j4432J0066L1567J3098k8302l9135
592c4300l240M1589M4875q500o3274m0878L8024P0969J8576n7051o9026J283P6222
605A5269O2597k7541q5784m9291M3529R5801M1322o9221j06112j7768R3737J00093
617I6631n475j10153r2352L5140J23533O8218o1413j22985m8817Q5520J26930
628I4777J8896j15522j14172J8572J31561R5574n4515j43570o3816Q7314J35018
639I0117L2752j02403j25821p755J20312J10205k3174j26342q8633M7892J30790
650E7940O2542p8071j22369k5890R2874J04591P91j04018r0030K7963J10339O6530
$$ plain form
566 -34507 -44924 -7902 34135 38052 -451 -36847 -27437 11031 31202 15129 -15270 -23537 -1828
579 -1828 16228 5978 -9447 -3604 10250 9164 -7162 -21594 -11528 20039 33137 4835 -34300
592 -34300 -37540 4049 48924 40424 -22850 -63728 -25704 45265 63841 6790 -62236 -60953 15269
605 15269 77866 50325 -35459 -84750 -41221 54580 95902 26681 -79431 -97199 -3462 96631
617 96631 91156 -18997 -111349 -76209 47324 115542 54129 -68856 -117673 -32153 94777
628 94777 113673 -1849 -116021 -97449 34112 129686 75171 -68399 -132215 -44901 90117
639 90117 122869 20466 -105355 -113110 7202 117407 94233 -32109 -120742 -72850 57940
650 57940 120482 42411 -79958 -105848 -12974 91617 92408 -11610 -101640 -73677 36662 103192
662A03192m9289j09780m6925P2155J05020J3989q4931q0060R330P9883N9823k5039
674D7368p4021l6934L4914O0820K1308l9064n4869l523M9552L7420j7119m3363
686a7511j9110K2762L5865N757k6137k0533M335J6065J0970m632j3563j705J2871
699E434L562j5688j1545J3294K6588O229l2120l5359J2480M9507K4093l0367m9070
712c2962j4167L9769N1905J738n3996m7566J5129O4618M2976l6210q1362k6101
724g6229O6373Q0570R43q0813p4606J7429R4529O5145l8152r9429n3842N3619
736d4463J08169L9518q1712j08686n650J01844R0527k4364j12325o9458N5582
747e1018J13258M1647p3794j09641k5287R5337J11523l096j17792r6024L4041
$$ plain form
662 103192 53903 -55877 -102802 -30647 74373 88362 3431 -76629 -67299 12584 72407 47368
674 47368 -26653 -63587 -28673 32147 53455 14391 -40478 -44001 5551 42971 25852 -17511
686 -17511 -36621 -13859 22006 27763 1626 -18907 -14572 1493 12463 7831 -5732 -7437 5434
699 5434 8996 -6692 -18237 -4943 21645 27874 -4246 -39605 -27125 22382 46475 16108 -32962
712 -32962 -47129 -7360 44545 46283 -7713 -55279 -40150 24468 67444 31234 -50128 -76229
724 -76229 -9856 70714 71657 -9156 -83762 -66333 28196 93341 55189 -44240 -98082 -44463
736 -44463 63706 103224 21512 -87174 -92824 9020 99547 75183 -37142 -106600 -51018
747 -51018 62240 103887 30093 -79548 -104835 -9498 102025 98929 -18863 -114887 -80846
758h0846J24862P3437o1003j22361m1831P8058J04041J9318q2569r5056O19R8291
770A4960Q0297l1720j05458n6935N8974J06329K6658q2409q8800L002Q2436P0274
782G7608j3563q2506n9655K8395Q0373M2137l9424p4114k2988N3379N8914o236
794D2320n2717l0887J8767M0234J6637k3221l3948o419K4651K9143L007k9419
806a852k8147J0490L2557Q338j9248j3671P267J1133m481j4648J425K2185J1653
819B3001j6093k4473q758J5511L1897J5470k6754m4098p071M3059M5142r497n7986
832b0650l4557L5862O0639Q653n0176n0616L841N8706N3087j7631p5206n0637
844g8685L5496R0876M4832o2875j02522j8464Q6273Q8391p413q9341p2141K4029
$$ plain form
758 -80846 44016 117453 56450 -65911 -107742 -29684 74357 93675 11106 -83950 -83331 14960
770 14960 95257 63537 -41921 -98856 -39882 66447 93105 10696 -78104 -75102 7334 77608
782 77608 64045 -18461 -78116 -49721 30652 72789 33365 -40749 -63737 -10358 48556 42320
794 42320 -10397 -41284 -22517 17717 34354 11133 -22815 -29234 -4583 24560 27567 -1852
806 -1852 -29999 -19509 13048 21386 2138 -11533 -4266 6867 2386 -12262 -10837 11348 23001
819 23001 6908 -17565 -26323 -10812 21085 36555 9801 -34297 -41368 1691 46833 37336 -20650
832 -20650 -55207 -19345 41294 49947 -229 -50845 -47004 11702 64789 47158 -28048 -78685
844 -78685 -43189 47687 92519 29644 -72878 -91342 -5069 83322 75909 -13432 -85573 -61544
856f1544R2406N6424m2590r4366m0540O3420J01718J5899r6055r2223K3314J08939
868C4802O9411m7064j11226m9821O4488J04940L2688p1575j01505k0544Q8539
879f867R6786r848j01486p0563L8952R6996M1415o0138q5490j1914O8350P0306
891F6499j663p3779o8689J8119Q8450N5316m1416q8861l4232N6399P8170R450
903F3763n9654n2769N515M5768L7835p545m3990k8272K0699M2194J1338l2366
915B516l5956P566M1663J9267k5529l0875j491J9927J6968J270j2378j0912K84
928g680O205L811j851l670O011J2461o743k8101j0377K8967L5385k974m0615l1783
942d0954J5475M4520K0819k4670l8670j2977K6189M2620P853m4515m5485J4093
$$ plain form
856 -61544 30862 87286 44696 -49670 -90210 -26790 74928 90827 -5228 -97451 -74137 34802
868 34802 104213 57149 -54077 -103898 -39410 65530 98218 26643 -74862 -95406 -6867
879 -6867 89919 80071 -21415 -91978 -53026 43970 85385 25247 -60243 -72157 -3807 66499
891 66499 64836 -8943 -77632 -59513 28937 84253 42837 -46024 -80256 -23857 54313 63763
903 63763 4109 -48660 -43145 2623 40458 32913 -11077 -39349 -18650 23544 34882 2516
915 2516 -33440 -25874 15789 35056 9527 -21348 -22839 -2912 14056 15326 2948 -7964 -7680
928 -7680 -1475 2336 485 -3185 2826 15287 8544 -19557 -29934 -967 34418 31444 -9171 -40954
942 -40954 -25479 19041 39860 15190 -23480 -36457 -10268 32352 40205 -4310 -49795 -35702
954c5702O2756L5922l9181p3470j9192O3145P0972j779o9674o3685Q522P6761
966A5395O4220k3007q8090n3307M2643R2458L4157o7376q7290l60Q2760O4765
978G6968k3633q4049n1372M0654R0909L8643o0857r5073k4046Q0746R8027j512
990H5405r9430p9520K8800R6065N5906m1426q8771l6327N2719P8715J8279o1424
1002H991p3001J355P8642O0535l2607q3890l5215N1098P6097J6479n9125o5537
1014e6178k028N7079N5347k112n7860n0760J5948O0349L0671l0362m8314r124
1026c7344L5374L2443r401l2343j3133J4374K2803J0022j5033k6474n437K3170
1038i79K2463l594k2907j3157J1240J6472m045j3148M745J4460j339j6818j2519
$$ plain form
954 -35702 27054 62976 23795 -49675 -68867 -5722 65250 63471 -6203 -69888 -61366 15395
966 15395 79615 56608 -31482 -84789 -42146 50312 84469 17093 -70197 -70557 12203 76968
978 76968 53335 -30714 -82086 -41432 49477 88120 27263 -67810 -91856 -11110 86917 85405
990 85405 -14025 -93545 -64745 31320 87226 45800 -42971 -79298 -26579 52136 70415 8991
1002 8991 -64010 -62655 15987 76522 43915 -39975 -75190 -24092 52005 68484 9359 -56178
1014 -56178 -58206 -1127 54220 52108 -5752 -56512 -40564 19785 50456 20094 -28220 -37344
1026 -37344 -1970 30473 21072 -11271 -24404 -10030 12773 22795 7762 -18712 -24149 -979
1038 -979 21484 17890 -5017 -18174 -6934 9538 5493 -7655 -2910 11550 10211 -6607 -19126
1051a9126P384K2726J5011j1526k8745j6745J4401L6734J8928k7746m5809l621
1063c8134M5097L5885j6333m8647k3101L1955M9758P638m3226m7358P1N3233N4108
1076F0946j1495p3552n0396L4749Q1968L5605n3429q0593j5596O6269O7648l733
1088E8391o6022n7439J4378P4455N0252l7183q2792l0789N9646Q3068P370p9812
1100f477p2926J9979Q5128N4265l1429q3214m6821M2821Q6398L2349n7326q2139
1112e9392j3772P1423P1884j3402p8847m6441L4514O9454K6747m3178o4610j3317
1124e8937N3533N9507J48o0789n5664J5468P0237L9817l4886o1672j8747L7877
1136a4108M7520P177l6977l4348K257L1702K5780p343l4294j8101K2122L2038
$$ plain form
1051 -19126 -11742 10984 25995 14469 -14276 -31021 -16620 20114 39042 11296 -34513 -38134
1063 -38134 6963 42848 26515 -22132 -45233 -13278 36480 44118 892 -46466 -46395 6838 60946
1076 60946 49451 -24101 -74497 -39748 42220 77825 24396 -56197 -71793 -5524 62124 58391
1088 58391 -7631 -65070 -50692 23763 74015 36832 -45960 -76749 -17103 65965 73335 -6477
1100 -6477 -79403 -59424 25704 79969 48540 -34674 -81495 -38674 47724 80073 22747 -59392
1112 -59392 -73164 -1741 70143 56741 -22106 -68547 -34033 35421 62168 18990 -45620 -58937
1124 -58937 -5404 54103 54251 -6538 -62202 -46734 23503 63320 28434 -33238 -51985 -14108
1136 -14108 33412 40589 3612 -30736 -28479 3223 29003 21660 -12634 -30735 -8613 23425
1148B3425j90k7793j9171J0719K4231P548j4849j4615J419Q513M725O16m586m059
1162d067N581N262p499j1792K590J8578J3952j3535l1178p215L0507K9570p139
1175B3615l3099k2059J2311L5061J9101k1209l8927j1906L0921M3335L256m8633
1187h233m3990J9095O0906K9581l5723o1256j8444M7037O1445N338n5806n7024
1199e7074L657O5197N6029k2135p7355l9728M3939P4954J9616n8209o8878J118
1211e8869O8523N5857j7252p0890m8066L0042P9221L6960n0520p9829j7354O4529
1223g648P2418k313p3646n7333K2497P0711M0354l0923o8372k9888M4005O7060
1235D6922J1453n5113n8168N600O3450M6005k5887o2592k6008L4033N2920J6094
$$ plain form
1148 23425 23235 -4558 -23729 -13010 11221 18769 3920 -10695 -9276 -763 3962 4578 -8 -4067
1162 -4067 1514 6776 -723 -12515 -9925 8653 22605 9070 -22108 -29323 1184 30754 23615
1175 23615 -9484 -31543 -19232 15829 34930 13721 -25206 -37112 -6191 37144 40400 -8233
1187 -8233 -52223 -33128 27778 57359 21636 -39620 -58064 -11027 50418 55756 -50 -57074
1199 -57074 -53417 11780 67809 45674 -31681 -71409 -27470 47484 67100 8891 -59987 -58869
1211 -58869 9654 65511 48259 -22631 -70697 -40655 38566 75526 25006 -54823 -72177 -7648
1223 -7648 64770 62457 -11189 -68522 -46025 24686 65040 34117 -34255 -64143 -20138 46922
1235 46922 58375 3262 -54906 -49306 14144 60149 34262 -28330 -54338 -20305 32615 48709
1247D8709l7464m8768m945M2058L9921n441m2827l1436J7086M2876J4427k6410
1259G786l0527j098K4061K1025m658k2926j2409R653J7859O628j1168j6280L2
1272a2022J6270P545j0321j0240M766J1125J386j2251r600R285J7433J049j6679
1285b254j5022K779K0477J8354q603l0406j5520K0045L4520Q171l1022l6840M481
1298c0840M2976K9137j8715m3854k1967K6729M8417J3609l8993m9090k476M9708
1310D641M7837j0380o2361m0013L1015O4571K3655m2349o1766j2056N3243N8259
1322E4296l740o0984n0103J7227O8341M2182l6241p2993k3201N1534O6277O273
1334E8868o0113n8961J0263O6421M6054k3401o6363l7613L6353P0113K1359n2476
$$ plain form
1247 48709 11245 -37523 -42468 -410 39511 34070 -8757 -40193 -23107 19769 34196 7786
1259 7786 -22741 -23839 222 21247 16589 -6337 -18746 -9093 8766 15394 4226 -12054 -12022
1272 -12022 4248 11793 1472 -8768 -4002 7123 8509 -3742 -13342 -4057 13376 14425 -2254
1285 -2254 -17276 -14497 5980 24334 15731 -14675 -30195 -10150 24370 32541 1519 -35321 -30840
1298 -30840 12136 41273 22558 -21296 -43263 -16534 31883 45492 6499 -42591 -45067 4641
1310 4641 52478 42098 -20263 -60276 -29261 35310 58965 16616 -45150 -57206 -3963 54296
1322 54296 50556 -10428 -60531 -43304 25037 67219 30978 -42015 -65216 -13682 52595 58868
1334 58868 -1245 -60206 -49943 16478 62532 39131 -27232 -64845 -28492 41621 62980 10504
1346A0504o2572j591N8147N2051j4077o1887l6471K7801N5995K3214l2825n3539
1358c5250j3818M3338M8506k525m7292l6700J4077M7140K4354k5438m0511r022
1370c3141K5691L0675N108k6584k7220L864K8094J8141j0925k5765r576J7669
1382c969K0476l815j7420o880P658R518J305p671n167L672O802q03o613m715M115
1397c507J2095M077j5152j6280Q113K3918R126j7800k5524k311K6690K4014q408
1410A9051k9774j8407J1891L3776J9278k2043m2314j0369L6170M1763k156m7115
1422a0249l8020J9638N3461K4028l0111n0827j6571L7134N2692P855m9232n1083
1434e1285O891N8542M4811k3974o6550k8537M2362O0118J0434m7448n3512o33
$$ plain form
1346 10504 -52068 -53659 4488 56539 42462 -19425 -55896 -28095 27900 51114 18289 -35250
1358 -35250 -49068 -5730 42776 40251 -7041 -43741 -29664 17476 41830 16392 -24119 -33141
1370 -33141 -7450 23225 28333 1749 -25471 -21607 6487 24628 13703 -12062 -21638 -3969
1382 -3969 16507 12692 -4728 -11608 -3950 5568 6873 -798 -5965 -2293 4509 3706 -2907 -7622 -3507
1397 -3507 8588 12665 -2487 -18767 -10654 13264 22390 4590 -20934 -23245 3445 27459 19051
1410 19051 -10723 -29130 -17239 16537 35815 13772 -28542 -38911 -2741 39022 36866 -10249
1422 -10249 -48269 -28631 24830 48858 18747 -32080 -48651 -11517 41175 49030 -202 -51285
1434 -51285 -44394 14148 58959 34985 -31565 -60102 -17740 42378 52812 5364 -48148 -48781
1446d8781N4355M8957j2319o0179m1975K5390O7653L0482m5262o5169q586N3524
1458a910N2252n086n4338m2358J6072N4195L1992k4030n4918k4568L7398N7018
1470D1719N427m9926m3291J1682M9289K9423k0945m4484j7867K3826L7646J2969
1482C5468k5168l8430n645L4707L1132r017l4618j6716J7842K7622L413k1064
1494d74j5181M598J3145R733j565j3799j0527P893J4718L232j2608j0007O229
1507d613J3185j254j5069j751J5264P645j0738j4144p07J2730J3622o36j5612
1520b078j4870L72J9991K1673o185l3264j8202K3909L5478K157l3082k8569R842
1533b2828L6879J9834j7738l5352j7200K1077M2838J7030l6666n0739j771N1823
$$ plain form
1446 -48781 5574 54531 42212 -17967 -59942 -34552 33101 63583 18321 -46848 -55434 -1910
1458 -1910 50342 45256 -9082 -51440 -35368 18827 50819 26789 -28129 -52697 -15299 41719
1470 41719 47146 -2780 -46071 -34389 14900 44323 23378 -21106 -38973 -15147 22499 35468
1482 35468 10300 -28130 -33775 932 32064 23047 -11571 -28287 -10445 17177 20590 -474
1494 -474 -15655 -11057 2088 11821 10256 -3543 -14070 -6177 8541 11773 -835 -10842 -4613
1507 -4613 8572 7318 -7751 -9502 5762 13407 2669 -11475 -12182 548 14170 13534 -2078
1520 -2078 -16948 -16576 3415 25088 18903 -14361 -32563 -8654 26824 28981 -4101 -32670 -22828
1533 -22828 14051 33885 16147 -19205 -36405 -15328 27510 44540 7874 -42865 -44636 7187
1545G187M4431j5721n7312l1342L0439N2913J5697l3574m6096j1621L8537N0029
1557D3567O86n3065m4986J8006O2588L2880l9075o2723j1443M9153M9634j52m6663
1570a593m5254L879N1918M2973j4819n7777l4589L0781O0280J4691m6717m6353
1582d2580O843M5364K9899j3275m0966k4477J8391M1999K0438k5611m6551j2878
1594d3404L9626M3544o619m3024k4697J5787L1856J3001j5001k2790p365J1311
1606g775J9229P143j5818k1570L534K5501J0525j8067j9513M032J8479Q003j0321
1619C382j0188K257M946k25K84K040k350r17M292l78r463n866J1146J8670k64
1634A7366k6145j8740J6660L0776M573k3098k1316R99K0076J8746k154k2380j9835
$$ plain form
1545 7187 51618 35897 -21415 -52757 -22318 30595 46292 12718 -33378 -44999 -6462 43567
1557 43567 44253 -8812 -53798 -35792 26796 59676 20601 -42122 -53565 -4412 45222 45070 -1593
1570 -1593 -46847 -42968 8950 51923 37104 -20673 -55262 -24481 35799 50490 3773 -42580
1582 -42580 -35737 9627 39526 26251 -14715 -39192 -20801 21198 41636 16025 -30526 -43404
1594 -43404 -3778 39766 33147 -9877 -34574 -18787 13069 26070 11069 -11721 -19086 -7775
1606 -7775 11454 18597 2779 -18791 -15257 10244 20769 2702 -16811 -12779 5700 13703 3382
1619 3382 -6806 -4549 397 172 456 2496 146 -771 3521 3143 -6320 -12186 -1040 17630 17366
1634 17366 -8779 -27519 -10859 19917 24490 1392 -19924 -18925 1151 19897 17743 -4637 -24472
1647b4472O651L1404K0916k3023m2937n602M2232L6765j3609m5287k5846K1269
1659b1539M3491K0084k3533m3056j9738K7519N1010J3542m5177m9048Q338N3681
1671A5574L2576k5512n0834j5529L4918M2367N213l5179m1957l759M5649M7449
1683E0976j0697n9552l7981K8974O1072K0677m0763n0588l108L9379L5620j211
1695C2798l5254l3377O414M2459K8815k1814m7529j4835L7506M3440m756m4455
1707a0588k7228J6121L4955J8485j2592l1164j9187J4039L2923J4873k0787l2347
1719b2497k348K8836J9573j4457k1721j034J4677R533l245r656o585J810Q407
1732A293R353j402j3849j0214J0721J5264l336j3768m72J1046L053j1597r384
$$ plain form
1647 -24472 -17821 13583 34499 11476 -31461 -37063 5169 41934 28325 -16962 -42808 -21539
1659 -21539 21952 42036 18503 -24553 -44291 -16772 34238 47780 2603 -46445 -38107 15574
1671 15574 48150 22638 -28196 -43725 -8807 33560 38773 3594 -38363 -42122 3527 50976
1683 50976 40279 -19273 -57254 -28280 32792 53469 12706 -37882 -40990 -1611 34009 32798
1695 32798 -2456 -35833 -29419 13040 41855 20041 -27488 -42323 -4817 38623 33867 -10588
1707 -10588 -37816 -21695 13260 31745 19153 -12011 -31198 -17159 15764 30637 9850 -22497
1719 -22497 -24845 3991 23564 9107 -12614 -13648 1029 10562 7317 -2339 -8924 -7114 1293
1732 1293 10646 9244 -4605 -14819 -4098 11166 7830 -5938 -6410 4636 7689 -3908 -13292
1745a3292R501J6292J001j4684j1198j15R517J5130O770j4999k4241j377K6066
1758D371K2844j0821l3492j1237K5890K7792n401k7512j8391R451K7939J8834
1770C0267j2683l6233j9610K2710M5707J4629l9534m7955L730M8414L3809j6261
1782B6990m2806k2851J9204L9690J7263k3828m0537j2951L5471M4895l209n1610
1794a4279l5041K4523N2741J9396l3803m6965r128L5749M1000N145l5232m1990
1806c7884j363M5515L8562j5794m9411k1715K9323M1557M632l4278k9906O895
1818b3867L0980K2025p568l2046k4368J5135M0029J7365k7509l7927m683L2790
1830C56K8188q231k7447j3308R185J6381R595n646j6123p717J1003J5996L0j7002
$$ plain form
1745 -13292 -3791 12501 13502 -1182 -12380 -12495 -2978 12152 18922 3923 -20318 -21695 4371
1758 4371 27215 16394 -17098 -28335 -2445 25347 19946 -7566 -25957 -16506 11433 30267
1770 30267 17584 -18649 -38259 -15549 30158 44787 5253 -42702 -38972 9442 43251 26990
1782 26990 -15816 -38667 -19463 20227 37490 13662 -26875 -39826 -4355 40540 37331 -14279
1794 -14279 -49320 -24797 27944 47340 13537 -33428 -42556 -6807 34193 39338 4106 -37884
1806 -37884 -39247 6268 44830 29036 -20375 -42090 -12767 28790 33422 -856 -30762 -23867
1818 -23867 7113 29138 21570 -10476 -34844 -19709 20320 37685 10176 -27751 -32434 356
1830 356 28544 20313 -7134 -20442 -11257 5124 14719 9073 -7050 -14767 -3764 12232 12262 -4740
1844d740j1652J1130J8673n49j7085p624P990Q457l1l772k379P00J033l30l30
1859e09j626n46O358P709p336j8456k238K0737J8241q725k4892j1894J5765K3093
1873A5681L054j6209j7100k473J5932K0514o80k6106k0330J3702L3744J2569k7264
1886E034l5996N19L6779K8191j0245l5614k3310J1351L7229K4582j8709m2406
1898b2595j7817K8871M3558N511m0755l5940J2633M2535K1479k0862l8453j4982
1910c6817K5808M0350Q631l3761m0798j465M3805L9129j3314n0059k5722K5719
1922a8494M2730J3550k7736l6580n403K9218L0606m94l1854k7914R671L8892J9602
1935C5794k4698l6539n125K9479K9043l523k9573k1452P327K5792J7711p007k6315
$$ plain form
1844 -4740 -16392 -5262 13411 12862 -4223 -11847 -3857 4600 4569 797 -1582 -882 151 -179 -509
1859 -509 -2135 -2681 3677 11386 4050 -14406 -16644 4093 22334 13609 -11283 -23177 -7412 15681
1873 15681 18735 2526 -14574 -17047 -1115 19399 18719 -7387 -27717 -14015 19729 32298 5034
1886 5034 -30962 -30443 6336 34527 24282 -11332 -34642 -23291 13938 38520 19811 -22595
1898 -22595 -40412 -11541 32017 37528 -3227 -39167 -26534 16001 37480 16618 -21835 -36817
1910 -36817 -11009 29341 37972 4211 -36587 -38052 5753 44882 31568 -18491 -44213 -18494
1922 -18494 24236 37786 10050 -26530 -31933 -2715 27891 27397 -4457 -32371 -22700 16192 35794
1935 35794 11096 -25443 -30568 -1089 27954 24431 -5142 -26594 -19267 6525 24236 17229 -9086
1948i086j5952J4172K6289M971j9251j7635M759J7468Q193j0341j2175L55Q429
1961A96O830K63p709q473K077J0381N410n953q888K84Q510L219q647n229Q039
1976C10R056l445j1574n942O275J3590N669r217j5545n290J1956J8789M200j9555
1990g23k1574N987K6452J3734j5026k5570o132K1424K4379k134k5535k1271O058
2003a9931K9702K2781j3985l7858j6940K5196L8496P359l2410l5101L179L6259
2015F747K6930j1087l4893k1498J5637L8117J6218k6717l8569n388L5111L5702
2027C6310o698m2125k6799J8377M0589J7785k2620l8643j2682K8260L7204M375
2039C3333l3106l2892M771L7131K5898j6665l6808j2405K2742L0032M806k5563
$$ plain form
1948 -9086 -25038 -10866 15423 20394 1143 -16492 -11733 5735 13928 3587 -8588 -8233 196
1961 196 7026 7289 -420 -8893 -6816 3565 8975 3022 -5866 -5582 2928 6147 -2500 -7729 310
1976 310 9366 5921 -5653 -11595 -5320 8270 13939 4722 -10823 -16113 -4157 14632 18832 -723
1990 -723 -22297 -16310 10142 23876 8850 -16720 -22852 -1428 22951 20817 -4718 -25989 -19931
2003 -19931 9771 32552 18567 -19291 -36231 -11035 27461 34820 2410 -32691 -29512 6747
2015 6747 33677 22590 -12303 -33801 -18164 19953 36171 9454 -29115 -34503 608 36310
2027 36310 29612 -12513 -39312 -20935 19654 37439 14819 -23824 -36506 -8246 28958 33333
2039 33333 227 -32665 -27894 9237 35135 18470 -18338 -30743 -8001 22031 26837 1274
2051A274k6509K194K8294K1509p900k9167j7948J4738L0773Q788k1261k3504o04
2064a9323J9645J6916l694j8134j0435P285J4202O105q188j3820j898J2832R968
2077A1461o047j2061k586Q252Q345j883q187k474M593L573j287l200j970L349
2091a22N569o00q690n221N508J2384L988j1417j5978Q71J8601J3007p775j8616
2105h491r394J0893J9927N875j6127k0278n82K0812J9954n935k7970j6593J7387
2118a0522L0502P776k3282k9241k081K8660K7031n364l1549k2854J0267L4427
2130A3770K0375j9840l7108r932K7697L3143O26l2862k8294R692L5661K0469j6832
2143A6565l5402j5620K3239L8028P698l2172l4634K230L5679K8564j1113l6452
$$ plain form
2051 1274 -25235 -23041 5253 26762 18862 -10305 -28253 -13515 17258 26046 4785 -18719 -19323
2064 -19323 322 17238 13544 -4590 -15025 -7740 6462 12567 4379 -9441 -11339 1493 11461
2077 11461 5414 -6647 -9233 -981 7364 5481 -2706 -5180 -587 2986 1699 -1501 -3471 -122
2091 -122 5447 4847 -3843 -9064 -3556 8828 12816 1399 -14579 -13708 4893 17900 10125 -8491
2105 -8491 -17885 -6992 12935 18810 2683 -17595 -18177 2635 22589 16654 -11316 -27909 -10522
2118 -10522 19980 27756 4474 -24767 -26848 1812 28843 23479 -8070 -30924 -20657 13770
2130 13770 34145 14305 -22803 -32735 -5038 28105 28731 -4131 -32425 -22733 12928 33397 16565
2143 16565 -18837 -34457 -11218 26810 34508 2336 -32298 -30068 5611 34175 23062 -13390
2155a3390j9641J8944L2451J0765k0986k9991n042K6198K6347l883k8799k0485
2167b7512J1383L0146J3420j9415k6703m496K0571K1950N33k0873j9329M403K1371
2180E449J3701q009j9629q422J2142J7251j012j3738q513N228J0384M038o702
2193B168q736L75P046N156j728o204m314L911O851m59o876j542N633M547l671
2208B157q222j932R530Q913l349j1743p385M671J3756Q924q664j8106n690J4627
2222b513J8781M30k0312j6846Q242K3665R981j5496k2011m386J8614K3113j60
2235B1102k5420k1427O492K9215J9587j3704l3691j3071K2795L0902M985k5665
2247B100k7583P75K9058K3520q068l0781j9326J5395L3830J3121k5690l3992j062
$$ plain form
2155 -13390 -33031 -14087 18364 29129 8143 -21848 -26890 -692 25655 21772 -7027 -27512
2167 -27512 -16129 14017 27437 8022 -18681 -23177 -2606 19344 19877 -996 -20325 -15922 5449
2180 5449 19150 11141 -8488 -16910 -4768 12483 11471 -2267 -10780 -5552 4832 8870 2168
2193 2168 -6568 -6193 853 6009 4281 -1923 -6237 -2326 4525 4066 -2810 -4352 1281 5828 2157
2208 2157 -6065 -7997 1533 10446 7097 -4646 -12031 -7360 6396 15320 6656 -11450 -17140 -2513
2222 -2513 16268 16698 -3614 -20460 -12218 11447 21428 5932 -16079 -20465 -1851 21262 21102
2235 21102 -4318 -25745 -19253 9962 29549 15845 -17846 -30917 -8122 22780 27765 2100
2247 2100 -25483 -24708 4350 27870 19802 -10979 -30305 -14910 18920 32041 6351 -27641 -28703
2260b8703L1758K7908p165l4020k2213J3905L4301J5734j8806l2009j0965K3461
2272f814L1516J564k8674k3867O874K8533J6698j3491k7264q701J8316K2971L213
2285B0874j9591k1979R38K4421J8920q720k4794j2096J2641K2752N078j5832j5985
2298a3373J049J3045J0088k780j1529p124O561J0622J840q131q445J906J0286
2311D015M757p265p633J641N541K800k109l608k35L078J793k906l543K00M942
2326A468O145j968j1383o961R010J4696K699j3387j5012J843J7176J2262p454
2339I134j7327p843R659J8784N557j6842j9720J669K2954J6939r450k7133j1983
2352b5602J7608K7230N135k1099k4616k373K3856K5106l341k7756k1240Q937L1056
$$ plain form
2260 -28703 3055 30963 23798 -10222 -32435 -18530 15771 31505 12699 -19310 -30275 -6814
2272 -6814 24702 26266 -2408 -26275 -19401 9132 25830 12339 -14925 -23626 -5310 17661 20874
2285 20874 1283 -20696 -19758 4663 23583 14863 -9931 -22027 -9386 13366 18444 2612 -13373
2298 -13373 -12324 721 10809 8029 -3500 -10624 -4063 6559 8399 268 -8177 -6271 4015
2311 4015 8772 1507 -6126 -4485 1056 3856 1747 -1861 -2096 982 2775 -131 -3674 -3474 1468
2326 1468 7613 5645 -5738 -12699 -3689 11007 13706 319 -14693 -12850 4326 16588 9134
2339 9134 -8193 -16036 -6377 12407 17964 1122 -18598 -16929 6025 22964 13514 -13619 -25602
2352 -25602 -7994 19236 24371 3272 -21344 -23717 139 25245 21904 -5852 -27092 -18155 12901
2365A2901J6062j7632l1630o594K5061K6385j914k7381k2734Q171L0995J8249
2377B9939j5940l2019j2601K1844L2930N029k8365k8252M370K8722K0458q907
2389A7208k6778j5174J3205K5216Q650j6219k3571l848K1817K1558n235k5089
2401h260j4466J1596K3836R262j5514k1843l180J6268J7268P88j6536j4749L702
2414a1828J6925Q922q841j2830j891R817Q419l834r202j904N316N363O84m640
2428D76n550L44O243L558k784m901j154M106L574l325o003K225Q249K222p057
2443B23q155m10R636J0158k335j3275r424M940J5202R776r591j8716m310J6151
2457a30J6427l410j8616j2570R456K0254P369j4734j9409l322J7623K0948K0k4021
$$ plain form
2365 12901 28963 11331 -20299 -26893 -1832 24553 22639 -4742 -27476 -19305 11690 29939
2377 29939 13999 -18020 -30621 -8777 24153 29182 817 -27435 -23065 5657 26115 17208
2389 17208 -9570 -24744 -11539 13677 22327 6108 -17463 -21311 506 22064 16829 -8260
2401 -8260 -22726 -11130 12706 21968 6454 -15389 -18569 -2301 14967 15755 -781 -15530 -11828
2414 -11828 5097 14019 5178 -7652 -9543 274 8693 4859 -4343 -6247 -931 4432 5116 476
2428 476 -5074 -4730 1513 5071 2287 -2614 -3768 338 3912 587 -5416 -3191 5058 7280 223
2443 223 -7932 -8342 1294 11452 9117 -4158 -13582 -8642 6560 16336 6745 -11971 -16281 -130
2457 -130 16297 12887 -5729 -18299 -8843 11411 18780 4046 -15363 -18685 -1062 19886 19906 -4115
2471d115k0626P208K7327J6268j2462k8404j1272J8915K6260M116k1700k2603
2483b1088QK5352K1026q780k9201j4825J7076L0201P455k4500k7929J919K7829
2496D543K1528o982k7579j7981J1432K7851J2977j5556k5766p893J8765K4290
2508A9629Mk3117j7401P494K1704J1727j0769k1666p270J5253K0019K874j8097
2521C84j8731J923K1292J4339q781j9315o984J0771J4227K449j0427r846J616
2534g083Q284N758k807p520l669N846P660j001p715m002L950O051J282n201l643
2549c810J721L920j29j702j876L89M103K188m985o835N51R411P826m141j4657
2564h026o117J1039J5504L16j4028j2267K740J5340J0617p380j6834o472J1454
$$ plain form
2471 -4115 -24741 -17533 9794 26062 13600 -14804 -26076 -7161 19099 23215 1515 -21088
2483 -21088 -21080 4272 25298 16518 -12683 -27508 -10432 19769 27224 2724 -25205 -23286 4543
2496 4543 26071 19089 -8490 -26471 -15039 12812 25789 10233 -15533 -23426 -4661 19629
2508 19629 19633 -3484 -20885 -13391 8313 20040 9271 -12395 -19665 -4412 15607 18481 384
2521 384 -18347 -16424 4868 19207 10426 -8889 -15873 -5102 9125 11574 1147 -8699 -7083
2534 -7083 1201 6959 4152 -3368 -7037 -1191 6469 5468 -2247 -6249 -2299 3752 5034 -167 -3810
2549 -3810 -2089 1831 1702 0 -1876 -1487 2616 4804 -181 -7016 -6465 2946 10772 6631 -8026
2564 -8026 -14143 -3104 12400 12716 -1312 -13579 -10839 4501 15118 7738 -9096 -15568 -4114
2577d114J7466L027j7453j7588M174K2078J3634j0532k2577r868J3930K3475O486
2590B2138j7496k2570l606K0400K3038j786k6388j8332J0638K6845J1515j6935
2602G461k6023l761K2688K1642l321k3791j8875P612K6809J5889j4669k7704r181
2615b5224J9146K5350L336k2377k1000L409K1735J4688n731k0580j2831J0674
2627i405K1447P084j4989k0264j017J9752J6638o624k1070r776J0431J8056N814
2640A6077j1355j6015k464J2413J2618p48j2251r336M746J1451L519p966o864
2653f175J711N948L708k939n357j229L532L923M69k894m073l0N307K438m284m227
2669d172K736N397P1n919n088M001R761K150q361r033l41R741J0328j844j3667
$$ plain form
2577 -4114 13352 16379 -1074 -18662 -14488 7590 21224 10692 -11885 -21753 -7823 15652 22138
2590 22138 4642 -17928 -21534 -1134 21904 20118 -6270 -24602 -13964 12881 24396 7461
2602 7461 -18562 -22323 365 22007 18686 -5105 -23980 -16368 10441 26330 11661 -16043 -25224
2615 -25224 -6078 19272 22608 231 -20769 -17360 4375 19063 13332 -7248 -20079 -9405
2627 -9405 12042 19126 4137 -16127 -17144 2608 19246 12622 -8448 -18224 -7793 10263 16077
2640 16077 4722 -11293 -13757 -1344 11274 10526 -1725 -11061 -6315 5136 8655 689 -6175
2653 -6175 -4464 1484 5192 2253 -3104 -4333 -801 3122 3591 697 -3376 -3406 1901 4339 55 -4172
2669 -4172 -1436 3961 4032 -1887 -6975 -2974 6787 8937 576 -8457 -8798 943 11271 9427 -4240
2684d240r296O000J5809O426j1084j6272p30J6216J2530n522j6722q557Q071J7505
2698A0134P146j2204j9452l852J6532J9888M51k1891j9311P300K4439J3020j1801
2711A0399k3569q946J6445K2634L168j9774k0208K247K2998J8081r881k7050j0604
2724b4060J7597K4202M024k0174k1418J339K1435J7441m794k1124j5430P798K3255
2737A0091J1328j3749k1634m889J6862J8427j220j8977j3759O854J8049R275q883
2750G775j8031o611J3450J7416M98j5530j3771M024J5579Q582p643j2863k189
2763i314P301P845O95n968o258R34O549M052l307n993j719N192N145k186o088
2778c120j083M118K897q75l234j866K864L727j473m089k829L482O642K168p996
$$ plain form
2684 -4240 -13536 -7536 8273 14699 3615 -12657 -13387 2829 15359 9837 -6885 -15442 -7371 10134
2698 10134 17280 5076 -14376 -18228 -1696 18192 18643 -3248 -22559 -15259 9180 22200 10399
2711 10399 -13170 -22116 -5671 16963 20131 357 -19851 -17604 5394 23475 13594 -13456 -24060
2724 -24060 -6463 17739 21763 1589 -19829 -18490 2945 20386 15592 -5532 -20962 -13164 10091
2737 10091 21419 7670 -13964 -18853 -1991 16436 15216 -3761 -17520 -10666 7383 16658 7775
2750 7775 -10256 -16867 -3417 13999 14497 -1033 -14804 -10780 4799 13381 5738 -7125 -9314
2763 -9314 -2013 5832 6527 559 -5699 -4765 1784 5836 2529 -3464 -5183 9 5154 2968 -3120
2778 -3120 -4203 -85 2812 1937 -1297 -3163 -299 3428 1955 -2134 -4963 -1481 5161 7329 -667
2793f67r308K693J2594O681p454j3263l614J1267J2935j688j2729r182L111J3022
2807D398R427o939j6478n461J2131J6172J552j5612j6132L612J9649J2100q267
2820A0152j9298j0055J0942K1032P371j5862k1392k080K0242J9190m150k3957
2832g865j4650J2683K2836O977j5342k0564k958J8832J8971k655k0485j5850O145
2845a3925K2615J3293j2624k2779o449J5922J9241J836j6929j6279J708J7776
2857C406J3231n894j7942j0321J0416J9257M403j5430j5787K222J5919J1147n805
2870H822j5445o473P882J2359L800p515j1205j843R643Q774k497r225m281L926
2884c278P627J083n435m832K372L553K054j264l763j860L022M177j023m137j971
$$ plain form
2793 -667 -9975 -7282 5312 11993 4539 -8724 -12338 -1071 11864 10176 -2553 -11735 -8624 4398
2807 4398 13825 6886 -9592 -15053 -2922 13250 14802 -810 -16942 -13330 6319 18419 10152
2820 10152 -9146 -19201 -8259 12773 20144 4282 -17110 -19190 1052 20242 16092 -7865
2832 -7865 -22515 -9832 13004 19981 4639 -15925 -18883 -51 18920 16265 -4220 -20070 -13925
2845 -13925 8690 21983 9359 -13420 -19869 -3947 15294 17130 201 -16078 -14370 3406
2857 3406 16637 10743 -7199 -17520 -7104 12153 16556 1126 -14661 -12439 3480 14627 8822
2870 8822 -6623 -13096 -5214 7145 10945 3430 -7775 -9618 25 8799 6302 -2923 -7204 -3278
2884 -3278 4349 5432 -3 -4835 -2463 1090 3144 1880 -1883 -3743 -721 3456 2433 -1704 -3675
2899c675L229M497j035o395k075O283O237l133q076l509N012R166K045q170r025
2914h624L37J0045R244k685j3595q178Q395J4555L208j1623j2851L43J4000J1453
2928A4024m788j4992r016O658J6574Q795j1769j9191l909J6956J7850j234j9883
2941c925j5665P360K1011J0121j1240j9410o914J4372J9834K029j8579j7048L903
2954a4151K0238J3751r372k1869q031J4156J8954L057j4336j7159p56J6623J5837
2967A6942l452j8313j3069P385J9762Q416j3003j7662j299J4505J3493k318j5081
2980c694j0383N637J4710P332q289j3852m535J1436J2807j275j2032p859M134
2993e863R347M557m486p643j824M962M799J056m802n097J159O649J941m354m529
$$ plain form
2899 -3675 -446 4051 3016 -3379 -5454 829 7066 3933 -4143 -7652 -2640 6526 8571 401 -8624
2914 -8624 -8287 1758 11002 8317 -5278 -13456 -5061 9494 12702 1079 -11772 -11429 2571 14024
2928 14024 9236 -5756 -14772 -8114 8460 17255 5486 -13705 -17614 -658 17192 15958 -3925
2941 -3925 -19590 -12230 8781 18902 7662 -11748 -18662 -4290 15544 17573 -1006 -18054 -14151
2954 -14151 6087 19838 10466 -11403 -19434 -5278 13676 16733 2397 -14762 -15518 1105 16942
2967 16942 13490 -4823 -17892 -10507 9255 17671 4668 -12994 -14293 212 13705 11387 -3694
2980 -3694 -14077 -8440 6270 13602 5313 -8539 -13074 -1638 11169 9894 -2138 -9997 -5863
2993 -5863 3484 8041 3555 -4088 -5912 -950 3849 4905 103 -4994 -3835 2814 4755 401 -4128
3008d128J282M517K342l328m622J884M129P83k792k798r1M137L569k318o836k368
3024f638O123P644K72r578q372M694J1965M816q194j0790j384R121R749l32j1100
3039b004q645K827J2414Q883p000j5597n622J2422J5685q0j4615j3692L085J7020
3053E081J1782p323j7693q790R689J9155O312j5601j8936J086J8635J4272o392
3066A1277j8918j0016J0298J8236N074j2661j6350k557J5130J7027j977j8779
3078d216j3406O569J9055J0088j0798j8473m145J2606J4647J141j2733j3627J789
3091a1503J5437J0666o761j5678o431J0555J4871J455j3567j1200L740J1403P135
3104A0122l796j0289n589M951R585L437n835q501j254P807O210l382p019r59M461
$$ plain form
3008 -4128 -2846 1671 4013 685 -3937 -2053 2076 2859 67 -2731 -2822 1315 4884 2566 -4270 -6638
3024 -6638 -515 7129 7401 -2177 -10549 -5855 6110 10926 2732 -8058 -9442 -321 9428 9096 -2004
3039 -2004 -10649 -7822 4592 13475 6475 -9122 -14744 -2322 13363 13283 -1332 -15024 -11939 5081
3053 5081 16863 9540 -8153 -16943 -7254 11901 18213 2612 -16324 -15238 3397 17669 11277
3066 11277 -7641 -17657 -7359 10877 15951 3290 -13060 -15617 -487 16540 14563 -4216
3078 -4216 -17622 -11053 8002 18090 7292 -11181 -15326 -2720 11927 13068 335 -13292 -11503
3091 -11503 3934 14600 7839 -7839 -14270 -3715 11156 12611 -956 -12156 -8416 2987 10122
3104 10122 6326 -3963 -9552 -4601 4984 8421 2586 -5915 -7169 638 6848 3466 -3553 -4512 -51
3119e1L283n52l442k881J907L576J026j966l322r22M180L557l578n104J547N982
3135C240J591m779n655Q81Q479L797m969q063j955N213Q341K737p869r665j49
3150h825J0842Q583l559j2538o349Q278J2857J069j0306j0239N57J1970J0257
3163A2597l547j4699r031O977J6750P611j1772j8747k158J6767J4965l523j6173
3176c983j1360N750J6658Q500r246j6165n646J2241J6812J355j7187j4339N549
3189a1061J7818J0096r039j7616o394J1676J5832L259j2026j5272j701J5236J4120
3202A4928l787j6637r270Q332J5086L902j0977j1985Q51J1037Q880k483j0730
3215b853q516M869J2540N780p859j1850k329R579R196j540q920m243K914N144
$$ plain form
3119 -51 3232 2680 -762 -3643 -1736 1840 2866 900 -2422 -3344 836 4393 815 -4289 -2742 3240
3135 3240 4831 52 -5603 -4722 3757 7554 2585 -5478 -7433 -2220 6121 8858 989 -8676 -8825
3150 -8825 2017 10600 7041 -5497 -11846 -3568 9289 10358 52 -10187 -9630 2340 12597
3163 12597 9050 -5649 -14680 -7703 9047 16658 4886 -13861 -16019 748 15713 12190 -3983
3176 -3983 -15343 -9593 7065 15565 6319 -9846 -15492 -3251 13561 14916 -2271 -16610 -11061
3189 -11061 6757 16853 7814 -9802 -16196 -4520 11312 14571 2545 -12727 -14428 808 14928
3202 14928 11141 -5496 -14766 -6434 8652 12554 1577 -10408 -9557 1480 10360 7877 -2853
3215 -2853 -11369 -6500 6040 11820 3961 -7889 -10218 -639 8557 7017 -1903 -6146 -3232 1912
3229A912K504j882m984j735L532M432p14m897k878L495N866r01n881k615M008
3244g38L528p33l216j166J794L032n01k833k720J669L987L598l375q783j270Q036
3260C09Q565j697j0425o627N040J0600L126o638q590j674O713R451J020j0735
3274a562r468L543J3764P111q923j4892l160J3132J3507j686j3310j1463K902
3287a0505J4357J1335n866j6940q042R559J6771M589j4419j4764K133J6195R634
3300A4037o055j5075p413Q538J5511N161j1430j5538k327J4476J5768k382j7994
3313d723j0866P097J5300O793q481j3654l530J0066J1438N86j0406j0576K162
3326h794J3167Q309p930j3073k715J0044J0303n03r881p835K154Q374N843j642
$$ plain form
3229 1912 4416 2534 -2450 -4185 -653 3779 3065 -1832 -4710 -1215 4651 3750 -2131 -4746 -738
3244 -738 2790 2057 -1159 -2325 -531 2501 2000 -833 -3553 -1884 2103 5701 2326 -6457 -7727 309
3260 309 8874 7177 -3248 -9875 -4835 5765 8891 2253 -6337 -8011 -1298 8153 9173 -1562
3274 -1562 -11030 -7487 6277 13388 4465 -10427 -13587 -455 13052 11366 -1944 -13407 -10505
3287 -10505 3852 15187 9321 -7619 -15661 -6102 10669 15258 839 -13925 -11792 4403 14037
3300 14037 7982 -7093 -14506 -5968 9543 14704 3274 -12264 -14591 -115 15653 13271 -4723
3313 -4723 -15589 -8492 6808 13601 5120 -8534 -12064 -1998 9440 10026 -380 -10956 -8794
3326 -8794 4373 12682 4752 -8321 -11036 -992 9311 8808 -1073 -8908 -6754 1620 7463 5821
3340E821p818n688L399Q794J541n487n582J600N777J936m095m028J804L614Q56
3355B444j121k795j462J864L616J96l362k650J710L879P84n057k959M186O286
3370E559j633o304l901K839O699L753m010p601l110M653R026K935p513j0305P87
3385h126J0797P341m960j0790m413P855J0595P37r287r394N48J1200J0153k679
3399I577j5496q914Q533J6120N069j1769j5108j037J4046J1158k242j2949r305
3412a2317L985J4007P835q066j5517l498J2709J3946q85j5517j1308N570J5452
3425F396P563p572j3847o113Q501J4319L683j1303j2669j9J3072J0390n051j3554
3439f204m432P702J0353J372p925r084K00R165P667j936r704p118M425J1307L703
$$ plain form
3340 5821 -1997 -7685 -4286 4508 6049 562 -5020 -3420 2357 4293 198 -3830 -2026 1588 2444
3355 2444 1323 -1472 -2934 -1070 2546 2742 -620 -3270 -1560 2319 3103 -1954 -4913 -727 5559
3370 5559 3926 -2378 -6279 -3440 3259 7012 3002 -4599 -7709 -3056 5970 8905 1392 -8913 -8126
3385 -8126 2671 10012 5052 -5738 -10151 -2296 8299 9036 -251 -9645 -9097 2103 12256 9577
3399 9577 -5919 -14833 -6300 9820 14889 3120 -11988 -13025 1021 12179 9937 -3012 -12317
3412 -12317 -8332 5675 13510 5444 -10073 -13571 -862 13084 12199 -3318 -14626 -9056 6396
3425 6396 13959 6387 -7460 -13573 -5072 9247 12930 1627 -11042 -11061 2011 12401 7350 -6204
3439 -6204 -10636 -2934 7419 8791 866 -8218 -8018 1147 8814 6878 -2826 -9944 -5519 5788 9491
3454I491p464q533L93O017N406j175n585k856K714L309J745k366m039k97M449
3469A209L078k978m386k9L872K817k180l810q8L359J619k206k252m57K430L358
3485C356l92m592l643K565O870K426m802q266j069Q814O950k710q871m665L939
3500d090Q591M104o163q879j647P568R387p31j1151q540N329J3717M484q536j2936
3515i493k119J0551J1849l51j1703j0713K391J3408R317n472j5052o027R959J3500
3529A0045J749j1929j1356J764J3561Q361m846j3172o996P191J4290M599j0651
3542B610j3664q38J2593J1578k343j3938q246O243J1732M759o327j1245k714Q487
3556a313J0359p83j0139p611L437J0569N202o903r539j700P453P229L76p144o154
$$ plain form
3454 9491 2027 -6506 -6113 -96 5310 4135 -1450 -4306 -1592 1717 3462 1096 -2943 -3240 1209
3469 1209 4287 1309 -3077 -3106 766 3583 1403 -2407 -2495 864 2483 277 -1975 -2432 -2 3356
3485 3356 2964 -1628 -5271 -2706 4164 6590 1788 -6478 -7547 1267 8217 5507 -3364 -8029 -4090
3500 -4090 4501 8605 2442 -6437 -8084 -516 8871 8140 -3011 -11551 -6222 7495 11979 3443 -9493
3515 -9493 -11612 -1061 10788 10437 -1266 -11979 -9588 3820 13137 7665 -7387 -13414 -3455 10045
3529 10045 11794 -135 -11491 -9727 3834 12195 7349 -5823 -12819 -5628 8662 13261 2610
3542 2610 -11054 -11892 701 12279 9936 -4002 -12248 -6005 5727 10486 4159 -7086 -9800 -1313
3556 -1313 9046 8263 -1876 -9487 -6050 4519 9721 2818 -6721 -8421 -968 6261 6637 -507 -6661
3571f661J511O842M218k392o289k588M211N203o14n023j793K312L554j05k517
3586a31k204R65K763Q95k070j857m31K435K593j754l650l12L796L020k197n116
3602c255j856M550N878r72n759m464J596O638N196l919q377l070O103Q053J215
3617G557p795q291K010J0042N697n180r482m084P121J0500J367r575r684P76J1291
3632B270R381l747j3508p037Q168J2779L085r185j1885o87J1145J0435k579j2185
3646c550q060M956J2906O242q773j3320j705J0708J1126n74j2106r339L847J2658
3660E016O396n944j1960m769P873J1754J599j0017r236J634J0097P207m249j0265
3674d864l901O020Q774J931o961q081J58P938O687k565q260l946L844P555J923
$$ plain form
3571 -6661 -5150 1692 5910 3518 -2771 -5359 -1148 4055 3441 -1582 -3375 -1063 2491 2386 -131
3586 -131 -2335 -1370 1393 2288 218 -1639 -2070 365 2958 1204 -2446 -2758 1038 4058 1861 -3255
3602 -3255 -5111 -561 5317 4345 -1414 -5878 -4282 2356 7552 3633 -4744 -7814 -1711 6342 7557
3617 7557 -238 -8529 -6519 3523 9220 4040 -5442 -9526 -2405 8095 9462 -113 -9797 -9021 2270
3632 2270 11651 7904 -5604 -12641 -4473 8306 11391 2206 -9679 -10366 779 11214 8635 -3550
3646 -3550 -11610 -6654 6252 12494 3721 -9599 -11304 -596 10530 9956 -2150 -11489 -7642 5016
3660 5016 11412 5468 -6492 -11261 -3388 8366 9965 -52 -9288 -7654 2443 9650 5401 -4864
3674 -4864 -8765 -2745 6029 7960 999 -7082 -6924 1014 7701 5136 -3124 -7070 -3226 4329 6252
3689F252n673n075N51M435L101q42m259k215K650L852n05k803j906J053L164J092
3705B872l394k400J724L041N21k289k264K74L563J693l131l309M46L702L228q72
3721C405n940l376L723O774J549n539o484l58P703O001k717p758m532L870Q784
3736E105L178o214r219r71Q998Q091j773j0454p050M839J1655M218p180j1006
3750g783k644Q870J1204K05j1301r278K999J2047P201n931j2769l942R027J0952
3764H857N76r903r353J494J1378Q285m803j1574o012O507J2229L670r592j1339
3778i580L28J0187Q541k520r740o763M648R787L285n362r113j730P557Q194j510
3793F209q529n384L772Q016L268m801p736p97N052N988l44m856m697J383N661
$$ plain form
3689 6252 579 -4496 -3945 490 3591 2749 -1510 -3725 -1075 2777 2272 -531 -2437 -1384 1780 2872
3705 2872 -522 -2922 -1198 1843 2364 75 -2189 -1915 1648 3341 210 -3099 -2653 1049 4277 3405
3721 3405 -2535 -5911 -2188 4586 6135 596 -5888 -6246 1457 7458 4741 -3017 -7549 -3679 5105
3736 5105 8283 2069 -7150 -8121 877 8968 7195 -3259 -10309 -5470 6185 10403 3223 -7783
3750 -7783 -10427 -1557 9647 9852 -1449 -10727 -7728 4319 11520 5589 -7180 -11122 -2095 8857
3764 8857 9433 -470 -9823 -8329 3049 11334 6531 -5043 -11055 -4548 7681 11351 1759 -9580
3778 -9580 -9252 935 9476 6956 -2784 -9547 -4899 4888 8173 2811 -6302 -8032 -475 7719 6209
3793 6209 -2320 -7704 -3932 4084 7352 2551 -5185 -5982 -930 5058 4714 -142 -4839 -3456 2205
3808B205K342l292l854k09K859K957j323l666m72K744J931l15k349j556O83K899
3824A584O84k608j823J046K793J001k675l782J413M799J876l094n056p25M274
3839b93N268l80o047m505J786O908M106l257q121k922O475P749m67p668o282K683
3855d967Q548M824m957r331k751O665R629J411r524r188J779J1135P124l988j1565
3870e156n615O562J1123K713q239r734n56R997Q584k415j0944o588N568J0784
3884F084M258p950j1259q26J0033R127j564r625p969K932J0554O140n373r957
3898e395l714O767R566O89q906o764K640P808M290l734p341k750N091P154N84
3913E985n671n989N6P013N064k708o555k177L546M734L68l402l262O93L253J307
$$ plain form
3808 2205 4547 1255 -2599 -2808 51 3008 1685 -1981 -2453 291 2222 1907 -442 -1998 -1315 1584
3824 1584 2268 -340 -2163 -1117 1676 2677 2 -3780 -2367 2432 4308 1214 -3842 -4567 -293
3839 -293 4975 4595 -1452 -5957 -4171 2737 6843 3586 -4535 -7457 -982 6767 6300 -1368 -7650 -4967
3855 -4967 3581 8405 3448 -5883 -8634 -1969 7660 9071 -453 -9641 -7862 3273 10397 6409 -5156
3870 -5156 -10771 -4209 6914 9627 1388 -8346 -8902 1095 9679 7264 -3680 -10268 -4700 6084
3884 6084 10342 2392 -8867 -9693 340 9467 7903 -1722 -9691 -6759 3795 9935 4562 -5395
3898 -5395 -9109 -2342 7224 7913 -993 -7757 -5117 2691 6981 3247 -4094 -6844 -1753 5401 5985
3913 5985 314 -5675 -5619 1394 6458 3750 -2805 -4982 -1436 3298 3666 264 -2998 -2305 948 2255
3929B255j276k307j040K712K390j544l220o30K430K777j022k676j380K539K240
3944B248p35k729r17J625K740J007l500l919Q94M815L795j876o450l469M452P203
3960E184O89n837n653K63N989N729k108p030l950L491P766K820o371q656L53R568
3976B247O402l027r814n280N010J0144L908o874r293k357P287R691M23r947p863
3991i343L130J0579N181n932r908k422Q153Q513n85q397p875J342J0550P309m596
4006E699j1171m741O792J0481J965q052q896J197P848N828j862p432m573L561
4020c356P383K701n584o904l82O875O291k636p843l039M343N429K085l406n474
4035c517j469M445M356j05m115k793J046L649J633l206k732J711K740L10k020
$$ plain form
3929 2255 979 -1328 -2368 344 2734 1190 -2030 -2660 -230 2547 1525 -1151 -2531 8 2248
3944 2248 1513 -1216 -2133 -508 2232 3239 -261 -4180 -3286 1529 5324 3448 -3002 -6471 -2019 5184
3960 5184 5873 36 -5617 -5354 635 6364 4256 -2774 -6724 -3233 4533 7353 982 -7674 -7321 2247
3976 2247 8649 5622 -4192 -9472 -4462 5682 9590 2716 -6577 -8934 -1647 8044 8467 -1480 -9343
3991 -9343 -6213 4366 9547 3615 -6293 -8715 -562 7951 7366 -1031 -8906 -7564 2986 10295 5699
4006 5699 -5472 -10213 -3421 7060 9025 973 -7923 -6726 1122 6950 5088 -2344 -6917 -3356
4020 -3356 4027 6728 1144 -5760 -6142 733 7024 4388 -3455 -6494 -2151 3278 5363 1957 -3517
4035 -3517 -4986 -541 3815 3710 -405 -3198 -2152 1497 3130 -76 -2808 -1097 1643 1953 -67
4050f7j948M97K217J280r09j623j452J034K608K30k935j493K178L102o19l721
4066a621k526K586M878J347m690l965j04L945N009j64n487n266K126O679L706
4081F453l647p474j572O489N833j231o919m518K549P967L871n053q495k812P039
4096a520R290Q43q897q790J764J0359O132m173r277m230N292Q991K074o837p849
4111f828j74Q139P415k449j0143n227O086R780J969p291q759o96Q156P774q94
4126F858q156o285K043Q399N520m868q389k076O385O441m64o977m447L202N901
4141C087K501l457n798k150M331O311N84n783n021J193N626L207k583m220n34
4156b706K359J896L37k031j570R42J981Q33k211k072M35K995J720k404l018N43
$$ plain form
4050 -67 -2015 -1518 699 1979 1070 -553 -2005 -971 1637 1867 -1068 -2561 -383 2719 2100 -1621
4066 -1621 -4147 -1561 3317 4664 -26 -3991 -4095 -150 4859 4695 -792 -6058 -3932 2747 6453
4081 6453 2806 -4668 -6240 249 6082 4851 -2068 -6586 -4037 3930 7801 2748 -5747 -8559 -1520
4096 -1520 7770 8613 -284 -9074 -7310 3049 9181 5008 -4269 -8499 -3207 5784 7858 1021 -6828
4111 -6828 -7002 1137 8552 6103 -4040 -9267 -3181 6599 8568 1277 -7482 -8178 -22 7752 6858
4126 6858 -1298 -7583 -5540 2859 8379 3511 -4878 -6954 -569 5872 5408 -1569 -6016 -2814 3087
4141 3087 5588 2131 -3667 -5817 -1486 4825 5409 -374 -5395 -4202 1424 4631 2048 -2172 -2706
4156 -2706 -347 1549 1886 -145 -1715 -773 1208 2041 -170 -2242 -1807 1188 2908 504 -2514 -1971
4172a971L030J000j644k151K02J927J357r16k585q33K003L495O40l638m670O78
4188d076O256L480k519o720k263M218N933Q18n065m761N18N002M975k211o800
4203c215k985M325P008J636o577p627J129Q985N476l669p816m791L822Q554M402
4218H657n962q807j802P004Q028p05q654o032M346Q403L243n828p148j608O443
4233d22P520pq236o964J979R021O227m545r493l327O064P795J006o026o262L80
4249e290O449M230j896n488l677L084O873J673n458o275J238N974L965k184n748
4264b530j940K950L871J515k019m493p39K923L331p29l240j252K214K202q13k538
4280a287n72J660J844j5j759j745M95K150J011j342j672o29K395J598r42l223
$$ plain form
4172 -1971 1059 2059 415 -1736 -1534 393 1750 834 -1751 -2584 -581 2914 3554 -84 -4754 -4076
4188 -4076 2180 5660 3141 -3579 -5842 -1624 4309 5127 62 -4699 -4181 821 5796 3585 -3215
4203 -3215 -6200 -1875 5133 6769 192 -7435 -6306 2679 8155 4486 -3330 -8121 -4299 4255 8657
4218 8657 2695 -6112 -7914 -910 7118 6413 -2241 -8273 -3927 4476 7719 1891 -5257 -6865 -422
4233 -422 7098 7091 -1145 -8109 -6130 2891 9118 4573 -4920 -8247 -2183 5612 6618 592 -5670 -5290
4249 -5290 1159 5389 3493 -1995 -5672 -2588 4285 5958 500 -5775 -4537 1437 5402 3218 -2530
4264 -2530 -4470 -1520 2351 3866 1847 -2646 -3385 -462 2869 2140 -1100 -2352 -138 2064 1251 -1287
4280 -1287 -1859 -199 1645 1630 -129 -1874 -1379 771 1782 440 -1232 -1861 534 2132 1190 -2033
4296b033p77L682K648j568m408j561K880M789Q27l797m487n31M307M712k97n381
4312i95m817K539O790K158m519n551n77N453N218j312o338m461K556P007M207
4327G358m238q747k165O402Q237K58p688o968J741Q370M786l566o998l798M345
4342b671P796J921o633p299R23P659N992l060q635m024N736P622J528n512o812
4357e469j345O992O274j212o705m845K267P113L592m829o533j29N178M432j261
4372C520n076l320J802N368K145k713m562j691L463N232l55m761k878J336L700
4387A210J639j713k560m17K137J117m71j622j188J586K080Q4k816j191J074K713
4403A662J41j786k013R72K435Jj758j409K64K337J784j479l425r44L122L478J33
$$ plain form
4296 -2033 -2810 872 3520 1952 -2456 -4017 -1137 3652 4479 682 -3805 -4336 -29 4683 4386 -995
4312 -995 -5812 -3273 3517 5675 1156 -4395 -4972 481 5699 4387 -1951 -6412 -3856 3151 7358
4327 7358 3120 -5627 -7792 -1390 6847 7105 -583 -7551 -5810 2560 7346 3780 -3218 -7016 -2671
4342 -2671 5125 7046 413 -6886 -5963 1696 7688 4628 -4007 -8031 -2295 5327 6855 1343 -5469
4357 -5469 -6814 178 6452 5240 -1465 -6310 -4043 3070 6662 1833 -4700 -4829 349 4781 3520
4372 3520 -1556 -4876 -3074 2294 4439 1726 -2836 -4527 -1064 4168 3813 -948 -3826 -2490 1210
4387 1210 2849 1136 -1424 -1841 296 1413 942 -680 -1868 -282 1798 1882 -934 -2125 -1051 1662
4403 1662 1803 17 -1996 -1024 1411 1412 -346 -1755 -1491 846 2630 1151 -2274 -3218 -96 3382 3515
4420C515l724m394J179N656K969l122n149j649L710N029M75m675m630P84N544
4435A518M055k332o782k847M970O737N56o274n952J194O611N418k606p271l970
4450f975L424P452L178n328p391n33O539O154j606p465m314L394P310K926n071
4465A694o513j884O111O736J17p291n890J815P598M160l650o962j941M533N601
4480D234P01m692n179P04N839L430k004n614k355L662N235N40m889l645J176L994
4496A137K594j514l771k031K316L186O89k562j883P1K343J797j595k467K69K099
4512F78R22r06j650k05J180J574n47j852o66O11J877P49j947k029R43L262M40
4529B434j955k927l38L874K518k021l578j586J920M252J754l353m745j73M196
$$ plain form
4420 3515 -209 -4603 -3424 2232 5201 2079 -3070 -4719 -1009 4020 4495 -180 -4810 -4026 1518
4435 1518 5573 3241 -3541 -6388 -1418 5319 5875 -399 -6351 -5157 1454 6872 4266 -3005 -6975
4450 -6975 -3551 3901 7079 1751 -5640 -6173 366 6520 4914 -2551 -6865 -3471 3839 6765 1694
4465 1694 -4819 -6703 -592 6144 6261 -1030 -6920 -5105 2493 6653 3003 -3959 -5900 -1367 4234
4480 4234 4935 243 -4936 -4232 1607 5037 3033 -2581 -4936 -1274 3961 4501 -388 -4033 -2857 1137
4496 1137 3731 2217 -1554 -3585 -1269 1917 2606 44 -1839 -1768 575 2372 777 -1690 -1421 678
4512 678 1600 694 -956 -1161 19 1593 1046 -806 -1472 -861 1016 1765 -182 -2211 -1268 1994 2434
4529 2434 479 -2448 -2786 1088 3606 1585 -1993 -3579 -1659 2593 4347 994 -3751 -3924 272
4544B72M016j004n032l481K988N567J924m614n001n18N177N314j252o410m080
4559f134K814O578L177l976p515j254N925O138j24o688m986J721O779L719l066
4574C108o936k171M134O585J179o016n998J106P193M229k794o684l286M280O143
4589D072J456m388n837o21N350N316j334n824l559K927N627J799l946m858l8M293
4605D35L243q34l507l216J618M270J965k761l673o91K692L238J70m005j257J294
4621a019K048Q65j445j883L41J666Q93j043j492n28J816J781j085j840p70J899
4637B04J728r09j592j107J363J687N14k569j976J503K303J428j487l451j074L376
4653e9L483l08l548l388J403M237K481k702m275j360L209M931J33m895l975J156
$$ plain form
4544 272 4288 3284 -1748 -5229 -2241 3326 5250 636 -4365 -4883 294 5608 4356 -2054 -6134
4559 -6134 -3320 3258 6435 2459 -5056 -6310 -385 5753 5629 -1059 -6045 -4324 2455 6174 3108
4574 3108 -3828 -5999 -1865 4720 5899 -117 -6115 -5009 2184 6413 3619 -3065 -6351 -2071 4072
4589 4072 5528 1140 -4697 -5318 32 5348 4014 -1810 -5369 -2442 3185 4984 1038 -3820 -3858 435
4605 435 3678 2844 -663 -3879 -2261 2009 3974 1213 -2460 -3151 -459 2779 2949 -1056 -2313 -1019
4621 -1019 1029 1894 449 -1434 -1093 573 1466 423 -1069 -1597 219 2000 915 -925 -1695 204
4637 204 1932 1023 -569 -1676 -313 1374 1888 -681 -2657 -1154 1149 2577 1090 -2361 -3435 -59
4653 -59 3424 3116 -432 -3820 -2417 1820 4301 1599 -2676 -4036 -827 4104 4237 -658 -4633 -3477
4669c477N369L446k599o198k003M135N940O55n474m759K51N955M353j886o737
4684c029k936L071O868J852m835n977j00O175M511j641n950l505K187O682K583
4699E956m321o140j098M824O023o39n997m227K247N537L097k801n099k137L684
4714a091M871K42l696m348Q12M757K566k285m286j113K647L957J93l227l010R01
4730b110K656J951j057k277j741J736K740j13k145r60N42J681N42j727j178O22
4746h38J880K27j031j040l54J082J246l18k074l54J465J709m4k325j647J740K963
4763B287K5k354k482K01L286K408j253m297j278K293L790J266l107m602M79M363
4779A025K790j278m564k199K337N008J424m333l964j60M580M271j053n804l870
$$ plain form
4669 -3477 1892 5338 2739 -3459 -5462 -1327 4613 5268 -206 -4965 -4714 1241 5594 3708 -3029
4684 -3029 -5965 -2894 3974 5826 991 -4986 -5086 1089 5600 3959 -1991 -5496 -3309 3373 5956
4699 5956 1635 -4505 -5603 -779 5244 4605 -1392 -5619 -3372 2165 5262 2461 -2638 -4775 -1091
4714 -1091 3780 4022 326 -4022 -3210 1547 4113 1828 -2458 -3571 -924 3033 3226 -1 -3011 -2110
4730 -2110 546 2497 1440 -837 -2578 -842 1898 1785 -360 -1320 -778 903 1445 -282 -1460 -838
4746 -838 1042 1269 238 -802 -1156 -74 1172 854 -1220 -1574 -109 1600 1556 -769 -2416 -676 2287
4763 2287 2312 -42 -2524 -2323 963 3371 2118 -2179 -3457 -1164 2626 3892 785 -3817 -3338 1025
4779 1025 3815 2537 -2027 -4226 -1889 3119 4543 210 -3754 -3914 666 4937 3884 -1920 -5790
4794e790K719O137K339l567n810j172N107M820o25n126m048J694N510L269k880
4809B577o006j840M541N384L76n764m567J578N692K807k101n088k587K805N490
4824C297J425l722m854j03M203L905j021n131k164K886L833Q86l139l459N02L272
4840F16K371q50l075k191J378L571J063k485k463j17K634J238n28j889q94J393
4856b28J125n0j142n36K07J282P55j545j259O47J227R02j207j645K20J914R04
4873A571j200j599l80J675J773J8l068j580J577K778J344j758l707p39L401L479
4889C585q72l688k197R01L961K059k398l970p41L192L519L25m376m059J720N646
4905B607K082k680n241j549M151M709K85m524m711P08M875M621j819o301k553
$$ plain form
4794 -5790 -3071 3066 5405 1838 -3972 -5144 -37 4783 4158 -968 -5016 -3322 2188 5457 2577
4809 2577 -3429 -5269 -728 4656 5032 -732 -5299 -3721 1971 4778 2677 -2411 -4998 -2193 3297
4824 3297 4722 1000 -3854 -3957 246 4151 3130 -2001 -4165 -1279 2554 3440 301 -3158 -2656 616
4840 616 2987 2137 -938 -3129 -1751 1820 2883 398 -2065 -2182 452 1690 1162 -727 -1621 -228
4856 -228 897 847 -295 -831 -624 658 1413 -132 -1391 -744 483 1385 178 -1467 -1247 667 1571
4873 1571 371 -1228 -1608 67 1840 1858 -1210 -2790 -1213 1565 2909 1151 -2556 -3295 106 3585
4889 3585 2713 -975 -3172 -2271 1690 3749 1351 -2619 -3360 -168 3351 3676 -700 -4759 -3039 2607
4905 2607 4689 2009 -3232 -4781 -630 4079 4364 -160 -4871 -4163 712 5333 3514 -2787 -5340
4920e340L797N479P35m242m624L62M905L668j982m606l196K669N265J919l602
4935A207n279o36M735M374m51m937l618K316M056J822k071l819j368K957L738
4950C026K10l886k578J076L674J929k428l293o21L072K082j99k516j703N87K085
4966E17J376p99j844r42J515J511o7k070l06J253R96l72j621n31J021J337J8j143
4984a51q29j47J636R01o14j995k26K114J358q24k573r66J968L075l87k898k156
5001b714P50K716K567j348l647j883K114M079Q84l317l558N01M165K438j747m301
5017b301j358K564L980J277l737m296J04M304M117j141n608l171K947N593J389
5032D663l665m258r65M052M179k41m648l072J498M772K575k953n525q23L844M962
$$ plain form
4920 -5340 -1543 3936 4671 429 -4195 -3833 1072 4740 2758 -1848 -5044 -2375 2890 4809 1207
4935 1207 -4072 -4708 27 4401 3950 -987 -4605 -2289 1767 3589 1518 -2301 -3669 -712 3026
4950 3026 3236 -650 -3228 -2152 1522 3451 1023 -2270 -2891 181 2263 2064 -452 -2155 -1568 517
4966 517 1893 1094 -750 -1692 -177 1334 1267 -803 -1109 144 1140 768 -853 -1384 -363 974 992 -151
4984 -151 -980 -1127 509 1410 796 -1199 -1425 689 2047 1223 -1350 -2316 -348 2727 2340 -558 -2714
5001 -2714 -1964 752 3319 1971 -1676 -3559 -1445 2634 3518 201 -3357 -2856 1309 3747 2000 -2301
5017 -2301 -3659 -1095 2885 4162 425 -3871 -3767 537 4654 3513 -2095 -5266 -2319 3274 4663
5032 4663 998 -3260 -4225 -173 4006 3765 -883 -3955 -2457 2315 4890 1937 -3588 -4411 -567 4395
5048D395o40m553l723J317M784L004k295m220k220K517M521J034l666l909P60
5063b894L743K662j869l504j023K111L053K06k062k454n88L245K448j310k769
5078a005j499J565K469N45k098j695N88J469M86j87j137o70J197R49m90j091o85
5095a289P01J779j15j445j328R91J958o8j563r93P65J707N46j478j465j07J559
5112A55J672j02k860j872J646L494J033k234l415j13K788K766p87l273j723R23
5128a902L204J993k094l788p50L201L737k53m523l298K238M707J879k855m434
5143b938j252L443M239M52l877m310P17M752L054j776m808j852L181M036N07l497
5159G1l671O25L884L046j544m092k392K361M086J933l134m641k5L858K730l96
$$ plain form
5048 4395 3755 -798 -4521 -3204 1580 4584 2289 -1931 -4151 -1634 2887 3921 255 -3654 -2894
5063 -2894 849 3511 1642 -1862 -2885 -774 2279 2485 423 -2031 -2619 626 3074 1764 -1005
5078 -1005 -2504 -939 1530 2075 -23 -1718 -1130 339 825 638 -499 -1169 28 977 487 -604 -1289
5095 -1289 -588 1191 1076 -369 -1697 -706 1252 1184 -379 -1372 -607 1100 1646 168 -1297 -1404 155
5112 155 1827 1725 -1135 -3007 -1361 2133 3166 932 -2483 -2596 192 2958 2171 -1102 -2825 -1902
5128 -1902 1302 3295 1201 -2587 -3337 -136 3601 3348 -1175 -4473 -2235 2472 4351 1496 -2938
5143 -2938 -4190 -747 3492 3944 67 -4243 -3526 1226 4280 2504 -2304 -4156 -975 3061 3568 71
5159 71 -3600 -2975 909 3955 2411 -1681 -4073 -1712 2374 4307 1173 -3468 -3493 365 3095 2699
5175B699l751k285J420L517J357j953k894r39K671K771m41l326j798J596L012
5190A656O31j546k435k69J900J710p6j555j511L37J759R17j175j287k54J643N52
5207I97p55j132k05J742N72m29j603m55R45J431j38j340r83Q49J610P7j155j755
5225a727O62K075J229j582k540k29K107K328l28k727j861L70L104K088j374l311
5241a716j670K586L243J71k707l071O22L765K534k122l560j504K022M128J005
5256C726l257m421L40M438L189j183m738k215K293M256J416l265l410p40L713
5271A42L447n85m414k661J897L965K168k758m191n99L731L140k29l330l233Q82
5287b628L839K277j735l392j773K338L829N2k972k748J133K930J449j379k508
$$ plain form
5175 2699 -1052 -3337 -1917 1600 2957 1004 -1890 -2829 -158 2613 2172 -1154 -2952 -1356 1656
5190 1656 2287 741 -1694 -1963 -63 1647 1571 16 -1495 -1158 601 1518 343 -944 -1198 445 997
5207 997 242 -890 -1095 647 1219 790 -813 -1268 -323 1108 970 -370 -1353 -504 1106 1183 28 -1727
5225 -1727 -1065 1010 2239 657 -1883 -2112 -5 2323 1995 -732 -2593 -2223 881 2969 1595 -1716
5241 -1716 -3386 -800 2443 2614 -93 -3164 -2542 1223 3757 1635 -1925 -3429 -1407 2721 3726
5256 3726 469 -3952 -3612 826 4015 2832 -1906 -4121 -1828 2428 3844 579 -2831 -3571 142
5271 142 3589 3004 -1410 -4071 -2174 1791 3959 1201 -2990 -3589 142 3282 3053 -277 -3510 -2628
5287 -2628 1211 3488 1753 -1639 -3412 -1074 2755 2807 -165 -2913 -1780 1150 2599 1220 -1288
5302a288j087J734K251N08k124j761J53K180J724j311k150m15R52J612P0j102
5318e4j057P36R52L84j197n59j38J071Q90q50j201j22J393J230o45j877l83J101
5336c26J893n68j681n72P23J823L72j407k105L23J935J972p78k969j240J374L252
5353B021L11k103k545J06K242L017q85l497j856J527L660Q39j986l501l43L503
5369E10L052p39l949k743J882M048J483k520l538j214L215L931r7l811l206J045
5385b651M539J439j595l797j613L010L591O5k963l195M39L720K342j113l993j994
5401c769K591L519R93k829l423J40L401K289j044l005j359R64K916Q73j575k800
5417b118J40K362J857m73k837j097J435J965K60r49j747l52J805J082l74j350
$$ plain form
5302 -1288 -2375 -641 1610 2118 -6 -1767 -1614 566 2290 979 -1171 -1586 -634 978 1048 -54
5318 -54 -1111 -375 577 961 -236 -795 -933 138 1028 178 -1023 -1145 248 1478 833 -1044 -1427 -326
5336 -326 1567 999 -682 -1254 -531 1292 1664 257 -1848 -1525 410 2382 1604 -1365 -2605 -1231 2021
5353 2021 2332 229 -2316 -2210 32 3049 2164 -1333 -3189 -1662 1998 2837 851 -2650 -2993 510
5369 510 3562 2823 -1126 -3869 -1987 2061 3544 1024 -2514 -3728 -513 3418 3321 -490 -3696 -2651
5385 -2651 1888 3327 1732 -2065 -3678 -668 2923 2988 25 -3170 -2731 989 3331 2218 -1775 -3769
5401 -3769 -1178 2341 3334 505 -2918 -2778 623 2912 1868 -1137 -2496 -1532 1384 2257 682 -2118
5417 -2118 -1978 384 2241 1768 -1069 -2166 -731 1234 1494 545 -1202 -1554 251 1333 959 -391
5433c91n71M65J282M8p97j189P27J001M31j146q09N00R84N63p90j031j56J256
5451C77O94m11j532m85J190J514j58j521j847J057K157J109j745j735p63J800
5467b99K358l5k058k565J093K673J348j104l265p63K325K617j9k682k379O85L310
5484A240K044j405l723j647K579L547P47l189l542N71L970K321j708l156k103
5499c454K003L859O29k380k970m87L011K956m56l842k149K057L156J292k365l320
5515b460o63L001K854p6k876k469P95L161J765j727l134o26K132K468K44k562
5531a73k203J054K346O78j014j621j000J426K119l9j805j528P72J403Q39m93j500
5548g39k41J094P44l40q86m78O46J137j82j358l30O18Q63N80j056j344L24J467
$$ plain form
5433 -391 -962 -497 785 833 36 -1153 -426 575 1006 -140 -949 -449 535 1098 308 -723 -879 377
5451 377 1071 660 -872 -1357 -167 1347 1189 -332 -2179 -1122 1035 2144 399 -1336 -2099 -299
5467 -299 2059 2024 -34 -2599 -1506 1167 2515 1411 -1854 -2617 -292 2325 2306 -376 -2755 -2070 1240
5484 1240 3284 1879 -1844 -3491 -912 2635 3382 193 -3349 -2778 1192 3513 1805 -1351 -3454
5499 -3454 -1451 2408 3037 657 -2313 -2800 211 3167 2711 -1131 -3280 -1223 1933 3225 860 -2460
5515 -2460 -3123 -122 2732 2656 -220 -2689 -1894 1267 3032 1305 -1829 -2455 -323 2145 2389 -173
5531 -173 -2376 -1322 1024 1702 688 -933 -1933 -507 1612 1573 -232 -1760 -988 415 1254 761 -739
5548 -739 -980 114 858 518 -368 -846 -200 937 755 -603 -933 -315 548 1128 72 -1272 -948 519
5566E19L32p99j215J74J196J581j103j627r03J461J576J52j397j903K97K370J688
5583B399j267k218j443J545K474J018k391k130M6K338K018l26l245j842J821L120
5599A917R57k626k971J56K777K834p54l313k023J166L603J855k854l173n99K850
5615a98K896l2l411k231J060L199J670j456l679r03K511K973J0k654k806M11L537
5632H97K393j662l163j485K258K523M96k083k508K74K768J549q23k340j282J362
5648h26K272L09j714j813K93J941J317o16j972q89J197J260M61j092j064j29J347
5665B82R45q76j035J98M33Q58K60j643k49Q87Q95n96l97q62N42R98J35j041o42
5684i08J24J102N47l22j573o53J720J666m44j730j419J084J771J079j454k342
$$ plain form
5566 519 851 52 -1163 -989 207 1788 685 -942 -1845 -384 1192 1344 -53 -1956 -1659 711 2399
5583 2399 1132 -1086 -2529 -984 1490 2508 117 -2013 -1967 371 2389 2063 -1182 -3024 -1203 1917
5599 1917 2874 248 -2723 -2567 210 3044 2290 -1023 -3046 -1880 1723 3578 724 -2449 -3048 -198
5615 -198 2698 2666 -745 -2976 -1916 1283 2953 1497 -2182 -3085 -574 2399 2409 -245 -3051 -2640 897
5632 897 3290 1628 -1535 -3020 -762 1761 2257 174 -2334 -2060 708 2257 1434 -906 -2188 -826
5648 -826 1446 1755 41 -1772 -1479 462 1779 1163 -809 -1698 -501 759 1220 128 -936 -1065 282
5665 282 1227 351 -684 -486 -53 805 1065 -578 -827 60 955 359 -38 -900 -358 640 775 -266 -908
5684 -908 -784 318 865 543 -1030 -1683 37 1703 1259 -471 -1890 -806 965 2044 590 -1752
5700a752L11J542J887L76k905j975J016K669J378j801k534m28J975K751k25k939
5716f54k045J125K868J863j740l276r96K175L170R5k419k958N57L201J940j406
5732A500k741j587J648L141O50k379k825p4L015K445q27l159j888J867L150Q48
5748B784k171k450q23K585K579o00k626j510P41K640J225j786k133r46K133K124
5764A766l20j872j384J068J668Q00r10j656o15J008J725k4j601j131R44J175J90
5781H31p45p91K87P52L37o76o37L58L13J154p30j157l20R48Q44o1p98j134Q09
5800d16R37M26j205o65J10J221R42p16j631l94J330J526R8j782j761M98K464R23
5818A905q94k132q38J072K487O25k061k113J15K687J529j022k604j458K176K583
$$ plain form
5700 -1752 -1441 101 1988 2364 -541 -2516 -1500 1169 2547 746 -1788 -2216 -241 2510 2285 -654
5716 -654 -2699 -1574 1294 3157 1417 -1859 -2855 -680 2490 2585 166 -2792 -2235 966 2906 1500
5732 1500 -1241 -2828 -1180 1961 2611 232 -2593 -2667 348 2793 1966 -1193 -3081 -1214 1936 2784
5748 2784 613 -1837 -2660 -75 2504 1904 -722 -2232 -1491 1149 2374 588 -1545 -2491 -358 1766
5764 1766 1446 -426 -1810 -742 926 1726 816 -840 -1455 -447 1278 1254 -347 -1478 -534 641 831
5781 831 86 -705 -418 334 671 -5 -642 -284 29 1183 453 -704 -1024 -76 768 707 -91 -1225 -416
5800 -416 521 947 -258 -923 -813 408 1350 634 -997 -1391 -61 1465 1563 -219 -1980 -1482 982 1905
5818 1905 1011 -1121 -1959 -887 1600 2225 164 -1949 -1834 853 2382 1360 -1244 -2702 -526 2057
5834B057M94k489k125j77K411K406j008k479j655J258K826J440j862l240l33K101
5850c75K884k31k859k366J214L194J236j745k378p54J465L015J25k907k105O92
5866a895K790J638j387k458r17J760J994j20j219j809N6J995J590q86k156m79
5882a503J008J601L99j525j389L01J559N59k53j077r34J170R73m9p80q49M24O91
5900C26K56p86o08P0J153M4k13q28j88J218M19l97j181R7K79R34J22r95j053J127
5920b04J356j05q82j409j21J772J140l18j769r23N11J984P93j333k087k37K082
5937B50J311K75k609j174P49K576J001j997j875p30J982K269K7k858j957J179
5953a581K466J791j617k958r22K252K885j71k120k513N98K563J937j226k584j457
$$ plain form
5834 2057 2551 62 -2063 -2240 171 2577 1569 -910 -2565 -1307 1519 2959 1097 -2143 -2476 -375
5850 -375 2509 2278 -581 -2947 -1733 1461 2697 952 -1426 -2180 -715 2300 2425 -482 -2587 -1895
5866 -1895 895 2533 1146 -1312 -2229 -469 1525 1405 186 -1623 -1567 428 2018 1132 -1024 -1503
5882 -1503 -495 1106 1505 -20 -1409 -1108 451 1010 757 -320 -1254 -84 889 840 60 -789 -365 326
5900 326 582 -204 -812 -742 411 455 242 -586 -774 444 863 466 -715 -618 -339 595 717 -278 -1331 -204
5920 -204 1152 1047 165 -1244 -1365 407 1547 1229 -540 -1463 -952 1032 1825 492 -1595 -1832 250
5937 250 1561 1836 -773 -1947 -1198 1378 2379 382 -1493 -2223 -241 2028 2055 -803 -2760 -1581
5953 -1581 885 2676 1059 -1899 -2821 -569 2316 2145 25 -2488 -1890 673 2610 1384 -1200 -2657
5969b657J786K346J049k617k176L16K719J820p52k921j251J464K329Q57j948k434
5985b070K11J677J835j93j879j610R89K165N21j078j613l87J640J244k08j760
6001e16q09L88J859L97j273j044l62J437Q60k39j224m08O04R36j13p65j04K14
6019a62O06j3o51p46L10J211L04n24o73l62O80R67m53p37n06O40P67L96j419p12
6039a077N8J395J181r87j700o39J617J473o8j682j390N64K087Q67n75j993q29
6056a698J010J943P23j886k131L87K602J245j012k590o65J184K500M53k139j890
6072a964l30K501J983l45k825j359R91K824Q84j870k489k89K513J681j83k487
6088g64j382R72K045J615j765k383j80J657J938j76j713j956O57K224R44r63k026
$$ plain form
5969 -2657 -871 1475 2524 -93 -2269 -1953 766 2586 1834 -1087 -2338 -874 1455 2312 364 -2070
5985 -2070 -1859 -182 1653 1460 -419 -2029 -1040 1125 1646 568 -1045 -1432 208 1452 1244 -516
6001 -516 -1325 -937 922 1319 46 -998 -1360 77 937 698 -526 -934 -330 606 493 -272 -376 -162
6019 -162 444 431 -220 -966 -656 555 859 335 -338 -700 -20 947 494 -243 -749 -109 658 1054 -365 -1077
6039 -1077 -1019 376 1557 570 -1130 -1769 -152 1321 1253 -429 -1819 -1255 832 1699 1124 -869 -1698
6056 -1698 -688 1255 1978 92 -2039 -1652 950 2195 1183 -1407 -2072 -888 1612 2065 -74 -1964
6072 -1964 -2294 207 2190 1845 -980 -2339 -1348 1476 2360 490 -1999 -2288 225 1906 1723 -764
6088 -764 -2146 -1174 871 2486 721 -1662 -1842 -185 1753 1577 -136 -2092 -1435 789 1733 770 -1256
6105a256m12J764J425j93j523r32j40J338J683j137j372o65J222J553k2j478r68
6122a113M20J029N53n47p67k64L67J212n40r18J39p6P59J9m27o65O54P32L1n82
6142A6m79k96J096N20r08l56l69P77Q99j70j176p18Q87R07P76j524r62j82J639
6161C77J265m93k188o79Q36K095M98j472j771k51J900J947p78k102j108J102J829
6178A007Q43j430k013p3J372K493o90k139j617R76K579J054j613k049r51K121
6194a30K073j48j769j915M51K253J322j050k244r07J439K263L97k387j664N00
6210a516K106J260n36k121j220J135K286P07j895j871K28J626J444n62j497j092
6226a518Q04J775M18j328j303J09J314J002p33q61o35L19J310N31r18q72J06Q63
$$ plain form
6105 -1256 -1668 96 1521 1328 -195 -1127 -1267 71 1754 617 -755 -1420 -198 1355 1333 -145 -1113
6122 -1113 -693 336 889 342 -425 -689 -322 890 350 -568 -429 -505 254 273 -154 -819 -165 567 598 16
6142 16 -463 -759 337 857 -51 -407 -776 1 900 730 -446 -1164 -277 630 1406 -118 -1080 -1262 377
6161 377 1642 1149 -1039 -1718 -882 1213 1711 239 -1532 -1783 117 2064 1286 -816 -1924 -822 1007
6178 1007 1850 420 -1593 -1666 -294 2199 1509 -630 -2247 -1271 1308 2362 749 -1300 -2251 -130
6194 -130 1943 1795 26 -1889 -1438 815 2137 1087 -1157 -2064 -625 1638 2035 -352 -2016 -1516
6210 -1516 590 1850 1314 -807 -2027 -892 1394 2101 206 -1665 -1437 189 1633 1071 -426 -1518
6226 -1518 -714 1061 1479 151 -1152 -1043 271 1273 540 -321 -956 -637 673 1204 286 -586 -480 383
6244C83Ql15n69j83N77Q83k00r84k0J42Q03j9q86k99M00R65j0n91j001K59J384
6265G27L60j077p19j96J058P55j62j270q31N76J486P10o63j735o70J115K223j30
6283A557j957j201P56J629J280j330j723p73J586J380P70k170j566K27K502J161
6299B128r36k454q26J392K209L93j568j857j69J932J819o14k345j099J329K064
6315A398P82j910j963m7K000J812o72k047j253P70K210O84j219k000m7J348J890
6332A736j90j904j261M17K035O40r29j411k54P29J607k8j308j185P59J053N51
6349A057o62j096m78J003Q48mp32p66J52J135L39n08m18k67N55L24j30j168J67
6368f49P08K77P7o95n80Q12M67J46q76p78Q52P17L56p34o94o7J051O99n17j247
$$ plain form
6244 383 391 76 -493 -676 -99 784 584 -400 -420 -278 525 506 -380 -679 -279 686 676 85 -916 -657 727
6265 727 1087 10 -709 -905 153 908 746 -524 -1355 -779 707 1417 754 -981 -1651 -536 1687 1557
6283 1557 -400 -1601 -845 784 2064 734 -989 -1762 -176 1204 1974 -196 -1762 -1535 967 2128
6299 2128 1192 -1262 -2088 -696 1513 1906 338 -1519 -1688 244 2063 1449 -896 -1995 -666 1398
6315 1398 2180 270 -1693 -1740 260 2072 1400 -647 -1900 -1130 1080 1764 545 -1455 -1502 -154 1736
6332 1736 1546 -358 -1619 -1202 833 1473 544 -867 -1121 -392 1215 1187 -121 -1306 -547 506 1057
6349 1057 395 -701 -1179 -176 672 668 -64 -830 -678 457 796 288 -130 -397 158 482 352 -816 -649
6368 -649 59 336 413 -282 -862 -50 417 563 -313 -1091 -239 478 834 100 -594 -661 390 1089 572 -675
6388f75l34P76J306j07j128r06o5J678O23l70j481r66J030J536P39j251j897j64
6406a656K271J164j063j538j067J280J869M98j348j879k51J845J687k60k004j705
6422b157J119J948J295j488k264q9J488J579K62j733j919P33J858J266o60k477
6438a239o95J618J751Q8j559j440o2J893J376o11j833q77Q78J657O93j548j407
6455a317M09J098R75n36j466l39Q65J080K36q71j032l6J271N62k84r95o29P73
6473b36O81L23o37q92M32P33n5m43m02J93M63J4o4n67J12J52Q68l32q61k64O44
6494a38P85J41j176j84P8Q20L95n64r72k53J183M54N33j385p64N14J454N72j206
6513B87j259l09J146J593j93j495j071M68J685R07r76j783m20J550J020J15j236
$$ plain form
6388 -675 -1009 -233 1073 966 -162 -1068 -1133 545 1168 798 -683 -1649 -619 917 1656 405 -1492 -1656
6406 -1656 615 1779 716 -822 -1889 -609 1260 1758 410 -1469 -1720 125 1812 1552 -452 -2157
6422 -2157 -1038 910 2205 717 -1547 -1636 -148 1431 1693 -40 -1959 -1226 632 1898 1238 -1239
6438 -1239 -1934 -316 1435 1523 -36 -1476 -1538 355 1731 1120 -713 -1590 -712 945 1638 90 -1317
6455 -1317 -908 190 1165 629 -837 -1176 -311 769 1005 134 -898 -934 337 899 615 -380 -1009 -236
6473 -236 445 768 131 -761 -329 404 349 -94 -496 -303 160 174 110 -457 -345 -193 675 343 -518 -782 -138
6494 -138 647 788 -388 -572 -494 326 721 157 -815 -1068 115 569 1102 -283 -1047 -533 921 1493 287
6513 287 -972 -1281 -135 1458 1265 -230 -1301 -833 852 1759 783 -1000 -1420 130 1150 1265 29
6530B9j918N56K183R27r08k018o31J267K042m4j597j431J14J991J022r3k450q21
6548a780J145K126kj491j471N2J522J792o62j884j087Q31K119M92j453j602K25
6565a128J037J509l13j776n27M57J615K50q83p23o61R82J022pj129q14O73J015
6583E99L70r30q60K57Q31O1P6l81n21J04M98M51j131J31N5P37R6l00m90o5Q05
6604C93K24p13r2k14L46Q35j57r56l50N38N48K79q31q31K57J042P99p63r79n10
6624a135J061R52j9p40j249P5J490P45q6j518j037Q62J592J80j193j220l0J749
6642D79J094m85k189l54P86J425O21j093j802M3J733J358l42j745j458Q83J970
6659I24N05j066j641k3J172J866l62j771j279P65J547Q51r07j562o54J516J450
$$ plain form
6530 29 -1889 -1333 850 1777 869 -1149 -1780 -513 1529 1485 -112 -1543 -1429 562 1584 1491 -959 -1780
6548 -1780 -635 1491 1489 -2 -1473 -1421 101 1893 1231 -653 -1740 -909 1210 1702 249 -1353 -1128
6565 -1128 -91 1418 1105 -671 -1198 -741 874 1124 241 -482 -1143 -161 861 854 -275 -1089 -416 599
6583 599 969 39 -821 -564 267 328 404 23 -498 -394 104 555 -576 -445 -390 347 443 143 -347 -412 393
6604 393 617 -96 -188 -402 -56 779 622 -334 -684 -146 402 681 -150 -981 -724 318 1117 354 -625 -1135
6624 -1135 -74 878 859 119 -1130 -1055 435 1180 1094 -424 -1461 -599 993 1173 -20 -1240 -1270 479
6642 479 1573 1088 -1101 -1455 -669 756 1377 284 -1518 -1475 258 1616 1274 -471 -1929 -1046 924
6659 924 1429 363 -1278 -1301 -129 1737 1375 -396 -1675 -910 637 1488 581 -981 -1635 -119 1331
6676A331J61j786j259N19J219J005n63j237o39Q32J077M19j423o56K41R79R44
6693A164o98j148q1P92O64r8p93l79j89P54Q42m80p56j98P06K40p8p22m4N03O06
6714F07j88o28K10j86L56K78o72j50j35L68P14n02k85l02M51M02L89r27l59jJ000
6735D40O13j096o33l12J344M98L9j174q07P08J178M75q71j206j08Q56J283m25
6753H02j018j388R72J460P00r86j618n12J654J476k59j425j372L90J640J079j018
6770E77j445n64P97J732L94j464j712L88J973O37m80j877n85J282J239L94j207
6787G9j270J07J192J359n38j760l40O12J302N11j076j371k58J633J134n11n79
6804B26j080K78J228O06j156q59O98K1Q64j78r90o46P54R91k35o2q63o1R60J61
$$ plain form
6676 1331 1492 -294 -1553 -1034 185 1190 627 -610 -1249 -417 660 1079 -344 -1000 -759 220 1164
6693 1164 466 -682 -763 29 693 595 -198 -577 -766 -12 830 350 -406 -604 102 342 264 -458 -502 1 607
6714 607 419 -209 1 -185 171 449 -223 -373 -508 -140 574 72 -213 -515 -64 338 727 -200 -559 -560 440
6735 440 1053 -43 -676 -988 356 854 893 -281 -1088 -380 798 1273 402 -804 -912 -56 1227 802
6753 802 -216 -1604 -632 828 1528 542 -1076 -1588 66 1542 1283 -142 -1514 -1124 516 1595 577
6770 577 -868 -1432 -635 1097 1491 27 -1685 -1297 676 1313 833 -1044 -1629 -347 892 1286 79
6787 79 -1191 -1084 108 1467 929 -831 -1171 -559 743 1254 178 -1193 -1451 182 1316 805 226
6804 226 -854 -576 652 1258 102 -757 -59 -38 826 648 -342 -988 -234 757 522 460 -403 -464 496 657
6824F57m28m90K74k07N00m9n55l19O11K80L94p74l72J93M39L32n04p22O23K26
6844A09O04k86r78k76M34J128n7p12r54N25J254M41o22j255m72J030Q89K80j106
6863b4j362O17J060Q88n68j717l4P86J874l01j501p52j50J439J155o69j397n71
6881a227P31J498L01j040j740N42J171J404n69j821o66M26J921M83r48j493l82
6898a409J472J350k95j419r97O51J506M69o73j713r9R50J307l48j099p88M76J095
6916D36O71o32q15p92Q57Q78j8p62q16L04J043J91m07p20K31L31J64K89m36o37
6936f40K62O06K94k87q01K07O12K70m44m20l01Q04K47n16l22j4J73O19n7k85l72
6957c65k99J173k48j73n72K1O41N48o88n92j08N38O90K58n06j224L01O82Q27q0
$$ plain form
6824 657 229 -261 13 -194 306 257 -298 -617 -6 274 668 -106 -478 -285 154 486 -18 -740 -117 109
6844 109 713 427 -551 -827 -393 735 678 -34 -988 -463 791 1232 610 -645 -1117 -87 802 1082 -24
6863 -24 -1386 -769 291 1179 611 -1106 -1140 -354 1520 1219 -282 -1034 -1184 255 1410 741 -656 -1227
6881 -1227 -496 1002 1303 263 -1477 -935 236 1640 1071 -750 -1416 -990 931 1414 466 -1027 -1409
6898 -1409 63 1413 1118 -301 -1298 -647 859 1328 655 -1058 -1157 -207 1100 752 -347 -1135 -659 436
6916 436 1107 475 -340 -1132 -275 603 585 -177 -993 -689 354 545 138 -582 -351 -20 144 433 -3 -640
6936 -640 -378 228 522 235 -566 -359 253 523 79 -341 -642 162 409 -107 -429 -443 -270 349 292 7 -365
6957 -365 -664 509 261 88 -484 -463 178 726 38 -554 -662 -124 566 824 318 -906 -605 77 904 824
6977H24j092j206J221J044O28j026j297j56J248P58Q7j621r89R42J375N62j052
6994B50j166m03J437J282l09j802o68M57J596O12n82j820l85J089J452Q5j106
7011A9j230K67J455P73o48j053p03Q57J355J4j138j004J20J353O30l30j338l95
7029i96O04J286J29q28j215J30J064O39k84n83r90O70R69M22r62p81K69Q53M10
7048H06m40q58q6M38P55l34k77m33J0O79j8j87m89K10K48K55k22k99j30L58L52
7069C38J11o51j23L38L09J83l75m86r9N96K98l08l86k97O03N24l6p08m71K66O49
7090B75P38m66j169m36R97J030K40j711o42L82J096Q83r25p87m63R50R84l0j115
7109a69r06N35P99R64n77j683l96R43J337K50j147j231L89J055J085k80j413o74
$$ plain form
6977 824 -268 -1474 -253 791 1419 393 -904 -1060 188 946 1033 -588 -1577 -635 740 1302 250
6994 250 -916 -1319 118 1400 1091 -711 -1379 -922 674 1286 704 -1116 -1501 -412 1040 1125 19
7011 19 -1211 -944 511 1284 636 -417 -1120 -263 1092 1106 -32 -1036 -916 437 1067 737 -601 -996
7029 -996 -392 894 1023 195 -1020 -890 174 813 529 -54 -1044 -374 595 1017 55 -726 -457 396 806
7048 806 366 -492 -578 -140 615 281 4 -429 -419 260 242 55 -434 -224 24 279 57 -242 -372 -14 338
7069 338 449 -202 -325 13 322 505 130 -356 -455 141 439 131 -255 -552 51 575 539 -169 -640 -374 275
7090 275 1013 547 -622 -1058 -61 969 1209 -502 -1144 -762 334 1217 292 -495 -958 -8 976 946 -169
7109 -169 -1075 -540 259 1223 646 -1037 -1433 -490 847 1097 -50 -1281 -892 163 1248 968 -445 -1119
7127a119P64J037N98j138j245L46R66Q25j37j308p83P43Q31N38o75j070k97J023
7145a01J013j69j149o66L89R93L61l55r27l73J126N66j94n44q77M19Q36J94l71
7164A71l20k87L94L91K90r43k97N89K24%l27l00K69L12k4lk65L35M8J67j55n62
7186b93J05m5L96K76q87j31N13N14j6n54k32j78Q46N78o50r91k9N88J116n7p85
7207H4r55L8R60Q17l06j273l32L32J078O19r86r99p8J200Q51m68q94o69M98J335
7227H52L40r05j327m20J463J267j07j383p90Q8J053J007p96q11p73J303P73q7
7245G47q46r20K66J217O22m44j235m08P73O78O97j497o60M59O69P37k06j621q0
7264a052J092K18L17m56p37K0J069K28k15p04l15M81N61M35j228l55J05R55j98
$$ plain form
7127 -1119 -355 682 1280 142 -1103 -757 209 1034 897 -411 -1194 -451 380 918 243 -827 -1124 -101
7145 -101 912 743 -406 -1072 -683 310 671 316 -611 -984 142 708 514 -30 -907 -488 348 542 171
7164 171 -149 -436 -42 349 639 -304 -601 -12 212 212 -115 -415 -146 166 142 139 -126 209 257 424 269 -293
7186 -293 -188 -233 163 439 -448 -579 -66 448 432 -122 -354 -532 314 892 242 -749 -778 -190 926 869 84
7207 84 -871 -833 127 944 638 -635 -967 -635 443 1062 76 -923 -1001 199 1050 582 -312 -981 -483 852
7227 852 1192 287 -1040 -1460 3 1270 1163 -220 -1010 -922 131 1138 342 -469 -1242 61 834 747
7245 747 -99 -1019 -753 464 1086 642 -593 -1001 -228 450 1147 -350 -1010 -551 118 855 649 -972 -1052
7264 -1052 40 258 575 119 -618 -598 471 699 484 -220 -535 -54 507 942 -286 -641 -536 419 221
7283B21Q1n90k02N11K83Q1m75m68L88M74J20n97l85O62l0K60m51k21J03O1O16
7304D42k50k60k69M02K95K41p98o36N05N63K09m82n75J99M10Q28m25r85P4J91
7324c21N34M81k00j082l29O28J374j55j074n52L61R73N32p97j063l11Q36J015
7342H50J71j369o59M65Q19J036p66j345m09J090J068l0r35j110L73P85R40m67
7360E07o71m57M81O52P71j324o54j59J093P53l86r56o59O38Q37J38n34o50k62
7379h42P96P78q4q89p65P92N46L83o03p86L32P50N4j10n81l45J66O86K05o99j29
7400c45J39M25K29Jp26k87N54L95k77j04k44MP65m21j19j02l31O94K66l77o26
7421d87L3O88K51n44l15l73P71L36J88m69p18K97O64L27l43q14j53O08O48N4n76
$$ plain form
7283 221 302 -288 -490 21 304 385 -90 -558 -170 304 424 -173 -558 104 74 334 -117 -338 -235 -174 442
7304 442 192 -68 -337 65 360 601 -197 -833 -328 235 444 -38 -613 -414 -4 824 399 -586 -512 -321
7324 -321 213 694 494 -588 -917 -289 1085 930 -144 -696 -335 638 1170 373 -690 -1001 -165 850
7342 850 1021 -348 -1007 -542 277 1313 547 -798 -1207 -117 951 921 -14 -1124 -751 34 974 507
7360 507 -164 -621 -140 512 1283 -41 -695 -854 239 992 606 -350 -1009 -371 466 604 70 -580 -842
7379 -842 -46 732 648 -241 -1006 -214 332 715 112 -674 -342 408 462 352 -229 -574 -408 278 483 -216 -345
7400 -345 -206 219 448 449 -277 -564 -10 385 108 4 -240 -236 529 108 -11 -113 -444 250 516 139 -487
7421 -487 -454 234 485 -59 -374 -747 24 360 548 79 -639 -342 322 649 306 -508 -661 -53 595 649 73
7442G3r46R8J105M70l80j022k49L00R83M37j131p36J76R14P45r6j343k21N50R81
7462G08K92q23j104oJ174O78k42j197p70Q26J017M49r47p05k80R11Q85j28j077
7481c39q62N35J188J53o81n32l82R58O34j2p56n12K7J188K84n78j341K12P69M38
7501C91Ln94k88J94P29J07m39o91m5K87P35l1m62k45J22K53K19q7k79j56K20M79
7523D22k69o99K98J8O90q7q96J37J28O72j62m19l92L20M09K90n00l78j50Q22J55
7544D09J83o53n52K78R54M23j087o05M63M50K84k42m54q62N79Q52J94k97j011
7563f94q7O95R25o4j218k94J79J331P0n82p82k74P36P64J22j034o69K24J189L45
7583H82o83q69j99Q45O57m6p84n07j7J148P04n40j132l39O16R32J22r00o79J83
$$ plain form
7442 73 -873 -775 330 800 420 -602 -851 -551 432 869 -262 -998 -822 92 837 741 -602 -823 -273 708
7462 708 1000 177 -927 -933 241 919 677 -520 -1290 -464 553 1002 55 -650 -930 -19 866 738 -339
7481 -339 -1201 -666 522 675 -6 -538 -920 38 672 660 -96 -608 -581 607 891 313 -1028 -816 -47 391
7501 391 394 -200 -488 -294 435 542 103 -588 -633 -346 389 358 -104 -349 -227 26 245 158 -121 -277 -57 422
7523 422 153 -546 -248 -230 460 373 -523 -386 -258 414 252 -167 -559 -239 170 460 -40 -418 -568 254 409
7544 409 592 -61 -613 -335 619 1042 -45 -650 -187 263 547 305 -149 -1011 -432 420 614 317 -694
7563 -694 -781 -86 839 775 -443 -737 -558 773 843 261 -521 -795 -59 705 827 -207 -876 -652 537 882
7583 882 199 -670 -869 -24 633 587 -197 -704 -721 427 1131 591 -541 -880 -264 668 790 -110 -789 -606
7603f06Q41M40j45j159J14J69O87L80p42o23m2P93M02o8o58o24P24M45j06k54
7623c2l85k62N02M93k11j06m27L57L18q3R9o44K10J62M03j62l51p6M70P2m74j72
7645b99J26K28J57K1n55j10K88L75J00m71k82Q0L50P52n51m83L8M9O88r3m93o53
7667g38M59Q36P2l06r14MM95P41K2r84m8J84L76O63n33j080Q8P81O67J81o38j070
7689g42PQ75M54l04p90n61P77O76K83n17o41m36Q72R99j27r28r56P39J050j73
7709E57l57j117M6Q76Q46k90o93n24J00J227m1m22q34M4N13O93l15m87l53L32
7729a99P03K27n15p04J31J02O84j34n48k84L23M03M67n19m38k59P42L47j48n63
7749a82q5L80P3J94k78j98l42L82K06l06K7l0J38K81l14l6q3lO40k20j64p18M90
$$ plain form
7603 -606 235 675 530 -629 -515 -346 341 721 -21 -644 -686 107 509 441 -217 -841 -117 328 222 -32
7623 -32 -417 -679 -177 316 105 -1 -428 -71 247 164 263 -381 -171 -9 394 232 -119 -195 275 347 -127 -299
7645 -299 -173 55 212 233 -322 -432 -144 231 331 -140 -422 -342 8 760 209 -274 -236 -187 501 408 -85 -738
7667 -738 -279 557 629 323 -591 -587 -92 649 671 -313 -361 -177 199 862 329 -751 -663 118 785 966 328 -742
7689 -742 -735 140 594 290 -500 -1061 -284 392 675 158 -483 -919 -47 952 825 -103 -1059 -320 730 557
7709 557 200 -917 -871 5 851 561 -132 -656 -556 671 630 208 -626 -582 -69 624 309 -178 -531 -199
7729 -199 504 731 216 -488 -357 -255 429 295 -253 -537 -214 189 656 137 -301 -560 182 529 381 -182
7749 -182 -267 113 186 380 102 -96 -438 -56 150 -156 -129 -159 -21 260 -54 -90 -173 -176 464 244 80 -638 -148
7772a48N69j59j7n82J28P56r9k85m93j54K73R07l65m59k95Q3L72O04l85o44m48
7793h41K14J042K6l09q47J06J100N34o49p52m39L93R65K76j010k97j62Q15M96
7812F61k29p56l18n0R14L19l11n79n47P90P82j68p70l33Q1P16M58o25m47j95N42
7833f5O42J56r04n61J67R11L39l10n43n71O44M07L65p44m33o5N43M58n9n33k85
7854d41K45L71K63j84m90J30m2J15Q3n19M80l58N25L5n66O6l2M58J95j67k26k98
7876c57N96l1m46J09k61L97l9J96l10q8K31L21K84q58j51r0O64N7J7p71J70O52
7898B92mK41p20l78L21Q20J8o99k88R2O5M78J89n40m70j75R01P11j174m57Q3N40
7920a54L71K29m26o17R7Q24M17o18m59k77L96N53L49r33k94pO40N39L5r31m67
$$ plain form
7772 -148 421 262 245 -337 -209 547 448 163 -330 -484 -211 696 331 -128 -423 -340 32 636 251 -393 -841
7793 -841 -627 415 441 132 -715 -609 491 1025 376 -376 -815 -422 543 819 -191 -488 -650 165 661
7812 661 432 -324 -642 -692 222 541 230 -349 -896 -106 676 508 -262 -595 -514 202 660 35 -412 -607 -65
7833 -65 577 733 -171 -732 -565 346 685 375 -168 -739 -95 312 677 -67 -500 -565 -22 436 377 -156 -441
7854 -441 -196 175 438 254 -236 -106 -148 -33 50 -469 11 -347 178 213 -353 -287 -319 139 334 167 -59 -357
7876 -357 239 208 -238 -129 -390 7 -32 164 -146 -234 -3 318 602 -256 -407 -497 167 224 241 -530 -360 292
7898 292 288 529 -191 -569 -248 572 590 -109 -397 -305 -240 238 427 -113 -583 -758 143 854 -320 -777 -694 -154
7920 -154 217 446 20 -597 -500 324 741 123 -336 -613 -217 336 685 -248 -542 -549 91 630 665 -266 -733
7941g33O12O94j39l49n46m4O69J43mn80n67O99O68K86o39o77K3M72R49n67l50
7962B0n80L03N35o7n8k45m54M31K92K83q17o9J03M32M13k74m76KN48K90j84m25
7984Ck88J63L64l36j65J8L33j06J85j54k84PL78K73l24l34P2J63J33J64l18m87
8006e40N03L24j60k56j72j07R38o8n38k48j46M22O19k44l17k52j05J85O50j22
8026C66o99l12L35J027k11n25m27N3L63Q07k71p11m42N31L69K98k54q48j66P14
8046cM74L6n60o95N32M57K87j80r08L2N37N67l27k41o25J93N10O80n67n90k66
8067f57N33O11j21m75m76M04J73M90k02q90K84J89L66L42n27m02N6K40L1K01l27
8088a57j94j53R62j62l54j62P0K24K46m06j80J23K01K04j38k76J06L2j69L22l19
$$ plain form
7941 -733 -121 573 434 85 -461 -505 164 307 303 -277 -844 -145 523 809 170 -507 -484 -12 937 370 20
7962 20 -560 -257 278 211 153 -92 -546 -115 177 460 -357 -426 -323 109 522 248 -228 -226 322 612 428 3
7984 3 -285 -122 242 -94 -259 -241 92 -14 171 17 -267 -260 118 391 67 -267 -195 -32 101 265 -53 -540
8006 -540 -37 287 127 -129 -301 -408 530 462 -76 -324 -470 -48 571 327 10 -242 -347 -162 488 366
8026 366 -333 -645 -310 717 506 -19 -446 -393 -30 777 506 -205 -647 -116 253 551 297 -551 -717 -3
8046 -3 471 507 -53 -748 -216 241 528 348 -560 -528 9 576 249 8 -617 -424 86 766 199 -391 -657
8067 -657 -124 487 366 -109 -585 -181 -8 482 280 -610 -326 -137 229 571 44 -358 -302 -62 -31 170 -157
8088 -157 -351 -504 458 296 -58 -220 -150 74 320 -86 -266 -143 58 262 124 -152 -46 -14 -183 139 -180
8109a80R0J9PJ51M3k65J09L06j1l81k77k10K81O03J9n05k12K71K96L96j95p61
8131d06J45J14M88J48m57n72J91Q11L26p86n28k05Q44J90J92p42k18K10N44lJ50
8152D36o53n45P86M45j9p42l03J69Q08N39m58q64K5K55O06o0l27p88M37M77L60
8173E84q1r69k72N73M41J55n39j92j19N07M48j11n80k80L99L60J95l38
$$ plain form
8109 -180 -90 -71 -64 87 130 -135 -26 280 269 -112 -389 -599 -318 285 304 -201 -413 -142 154 550 355 -406
8131 -406 -261 -147 341 489 32 -540 -349 462 788 2 -526 -731 113 303 495 -247 -465 -255 289 286 436
8152 436 -217 -762 24 469 450 -292 -595 -426 382 921 463 -401 -376 -121 485 425 98 -690 -253 224 584
8173 584 503 -466 -738 -165 276 431 -108 -300 -419 88 536 425 -155 -435 -36 324 519 181
8191A81
$$ Imaginary data points
##PAGE= N=2
##DATA TABLE= (X++(I..I)), XYDATA
0@%%%%%%qJ6j6J6k4L2m0M8n6P2q8J01j17J40j62J86k17K50k86L32l80M27m85N48
30B89o15O95p79Q65r68J082j199J331j480J638j812K008k224K462k727L026l362
47a770L747m191M702n309O039o933Q069r555J1591j4579J9391k8399N0953k07249
61a73493m29265M00546N22356Q1742l45237k57167j0003J40760J40565R9077p4878
72I5003k15619p8998K48462K20288j90056l71493J3439M00530K52578k01249l53095
83a80210j13657J51738K10828J61582K1776k30082l30362p422L83555K78571j84274
94A62043l34882j5078K38904P4324j68493q3908J42084J14766p1409r3018m415
105c9082k5292m1332J01826J92033l112k50823j75544J29081K19247J0801j11021
$$ plain form
0 0 0 0 0 0 0 0 -8 8 -8 8 -16 16 -24 24 -32 40 -48 53 -64 76 -86 100 -117 133 -153 179 -201 226 -259 289
30 289 -326 369 -410 455 -513 569 -630 701 -779 859 -953 1055 -1169 1293 -1434 1592 -1770
47 -1770 1977 -2214 2488 -2821 3218 -3715 4354 -5201 6390 -8189 11202 -17197 33756 -173493
61 -173493 -602758 -202212 320144 401886 56649 -200518 -210521 -69761 70804 169881 95003
72 95003 -120616 -199614 48848 269136 79080 -292413 -278974 121556 374134 172885 -180210
83 -180210 -293867 -142129 68699 230281 252057 21975 -308387 -315809 67746 346317 162043
94 162043 -172839 -187917 50987 125311 -43182 -127090 14994 129760 58351 -34667 -39082
105 -39082 -64374 -105706 -3880 188153 185041 -65782 -241326 -112245 107002 117803 6782
116F782N878M8870j03806j31256Q8218K10876M4988j40598j01163J2970k825k7449
128h8515J03044J82480l4608k78028j32082K06500K20204p5357j97388J669J61399
139F9318M1689j35231j01233M6250R4784P7370O2178o2718k43807j58075K12305
150i7170L80633N9699l50190l13629Q8084L10090J38110j01490j40267p6484j2645
161a15259R8925J54010j2553k20264j18423K06989K75184p6110l71927j66591
171c46019K70965L50493J5698k72103k46531l1819J84644K68313J07360k07195
181I3806l31930o4213L00373K81040j00788l08305p6661K06651J53835p2870j46728
192f5790n1010N4253J10435J03617j7913k00186j98540R4211L41117J60128k43739
$$ plain form
116 6782 12660 61530 -42276 -173532 -85314 125562 170550 29952 -71211 -58241 -61066 -88515
128 -88515 14529 197009 162401 -115627 -247709 -41209 178995 103638 -93750 -92081 69318
139 69318 111007 -24224 -125457 -79207 15577 92947 155125 92407 -151400 -309475 -97170
150 -97170 283463 343162 -7028 -320657 -232573 77517 215627 114137 -26130 -102614 -115259
161 -115259 -16334 137676 125123 -95141 -213564 -6575 268609 192499 -179428 -346019
171 -346019 -75054 275439 291137 19034 -227497 -259316 -74672 193641 301001 93806
181 93806 -238124 -302337 -1964 279076 178288 -130017 -206678 -27 153808 80938 -65790
192 -65790 -116800 -62547 47888 151505 133592 -66594 -265134 -170923 170194 330322 86583
203H6583l24938r968K49831J74557m2265j31754p9607p451M8533Q6182L5623q6302
215i76r0343O8699J32251l4714j71822m7612J51603J33793n1587j31497l6395
226g8600M4235J5165J0397P0386L7515r2806j09300K7278J00686K2890m2799O058
238A1105M5449m0770j18734j1219J51534J12573p6560j40652l1128O3332O1086
249B6016K6387o948m9809n7856J9973R8160L0653j24983j06527J09266J99457
260A63789m354k20407j50055R6906K09723R0275r0481j59706r8183L4307J66685
271C8499J57725n1130k37346j29503J51775K27544R455j99537j38046Q5640J80203
282I5279N5848j11484j52482n2372J17725K06190O4355k05963k59941J4342K90251
$$ plain form
203 86583 -238355 -248323 1508 176065 133800 2046 -77561 -85012 -36479 49703 85326 -976
215 -976 -91319 -22620 109631 74917 -96905 -144517 7086 140879 89292 -42205 -78600
226 -78600 -34365 -19200 -8803 61583 99098 6292 -103008 -75730 24956 47846 5047 11105
238 11105 56554 15784 -102950 -114169 37365 149938 73378 -67274 -98402 -35070 26016
249 26016 52403 45455 -4354 -62210 -42237 55923 86576 -38407 -144934 -35668 163789
260 163789 159435 -60972 -211027 -114121 95602 185877 95396 -64310 -162493 -128186 38499
271 38499 196224 145094 -92252 -221755 -69980 157564 167019 -32518 -170564 -84924 95279
282 95279 151127 39643 -112839 -165211 -47486 158704 223059 17096 -242845 -228503 61748
293F1748K17030j13788k87740j13791J55710K00190L9639j09628j35347m8566
303a34543R2658J52312K6942j51718j48676N7302K07047Q8613j54501j98976L341
314a60199J77653J37615k3793j41074j30503Q39J45562J46588j8271j71971j24207
325a61761P8535J70325L2329j25053q3958N3788Q2665J821n3770l5222P564L1503
337a234L4992J8251l3923p4399j9852P9537P5062k8860p6211j7910L5529J7298
349H280j4173J504L1054R299m0992l7501J1301L0740K2005K1242m926o1258n8178
362h1603L6787J04221L7717q9550j03540K8402J21382M1610q9222r0114J7801
373f6109R1533O3703k6519r9701p5631L9302J32919Q8896p4077j75921o9039J33711
$$ plain form
293 61748 278778 164990 -122750 -236541 -80831 119359 158998 49370 -85977 -134543
303 -134543 -41885 110427 137369 -14349 -163025 -105723 101324 189937 35436 -163540 -160199
314 -160199 17454 155069 131276 -9798 -140301 -139462 6100 152688 134417 -37554 -161761
325 -161761 -83226 87099 119428 -5625 -89583 -35795 46870 48691 -5079 -40301 -32737 -1234
337 -1234 33758 52009 18086 -56313 -76165 3372 78434 49574 -26637 -44547 -9018 8280
349 8280 -5893 -4389 26665 35964 -5028 -42529 -31228 -488 21517 42759 37833 -23425 -81603
362 -81603 -44816 59405 97122 7572 -95968 -67566 53816 95426 6204 -83910 -66109
373 -66109 25424 89127 62608 -37093 -112724 -73422 59497 148393 74316 -101605 -170644 -36933
385c6933J74426Q254j49711j29022J9353J34835J07162l1640j37309r7751N6890
396h1446J64806Q0612j24223j89936r773J91487J54963o6017k02781j05623J04404
407h3527J89907O8528j15748j73405n5377J25886J79905K6307j63831j56271L5395
418a22231J73387J01596q0579j57658m8718J03829J29274J7753j06166j23297
428a12810p182J34484J29244l5702j64015r8680Q1236J61286N1080j10008j26041
439i7108j030R8982P8988j1110p7738o2839K1140P8161M0198m2239p1267j3483
$$ plain form
385 -36933 137493 145747 -3964 -132986 -113633 21202 128364 96724 -40585 -138336 -81446
396 -81446 83360 163972 39749 -150187 -159960 31527 186490 120473 -82308 -187931 -83527
407 -83527 106380 174908 59160 -114245 -169622 -43736 136169 162476 -1355 -157626 -122231
418 -122231 51156 152752 72173 -85485 -134203 -30374 98900 116653 10487 -112810
428 -112810 -119992 14492 143736 108034 -55981 -154661 -73425 87861 138941 28933 -97108
439 -97108 -98138 844 79832 68722 -9016 -71855 -50715 27446 67644 25405 -45862 -59345
$$ [...]
8191e79
##END NTUPLES=NMR FID
##END=
